##TITLE=C13_SL30-Dau(A)
 CDCl3, 24900 sc

 10.1.2022
##JCAMPDX= 6.0         $$ Bruker NMR JCAMP-DX V2.0
##DATA TYPE= NMR SPECTRUM
##DATA CLASS= NTUPLES
##ORIGIN= UXNMR, Bruker Analytische Messtechnik GmbH
##OWNER= root
$$ XWIN-NMR		Version 3.5
$$ Thu Jan 20 10:44:21 2022 Russian Standard Time (UT+4h)  she@DPX200
##.OBSERVE FREQUENCY= 50.327896
##.OBSERVE NUCLEUS= ^13C
##.ACQUISITION MODE= SIMULTANEOUS
##.ACQUISITION SCHEME= undefined
##.AVERAGES= 24901
##.DIGITISER RES= 17
##SPECTROMETER/DATA SYSTEM= spect
##.PULSE SEQUENCE= zgpg30
##.SOLVENT NAME= CDCl3
##.SHIFT REFERENCE= (INTERNAL, CDCl3, 0, 222.961)
##AUDIT TRAIL= $$ (NUMBER, WHEN, WHO, WHERE, WHAT)
$$ ##TITLE= Audit trail, XWIN-NMR		Version 3.5
$$ ##JCAMPDX= 5.01
$$ ##ORIGIN= Bruker BioSpin GmbH
$$ ##OWNER= she
$$ F:/spectra/data/she/nmr/c13/1/pdata/1/auditp.txt
$$ ##AUDIT TRAIL=  $$ (NUMBER, WHEN, WHO, WHERE, WHAT)
(   1,<2022-01-20 10:42:32.87 +0400>,<she>,<DPX200>,
      <created by zg, POWCHK disabled, PULCHK disabled
       terminated by command 'halt'
       configuration hash MD5:
       00 E9 B6 7A A2 85 ED C7 34 08 36 98 17 FE 4E 26
       data hash MD5: 32K
       A2 D2 54 24 52 E3 4F 23 59 69 6E B0 E3 FC 4A 26>)
(   2,<2022-01-20 10:42:35.39 +0400>,<she>,<DPX200>,
      <Start of raw data processing
       efp BC_mod = 2 LB = 1 FT_mod = 6 PKNL = 1 PHC0 = -331.1852 PHC1 = 32.96236 SI = 32K 
       data hash MD5: 32K
       AA D2 17 71 92 64 33 D8 8A 45 BE 30 F6 26 BF D3>)
(   3,<2022-01-20 10:42:38.01 +0400>,<she>,<DPX200>,
      <abs ABSG = 5 
       data hash MD5: 32K
       AB 4A DC A5 F2 71 53 92 23 FE DC B1 58 53 12 2D>)
(   4,<2022-01-20 10:43:35.71 +0400>,<she>,<DPX200>,
      <pk PHC0 = 9.552512 PHC1 = -13.80004 
       data hash MD5: 32K
       1F 99 48 BB 4E 97 51 5D C2 41 F4 BB 02 05 B7 62>)
(   5,<2022-01-20 10:43:39.20 +0400>,<she>,<DPX200>,
      <abs ABSG = 5 
       data hash MD5: 32K
       15 6F F6 02 03 C8 4C FA 48 6E 5B 19 18 D5 57 AB>)
$$ ##END=
$$ 
$$ hash MD5
$$ 17 A8 A7 5A 37 D5 FB 5C AC 01 93 41 CA AA EC E4
##$RELAX= 
##$RELAX= 
##$RELAX= 
##$RELAX= 
##$RELAX= 
##$RELAX= 
##$RELAX= 
##$RELAX= 
$$ Bruker specific parameters
$$ --------------------------
##$DU= <F:/spectra>
##$EXPNO= 1
##$NAME= <c13>
##$PROCNO= 1
##$TYPE= <nmr>
##$USER= <she>
##$AMP= (0..31)
100 100 100 100 100 100 100 100 100 100 100 100 100 100 100 100 100 100 
100 100 100 100 100 100 100 100 100 100 100 100 100 100 
##$AQSEQ= 0
##$AQ_mod= 1
##$AUNM= <au_zg>
##$AUTOPOS= <>
##$BF1= 50.322709
##$BF2= 200.13
##$BF3= 50.322709
##$BF4= 500.13
##$BF5= 500.13
##$BF6= 500.13
##$BF7= 500.13
##$BF8= 500.13
##$BYTORDA= 1
##$CFDGTYP= 0
##$CFRGTYP= 5
##$CHEMSTR= <none>
##$CNST= (0..31)
1 1 145 1 1 1 1 1 1 1 1 1 1 1 1 1 1 1 1 1 1 1 1 1 1 1 1 1 1 1 1 1 
##$CPDPRG= <waltz16>
##$CPDPRG1= <>
##$CPDPRG2= <waltz16>
##$CPDPRG3= <>
##$CPDPRG4= <mlev>
##$CPDPRG5= <mlev>
##$CPDPRG6= <mlev>
##$CPDPRG7= <mlev>
##$CPDPRG8= <mlev>
##$CPDPRGB= <>
##$CPDPRGT= <>
##$D= (0..31)
$$ [...]
##$SUBNAM4= <"">
##$SUBNAM5= <"">
##$SUBNAM6= <"">
##$SUBNAM7= <"">
##$SUBNAM8= <"">
##$SUBNAM9= <"">
##$SW= 239.972175391363
##$SWIBOX= (0..15)
0 1 3 0 0 0 0 0 0 0 0 0 0 0 0 0 
##$SW_h= 12077.2946859903
##$TD= 32768
##$TD0= 1
##$TE= 0
##$TE2= 300
##$TE3= 300
##$TEG= 300
##$TL= (0..7)
120 120 120 120 120 120 120 120 
##$TP= (0..7)
150 150 150 150 150 150 150 150 
##$TP07= 0
##$TPNAME0= <>
##$TPNAME1= <>
##$TPNAME2= <>
##$TPNAME3= <>
##$TPNAME4= <>
##$TPNAME5= <>
##$TPNAME6= <>
##$TPNAME7= <>
##$TPOAL= (0..7)
0.5 0.5 0.5 0.5 0.5 0.5 0.5 0.5 
##$TPOFFS= (0..7)
0 0 0 0 0 0 0 0 
##$TUNHIN= 0
##$TUNHOUT= 0
##$TUNXOUT= 0
##$USERA1= <user>
##$USERA2= <user>
##$USERA3= <user>
##$USERA4= <user>
##$USERA5= <user>
##$V9= 5
##$VALIST= <valist>
##$VCLIST= <CCCCCCCCCCCCCCC>
##$VD= 0
##$VDLIST= <DDDDDDDDDDDDDDD>
##$VPLIST= <PPPPPPPPPPPPPPP>
##$VTLIST= <TTTTTTTTTTTTTTT>
##$WBST= 1024
##$WBSW= 4
##$XGAIN= (0..3)
0 0 0 0 
##$XL= 0
##$YL= 0
##$YMAX_a= 173176151
##$YMIN_a= -42202560
##$ZGOPTNS= <>
##$ZL1= 120
##$ZL2= 120
##$ZL3= 120
##$ZL4= 120
##$ABSF1= 222.961
##$ABSF2= -17.03589
##$ABSG= 5
##$ABSL= 3
##$ALPHA= 0
##$AQORDER= 0
##$ASSFAC= 0
##$ASSFACI= 0
##$ASSFACX= 0
##$ASSWID= 0
##$AUNMP= <proc_1d>
##$AZFE= 0.1
##$AZFW= 0.5
##$BCFW= 0
##$BC_mod= 2
##$BYTORDP= 0
##$COROFFS= 0
##$CY= -3
##$DATMOD= 1
##$DC= 0
##$DFILT= <>
##$DTYPP= 0
##$F1P= 0
##$F2P= 0
##$FCOR= 0.5
##$FTSIZE= 32768
##$FT_mod= 6
##$GAMMA= 0
##$GB= 0
##$INTBC= 1
##$INTSCL= 4.134877e-10
##$ISEN= 128
##$LB= 1
##$LEV0= 0
##$LPBIN= 0
##$MAXI= 10000
##$MC2= 0
##$MEAN= 0
##$ME_mod= 0
##$MI= 0.1934396
##$NCOEF= 0
##$NC_proc= 3
##$NLEV= 6
##$NOISF1= 120.0001
##$NOISF2= 80.00006
##$NSP= 0
##$NTH_PI= 0
##$NZP= 0
##$OFFSET= 222.961
##$PC= 1.4
##$PHC0= -321.6327
##$PHC1= 19.16232
##$PH_mod= 1
##$PKNL= yes
##$PPARMOD= 0
##$PSCAL= 0
##$PSIGN= 0
##$REVERSE= no
##$SF= 50.3227146458226
##$SI= 32768
##$SIGF1= 140
##$SIGF2= 120
##$SINO= 11.81781
##$SIOLD= 32768
##$SREGLST= <13C.CDCl3>
##$SSB= 0
##$STSI= 32768
##$STSR= 0
##$SW_p= 12077.2946859903
##$SYMM= 0
##$S_DEV= 0
##$TDeff= 32768
##$TDoff= 0
##$TI= <>
##$TILT= no
##$TM1= 0
##$TM2= 0
##$TOPLEV= 0
##$USERP1= <user>
##$USERP2= <user>
##$USERP3= <user>
##$USERP4= <user>
##$USERP5= <user>
##$WDW= 1
##$XDIM= 32768
##$YMAX_p= 265954715
##$YMIN_p= -1752290
$$ End of Bruker specific parameters
$$ ---------------------------------
##NTUPLES= NMR SPECTRUM
##VAR_NAME=  FREQUENCY,     SPECTRUM/REAL,   SPECTRUM/IMAG
##SYMBOL=    X,             R,               I
##VAR_TYPE=  INDEPENDENT,   DEPENDENT,       DEPENDENT
##VAR_FORM=  AFFN,          ASDF,            ASDF
##VAR_DIM=   32768,         32768,           32768
##UNITS=     HZ,            ARBITRARY UNITS, ARBITRARY UNITS
##FACTOR=    0.368581032318806, 1,           1
##FIRST=     11220.0027064323, 0,            0
##LAST=      -857.291979557962, 0,           0
##MIN=       -857.291979557962, -1752290,    0
##MAX=       11220.0027064323, 265954715,    0
$$ Real data points
##PAGE= N=1
##DATA TABLE= (X++(R..R)), XYDATA
$$ [...]
15818b34224J52222J22278J62476m0230k57884l1149K5916J5916j49107k90775
15808e24561j86346N014K01612K48995j5228k9209j7198q7458l5049J79568L35243
15797G5383P3231l61647k49177j07798J78121K23661K22637K34156J1504M2892
15787C42963q5462r3871j10165o9869l6194K7878j22280l33259k53965p1662J41720
15776f64166J1651J67697K25082J22884R1615O2713j3085K070j54022j50250M4425
15765b53386J8966N8010J56603o3203J07429n729j31100J5373j6384M2334K2515
15754d8572j39148j70783k7602J17043J10400J58936K29257K59452j00442k15546
15744A72995Q0467n2839p4825N6084m1163M0745N2055J07738k14595l78011k11111
$$ plain form
15818 -234224 -82002 40276 202752 162522 -95362 -126511 -100595 -84679 -233786 -524561
15808 -524561 -710907 -705893 -504281 -255286 -270514 -299723 -316921 -404379 -439428 -259860 75383
15797 75383 148614 -213033 -462210 -570008 -391887 -168226 54411 288567 300071 342963
15787 342963 257501 163630 53465 -16404 -52598 -24720 -147000 -480259 -734224 -805886 -664166
15776 -664166 -652515 -484818 -259736 -136852 -45237 17476 4391 6461 -147561 -297811 -253386
15765 -253386 -234420 -176410 -19807 -83010 24419 18690 -112410 -97037 -113421 -71087 -48572
15754 -48572 -187720 -358503 -386105 -269062 -158662 274 229531 488983 388541 172995
15744 172995 253462 200623 125798 181882 140719 181464 233519 341257 126662 -251349 -462460
15733d62460j14926P2144J50813o788j86706o1681J78010K50546l9793l18058
15723e38899j39613Q4868j3173J1344J0515J84535K66367l1775p6159J31252J04417
15712f321J4925K2356k4347q6055K1038K77177K65832j44336l10187j67348J39718
15701B452J59919N5468L9n2121j69891j65995j27859J11316K29764P3465K6713
15690A43270p4802j93361k36676o4084P6142J45877m5184k78470J48306K33670
15680a45312J2431j28216j14282K4945J84574L51125L18337Q4987q9157p5744
15670D23688j65965j28859j65009j3210K46355J86889K5258l7249j24950j48345
15660I8603m7584j61922l8373j53638k64211R6796K30582j44101j28465J72821
$$ plain form
15733 -462460 -577386 -505242 -354429 -361217 -547923 -609604 -431594 -181048 -220841 -538899
15723 -538899 -678512 -593644 -606817 -595473 -584958 -400423 -134056 -165831 -241990 -110738 -6321
15712 -6321 8604 30960 6613 -79442 -58404 218773 484605 340269 30082 -137266 2452
15701 2452 162371 217839 217878 165757 -4134 -170129 -297988 -186672 43092 116557 143270
15690 143270 68468 -124893 -361569 -425653 -349511 -203634 -248818 -527288 -378982 -145312
15680 -145312 -132881 -261097 -375379 -350434 -165860 185265 503602 588589 499432 423688
15670 423688 257723 128864 -36145 -49355 197000 383889 409147 371898 246948 98603
15660 98603 51019 -110903 -149276 -302914 -567125 -470329 -239747 -383848 -512313 -339492
15650c39492n7022j65578r5449P2849J09716R2860q5606j72510Q0041N79680N39508
15639E58997j34564k49643j74722q9578j61745j07049l6011k43535r4839J9945
15629g12744n3664K57890M36611N3187j92403n8910r0832P7850Q4277p3298k15163
15618d87199o1452L44032K14805j90861m01762j44137j41737M8738M47117K79179
15608i3277j18030k39167J4255J51420J98581K24612K09553J03616j05985j07354
15598B38224j71228L4329p9593k87959l29102k48791J63457L11950K99442J01371
15588C2100q2842r9001J95502J00361m8923L0038J15262r787j2869j84955k57929
15577b23043l7725J0476m1183j17993J6722K32070N20495K14595j50570k17308
$$ plain form
15650 -339492 -396514 -562092 -657541 -584692 -474976 -382116 -467722 -640232 -560191 19489 558997
15639 558997 424433 174790 68 -89510 -251255 -358304 -394315 -637850 -732689 -712744
15629 -712744 -766408 -508518 -71907 -18720 -211123 -270033 -360865 -283015 -198738 -272036 -487199
15618 -487199 -548651 -204619 10186 -180675 -582437 -726574 -868311 -819573 -372456 -93277
15608 -93277 -211307 -450474 -436219 -284799 -86218 138394 347947 451563 345578 238224
15598 238224 66996 101325 21732 -266227 -595329 -844120 -680663 -368713 -69271 32100
15588 32100 -50742 -149743 45759 146120 97197 127235 242497 232710 219841 34886 -223043
15577 -223043 -260768 -250292 -291475 -409468 -392746 -160676 359819 574414 423844 206536
15567B06536j78097j90906j83308j0387P8105J76997J14699k5044p8385p2064
15557a61854R3097j03256j66880J90770L8910p1000J45593q7750j83555J70462
15547a35463J5446k07646j49750m686p328M3071K9928p4954N1815O1606L7238
15536c40723J44150J18898J57550q265p5868j95134J14690K59737K14472R9746
15526D89253k25576k52885L4955L13865J07885k11070p7841M6718j57541j46760
15516g8997m690J08357K37565J74514m3641j63693k68821k73882j88205l1211
15506e32704k3073J07450J77490j23853k03002Q2137J08952O5869l960N9397J92432
15495i2865J49191r0809m38849k46559j72772j51391K18291K31768K86133J49497
$$ plain form
15567 206536 28439 -162467 -345775 -356162 -278057 -101060 13639 -11405 -89790 -161854
15557 -161854 -68757 -172013 -338893 -148123 -109213 -180213 -34620 -122370 -305925 -135463
15547 -135463 -120017 -327663 -477413 -482099 -489427 -446356 -416428 -491382 -439567 -377961 -340723
15536 -340723 -196573 -77675 79875 71610 -4258 -199392 -84702 175035 389507 489253
15526 489253 263677 10792 45747 359612 467497 256427 178586 225304 67763 -78997
15516 -78997 -83687 24670 262235 436749 393108 229415 -39406 -313288 -501493 -532704
15506 -532704 -555777 -448327 -270837 -394690 -597692 -515555 -406603 -340734 -344694 -285297 -92865
15495 -92865 56326 -34483 -473332 -719891 -892663 -1044054 -825763 -593995 -307862 -158365
15485a58365N0205J46259K05789O2394j98127j17896R964p2756J26737K37891
15475B92095J18257k0846Q8174j9224n9418j28210k01795n044n8754k2251k9211
15464d6227r0326O7125Q1379J07176K6051j56170j39444j3108K90263J62619j66969
15453A22369j17614M9460R372j83510j87463M8178j75885j81064K30219L38029
15443d7909J03l37110j11936L2516m5912J54942Q2725j20399o1197J25160N1038
15432b77979L1984K46337j19462j38808O7361k42841k78445R4292J39277k81049
15422g59333j77921M6385l2454J2797M8047J14035J50753K14393J20980Q7096
15412a75222k01715k04473m3372k2935O0720R0661j8049J48800K82393L46379
$$ plain form
15485 -158365 -108160 38099 243888 306282 108155 -9741 223 -72533 54204 292095
15475 292095 410352 389506 477680 458456 399038 270828 69033 63989 5235 -17016 -46227
15464 -46227 -136553 -69428 11951 119127 145178 -10992 -150436 -163544 126719 289338 122369
15453 122369 4755 54215 63587 -119923 -307386 -259208 -435093 -616157 -385938 -47909
15443 -47909 -47806 -384916 -496852 -464336 -510248 -355306 -272581 -392980 -454177 -329017 -277979
15432 -277979 -245995 342 -119120 -257928 -190567 -433408 -711853 -617561 -478284 -759333
15422 -759333 -937254 -890869 -923323 -910526 -862479 -748444 -597691 -383298 -262318 -175222
15412 -175222 -376937 -581410 -624782 -647717 -586997 -496336 -514385 -365585 -83192 263187
15402B63187L43948j55473k94949j98173j28329j59111k29917j35622k9642N2050
15392f72031J30779K66154J52751n0471Q7848m3566j43827L5915M8389q0732N3848
15381b14943J23477m6814j00536M5224K03794J48824n0758l45517l15118m0234
15371e92601j48867j06252M0928M8700J20437O2131K1938N6821O6223n6994j84751
15360f72287j35357l0484N9961J12219O1137N0134J16662J59674J12961j62604
15350c27984j51496M0773K14492K82200K01326M4580j60875j32044j94477k57976
15340d41481L9751L20073O1348k1124j35224j00717j41732k7653J55324l9241
15330c30676q5716J50696R7862J52581J16537l7815P4648Q3412J01470O9851r9053
$$ plain form
15402 263187 607135 451662 156713 -41460 -169789 -328900 -558817 -694439 -724081 -672031
15392 -672031 -541252 -275098 -122347 -172818 -84970 -128536 -272363 -236448 -188059 -268791 -214943
15381 -214943 -91466 -138280 -238816 -193592 10202 159026 108268 -237249 -552367 -592601
15371 -592601 -741468 -847720 -806792 -758092 -637655 -575524 -553586 -496765 -430542 -487536 -672287
15360 -672287 -807644 -838128 -778167 -665948 -604811 -554677 -438015 -278341 -165380 -327984
15350 -327984 -479480 -438707 -224215 57985 259311 303891 143016 10972 -183505 -441481
15340 -441481 -401730 -81657 -20309 -41433 -176657 -277374 -419106 -446759 -291435 -330676
15330 -330676 -416392 -265696 -167834 -15253 101284 63469 138117 221529 322999 392850 293797
15319B93797j42534j04293k20730k55707k8340L3000j9762r356N3253j46459j65025
15308g12156j3012O042J56625R3744P3845J08198m4298p6545n9903m3362J67593
15297c43229L29305K54539k34117l65066n3187J72509N1624q3003o4737J8107
15287c17255j14331J22757J19440p0904k6844J20173J23643J32350K2985M4127
15277A56141j07625o7098L7917J36333J05892J12554n9569j91089Q5322n9329
15267A49449k51778k15301k50979l9552K66896K68959n687l36658L7307L17732
15257e9612J204k23354j22667J38730J48191J9523q6144r1191j00144o8542k3244
15246d67250N8446N9020J6707Q5994J57883R5736J0101r7631J00698K41940P6124
$$ plain form
15319 293797 151263 46970 -173760 -429467 -457807 -424807 -444569 -453925 -400672 -547131 -712156
15308 -712156 -725168 -719126 -562501 -468757 -394912 -286714 -331012 -407557 -467460 -510822 -343229
15297 -343229 -13924 240615 6498 -358568 -411755 -239246 -187622 -270625 -335362 -317255
15287 -317255 -431586 -308829 -189389 -260293 -287137 -166964 -43321 89029 112014 156141
15277 156141 48516 -18582 19335 155668 261560 374114 314545 123456 208778 149449
15267 149449 -102329 -317630 -568609 -608161 -341265 -72306 -77993 -414651 -377344 -59612
15257 -59612 -58408 -281762 -404429 -265699 -117508 -97985 -184129 -275320 -375464 -444006 -467250
15246 -467250 -408804 -349784 -333077 -247083 -89200 6536 16637 -80994 19704 261644 337768
15235C37768k67407k33071p4421J19624L8911j73291L9040K4005l3099J04027
15225a17914R5223j18866k58574k80303r5278J01284O0684p2077J73314K71952
15215b40555J30048J3358N4048Q3639K9175n7611j18789k20995k19658j82472
15205g29812O7465K27215J39373J29973J58570J98555Q0885L0591J78228J31445
15195F12488j92384l31661j04164J3891J04410J79905N8595m1131k6150j62345
15185A11454j40079j01022k13753j54319Q3909K36352R3861l7990J5093n4726
15175a61220O4772O2493O4532J5818k29970j25957J72080J2135J29743J55169
15165A59595J55192O9523k70878j75686q6720j00585k44702k47001k5410K64396
$$ plain form
15235 337768 70361 -162710 -237131 -117507 -78596 -251887 -212847 -188842 -221941 -117914
15225 -117914 -22691 -141557 -400131 -680434 -775712 -674428 -613744 -685821 -512507 -240555
15215 -240555 -110507 -97149 -43101 40538 69713 12102 -106687 -327682 -547340 -729812
15205 -729812 -662347 -435132 -295759 -165786 -7216 191339 272224 302815 481043 612488
15195 612488 420104 88443 -15721 -1830 102580 282485 341080 299949 273799 111454
15185 111454 -28625 -129647 -343400 -497719 -413810 -177458 -83597 -121587 -106494 -161220
15175 -161220 -96448 -33955 30577 46395 -183575 -309532 -137452 -125317 4426 159595
15165 159595 314787 384310 113432 -62254 -148974 -249559 -494261 -741262 -766672 -502276
15155e02276L42719N3124J01840J48527p3918j87275k03200j64697O8493r3464
15145e10127p7006q8992k3435J63315O1160p5716n9505J34321L02650K94436k260
15134A18841k60177k47684j56468j05116p4918Q9544K01510o5891r3967J45638
15124d48688K38755R0686J00715k5338p7628P8298n4256j77657J06958K17822
15114D9667J52684J37579K48527l0003j80706j9818j10705l05157o390K71133
15104B06811K02657K2618j66186k95676j49612O3144n8044j04190k13090n2242
15094e43810L0897l7865j49562L3438J16087Q7155K09232K15693o1387j21290
15084b21412r5767J8956R9688O648R092J12131j6941l8650j63913m9685o384j46328
$$ plain form
15155 -502276 -159557 -106433 -4593 143934 70016 -117259 -320459 -485156 -416663 -510127
15145 -510127 -587133 -676125 -699560 -536245 -475085 -550801 -610306 -475985 -173335 121101 118841
15134 118841 -141336 -389020 -545488 -650604 -725522 -635978 -434468 -500359 -594326 -448688
15124 -448688 -209933 -119247 -18532 -43870 -121498 -43200 -97456 -275113 -168155 49667
15114 49667 202351 339930 588457 558454 377748 357930 247225 -57932 -64322 206811
15104 206811 409468 432086 265900 -29776 -179388 -116244 -174288 -278478 -491568 -543810
15094 -543810 -512913 -550778 -700340 -666902 -550815 -463660 -254428 -38735 -100122 -221412
15084 -221412 -317179 -298223 -198535 -191887 -182795 -70664 -87605 -126255 -290168 -339853 -346237 -492565
15072d92565n3490O376q9801j39347j44072j7221J50225K15652K32120J15563
15062b16560j51311j19772K41991M32450J63431j59608k31800j39066k13143l2782
15052d26170J64912q4387m9968p5907j68674j93921j26677P6008J39325M296J47959
15041e93204K01923L67358J83866k6328K7357j1296l6096O8987l6230K4724M0666
15030B11727J04317k2350r6022J69863J46457j45779l28474j39967K6630N423
15020f8175J03256P4014l1221n3418j9752n7406n1269j20896q3662m7680J52194
15009b04015J16522k57503k23198k14153j48350M1608K01006J01500P2294K02715
14999c11574J50768l0010k27513j78476j02667q9853J83122J06855M1781j8023
$$ plain form
15072 -492565 -546055 -539679 -629480 -768827 -912899 -930120 -779895 -564243 -332123 -216560
15062 -216560 -367871 -487643 -245652 186798 350229 190621 -41179 -180245 -393388 -426170
15052 -426170 -261258 -345645 -395613 -471520 -640194 -834115 -960792 -884784 -745459 -741163 -593204
15041 -593204 -391281 -23923 159943 133615 160972 149676 113580 182567 146337 171061 211727
15030 211727 316044 293694 197672 367535 513992 368213 39739 -100228 -73598 -68175
15020 -68175 35081 109095 77874 24456 4704 -52702 -103971 -224867 -308529 -356209 -204015
15009 -204015 -87493 -344996 -568194 -782347 -930697 -889089 -688083 -586583 -514289 -311574
14999 -311574 -160806 -190816 -418329 -596805 -699472 -789325 -606203 -499348 -457567 -475590
14989d75590k40690P2K27293K09681J60293M04424J50453l17185q5059J95437
14979B29129K6292k1382l73803k82975R7187K43305M3244N3676J37559J22100
14969B74332N8740j67099k51145m5041J2624m4574J90052J81989J05859j89378
14959A26359n5684l1476r2574j30219l2256J47576J30772J36052R3679j01123
14949A91106k72978P688O4010j73909q9131j86825l33507O2796J57746j08195
14939f81199q8420K00224K28379q0603q6812K00258K97508J13741j10342p7465
14929h4731q650J09693P3899q1414j48050M5030Q9091p5439j27311J04313Q1805
14918b1764J5944L8507j50837j34998Q4496j58238l922K85342M7274j24599p3987
$$ plain form
14989 -475590 -716280 -716208 -488915 -279234 -118941 285483 435936 118751 33692 229129
14979 229129 255421 234039 -139764 -422739 -325552 -82247 -39003 14673 152232 274332
14969 274332 333072 165973 -85172 -130213 -117589 -162163 27889 209878 315737 126359
14959 126359 70675 39199 -53375 -183594 -215850 -68274 62498 198550 292229 191106
14949 191106 -81872 -74184 -10174 -184083 -273214 -460039 -793546 -730750 -573004 -681199
14939 -681199 -769619 -569395 -341016 -421619 -508431 -308173 -10665 103076 -7266 -84731
14929 -84731 -93381 16312 90211 8797 -139253 -94223 -5132 -80571 -207882 -103569 -21764
14918 -21764 -5820 32687 -118150 -253148 -168652 -326890 -330812 -45470 1804 -122795 -196782
14907a96782P027j47722j06891k4832J12056K07502l312J7074J62076P9892p4902
14896C1186j54579r2867k4528O0550O6889k8746J32933k8072j69836q0680M710
14885b83040J76509J37519J42583J03016j9538j04075j28717R060N4360J1589
14875I9266j75870k27092q7117k11156r2946J36048O7777j8200J23763J05156
14865b80371k0621j94117q34K77558L31981R8611j98627m58230m35773k87488
14855a167911j14133K85805M56257Q2437k2812J56287J74866J08901J36918o1749
14845C4866o9752J74985K25009O5043J9110j001l9718k83497l57870r9293J700
14834c30418Q233J60616J08201N5168J23451N3191j44674k20684J31665K74328
$$ plain form
14907 -196782 -189755 -337477 -444368 -469200 -357144 -149642 -152954 -135880 26196 106088 31186
14896 31186 -123393 -216260 -240788 -180238 -113349 -142095 -9162 -37234 -207070 -287750 -283040
14885 -283040 -106531 30988 173571 276587 257049 152974 24257 33317 87677 99266
14875 99266 -76604 -303696 -390813 -601969 -694915 -558867 -491090 -509290 -385527 -280371
14865 -280371 -300992 -495109 -495943 -218385 113596 212207 13580 -444650 -880423 -1167911
14855 -1167911 -1282044 -996239 -539982 -457545 -480357 -324070 -149204 -40303 96615 34866
14845 34866 -34886 140099 365108 430151 449261 448260 408542 125045 -232825 -332118 -330418
14834 -330418 -322185 -161569 -53368 1800 125251 178442 33768 -186916 -55251 219077
14824B19077P534k43636j72340J47938P3616j16191l3892J32066O5136j17168
14814c7860k70522M0312J61984O195j0415J01470O5289j02809M4762R6868j66024
14803g0750M7315J14102j41682J1365K65492j5941r8228J24238P8005J02257p2136
14792C44037k33658k24666k3472K09713K02989K15023o431k91355k27477j97374
14782b32671k1273P8686N4225J05405k8624J1343j01736n5929K70948J26847o8527
14771A38694l8182k5172q9685j37150k26915o6375N39441L47816k04288k12185
14761B5999m4765l7231k64613m1818J93845J44652J00740J3781J61044K89896
14751E41530K37645j42455m25763k02094J42698J91824O5083l590J21290l2562
$$ plain form
14824 219077 226611 -17025 -189365 -41427 32189 -84002 -117894 14172 79308 -37860
14814 -37860 -308382 -268070 -106086 -99891 -110306 -8836 56453 -46356 -1594 95274 -70750
14803 -70750 -23435 90667 -51015 -39650 225842 209901 111673 235911 313916 416173 344037
14792 344037 110379 -114287 -137759 71954 274943 489966 483535 192180 -35297 -232671
14782 -232671 -253944 -175258 -121033 -15628 -44252 -32909 -134645 -190574 80374 207221 138694
14771 138694 100512 75340 -14345 -151495 -378410 -444785 94656 442472 238184 25999
14761 25999 -18766 -55997 -320610 -362428 -168583 -23931 76809 90590 251634 541530
14751 541530 779175 636720 210957 8863 151561 343385 408468 404878 526168 493606
14741D93606j26946O2102j59926k29129j03340M3462j42256k72577j17372J19512
14731d32864J32673J91393R1941j5836j54140r7388N8603Q3229L06552K81589
14721D45752l4978j65119j38967J33689L48877L6584j30132o4098j26807k57365
14711D7436j68743k551O5669k8438p9419K0306j77976j82290M1886K6502K8034
14700d09584J60463m1708p9116m5664j6342r753M2347J17125k8830k17225j04763
14689f33050R9099L68810J93191Q4584j63484l84542j37527P5078J51001K20158
14679a26682J41928N6618J6913j88859r2699l0826n5225k14737k42958o0731K55721
14668e41537K70416J9508N009J26854K39950k0460j72872j30242j86713j1628
$$ plain form
14741 493606 366660 428762 268836 39707 -63633 -20171 -162427 -435004 -552376 -432864
14731 -432864 -300191 -108798 -16857 -32693 -186833 -284221 -225618 -142389 164163 445752
14721 445752 410774 245655 106688 240377 589254 625838 495706 431608 304801 47436
14711 47436 -121307 -123858 -58189 -86627 -166046 -145740 -323716 -506006 -464120 -437618 -409584
14700 -409584 -249121 -290829 -369945 -415609 -431951 -441704 -399357 -282232 -311062 -528287 -633050
14689 -633050 -533951 -165141 28050 112634 -50850 -435392 -572919 -497841 -346840 -126682
14679 -126682 15246 71864 88777 -100082 -192781 -223607 -278832 -493569 -736527 -797258 -541537
14668 -541537 -271121 -251613 -246604 -119750 120200 99740 -73132 -203374 -390087 -401715
14658d01715J37694m7329n8472Q459K1130J5892J76180N4140K8875J33300N0476
14647A18630r356K1976K1132k14192j34288K65414J68334j40675J2329l2621n0360
14636B6323j43256p3221j05772j66407j10759Q2725J41551J54291K23027J86744
14626B15246l358k55111j70542r5860j55457L8022K36866L23108K16831K2439
14616C72184j96614l90452j71461J60328k3874m50924m12475o3482J21014L23911
14606g31845L58136J21778M234J23839J51520j2882j9795j25707l0741J94451
14596C2988N3932k20814j19120j94324J48846L95938J93838j42645k86416j49375
14586b87152J26150K17508J3968k12369p7118q0913K1003J01725J3459l1407J03951
$$ plain form
14658 -401715 -264021 -311350 -369822 -361363 -340233 -324341 -148161 -94021 -65146 68154 118630
14647 118630 109274 131250 152382 -61810 -196098 69316 237650 96975 109304 76683 26323
14636 26323 -116933 -190154 -295926 -462333 -573092 -490367 -348816 -194525 28502 215246
14626 215246 211888 -43223 -213765 -309625 -465082 -427060 -190194 132914 349745 372184
14616 372184 175570 -214882 -386343 -226015 -249889 -700813 -1113288 -1176770 -1055756 -731845
14606 -731845 -373709 -251931 -247697 -123858 27662 14780 -5015 -130722 -161463 32988
14596 32988 86920 -133894 -253014 -447338 -298492 97446 291284 148639 -137777 -287152
14586 -287152 -161002 56506 70474 -141895 -219013 -299926 -278923 -177198 -163739 -195146 -91195
14575i1195J16241J0829k1261M1897p0225j22677j41263k04821J59825K11723
14565a10927L8036r5245j0508K1023j28366Q6111J41769j09450k32328j00519
14555e00404p3744k07150P8337J64191j5096j13105Q8891L03188Q9536k63870
14545d49226j6814J9088k02015K34182L60556K03870L4772R0131Q4357r9907k82833
14534b3839l64095q1956J04570L10207P4759j88422k30608j83409K719K04823
14524c75251M2513k24963J1633K15163J90658Q6842J5830J15745J23241m4413
14514A56998j19880j7013j70304j17325j0311K3163J43409K97966J98734J57701
14504E43138k8959l32394k39192J00161K65196o8783j14252K67256n6117k98160
$$ plain form
14575 -91195 25046 35875 14614 56511 -13714 -136391 -277654 -482475 -322650 -110927
14565 -110927 -72891 -168136 -178644 -157621 -285987 -199876 -58107 -167557 -399885 -500404
14555 -500404 -574148 -781298 -702961 -538770 -553866 -666971 -578080 -274892 -185356 -449226
14545 -449226 -466040 -446952 -648967 -414785 -54229 149641 184413 274544 358901 258994 -23839
14534 -23839 -387934 -469890 -365320 -55113 19646 -168776 -399384 -582793 -580074 -375251
14524 -375251 -332738 -557701 -546068 -330905 -140247 -53405 -37575 78170 201411 156998
14514 156998 37118 20105 -150199 -267524 -277835 -254672 -111263 186703 385437 543138
14504 543138 514179 181785 -57407 42754 307950 239167 124915 392171 336054 37894
14494C7894j21606j00135q584J44039P5481l2731l9034p5940M9459L20549K24468
14483D73860j09214j47682J47335J36979p9781k89533j08431j1634j79975R8694
14473f9382P5241j94074j61344j23592n6284m4804N2164m6105p7064Q3693K29507
14462c32044J25766O7589p8600q0650K15358J41407j63772k04734l1757J31506
14452b09931J20561q7878j8265J58942m6469j36774q1697l19817j40965M9481
14442g12812J50576K45740P9108J6445Q0247J75994k0588N6362O9352R811p3813
14431G6422o0620Q9008J51524O3581j40293j3464K6820o1530J6029M2736r5551
14420I4662K0355L2738p1687o3693k3900j08295q2355r7731P9373l5547O4785
$$ plain form
14494 37894 -83712 -183847 -192431 -48392 27089 -5642 -44676 -120616 -71157 249392 473860
14483 473860 364646 216964 364299 501278 421497 131964 23533 11899 -168076 -69382
14473 -69382 5859 -188215 -349559 -473151 -529435 -574239 -522075 -568180 -645244 -561551 -332044
14462 -332044 -206278 -138689 -217289 -297939 -82581 58826 -104946 -309680 -341437 -209931
14452 -209931 -89370 -177248 -195513 -36571 -83040 -219814 -301511 -621328 -762293 -712812
14442 -712812 -562236 -316496 -237388 -220943 -140696 35298 14710 71072 140424 150235 76422
14431 76422 15802 104810 256334 319915 179622 166158 192978 131448 147477 190213 94662
14420 94662 115017 147755 76068 12375 -11525 -119820 -202175 -299906 -220533 -256080 -191295
14409a91295K63641K4805k45575k51706J32892P3953k28437j37111n6579N3709
14399e61703N3999k16785j69436J97756J27556l7340J08180K54950K29373n6219
14389f9669n2042R0293J74611q4505o6251K52956J83768Q0012k6955k19291j91448
14378G1479p2119j58882n3642j45538k25528k11488N6852J72114R2249J60332
14368c14171K4001j12100m909K18667J57163j2348k5010j38444k13421j2109K17802
14357b14879O0645j76038j42238o7234Q2872J10995M5850J12804m9945j07105
14347c44273J12685J06431P6654p0064n9435J347J24079N4706P9195L9704j86955
14336f5926r4677m4379l33184k98853J13964L48230M5107l1376L24403L43915
$$ plain form
14409 -191295 72346 97151 -148424 -400130 -267238 -193285 -421722 -558833 -615412 -561703
14399 -561703 -507704 -724489 -893925 -696169 -568613 -605953 -497773 -242823 -13450 -69669
14389 -69669 -121711 -31418 143193 58688 -7563 245393 429161 509173 482218 262927 71479
14378 71479 -640 -159522 -213164 -358702 -584230 -795718 -738866 -566752 -474503 -314171
14368 -314171 -290170 -402270 -407179 -188512 -31349 -43697 -68707 -207151 -420572 -432681 -214879
14357 -214879 -154234 -330272 -472510 -539744 -456872 -345877 -300027 -187223 -237168 -344273
14347 -344273 -231588 -125157 -48503 -118567 -178002 -176655 -52576 2130 81325 121029 -65926
14336 -65926 -160603 -204982 -538166 -837019 -723055 -374825 -329718 -361094 -36691 307224
14326C07224R5915j52330l09699k26311m256n233j14498k49404k81152j69864
14316a109608K34878M68443J81273n8695n9365p4753m581K74775K25261J99047
14306B76675J03351n0292k68281j66338l4825j53912j7953n4354k13568K3095
14296e56402J13150J00198K57742L22883K04185j12128j12913j59699M7355K34264
14286C38635P8095r9555r1899l0997L35738J45099j62828j05729j03884k17362
14276H5313p9727J16628q2496j87674O239n5049n4018N9470K7315l1369n7128
14265b52496K65621J40447j74096k327R7836q7897k98640j63304L11265L20272
14255A56681J53044j41212j57906J25858j509r3337k37016j04385k2715K1756
$$ plain form
14326 307224 403139 250809 -58890 -285201 -289457 -294690 -409188 -658592 -939744 -1109608
14316 -1109608 -874730 -406287 -225014 -283709 -343074 -417827 -422408 -147633 77628 276675
14306 276675 380026 329734 61453 -104885 -139710 -293622 -311575 -365929 -579497 -556402
14296 -556402 -443252 -343054 -85312 237571 441756 329628 216715 57016 104371 338635
14286 338635 416730 317175 225276 194279 530017 675116 512288 406559 302675 85313
14276 85313 5586 122214 39718 -147956 -141717 -196766 -250784 -191314 -163999 -195368 -252496
14265 -252496 13125 153572 -20524 -22851 74985 -12912 -311552 -474856 -163591 156681
14255 156681 309725 168513 10607 136465 134956 41619 -195397 -299782 -322497 -300741
14245c00741M9268L8140O5371R8178Q601p9374l7663J25945K11103O0729P5537
14234C15094K5797j42356j98191r8284j54398l50682k60768R1361J61074N151
14224f06202j3603K5449n4570Q3546K20138J27545P62p5800Q2234j25310k29552
14213e65363j9777J58870K14221J7237P3279K26284J02751k5490j15566m4665
14203B1781p4636k5509N6420N3965P7291R4029P4591j81907o5031o132j16068
14192i1206k81046k48630J18657K96173K36953M2982N1156j95939j81855n695
14182b58450J5963n086j32118n915K76446J75875j8729L5210J36649J6208o0197
14171A75856j10239k20142R6962J55486N1624R8676j28348j29567o3197p5073
$$ plain form
14245 -300741 -251473 -213333 -147962 -49784 -41183 -120557 -158220 -32275 178828 239557 315094
14234 315094 340891 198535 344 -97940 -252338 -603020 -863788 -772427 -611353 -606202
14224 -606202 -619805 -594356 -648926 -565380 -345242 -217697 -216935 -292735 -210501 -335811 -565363
14213 -565363 -585140 -426270 -212049 -194812 -121533 104751 207502 182012 66446 21781
14203 21781 -52855 -78364 -21944 32021 109312 203341 277932 96025 30994 24862 -91206
14192 -91206 -372252 -620882 -502225 -206052 30901 73883 125039 -70900 -252755 -258450
14182 -258450 -242487 -247573 -379691 -385606 -109160 66715 47986 83196 219845 236053 175856
14171 175856 65617 -154525 -57563 97923 149547 248223 119875 -9692 -72889 -147962
14161a47962j42690p5778J20616K68176J33603r9581j42165r1297j00714n9069
14151c36861J85339K13027R1849j6761j75085q0856J3901n2023o1580l4434J5252
14140b38232k0588r00L66407K83512r4891k82365l20975j64461q5205K8651J96093
14129c32954J66152r6461p7500j9732O5826L0732J01347K56677J43336n1448O2725
14118B48700K47838P8369m2833r1429j66889k63711m8211l2963q4237L10878K13356
14107C68868j67679k48361r3094k2957j1202j13638k64817p5787L60869K45388
14097b2410P9591o0803q0444O1355j50067j71887R6646J93732L7373j25749j29195
14086b71858k5728J90364J17503j90426l12160J0263K02721P1973J02629q820
$$ plain form
14161 -147962 -290652 -366430 -245814 22362 155965 56384 -85781 -177078 -277792 -336861
14151 -336861 -151522 61505 153354 136593 -38492 -119348 -105447 -157470 -219050 -253484 -238232
14140 -238232 -258820 -259720 106687 390199 295308 12943 -308032 -472493 -557698 -529047 -332954
14129 -332954 -166802 -263263 -340763 -360495 -294669 -263937 -162590 94087 237423 185975 248700
14118 248700 496538 574907 532074 440645 273756 10045 -38166 -71129 -155366 155512 368868
14107 368868 201189 -47172 -140266 -163223 -174425 -288063 -552880 -628667 -267798 -22410
14097 -22410 57181 -3622 -84066 -22711 -172778 -344665 -248019 -54287 -16914 -142663 -271858
14086 -271858 -297586 -107222 10281 -180145 -492305 -482042 -279321 -207348 -104719 -113539
14076a13539J25562K06545j29656q0140p3164j66178r6457J46113P8966j29954
14066b31902j2887Q2246K03154m7895l56097j55232k4113L4948J72216M1010j08090
14055d02642r1608o1559L5004M1888R3110N4360M7254L7128J9052N0252k987j44350
14043c25098j9897J69994Q2896m9871j3384J45721K01015j29151m57470l07794
14033g03039J85060M42500K0905j04623j1403k3825J00267J52792Q2360o4457
14023G6537j74509j32121J7910k79283r3004L75701K12087j47628j69022Q900
14013c04432O687r8718k85195k43804j8535J98355L0434K05387K21092R5816K03014
14002A0101J22331j79161P2436M82432Q9515j56159l24145l55203j42966R425
$$ plain form
14076 -113539 12023 218568 88912 8772 -64392 -230570 -327027 -180914 -101948 -231902
14066 -231902 -244789 -162543 40611 -7284 -363381 -518613 -542726 -507778 -335562 -294552 -402642
14055 -402642 -494250 -555809 -520805 -478917 -385807 -331447 -284193 -247065 -228013 -177761 -180748 -325098
14043 -325098 -344995 -175001 -92105 -141976 -155360 -9639 191376 62225 -395245 -703039
14033 -703039 -517979 -75479 -54574 -159197 -170600 -194425 -94158 58634 140994 76537
14023 76537 -97972 -230093 -212183 -491466 -584470 -208769 3318 -144310 -313332 -304432
14013 -304432 -297745 -396463 -681658 -925462 -943997 -745642 -715208 -509821 -288729 -192913 10101
14002 10101 132432 -46729 25707 508139 597654 441495 117350 -237853 -380819 -371394
13992c71394J64453K40563J02728N7513k5984j58359j31398p0325j77334L9164
13982c30373J63506p2348Q281R8333J40397j4020o9617j88316j10591j77838j83288
13971g35874Q5800J81446m2604k38017q9407K05781J47867J02282O58l3227n9333
13960d74628o5432Q2318K12949J76385N409k8473k41767k76702l9505K31307K79566
13949a38573J41916Q0359P5838Q5343R8343J3772k95569l52522J57624K13601
13939H0132J6443j64800l5196o7031j60201j18272l4679L0106K33463K03155K6536
13928I656j50802p047K3776M8549n6306l3893p0901L2295Q1298k07243n6961R5255
13916b92324p898N823j57818J8063L91190J19095J31320K02052k67745m26473
$$ plain form
13992 -371394 -206941 33622 136350 193863 167879 9520 -121878 -192203 -369537 -330373
13982 -330373 -166867 -239215 -230934 -132601 7796 -6224 -75841 -264157 -374748 -552586 -735874
13971 -735874 -650074 -468628 -511232 -749249 -838656 -632875 -485008 -382726 -382068 -415295 -474628
13960 -474628 -540060 -457742 -244793 -68408 -62999 -91472 -333239 -609941 -649446 -418139 -138573
13949 -138573 3343 83702 159540 244883 343226 356998 61429 -291093 -133469 80132
13939 80132 96575 -68225 -103421 -170452 -330653 -448925 -483604 -453498 -220035 -16880 9656
13928 9656 -141146 -148193 -124417 -75868 -132174 -166067 -236968 -204673 -123375 -330618 -387579 -292324
13916 -292324 -300222 -294399 -452217 -434154 -42964 76131 207451 409503 141758 -284715
13906b84715k76411J81121J80797k41028l74044j60633K81420K85539k289k5791
13896d36034N1004k8306j05454r7198k6044j95580J07744J04572P3128R0595j19131
13885e80704O9768K44107J53985Q6342J83730l4044L7846N4415j70561j04598
13875e9714j39496M3799K19591K03793J24328k8075M9516M3357j95013k78402
13865a6316k03930j03362o1723R5293p6256j12111O0090r859Q281J27156m0942
13854c33679k04285j73813N0927r4570j60885O4637R2830K07052K53433K4596
13844b73757q7758R9969k8821K6469K19942J22476R7692j30198j93718j56495
13834c04199Q6138N6015J65462O7018j60217l2126N5661L3256l4324n1148K09118
$$ plain form
13906 -284715 -561126 -380005 -199208 -440236 -814280 -974913 -693493 -407954 -410243 -436034
13896 -436034 -385030 -413336 -518790 -615988 -642032 -837612 -729868 -625296 -552168 -461573 -580704
13885 -580704 -510936 -266829 -112844 -26502 157228 123184 161030 215445 44884 -59714
13875 -59714 -199210 -155411 64180 267973 392301 364226 413742 457099 262086 -16316
13865 -16316 -220246 -323608 -385331 -290038 -366294 -478405 -418315 -428174 -419893 -292737 -333679
13854 -333679 -537964 -711777 -660850 -755420 -916305 -851668 -758838 -551786 -298353 -273757
13844 -273757 -361515 -261546 -290367 -263898 -43956 78520 176212 46014 -147704 -304199
13834 -304199 -218061 -162046 3416 70434 -89783 -121909 -66248 -32992 -67316 -118464 90654
13823I0654L40781L6418j74844k21759l51008n32413k07700N8144Q5790O0358
13813h15579L11832K47652P5606n9751j16871n4464L7288K67922J59539m17n1033
13802A724J10160N2465m8565O6088J32382l2774k30263m4202j5119l9586O579
13791d1111k66809j94557k429M7792J23607K69640K10689J55711K0609k6220n9960
13780B36962q6405o2005R9371L5528M2794J19551p5997k08317j92825K9923M9970
13769a1450M2549M2718p8396K9743Q5842j2115J18417P4261M5315J19723N1808
13758E08415J36867k47805l24472Q1306l9922l31187n5088K29694K4282j94583
13748b12493l85197j44227Q117J05075J35593J71785K45857L15093o0638k64517
$$ plain form
13823 90654 431435 467853 293009 71250 -279758 -812171 -1019871 -961727 -875937 -815579
13813 -815579 -503747 -256095 -180489 -240240 -357111 -411575 -374287 -106365 53174 52757 1724
13802 1724 111884 164349 115784 181872 314254 281480 51217 7015 -8104 -47690 -41111
13791 -41111 -307920 -502477 -504906 -457114 -333507 -63867 146822 302533 323142 296922 236962
13780 236962 150557 88552 187923 223451 266245 385796 309799 101482 -91343 -61420 -11450
13769 -11450 31099 73817 -4579 25164 111006 98891 217308 291569 336884 456607 508415
13758 508415 645282 397477 73005 154311 114389 -216798 -271886 -42192 -17910 -212493
13748 -212493 -597690 -741917 -733800 -628725 -493132 -321347 -75490 239603 178965 -85552
13738h5552j38955j95483J3503J26327p1549q6012J85688J46113K10609N0142
13728A54831k41476n4129p5978o2474J19461K1991J35440K06306k74494k44356
13718c14878J2454N881O724O007j26799N7019O4014Q7741m197j44392l3635p6447
13706d60508K9686J80763J10110j20116j27943P1139J68272j63115l68047j43424
13696h23183J98472Q9993j93434N1712J60285l6745r4374j10113q286J89230K48672
13685c27771J38754R0806N1190J51481Q6932J49297J6061k06785k6179l4234j74074
13674h4522p3994l08648j20375O1850p6093K8189J89222J22731R6373l6960k43209
13663d45436j4608M2085j19420j25860k8778J06455J55825K64957K51018J34986
$$ plain form
13738 -85552 -224507 -419990 -406487 -280160 -351709 -437721 -252033 -105920 104689 154831
13728 154831 -86645 -140774 -216752 -279226 -159765 -137774 -2334 203972 -70522 -314878
13718 -314878 -302424 -296543 -289819 -283812 -410611 -353592 -289578 -201837 -206034 -350426 -384061 -460508
13706 -460508 -430822 -250059 -139949 -260065 -388008 -316869 -148597 -311712 -679759 -823183
13696 -823183 -624711 -534718 -728152 -676440 -516155 -552900 -647274 -757387 -765673 -576443 -327771
13685 -327771 -189017 -98211 -47021 104460 191392 340689 356750 149965 123786 89552 -84522
13674 -84522 -158516 -467164 -587539 -525689 -601782 -573593 -384371 -261640 -165267 -202227 -445436
13663 -445436 -460044 -417959 -537379 -663239 -692017 -585562 -429737 -164780 86238 221224
13653B21224k3943j35239m4435K653N3744j70165j50824j04946O9808P0588N1392
13642a60143l8452K4887j50422j06430J57639j76941l79970k73429l8198N5844
13632a085615K18366M03495N01284K70047j93077j34885l4952j81923j35108p544
13622c79912K43010K60895N4793k85192k88739K673j25871J06893K48167K19477
13612E6194J94268K3164l07547l46352k09422j64376l9708J49516K49396J31729
13602b63138n9962k10086Q3433K63524n302k09340k2445K05556J98809J0964m8408
13591e6395Q1971l992j52987l07632j27680P0230K45068K80220R9266J38018J11211
13580C77298j54224k7206K4400k27404l56175j44415o5316o2720Q9543Q5956J52417
$$ plain form
13653 221224 197281 62042 17607 20260 74004 -96161 -246985 -351931 -282123 -211535 -160143
13642 -160143 -198595 -173708 -324130 -430560 -272921 -449862 -829832 -1103261 -1141459 -1085615
13632 -1085615 -867249 -463754 37530 307577 114500 -20385 -55337 -237260 -372368 -379912
13622 -379912 -136902 123993 178786 -106406 -395145 -392472 -518343 -411450 -163283 56194
13612 56194 250462 273626 -33921 -380273 -589695 -754071 -793779 -644263 -394867 -263138
13602 -263138 -323100 -533186 -449753 -186229 -191531 -400871 -423316 -217760 -18951 -7987 -56395
13591 -56395 25576 21584 -131403 -439035 -566715 -496485 -251417 28803 128069 266087 377298
13580 377298 223074 195868 220268 -7136 -363311 -507726 -573042 -635762 -546219 -460263 -307846
13569c07846J05753j64863k65553j94098R0809P4218k26508k1807K28357L37560
13559c43978J63312N6812l2433L5794R5212M3028J45676O5978k64267k13446r0212
13548c38524j04558o6479q7554o1842N5780P2843L01840K31953J31564J14566
13538B49589j51408k43637k95397k8309K85689L83349M40577R8243l37185j75507
13528B26004k12032l04650j19205n63N8935J29483J14628P9173m8736r2227p3307
13517b42497J08847N4425L2878o6877n8210K64711J8846j45387m9122R5831J68249
13506A81694R2053Q355k84109l53862j39917J07461r2493k16167k2478M1051R8791
13495e79621O0022j70153k9831J50809j09947j07098L8507o7747k55508j69030
$$ plain form
13569 -307846 -202093 -366956 -632509 -826607 -735798 -661580 -888088 -909895 -681538 -343978
13559 -343978 -180666 -123854 -156287 -120493 -25281 17747 163423 229401 -34866 -248312 -338524
13548 -338524 -443082 -509561 -597115 -658957 -603177 -530334 -228494 3459 135023 249589
13538 249589 98181 -145456 -440853 -469162 -183473 199876 640453 738696 401511 226004
13528 226004 13972 -290678 -409883 -410446 -351511 -222028 -107400 -28227 -76963 -169190 -242497
13517 -242497 -133650 -79225 -46347 -113224 -171434 93277 112123 -33264 -82386 13445 181694
13506 181694 273747 282102 -2007 -355869 -495786 -388325 -480818 -696985 -719463 -678412 -579621
13495 -579621 -519599 -689752 -719583 -568774 -678721 -785819 -747312 -815059 -1070567 -1239597
13485a239597l7678L38491J91079J23985K60813J40815j2717J90755k6381m12264
13475d82699k61300J87439K97210K35575J1111j50340k86432j67959l2113k0915
13465f70423q4008N953K2361J26952K20919N9372k9084o5884J33732J44108j12927
13454b48929j39093j71280o7407l2377J16095K39273P9620j70228o0247K06643
13444b47930J12860j42666p5728J55O1880Q0990J83807J52387j98051k98939j98146
13433e69381K48603L09639M397k75268j74229l8750N6144N6212j08150j25690
13423f16473M1272O7357P0267N0033r4346k11778K4590K37733K09400j77142j95060
13412e94147O3883o2696q5600K81987K19186o4529j62355k32140J5383K37849
$$ plain form
13485 -1239597 -1277275 -938784 -747705 -623720 -362907 -222092 -234809 -44054 -70435 -482699
13475 -482699 -743999 -556560 -259350 -23775 -12664 -163004 -449436 -617395 -649508 -670423
13465 -670423 -754431 -748478 -726117 -599165 -378246 -318874 -347958 -413842 -280110 -136002 -248929
13454 -248929 -388022 -559302 -626709 -659086 -542991 -303718 -224098 -394326 -454573 -247930
13444 -247930 -135070 -277736 -353464 -353309 -291429 -210439 -26632 125755 -72296 -371235 -569381
13433 -569381 -320778 -11139 -6742 -282010 -456239 -494989 -438845 -382633 -490783 -616473
13423 -616473 -575201 -507844 -437577 -387544 -481890 -693668 -669078 -431345 -221945 -399087 -594147
13412 -594147 -530264 -592960 -678560 -396573 -177387 -241916 -404271 -636411 -621028 -383179
13402c83179Q4336J4055O9673K45373o2865l02797j64277l2691M6913J53858J19605
13391b11996J22796J53094P2529N4217k8855j17489q7829j84548j64846q1289
13381d74216j10667j32622J25930J51730L4922j20796p3214J77762J41017Q8333
13371a91821o383P8723J31261m7197j2717j61353j09166P7512p8843k05459j89001
13360g14444q1221J2906j162J7740Q0699K02904L54068P6183j60229j97825M976
13349d05405K16235K11141j9708M4176J42098m7512j74256p0241o4016q2085P7972
13338a71601K86588K48442k84079k98918O2951K84231J78694j33866j23738P07
13328D9411O9461J08454o9239l7191k23255k86118j11055j7251L1096J25173L43707
$$ plain form
13402 -383179 -298843 -284788 -215115 30258 -32607 -335404 -499681 -532372 -485459 -331601 -211996
13391 -211996 -89200 63894 136423 190640 161785 44296 -43533 -228081 -392927 -474216
13381 -474216 -584883 -717505 -591575 -439845 -404923 -525719 -598933 -421171 -280154 -191821
13371 -191821 -198204 -119481 11780 -35417 -48134 -209487 -318653 -241141 -319984 -525443 -714444
13360 -714444 -795665 -782759 -783921 -766181 -685482 -482578 -128510 -52327 -212556 -410381 -405405
13349 -405405 -189170 21971 2263 46439 188537 141025 -33231 -103472 -167488 -249573 -171601
13338 -171601 114987 363429 79350 -219568 -156617 127614 306308 172442 48704 49411
13328 49411 118872 227326 158087 120896 -102359 -388477 -499532 -516783 -485687 -360514 -16807
13317a6807K90556j858p2282r8977J23772N2431l59402k04841r247J40607J82424
13306B6376J03786n6527K2100l161k50569k05100m4527J32727J55995L2091k91192
13295c78001p5720n4151N968P8259J3178J97329K69019M3047p1664J40566J84266
13284C52096j8997l52820l70294r7983L6131j59524m4244K21672K87337J66926
13274B0300K34584M38849K78852k08698n03966k83790p9783J28697L15808k3526
13264C17327m50376l80572j07736J44232M6676k0709p9744J28977K8039j08727
13254d82613J49462J12724J52881r6339j64198l8878o1488J21705k2037m7867
13244c76648J30062K08646K38021n9121o7468p002k18488j51806N1672j34680
$$ plain form
13317 -16807 273749 271891 199609 100632 224404 276835 -82567 -287408 -296655 -156048 26376
13306 26376 130162 73635 95735 92574 -157995 -363095 -407622 -274895 -118900 -86809 -378001
13295 -378001 -453721 -507872 -501904 -423645 -410467 -213138 55881 98928 27264 167830 352096
13284 352096 333099 -19721 -390015 -487998 -451867 -611391 -655635 -433963 -146626 20300
13274 20300 254884 693733 972585 763887 259921 -23869 -103652 25045 340853 317327
13264 317327 -133049 -513621 -621357 -477125 -430449 -451158 -530902 -401925 -373886 -482613
13254 -482613 -333151 -220427 -67546 -163885 -328083 -366961 -428449 -306744 -328781 -376648
13244 -376648 -246586 -37940 200081 140960 73492 66490 -151998 -303804 -252132 -386812
13234c86812P5697L86514K72272l1486k04693k00148p0587r11p4421j22604J4957
13223c42222O711J32936J35887j98336j04973N0424r7868j52627n7997K5849J8084
13212e84132J20764Q2926N8636R8000j38707O3549J51831r6813j31503O5125J89141
13201a21183J93016J01961q8759J2556J0814j05098R1550K71048K59999K2931
13191F48835l24348l53125j40047j88355j67518P7760J78203J41182J4191P3595
13181c9627J89861J41198O5236q837r6798j42511r2246J00081J11555K21409l9497
13170D09824j69897j0788j39110j73456j9919r582n7709k13783k4451M16955M58273
13159D66357J99184J95202K78505L17711J56429l00901l32574j02148j34823m5090
$$ plain form
13234 -386812 -311115 75399 347671 316185 111492 -88656 -159243 -160154 -234575 -357179 -342222
13223 -342222 -335511 -202575 -66688 -265024 -369997 -319573 -417441 -570068 -628065 -602216 -584132
13212 -584132 -463368 -380442 -321806 -223806 -362513 -298964 -147133 -243946 -375449 -310324 -121183
13201 -121183 71833 173794 85035 97591 108405 3307 94857 365905 625904 648835
13191 648835 324487 -28638 -168685 -357040 -524558 -446798 -268595 -127413 -113222 -39627
13181 -39627 150234 291432 356668 347831 251033 108522 16276 116357 227912 449321 409824
13170 409824 239927 229139 90029 -83427 -103346 -112928 -170637 -384420 -408871 8084 466357
13159 466357 665541 860743 1139248 1456959 1613388 1312487 979913 877765 742942 697852
13149F97852j91077l30114K2685K80725J54914K36333P7469J96865L66089K64687
13139A776428M5166N5094j27671m11080l93157j53064l37111l51350O3205O6919
13129B33379j34176M7772R5153k15441m47751k82132l9635L5292J41638J81323
13119c84578J30972j57054l3922K00102p2788p5675Q936J8261K18863L38598J62268
13108C53983K2561J50911K06626j13922l31634k16655o6054o78o6515J05345K44086
13097B88054K55530R6450M0903J8661j22602j35434j27393L7762k6817q2430k7495
13086B15189J50056K37521O1077o8221p7991Q9141K30747K84584K31956m6693
13076A307366m5057R6918K67308J5109k14290j40630j49359j14366j13612j8007
$$ plain form
13149 697852 506775 176661 199346 480071 634985 871318 948787 1145652 1511741 1776428
13139 1776428 1821594 1876688 1749017 1337937 944780 791716 454605 103255 166460 233379
13129 233379 99203 146975 242128 26687 -421064 -703196 -742831 -707539 -565901 -384578
13119 -384578 -253606 -410660 -444582 -244480 -317268 -392943 -384007 -365746 -146883 191715 353983
13108 353983 376544 527455 734081 620159 288525 71870 5816 5138 -61377 43968 288054
13097 288054 543584 640034 680937 699598 576996 441562 314169 351931 325114 242684 215189
13086 215189 365245 602766 663843 595622 517631 606772 837519 1122103 1354059 1307366
13076 1307366 1262309 1359227 1626535 1641644 1427354 1286724 1137365 1022999 909387 891380
13066H91380k09476Q5461K01031j40779m0109J06943O1522Q0231K18056J53148
13056A407408M8910m3530j77496l41079n9475K57162R5842q5101j15448j9338
13046I67855j90106k30684Q2251K06408L8034p9549j71938J66093K21866n4095
13036I56135k10810n2498n336J22961J01229K50322K42209j11003k31868p6127
13026I85214o4530K3546J12118L11407Q7277j59862k2906K97458K40970J21494
13016A932186J08255J15836J18464N9852K0699K81968K58994J68423J41719J18857
13006C325253M72360M52680J12618P2122L06122L89350L18914L78096M87760O50540
12996F965815R35060R44655P81974J068855J664672J881434K138148K720363L418705
$$ plain form
13066 891380 681904 767365 968396 827617 787508 894451 955973 1036204 1254260 1407408
13056 1407408 1456318 1412788 1235292 894213 834738 1091900 1187742 1102641 987193 967855
13046 967855 777749 547065 629316 835724 873758 794209 622271 788364 1010230 956135
13036 956135 745325 692827 687491 810452 911681 1162003 1404212 1293209 1061341 985214
13026 985214 920684 944230 1056348 1367755 1455032 1295170 1272264 1569722 1810692 1932186
13016 1932186 2040441 2156277 2274741 2334593 2355292 2637260 2896254 3064677 3206396 3325253
13006 3325253 3797613 4250293 4362911 4435033 4741155 5130505 5449419 5827515 6315275 6965815
12996 6965815 7900875 8845530 9627504 10696359 12361031 14242465 16380613 19100976 22519681
12987B2519681M324613N410309O602297Q321627J0765189J3745688J7710542K3733136
12979A13133082L1072046L8396905L9262349K3593837o802497l2560850m0201445
12972A65893427l5338510k7480653k0656296j5404523j1451489q575812o756843
12965D0229301n677003m795273l831686l224372k490586j951717j444751j210977
12957A5602936j125443j078393j183653j215038j005669n74946m51938m96452
12949H471404n79093o16749l51485j94969j24598j85514k61725o3689J05358q1365
12939F117575m26046m83501l17215N2584L43027L39102J79844J64042J98383K3579
12929F191374O8420K59017J51428J9866J3745K15855L30243N20612P85836J032690
$$ plain form
12987 22519681 26844294 32254603 38856900 47178527 57943716 71689404 89399946 113133082
12979 113133082 144205128 182602033 221864382 245458219 238655722 206094872 165893427
12972 165893427 130554917 103074264 82417968 67013445 55561956 46986144 40229301
12965 40229301 34552298 29757025 25925339 22700967 20210381 18258664 16813913 15602936
12957 15602936 14477493 13399100 12215447 11000409 9994740 9419794 8967856 8471404
12949 8471404 7892311 7275562 6924077 6729108 6604510 6418996 6157271 6093582 6198940 6117575
12939 6117575 5691529 5208028 4890813 4943397 5286424 5625526 5805370 5969412 6167795 6191374
12929 6191374 6259794 6518811 6670239 6690105 6703850 6919705 7249948 7770560 8556396 9589086
12919I589086J293280J385096J214175K51569n97268r58259p90596l67934l16950
12910A0702199k09605K15679M86190N81027R74490J475206J692196K120883K732760
12901B0771025L379984M527068N668160P158818Q840858J1004833J4570115J9552109
12893I5472970K5858406L3684911M0826388L9059369J8253252j5134918l7690840
12886B00329538m1035364l4444232k6182400j9327360j4345020j0868670q286618
12879D5839874o551969n252623m147400l346066k497998j885176j492780j311903
12871A9353959q21202l77800m18203j76463M95109J402555K470011M143416N941452
12862C2012834M181174l201969p021428n286721l233168j868240q84106r27116
$$ plain form
12919 9589086 10882366 12267462 13481637 13733206 13135938 12177679 11387083 11019149 10702199
12910 10702199 10492594 10708273 11194463 11775490 12749980 14225186 15917382 18038265 20771025
12901 20771025 24151009 28678077 34346237 41505055 50345913 61350746 75920861 95472970
12893 95472970 121331376 155016287 195842675 234902044 253155296 238020378 200329538
12886 200329538 159294174 124849942 98667542 79340182 64995162 54126492 45839874
12879 45839874 39287905 34035282 29887882 26541816 24043818 22158642 20665862 19353959
12871 19353959 18532757 18154957 17736754 17560291 18055400 19457955 21927966 26071382 32012834
12862 32012834 36194008 32992039 25970611 20683890 17450722 15582482 14698376 13771260
12854A3771260j578259j525395j031396p48250o07212m28256k50114k54951l57110
12845F990317j37069n4503n3364l17492l63616o9219R6928J89569K51381R8990
12835F631922K66M6764K66862J94630J81392J26509L01285N00132K33727K32737
12825H716226L64966O15177R56737Q86534P96175J042078J275768J816302K268521
12816A8738484K550386L294163L960402M829749O299414P961560J0236682J3147572
12808G1018412J6790540K2163340K9252795L7362376M2966768L6357484J0043000
12801B65954715k3167760m1417702m1842801l4257534k5737943j9132320j4535377
12794F5863278j1217540q695552o685583n254130m325574l767388l108385k599371
$$ plain form
12854 13771260 12193001 10667606 9636210 8887960 8280748 7852492 7602378 7347427 6990317
12845 6990317 6853248 6798745 6745381 6427889 6064273 5995054 6091982 6281551 6532932 6631922
12835 6631922 6632188 6678952 6945814 7140444 7321836 7448345 7749630 8249762 8483489 8716226
12825 8716226 9081192 9696369 10653106 11539640 12335815 13377893 14653661 16469963 18738484
12816 18738484 21288870 24583033 28543435 33373184 39672598 47634158 57870840 71018412
12808 71018412 87808952 109972292 139225087 176587463 219554231 255911715 265954715
12801 265954715 242786955 201369253 159526452 125268918 99530975 80398655 65863278
12794 65863278 54645738 45950186 39264603 34010473 29684899 25917511 22809126 20209755
12786B0209755j968049j488257j562844j675576j339822p77493p52564n88515
12778A0056635n94888m79152m78906o06272m66065n71481l72965n1521j81715
12769F253670m29912n24855k94791N412j54546j59038j71897k34135k08413J5919
12759D097414q9546l36648k58388p800P8975L3187k0414j80701k09633k67302
12749B839144j73980N3486J83188J84891j40126m41263l65172j62045Q2515J97978
12739B258616N4393m1475l0689m0356J6861k17469k38985L1237j1419K8196J49987
12728A958897J60743K4285j64157j77905j56655j17066J07705k0995l00003j81109
12718A133740K6278l6239n5607J56878J37077J02404k7835p3850J63333o6466
$$ plain form
12786 20209755 18241706 16753449 15190605 13515029 12175207 11397714 10645150 10056635
12778 10056635 9461747 8982595 8503689 7897417 7431352 6859871 6486906 6435385 6253670
12769 6253670 5823758 5298903 5004112 5009524 4854978 4695940 4524043 4289908 4081495 4097414
12759 4097414 4007868 3671220 3412832 3405032 3484007 3517194 3496780 3316079 3106446 2839144
12749 2839144 2665164 2718650 2901838 3086729 2946603 2505340 2140168 1978123 2060638 2258616
12739 2258616 2313009 2271534 2240845 2200489 2217350 1999881 1760896 1792133 1780714 1808910 1958897
12728 1958897 2119640 2143925 1979768 1801863 1645208 1528142 1635847 1614852 1314849 1133740
12718 1133740 1160018 1123779 1068172 1225050 1362127 1464531 1436696 1362846 1526179 1459713
12708A459713k65646k39540j53725p4122J3115L0327K51423j52135k95823j52727
12698D20860m8767K46294J48983J69381K4611j6251j24663r1334Q9063r233R9567
12687I08511J05595j7496j14911k62728j88481m0349K07774J07796j57522r970
12677E38219P5242Q5560j43093l18794p9929M6910O3551K00305J39944j42942
12667D64973j71803o4922K15478J94929J03071K8054k3024k8932n160j64658j3833
12656E34173J69596m5542j01137j17295M1229K93765K31382L4547L7408J4524
12646A092650k7466L5134q4901j11082j98519j12038Q1842J54289R0332j1746
12636I08495j45168J05990J38298k18550J992J02163p4777m2704j23272r6882
$$ plain form
12708 1459713 1194067 954527 800802 726680 739795 770122 1021545 869410 573587 420860
12698 420860 372093 618387 767370 936751 961362 945111 820448 729114 818177 808944 908511
12687 908511 1014106 996610 881699 618971 430490 390141 597915 705711 548189 538219
12677 538219 613461 699021 555928 237134 157205 204115 267666 467971 607915 464973
12667 464973 293170 228248 443726 638655 741726 769780 746756 717824 712664 548006 534173
12656 534173 703769 658227 557090 439795 481024 774789 1006171 1040718 1078126 1092650
12646 1092650 1065184 1100318 1015417 904335 705816 593778 675620 829909 920241 908495
12636 908495 763327 869317 1007615 789065 791057 893220 818443 775739 652467 555585
12626E55585J88391M475j42451j3041J50226j14219j30709K9686J45162K7970
12616G01075j82873o6985l7252o5498l6164K1530O1949J27654J28748q2636m6834
12605E22714R0902O036n4950J35712M3237k26224l26170l10480j47535m1967Q4331
12594b24394K55254K62805J42504o7796O1545K95645J29091j1493J15820J00011
12584A058992n3575j52888p0371K02862L20643n0803k09825j96279o4941K21802
12574A005617N0142k28803j89357j80409j66663J06653K16703o7307j70404j06932
12564B69240J8612J33278L18065K77290n6838o4250o7157j10084j907J54570J54173
12553A024992Q3946j06110j22147O2173R5727l7959j65832o3263j7509m1008k61759
$$ plain form
12626 555585 743976 748451 606000 592959 743185 628966 498257 527943 673105 701075
12616 701075 518202 451217 413965 348467 312303 333833 395782 523436 652184 569548 522714
12605 522714 613616 619652 564702 700414 743651 517427 191257 -119223 -266758 -308725 -224394
12594 -224394 30860 293665 436169 368373 429918 725563 854654 843161 958981 1058992
12584 1058992 1005417 852529 782158 985020 1305663 1254860 1045035 848756 783815 1005617
12574 1005617 1055759 826956 637599 457190 290527 397180 613883 546576 376172 269240
12564 269240 287852 421130 739195 1016485 959647 895397 828240 718156 716249 870819 1024992
12553 1024992 1108938 1002828 880681 942854 1038581 1000622 834790 771527 754018 713010 451251
12542D51251k26499M5951K85195P8408K0670O1847n6935o5750j25663j35997l1256
12531C01222J46508J83802N0441k77913k38591Q8375J56138m3466Q3633J1333
12521D61482J55576j8326k10603o6696J14347P6165k9132p2371j9049N2630J40807
12510E84830J15552j49864l78759j84846j009J47945K74376q4503m17158j78213
12500b71649N0297m776N4325M5174P9071j27126O4974L52055J39598j15380J29863
12489C96426K00009P0151j1662m14530l96135M0175K42693K73629J87247j0093
12479E77910j21685L6967j21322l59225j18919K99331Q2580j64134J07489j43019
12469G5973k17451J2207K84679L1318j38685J18457O5058P4J24187O0369j93774
$$ plain form
12542 451251 224752 270703 555898 634306 654976 716823 659888 594138 468475 332478 301222
12531 301222 447730 631532 681973 404060 165469 253844 409982 366516 450149 461482
12521 461482 617058 598732 388129 321433 435780 511945 482813 410442 391393 444023 584830
12510 584830 700382 550518 171759 -13087 -14096 133849 408225 323722 -93436 -271649
12500 -271649 -221352 -226128 -171803 -126629 -47558 -174684 -109710 242345 381943 266563 396426
12489 396426 596435 666586 654924 240394 -155741 -115566 127127 400756 588003 577910
12479 577910 456225 493192 371870 12645 -106274 193057 275637 111503 218992 75973
12469 75973 -141478 -129271 155408 186726 48041 166498 231556 231630 355817 416186 222412
12458B22412k33370j55743Q3928J74838L08803K22513J67222N4775l09718k82784
12448B52876o809m3683m0843K04550K09486L0301L851j03524j66027k30808j27322
12437a7952Q1719J49417J79439m2161j28011k10393j38923j62026m5396J42051
12427a92236K85993J11176k6349m1636K9180r3044j05456J086p0236k4367O1102
12416f4787O5510L1558J175O379K90j03704K1285J38474J27207N0062j33515j19392
12404B0542n0397k07439j03108J00224J07072L4081N0747Q561p0317j44967j35663
12393c90664j35788j54109L2560K55349M71303K71991N2532k5751q6977j216L5438
12382C24668R1701J03306j6063k97774j82836k0259j3047M1077r8211k21895J36780
$$ plain form
12458 222412 -10958 -166701 -82773 92065 400868 623381 790603 845378 535660 252876
12448 252876 246067 202384 161541 366091 575577 605878 609729 506205 340178 109370 -17952
12437 -17952 63767 213184 392623 350462 222451 12058 -126865 -288891 -334287 -192236
12427 -192236 93757 204933 178584 136948 166128 73084 -32372 -31286 -101522 -125889 -64787
12416 -64787 723 32281 33456 39835 40125 -63579 -42294 96180 223387 273449 139934 20542
12404 20542 -29855 -237294 -340402 -240178 -133106 -99025 -48278 -39717 -110034 -255001 -390664
12393 -390664 -526452 -680561 -648001 -392652 78651 350642 403174 377423 290446 289230 324668
12382 324668 416369 519675 503612 205838 23002 2743 -10304 30773 -67438 -289333 -152553
12371a52553J54982j02344q8894J9557J11133J01564J46055N8221P7744k04226
12361A21239k62069l56028O3291L79542J98072O6938k9838k4315j57104p4174
12351g4446J14803J05309j44864l6992K84621K01575L9446j30211k26207n164
12341A27870k7856m6160J7505J0092r2344r5233L5167O8219K06817J18611q2928
12330B39760j40041m4642K18242K02240K28949L85836J78289o2215k66222m83822
12320D56374m90777k56467o0761J54284J57695Q6502J14674J20200Q5211m2703
12310C24232j46867p0017k5442j70616j70759n7660o7452l4049J48253J60000
12300a10377M963N1586R8994J19311Q7130J71468J17503r9594l06831L3368L11200
$$ plain form
12371 -152553 2429 -99915 -188809 -169252 -58119 43445 189500 247721 325465 121239
12361 121239 -140830 -496858 -433567 -54025 144047 210985 181147 156832 -272 -74446
12351 -74446 40357 145666 802 -36190 248431 450006 489452 359241 133034 127870
12341 127870 100014 53854 71359 81451 -10893 -106126 -70959 -2740 204077 322688 239760
12330 239760 99719 55077 273319 475559 704508 1090344 1268633 1206418 940196 456374
12320 456374 -34403 -290870 -351631 -197347 -39652 46850 161524 281724 366935 324232
12310 324232 177365 107348 81906 -88710 -259469 -317129 -384581 -418630 -270377 -110377
12300 -110377 -105414 -53828 45166 164477 251607 423075 540578 440984 134153 167521 478721
12289D78721J34986j08986j45261r4394j48506O9770l7165j1491m2532j60907
12279f5765J47100L33941R8673j02221j49808j36731j947j00767j0390K02701
12269B14786K61437O1535j75327m5498k74639k85269p6490J00610M06616L59470
12259E47231O9785j06789O003K3845j15862j07411m5630k95030p4839L6072j87083
12248b49708J0994K31735M09739J68805j02558j11895J8008J47109l1970K1287
12238E11546L32729N6490r6382m5244j48612j82765l06997l54233m9012K26234
12228e6246K22786J03144J36196L5969j14803k02583j41363k26796j06809O357
12218c44148j9920O9596j40884o5403L93191N17558J96005p2806j46812q6699
$$ plain form
12289 478721 613707 504721 359460 265066 116560 186330 149165 137674 95142 -65765
12279 -65765 81335 415276 513949 411728 261920 125189 123242 22475 12085 214786
12269 214786 476223 537758 362431 316933 42294 -242975 -319465 -218855 187761 547231
12259 547231 617016 510227 516230 540075 424213 316802 271172 -23858 -98697 -62625 -249708
12248 -249708 -238714 -6979 402760 571565 469007 357112 375120 522229 490259 511546
12238 511546 844275 900765 804383 759139 610527 427762 120765 -233468 -282480 -56246
12228 -56246 166540 269684 405880 441849 327046 124463 -16900 -243696 -350505 -344148
12218 -344148 -364068 -294472 -435356 -500759 -107568 409990 605995 533189 386377 299678
12208B99678L5602M658l44370l58653J83697J93115k18900j52133m8282r8607
12198e04195k7451J92665J54823J39843K08561J74531J51834m1986N7885N2659
12188E59169j53651J0515o2694j39415j11807J35428J50134j44230k18415m23946
12178c98912l50496J47052N41799J55535l27312k18402J59552K22548N7440k48910
12168b60106r9171J97175J87399O03P6475m9882J29744J22727j4307K8465J2063
12157C31185j26977k00950O0247J30046n1403j18186P2614K13573j76186j82631
12147d8668m5448M152j25964j73092j6354K48210M6493J89186K79438Q4838Q1009
12136E23800K06496J89868J44291N52481O91612o61742j102878L8100J82317j12538
$$ plain form
12208 299678 335280 339938 -4432 -363085 -179388 13727 -205173 -357306 -405588 -504195
12198 -504195 -531646 -338981 -184158 -44315 164246 338777 490611 448625 506510 559169
12188 559169 405518 416033 353339 213924 102117 237545 387679 243449 25034 -398912
12178 -398912 -749408 -602356 -60557 94978 -232334 -450736 -291184 -68636 -11196 -260106
12168 -260106 -359277 -162102 25297 25900 102375 52493 182237 304964 290657 319122 331185
12157 331185 204208 3258 63505 193551 142148 23962 96576 310149 133963 -48668
12147 -48668 -94116 -89964 -215928 -389020 -405374 -157164 -110671 78515 357953 442791 523800
12136 523800 730296 920164 1064455 1616936 2308548 1646806 543928 582028 764345 651807
12126F51807l36391P4534j21772j74929Q7267M6726p0113k68016P124K42354J29303
12115B67894j11950r5947J17772j112m7940j10134j25027J5872l9530k44177j11535
12104d85814P1021Q9129J17450J83146O378r4023o6568k29571j79339O7270Q0480
12093d40441K99071J06303n0944p5547j42723k81262J6918J82395o0558J35084
12083c11704J53633O2391K06100J68100j97668j86152q0064J4146m2676Q887P9425
12072a25582J8477j63405j89565n9340m6767q3673r9761l7329J76013L45121N4206
12061b11605j08977m4898K56341L25391K36125K49581O3385j64297o2668Q3694
12051F22072J86957J91203J83982N2537j98298j48716k33388j21003j09529p8890
$$ plain form
12126 651807 315416 389950 268178 93249 180516 227242 157129 -110887 -103763 138591 267894
12115 267894 155944 59997 177769 176657 128717 18583 -106444 -90572 -130102 -374279 -485814
12104 -485814 -414793 -325664 -208214 -25068 -18690 -112713 -179281 -408852 -588191 -520921 -440441
12093 -440441 -141370 -35067 -86011 -161558 -304281 -585543 -568625 -386230 -446788 -311704
12083 -311704 -158071 -95680 110420 278520 80852 -105300 -185364 -171218 -213894 -205007 -125582
12072 -125582 -107105 -270510 -460075 -519415 -566182 -649855 -749616 -786945 -610932 -265811 -211605
12061 -211605 -320582 -365480 -109139 216252 452377 701958 765343 601046 538378 622072
12051 622072 809029 1000232 1184214 1236751 1038453 889737 656349 535346 425817 346927
12041C46927j22694P943q5795l43086j86290K47324L06497q0432N4323L13811
12031D58528L43779J44336k0206j37286j61469j01413O6931k2809l5775L6637
12021E71253J49041K03202l09265m71549k88292q3061J88605K88783K86711R6550
12011F31978m2665j2757J47209J04762m1641r4061j50481j05135P2948K82938
12001G93095O9904j72757k86311l72478m73563l10028J86408M23033K46004o4739
11991C8568j80762J42100K54850J25792J58125P6337M5313l1767j64220j38345
11981C25991l5823j74953n8708o016p9820k244J88929J14305k28832m6580J5480
11970A1729J12193J53533J02981N3713j21980o1891n5985j98308k80197j85074
$$ plain form
12041 346927 224233 232176 146381 -196705 -382995 -135671 170826 90394 144717 458528
12031 458528 802307 946643 926437 789151 627682 526269 593200 570391 534616 571253
12021 571253 720294 923496 614231 142682 -145610 -228671 -40066 248717 535428 631978
12011 631978 589313 576556 723765 828527 786886 692825 542344 437209 510157 793095
12001 793095 862999 690242 403931 31453 -442110 -752138 -565730 -142697 103307 38568
11991 38568 -142194 -94 254756 380548 538673 615010 660323 628556 464336 325991
11981 325991 290168 115215 56507 50491 -29329 -31573 157356 271661 42829 -3751 11729
11970 11729 123922 277455 380436 434149 312169 250278 194293 -4015 -284212 -469286
11960d69286K9836J12855J78366K25189K68217L17705L35884J67112J32862P6540
11950A375280j95163j11171Q304L6381M9441o7013j49249rO526k7303J4720M1997
11938I82741K1735R1900m6455k14371j44844K64923J60768j00435o9006J07120
11928A054076J80349J88842R3123k2488N7757L00874M83970O50536Q16694N86339
11918D390072O65339J085602J248626J401921J673282K097618K351797J629766
11910A6544023j04815j747651k327016k114547j567771j220007j099449q01253
11902E561514p39299p04984n45388l62471j74470k52553m26789j69917q8653k40883
11892A856107k28869j40643m2450p6722l20102k06911J39449J41343r8051p3940
$$ plain form
11960 -469286 -439450 -326595 -148229 76960 345177 662882 998766 1165878 1298740 1375280
11950 1375280 1180117 1068946 1077250 1113631 1163072 1096059 946810 946801 953327 926024 940744 982741
11938 982741 1004476 1096376 1049921 835550 690706 955629 1116397 1015962 946956 1054076
11928 1054076 1234425 1423267 1516390 1493902 1551659 1852533 2336503 2987039 3803733 4390072
11918 4390072 5055411 6141013 7389639 8791560 10464842 12562460 14914257 16544023
11910 16544023 16439208 14691557 12364541 10249994 8682223 7462216 6362767 5561514
11902 5561514 4822215 4117231 3571843 3209372 3034902 2782349 2355560 2185643 2096990 1856107
11892 1856107 1627238 1486595 1444145 1367423 1047321 840410 979859 1121202 1023151 949211
11882I49211j17403p3801l9258M8241K87945O3428k21887k14060p9394R2255O4767
11871G60044p5931J78132K25386n6984k14557k64530J35073M99782M38876L80310
11861B005601L80801k0810n46564l74309j83551l20215l9059L958k64480k36116
11851D05256o241R5164K79730R9345p9442n0796K0331p3653K9056o0042n7237
11840F01471m1994J07902J43959L6073J33789q5796k31558j46315l42126o1079
11830A14326J28694q4483R7251J89682J84321k7744r9115k61897J40706L23766
11820G05507L0776j55726m9297j35778j54688q8797j22329p6865J28662K26998
11810C08463J10022j58320k89667L5661J39246K38823N0361k01945k44134R6983
$$ plain form
11882 949211 831808 758007 718749 766990 1054935 1118363 896476 682416 603022 695277 760044
11871 760044 684113 862245 1087631 1030647 816090 551560 686633 1186415 1625291 2005601
11861 2005601 2386402 2365592 1819028 1444719 1261168 940953 901894 905852 641372 405256
11851 405256 399015 494179 773909 873254 793812 743016 763347 689694 718750 658708 601471
11840 601471 559477 667379 811338 847411 981200 895404 663846 517531 175405 114326
11830 114326 243020 158537 255788 445470 629791 602047 502932 241035 381741 705507
11820 705507 736283 580557 531260 395482 240794 151997 29668 -47197 81465 308463
11810 308463 418485 260165 -29502 6159 145405 384228 434589 232644 -11490 85493
11800H5493J84825N8443J5574q3517J03277K23015K40071j95445l52550j0483
11790B68703j15490j83629j1494R3126l2319k17012j95924M0427L50859K55238
11780B52485R2833J99163J04747j72392l16104L4691K45089l0536j81385Q7479
11770C16070M0708J0095j7231j31327p7019J45231N1239J81852j30945k74221
11760A14452J2192Q6135k0860J62514K55013K78879n0925j51436m6226L5024m01137
11749B73625k29439J81824j263403l14681r5844L9099N23807P35818J47398p2495
11739g4291j90696k01912O4705K64633R4565k88401k18187J26053J83967J54410
11729h5154J31440L4852j28541j8179j26041k32401k40574k19405k07333K45017
$$ plain form
11800 85493 270318 328761 344335 260818 364095 587110 827181 631736 279186 268703
11790 268703 153213 -30416 -41910 51216 18897 -198115 -394039 -353612 -2753 252485
11780 252485 345318 544481 649228 476836 160732 195423 440512 409976 228591 316070
11770 316070 356778 366873 349642 218315 141296 286527 337766 519618 388673 114452
11760 114452 126644 212779 191919 354433 609446 888325 837400 685964 639738 674762 273625
11749 273625 44186 226010 -1037393 -1352074 -1447918 -1408819 -885012 -149194 -1796 -74291
11739 -74291 -264987 -466899 -402194 -137561 -42996 -331397 -549584 -423531 -239564 -85154
11729 -85154 46286 81138 -47403 -65582 -191623 -424024 -664598 -884003 -1091336 -846319
11719h46319M85193K38519K11663l7281j56442N6960l0861j18555o8080l4248
11709b99451l9537j41250L1970J18282O4827j38798j90258q1543J86568M17862
11699g1328K86539l732K6592j04107j27485l3036M4233O1358J08568O3697J31086
11688C82385J45306k2115l8663j74106j52427k74741k86658O1834K25291J88730
11678E4836K32743O0396j44968l2806o3323j28767k018P7961J17300o2388j49858
11667d0892j0307K33233J62488O8925p065j68857j32196k5281l9977j50090k006
11656a12025K5383K7243M2816J32712q754L4703R2585J60299K63615M3043j70147
11645E31473j64932m3622M8831K2195n3148k26169j51069m8307J8138L8384m5704
$$ plain form
11719 -846319 -361126 -122607 89056 51775 -104667 -47707 -78568 -197123 -265203 -299451
11709 -299451 -338988 -480238 -448268 -329986 -265159 -403957 -594215 -675758 -489190 -71328
11699 -71328 215211 211479 238071 133964 6479 -26557 17676 79034 187602 251299 382385
11688 382385 527691 505576 466913 292807 140380 -134361 -421019 -359185 -133894 54836
11678 54836 287579 347975 203007 170201 106878 -21889 -23907 54054 171354 108966 -40892
11667 -40892 -51199 182034 344522 413447 406382 237525 105329 80048 40071 -110019 -112025
11656 -112025 -86642 -59399 -16583 116129 107375 142078 234663 394962 658577 701620 531473
11645 531473 366541 322919 371750 393945 340797 114628 -36441 -84748 -66610 -28226 -73930
11634g3930n2998J20215N9950O9109l1901k9448O838J21541K46564j91022k76214
11623c1296O2749O9671R8045N2528m9736K03462J75233j71231k53298j62428P9360
11612G3059Q5294o118o6540j2649K04920K11896p794l05546j56160K8085j59654
11601a11207l3402j59958m1411L6344M3498N7987k57808k32910r6939P7656K66293
11590d51857K91023l0206j1512J81689R0405L7924p0967j34044j56248j67534
11580d21327K5190L46967M38201l5525k80685k56603N6999K08421N333N2383K65500
11569D04854K13271O0234k70612k24090N148J10744K64626J76566J12121O5392
11559I18254j03235o1581m3140k05059l2254J15011R8662l8035m2160j45545q2464
$$ plain form
11634 -73930 -126928 -6713 53237 122346 90445 60997 67835 189376 435940 244918 -31296
11623 -31296 31453 101124 199169 251697 201961 405423 580656 409425 156127 -6301 73059
11612 73059 158353 152235 85695 73046 277966 489862 482068 176522 20362 48447 -111207
11601 -111207 -144609 -304567 -345978 -309634 -266136 -208149 -465957 -698867 -795806 -718150 -451857
11590 -451857 -160834 -191040 -202552 -20863 69542 107466 36499 -97545 -253793 -421327
11580 -421327 -396137 -49170 389031 353506 72821 -183782 -126783 81638 86971 139354 404854
11569 404854 618125 678359 407747 183657 188805 299549 564175 740741 852862 918254
11559 918254 815019 753438 710298 505239 472985 587996 686658 648623 606463 460918 378454
11548C78454J5035P8315R6885J70872K08976q411q7380l83573j89451P7891J85100
11537E42713J61277p5651j26345j40581Q1354J61888R6747n0072M5299J01133
11527G97762R42k0876j25801j17055J55822J39762R8327q1494J6997k2783j72992
11516F68611j20398J36321J75151K63131J78353j09739o2531L50446L60567L00536
11506B140448J81435K66571M99329O16857O88499R74076J264362J476199J833863
11497I941639K410163K882605K406300J053472o32092j819726j899772j648993
11489A2693596j311648p01398k83892J69933Q98183J484138J914972K036057J632036
11480A8531977J41686j737027k587544k378994k142743j805354j353939j170739
$$ plain form
11548 378454 393489 471804 568689 739561 948537 940126 852746 469173 279722 357613 542713
11537 542713 703990 628339 501994 361413 442767 604655 701402 651330 696629 797762
11527 797762 798704 777828 652027 534972 690794 830556 928883 847389 864386 841603 668611
11516 668611 548213 684534 859685 1122816 1301169 1191430 1128899 1479345 1839912 2140448
11506 2140448 2321883 2588454 3087783 3704640 4393139 5367215 6631577 8107776 9941639
11497 9941639 12351802 15234407 17640707 18694179 18062087 16242361 14342589 12693596
11489 12693596 11381948 10680550 10396658 10566591 11464774 12948912 14863884 16899941 18531977
11480 18531977 18673663 16936636 14349092 11970098 9827355 8022001 6668062 5497323
11472E497323q01802m34176l38001o75154n78904k78908l65850l35860k5892l3319
11462A629457j41465l37161m36172o41952q77363j93757N93950L52472M23802
11453C71811K30712M87509M72320m53K8478P6544j93236m32664m20938j43331
11443D76752k469p6693j48506Q1701j28246j20748J82475l4291l42003r0104K41399
11432C9267K15454M7222K4660R2102O0270P0523m3841l02807j11039q550r7530
11421a4269J88623J05362P0469M0692M5753k1344N6935k34506l06505l31548j62137
11410e62475J92263J03320J88815M12656J77236J4399j30961o0854K68012r6522
11400E05889k63418n6019K33044j9328k33095j42536K8472J4999j74594l5778
$$ plain form
11472 5497323 4695521 4261345 3923344 3248190 2669286 2390378 2024528 1688668 1662776 1629457
11462 1629457 1487992 1150831 714659 72707 -804656 -998413 -404463 -51991 371811
11453 371811 602523 1090032 1562352 1561899 1590377 1666921 1473685 1041021 620083 476752
11443 476752 474283 397590 249084 330785 202539 81791 264266 229975 -112028 -202132 39267
11432 39267 254721 301943 326603 418705 478975 549498 505657 202850 91811 83261 -14269
11421 -14269 174354 279716 350185 390877 436630 415286 472221 237715 -68790 -400338 -562475
11410 -562475 -370212 -266892 -78077 334579 511815 526214 395253 334399 602411 505889
11400 505889 242471 186452 419496 400168 167073 24537 53009 68008 -106586 -142364
11390a42364K03528N318k71654q8209M9226J30028J43590R5524J66632J94728
11380D86347J7652k14840j57204j562J55423P7686l9640j14024o7693j13582K31704
11369B60267L32975j07864j79234o9269j22749k28697K6662K6098J4873O4091
11359A7153P2286J2654J0344M8626j2313l4246J40079O6427J44814L18475L08559
11348A092858Q4253j55639k34743o1658k28520k66215k17907j14538L7479O9749
11338E119O2277P988q6034o7949l7673R8704K09267R5382o914o407j32953k40822
11326a00015o8318K03929Q1908j46851k40490j62583M229j5333J42980K65141
11316c5403K11944K03255N8664K1368J3287k61402k69592q0814j06864p3770J95430
$$ plain form
11390 -142364 61164 66482 -205172 -293381 -244155 -114127 29463 124987 291619 486347
11380 486347 503999 289159 131955 130393 285816 363502 323862 209838 142145 28563 260267
11369 260267 593242 485378 306144 236875 114126 -114571 -87909 -61811 -46938 17153
11359 17153 89439 102093 112437 161063 148750 114504 254583 321010 465824 784299 1092858
11348 1092858 1177111 1021472 786729 725071 496551 230336 12429 -102109 -64630 5119
11338 5119 67396 75384 -10650 -78599 -116272 -17568 191699 287081 280167 273760 140807 -100015
11326 -100015 -168333 35596 117504 -29347 -269837 -432420 -428191 -443524 -300544 -35403
11316 -35403 176541 379796 438460 459828 473115 211713 -57879 -138693 -245557 -319327 -123897
11305a23897J8549K1155K52379L27786n9851k37545k51373j43368m122j70558
11295c70845j99326K07803K65207K41161K86353j06593k68569J7981J71971R5957
11285C41100n8210l0703j63088p9386J27702K15372P3318j04986K8394n7417j29277
11274A62819N6119J33621q5843L2011O1496J18678K68037N9472j06197m3724l04182
11263C52307l01914k35999j19348M893l0813K743R0958J26389K8937m9419j00767
11252b32033o1675l0361R7769J07935P8485P2198l9871P6699K72761J42092o180
11241D77819j3979J79124m1030l66243k05232j09051Q692K54543Q6363j5925J4772
11230B69853k8523k08062m7748M1171j10776K43K38758J95982M4011N8730N5427
$$ plain form
11305 -123897 -105348 -84193 168186 495972 436121 198576 -52797 -196165 -200287 -370845
11295 -370845 -570171 -362368 -97161 144000 430353 323760 55191 73172 245143 341100
11285 341100 282890 252187 89099 9713 137415 352787 426105 321119 349513 292096 162819
11274 162819 218938 352559 266716 298727 360223 478901 746938 806410 700213 656489 352307
11263 352307 50393 -185606 -304954 -300061 -330874 -328131 -237173 -110784 -81847 -131266 -232033
11252 -232033 -293708 -324069 -226300 -118365 -39880 32318 -7553 69146 341907 483999 477819
11241 477819 463840 642964 601934 235691 30459 -78592 -69900 184643 271006 255081 269853
11230 269853 241330 33268 -14480 26691 -84085 -83842 154916 350898 394909 453639 509066
11219E09066J5047j15919m4313k51951k79865N5114K30681K08455m0967j19557
11209A65791O9302K22525M442k60672j11906N124n2338M2o286L768M5235m3078
11197D1949k1360j29537n5028L3744k36772j30457O3205J32972k737n7508m5783
11186d07312P132K67892J80251j58346l13233p9496R8166J86271M4126p5865J48369
11175a02045K40875k6176j24539o9633K61955K02847k82937k87813k56654O0841
11165c83279L31370J12318o5887r5931m7841n171j24381r5597p768j4709l23983
11154g20859j81907K3441L05366N72768L22691r6028j42930O7102j26951l0878
11144h185q2079j79967j30319r4896n6961K5184N93n2128l9581P5454Q5582n7780
$$ plain form
11219 509066 524113 408194 363881 111930 -167935 -112821 117860 326315 285348 165791
11209 165791 235093 457618 462060 201388 89482 94606 42268 42310 36024 39792 85027 41949
11197 41949 20589 -108948 -163976 -130232 -367004 -497461 -434256 -301284 -304021 -361529 -407312
11186 -407312 -400180 -132288 47963 -110383 -423616 -503112 -404946 -218675 -174549 -250414 -102045
11175 -102045 138830 112654 -11885 -81518 180437 383284 100347 -187466 -444120 -383279
11165 -383279 -51909 60409 -5478 -101409 -149250 -154421 -278802 -374399 -382167 -396876 -720859
11154 -720859 -902766 -879325 -573959 -1191 321500 225472 82542 149644 22693 -8185
11144 -8185 -90264 -270231 -400550 -495446 -552407 -527223 -526630 -578758 -618339 -542885 -457303 -515083
11132e15083q3102R8861L08364K25156K56651Q4957o739j36329k79950j71400
11122b18614M2844J07428J41833r3502k19938r8735R0755J39146k1846k3343R5508
11111e8464p392L0937L03309J64777J03223Q5434k14021k10670p9368k06987k11090
11100c00312K1922l0826j65115l52129k29878m0617k4272L98275L90718J99212
11090a33022l4566j54443L0748J30676m070k3841J04656L36195L13078J6569N7516
11079F39496o1196j43009j75649k69336k02511o7796j75167j83605p814J41997
11069e04590K77057L39095N9946l54465j54313o3337R0206N34974J18480j14694
11059B28359p7461j23772L1297O0141N7427j9087q4533l06234j82494M903j28762
$$ plain form
11132 -515083 -598185 -499324 -190960 34196 290847 375804 369065 232736 -47214 -218614
11122 -218614 -175770 -68342 73491 -20011 -239949 -338684 -247929 -108783 -130629 -153972 -58464
11111 -58464 -65856 -34919 268390 433167 536390 621824 407803 197133 117765 -89222 -300312
11100 -300312 -278390 -309216 -474331 -826460 -1056338 -1096955 -1121227 -722952 -332234 -133022
11090 -133022 -167588 -322031 -291283 -160607 -164677 -188518 -83862 252333 565411 581980 639496
11079 639496 578300 435291 259642 -9694 -212205 -280001 -455168 -638773 -646587 -504590
11069 -504590 -227533 111562 171508 -182957 -337270 -400607 -310401 224573 343053 228359
11059 228359 150898 27126 58423 118564 175991 156904 72371 -233863 -416357 -411454 -540216
11048e40216j08623K0056K27635L82184O4203k05267j95494j27548n6200j26998
11038f66268j00452P4312O5485N5979o3951k09338j45760Q2140J61228J65177
11028e81448L1632K40084L96326J64219O4800O7207j02027k02921l13226j62467
11018c97821N6220J52263J73965K6314Q6997O5990o0047j31433p1766J9340J19874
11007C9896j01404j14370Q2588P0765K1085j20631k30236j29704J11366K39563
10997a31082k5301j39544k6301o8082o983O0126j5721l8515K10870J71794J40619
10986A31880J58881J63384j55376l32822j68672Q6809P3884p8613r0487J1735
10976a99397k3864j1825j0096N580K01470J50562o9091j29691m076j9760l35048
$$ plain form
11048 -540216 -648839 -628783 -401148 -18964 45239 -160028 -355522 -483070 -539270 -666268
11038 -666268 -766720 -692408 -626923 -570944 -634895 -844233 -989993 -907853 -746625 -581448
11028 -581448 -549816 -309732 86594 250813 315613 382820 280793 77872 -235354 -397821
11018 -397821 -341601 -189338 -15373 10941 97938 163928 103881 -27552 -99318 -79978 39896
11007 39896 -61508 -175878 -93290 -22525 -1440 -122071 -352307 -482011 -370645 -131082
10997 -131082 -156383 -295927 -322228 -390310 -397293 -337167 -352888 -391403 -180533 -8739 131880
10986 131880 290761 454145 298769 -34053 -202725 -115916 -42032 -120645 -211132 -199397
10976 -199397 -223261 -235086 -245182 -239602 -38132 112430 43339 -86352 -90428 -110188 -445236
10965d45236l63604J82320J80189N7227k87663l15980J60843K51737J16511K3231
10955d40425K7012M9156q1815J18152J81863J12901J04083J8246J44652j53703
10945H0122l61605p2462J7521r6646m746m7521R6858J02148J26764K2330J88699
10934E1462O8273j12501P3385K42540K43321J40427r304k33330j75163q2615q5272
10923A21223k6359o3308Q8514o5691q1098Q9799O2948j1467j20965J3098J75559
10912A82253J27497o7871j60231k89113p9968r0093J44840L08705L08425J15286
10902D99730l0461k44424k63662q3491O6511j44058K1958K13928J99637J27214
10892C62882J42853J96262J05424n6172l46915l38632k36073l20438p8667K08786
$$ plain form
10965 -445236 -808840 -626520 -446331 -389104 -676767 -992747 -831904 -580167 -463656 -440425
10955 -440425 -413413 -364257 -446072 -327920 -146057 -33156 70927 89173 233825 80122
10945 80122 -281483 -353945 -336424 -433070 -437816 -485337 -388479 -286331 -159567 -137237 51462
10934 51462 119735 7234 80619 323159 566480 706907 697603 464273 289110 206495 121223
10923 121223 94864 31556 120070 54379 -26719 63080 126028 114561 -6404 6694 182253
10912 182253 309750 241879 81648 -207465 -287433 -377526 -232686 76019 384444 499730
10902 499730 469269 224845 -38817 -122308 -55797 -199855 -177897 36031 235668 362882
10892 362882 505735 701997 807421 751249 404334 65702 -170371 -490809 -569476 -360690
10882c60690J50879J75256j4182j41083l4454j03103j9730J35701J12707J03321
10872D622o1151P4131J58815J12012l8820j62850l09129k8117M4804o1120l5270
10861c02073J6639J16287R0832M7959J46054j70835k17369L0660J23456J06635
10851a1755J50602Q3573k11754l77143o0385J46698l1808j73740l0903Q1885j93358
10840f28088m201K47182J35828L3231J45056K11807k7148k00215K6796m786n7506
10829a22044J7638L6535K84709J97706j19147k02258j9886R2520J68243K21295
10819E55311R3827J61853R7808j7828r9790Q9714L82399L63808R2274M3881j21521
10808A641736n69333n35007j72900R171k739k4093k23868k92515r5640k1091R160
$$ plain form
10882 -360690 -209811 -34555 -48737 -189820 -224274 -327377 -347107 -211406 -98699 4622
10872 4622 -56529 17602 176417 288429 249609 86759 -222370 -250487 -205683 -266803 -302073
10861 -302073 -285434 -169147 -78315 -30356 115698 -55137 -272506 -241846 -118390 -11755
10851 -11755 138847 222420 10666 -366477 -426862 -280164 -311972 -485712 -516615 -434730 -628088
10840 -628088 -632289 -385107 -249279 -216048 -70992 140815 113667 -86548 -59752 -64538 -122044
10829 -122044 -104406 -67871 216838 414544 295397 93139 73253 165773 334016 555311
10819 555311 649138 810991 908799 890971 791181 880895 1263294 1627102 1719376 1763257 1641736
10808 1641736 1072403 537396 364496 373667 370928 346835 122967 -169548 -265188 -286279 -277119
10797b77119j0785n6970J08917M5102l8974J73320K96330J30652p0812N9288R3561
10786D52510M3513m1489K6478M8128K0278j58026J8974k58187l25447j84502J30105
10775b27665J71853M2311K02981K03970j24158j84573J83487J49710K9235q04
10765D46347k24690q7654M9852k2238j77419r8566Q3153J38221J39064L2262j57583
10754A20749j99831j18147l8119m3129r1506k7803Q5218J33567N7149j41811n0305
10743c13968L17330K01392j14146k11926o7526p8506q8095R8279J90376o7337
10733a34127q9911R4218J45910J73904L1600r9615m3710N1695n2129j22622R9442
10722E4655K09411n7685k50919j88801J1676N8826o9408J39461K64860J8075m146
$$ plain form
10797 -277119 -287904 -344874 -235957 -190855 -229829 -56509 239821 370473 299661 358949 452510
10786 452510 496023 454534 481012 529140 549418 391392 410366 152179 -173268 -357770 -227665
10775 -227665 -55812 -13501 189480 393450 269292 84719 268206 417916 447151 446347
10765 446347 221657 134003 183855 161617 -15802 -114368 -31215 107006 246070 278332 120749
10754 120749 -79082 -197229 -235348 -278477 -369983 -397786 -312568 -179001 -121852 -263663 -313968
10743 -313968 3362 204754 90608 -121318 -188844 -267350 -355445 -257166 -66790 -134127
10733 -134127 -224038 -129820 16090 189994 221594 121979 78269 129964 77835 -44787 54655
10722 54655 264066 206381 -44538 -233339 -221663 -162837 -232245 -92784 172076 190151 186005
10711A86005n5197k39203l40775K15939L88113r7406k94964j4671R3188J65922
10701F951K158k29436P4922L0290P7068k3722j0366m9874l7587k18087m9072j04076
10689e30831j50673J22840J13743R0576J75167K66551J11266m8522P9267j2068
10679B17316k7828j60544l63013P7245J19630p3308O9868K1749j42523j89268
10669d50676l6079j376K2368q3381r2110N7767K77497J13056r9088o2048K8822
10658c25248j1147J19941K27160J10461p4608j68053l1681J21447N760r4693p4155
10647a94816j91161k81573j66344j00345k25503p2005K91524M77438K59216K9561
10637a74008P3338l3343m24238k55786J23856M6070J86448K67614R3487o1494
$$ plain form
10711 186005 130808 -108395 -449170 -233231 154882 57476 -237488 -252159 -158971 6951
10701 6951 9109 -220327 -145405 -115115 -38047 -61769 -72135 -122009 -159596 -377683 -426755 -530831
10689 -530831 -681504 -558664 -444921 -354345 -179178 87373 198639 150117 229384 217316
10679 217316 189488 28944 -334069 -256824 -137194 -210502 -140634 -118885 -261408 -450676
10669 -450676 -486755 -488131 -465763 -549144 -641254 -583487 -305990 -192934 -292022 -354070 -325248
10658 -325248 -336395 -216454 10706 121167 46559 -121494 -153175 -31728 -25968 -120661 -194816
10647 -194816 -385977 -667550 -833894 -934239 -1159742 -1231747 -940223 -462785 -203569 -174008
10637 -174008 -100670 -134013 -558251 -814037 -690181 -644111 -457663 -190049 -96562 -158056
10627a58056k2055k42231j80423L02189M21066O1010k72150l64998k66087J33788
10617e87947J68626j31962j06504K9471J15898K15851J57187K7541j5699n6571
10607a84109l1855j03700j01749O9850J82227m6234R2312J91137L1664p3992m8458
10596b2907M8212R4587j91739k24632Q4182J15898J68024J1209k0082p5876n6468
10585f9592P0898M1847o779k3147p0092j06939o3143k475P249N2935m6981m0278
10573b56497l6909j82308k33813N263J81580J8620J30797M7093P84J16579J6886
10562a91925n217Q1101j78315k81499k5577K18554K28635Q5324K6964j37143j52955
10551c32053q3301o3823r9030o0994Q4058K48078O3817o8461j51666j43099j93579
$$ plain form
10627 -158056 -180111 -422342 -602765 -300576 120490 181500 -90650 -455648 -721735 -587947
10617 -587947 -419321 -551283 -657787 -628316 -512418 -296567 -139380 -111839 -127538 -184109
10607 -184109 -215964 -319664 -421413 -351563 -169336 -215570 -123258 67879 99543 25551 -22907
10596 -22907 25305 119892 -71847 -296479 -212297 -96399 71625 82834 62752 -13124 -69592
10585 -69592 1306 43153 36374 13227 -56865 -163804 -226947 -229422 -222173 -169238 -216219 -256497
10573 -256497 -293406 -475714 -709527 -704264 -522684 -504064 -373267 -326174 -325390 -208811 -191925
10562 -191925 -197142 -116041 -294356 -575855 -601432 -382878 -154243 -68919 -41955 -179098 -332053
10551 -332053 -415354 -479177 -578207 -639201 -555143 -307065 -243248 -311709 -463375 -606474 -800053
10540h00053n7383J56055L05936J23060k25978j2925K55507N9729j14282n2470
10530c62804r017J01743n1163k25600L2869M3047j59484K5561N9856K8710J11480
10519d04802N4386R9173J8947j0838j21643r4425o6214j020J46787J83793m9006
10508b44862l2998m4962M3854P8212j3394o342m2758K09466J41017j2426K7709
10497A02516j6065J20488K84761J75676J19580j54396l09553k57633j78041r6682
10487b09349l3170P6846J95049J17158j11924q8219R9851J8799k59586j82341
10477c76886r3910M9239J37187K98070K39017K2720o602J67755N4922j77296j95699
10466A18517j85417j91698j9193K6548K4518J05859m7741j30162J5424k477p901
$$ plain form
10540 -800053 -857436 -701381 -395445 -272385 -498363 -511288 -255781 -196052 -310334 -362804
10530 -362804 -371821 -270078 -321241 -546841 -513972 -470925 -630409 -604848 -544992 -516282 -404802
10519 -404802 -350416 -251243 -232296 -243134 -364777 -459202 -525416 -526436 -379649 -195856 -244862
10508 -244862 -277860 -322822 -278968 -200756 -214150 -220492 -263250 -53784 87233 74807 102516
10497 102516 86451 206939 491700 667376 786956 632560 323007 65374 -112667 -209349
10487 -209349 -242519 -165673 29376 146534 34610 -53609 46242 65041 -194545 -376886
10477 -376886 -470796 -421557 -284370 13700 252717 275437 268835 436590 491512 314216 118517
10466 118517 -66900 -258598 -277791 -251243 -226725 -120866 -168607 -298769 -283345 -285822 -293723
10455b93723n1708N1513J71463Q5119O9726j0546k10288n5553J61131K12784j84055
10444e4137k38303l5158J3567J77021n4740j92348J68426K74158O9296k04276
10434g6494j36296j51807j88541P2784M62104L16118J45872J05588O7849k32574
10424C84603l51242j37273L6767J36525m7165k26122j30568J20826R4345K4402
10414i4902l4579j25202k85160j37114J32539K33766N1202Q8490N8312j137J1736
10403a02049N0856M6523o9144k15332r2692R0438p6393j94380j34634j01383R7495
10392g00695K60685J71260J63837K06435J63877R6953k58443k91066k69727l06562
10382g63446j6503J95049J04125J51355J06459j40975r4922J96396K33046j2225
$$ plain form
10455 -293723 -345431 -293918 -122455 -37336 32390 21844 -188444 -243997 -82866 129918 -54137
10444 -54137 -292440 -327598 -314031 -137010 -191750 -384098 -215672 58486 127782 -76494
10434 -76494 -212790 -364597 -553138 -480354 -18250 297868 443740 549328 617177 384603
10424 384603 33361 -103912 -67145 69380 22215 -203907 -334475 -213649 -119304 -94902
10414 -94902 -129481 -254683 -539843 -676957 -544418 -310652 -259450 -170960 -112648 -113785 -102049
10403 -102049 -51193 -4670 -73814 -289146 -381838 -291400 -367793 -562173 -696807 -798190 -700695
10392 -700695 -440010 -268750 -104913 101522 265399 362352 103909 -187157 -456884 -763446
10382 -763446 -779949 -584900 -480775 -329420 -222961 -363936 -458858 -262462 -29416 -41641
10372d1641j42408j27177j00102l2907Q45K133k29251l50760J31714L47787N4517
10361d87250r9907j3811J90051j7786j2474K07925L06192J64925l1013k5137o6638
10350A15077j84762j29088j1399O9702j63345k26217L2271K43892J02624J26128
10340b5117J9217l3082k0700j71383J37983L02970J00907K0620L10182K03368
10330H44965p9043k09525l00887j18815K35963J89571o3757L1330N6853k26368
10320C60287k57600o2087N8349l4417o0068j1231j51923j50006o691j93710k40373
10309g49470k9762J17103J52501M5335K41121P8016n1300K48511L21068K38562
10299F11685L63887J69063k13293m48402l70072j5601l4655l11690j31672K31818
$$ plain form
10372 -41641 -184049 -311226 -411328 -444235 -443390 -441257 -670508 -1021268 -889554 -541767 -487250
10361 -487250 -587157 -600968 -410917 -428703 -441177 -233252 72940 237865 206852 181715 115077
10350 115077 -69685 -198773 -210172 -140470 -303815 -530032 -497761 -253869 -151245 -25117
10340 -25117 -5900 -38982 -59682 -231065 -93082 209888 310795 331415 641597 844965
10330 844965 765922 556397 255510 136695 372658 562229 498472 529802 586655 360287
10320 360287 102687 40600 98949 64532 4464 -6767 -158690 -308696 -315387 -509097 -749470
10309 -749470 -779232 -662129 -509628 -464293 -223172 -145156 -196456 52055 373123 611685
10299 611685 975572 1144635 931342 482940 112868 97267 62612 -249078 -380750 -148932
10289a48932K33862J73049J65921O9746l3139j84975k20254m91264j69625J72256
10279d33355K72335J12366k03811k15739j73735k25507m4390R1634M1341J79661
10269e99200J82769J88612J81949K90738N0722q7921M585K2771j1216Q3590n170
10258C02229l1090j15819k17831p7625J265J3298q4014J69284o4893p6264J888
10247a79572O4715M0049j73385K4210J79722J16589J22975K66896k9634k59995
10237A72570j78191k741J50478k9534J5922M2244N2361P0965q8531k7105m6238
10226A32200j23770q6873M0364K47218K0179k92442j05822J79138K50520p1366
10216A89346j49719J66476J7105j87771q4478Q4575n8111o9262K05850J25226
$$ plain form
10289 -148932 84930 257979 423900 493646 460507 275532 55278 -435986 -605611 -433355
10279 -433355 -161020 -48654 -252465 -468204 -641939 -867446 -911836 -820202 -778861 -599200
10269 -599200 -416431 -227819 -45870 244868 295590 207669 212254 235025 223809 307399 302229
10258 302229 271139 155320 -62511 -140136 -138871 -125573 -209587 -40303 -105196 -181460 -179572
10247 -179572 -114857 -74808 -248193 -223983 -44261 72328 195303 462199 432565 172570
10237 172570 -5621 -8362 142116 112582 128504 170748 223109 294074 205543 178438 132200
10226 132200 8430 -78443 -38079 209139 229318 -63124 -168946 10192 260712 189346
10216 189346 39627 206103 223208 35437 -49041 35534 -22577 -91839 114011 239237
10206B39237N2796m9238j19501j52901K9848J16377j14727j84068j59269j11979
10196d53425J4667M1657P824J15501O6645q6628j21603R8618L24050J21872n9577
10185F9601n3625j57092j51458J13981J01853m0613M7683Q5830l6834j39423o5178
10174b25275O9450o2687l04154j28223Q9310J99242K07906m5253K6409O947q1137
10163b47465n6278O032j24217p4565J01447J78283J10930P0135q472j36012j44880
10152c25062j03539k0407J26527R9214P9226l8314j02862j11575j75175p2920
10142f44887J33861J0566N670J47891K27053J29732K60332J58950Q7299P1639
10132E88106j14789k74392k90886j77201J13542K35439J25485P6885J82781K99300
$$ plain form
10206 239237 292033 242795 123294 -29607 241 116618 1891 -182177 -341446 -453425
10196 -453425 -438758 -397101 -389277 -273776 -207131 -293759 -415362 -316744 7306 129178 69601
10185 69601 15976 -141116 -292574 -178593 -76740 -117353 -69670 16160 -20674 -160097 -225275
10174 -225275 -155825 -218512 -522666 -650889 -561579 -362337 -154431 -199684 -173275 -166328 -247465
10163 -247465 -303743 -297711 -421928 -496493 -395046 -216763 -105833 -35698 -44170 -180182 -325062
10152 -325062 -428601 -449008 -322481 -223267 -144041 -182355 -285217 -396792 -571967 -644887
10142 -644887 -511026 -500460 -494790 -346899 -119846 9886 270218 429168 516467 588106
10132 588106 473317 198925 -91961 -269162 -155620 79819 205304 282189 464970 764270
10122G64270K90166o395k41838J00835L39496J74428J64290K22288L53555M50610
10112B611705M61031P63281P05053P79503J381311J872185K429031L226941M202697
10103A8432738M793558N077650L013194k237025n395329n116316m058941l160328
10095A1349201k187200j328853p40135q28211r57189p56878l38501p7685k20919
10086C913630n34642o91578m91892l59429l02899r5097j84756k74769k74982q1849
10076F21737J83548K05865K28927N8149l0930j64175j71737l0273o9338k76120
10066E55653j23025L4499l9906o7092p2007P0814L7739N3671R6062j27033n1429
10055C67946J1242P7326m3542l82806l97229k52408k3512J70843L68672J55975
$$ plain form
10122 764270 1054436 1048041 806203 907038 1246534 1420962 1585252 1807540 2161095 2611705
10112 2611705 3072736 3836017 4541070 5320573 6701884 8574069 11003100 14230041 18432738
10103 18432738 23226296 28303946 31317140 29080115 23684786 18568470 14509529 11349201
10095 11349201 9162001 7833148 7093013 6264802 5307613 4550735 4212234 4134549 3913630
10086 3913630 3378988 2687410 2195518 1836089 1533190 1438093 1253337 978568 703586 621737
10076 621737 805285 1011150 1240077 1298226 1267296 1103121 931384 901111 831773 555653
10066 555653 432628 467127 427221 360129 288122 358936 396675 450346 546408 419375 367946
10055 367946 379188 456514 412972 30166 -367063 -619471 -642983 -472140 -103468 52507
10045E2507R6397J73771M1004o4591p70Q1845l466l1547o5125k98250k87726r3586
10033c99537K4196M5784K2484R4824K73620J66602l1779j85563k72800l15996
10023e78165j78687q7429J49630K93057J20275l88406n02989j57002K15086M83063
10013f31567L83259J80752R0885J43637N2863j05834k48126M7147L24027k2488
10003B14555j40873j36906j97141j0955K35076M7518k00519l9147j53831j68553
9993e50776j94420j26922Q7332J41130O7085K69926J54915r4130k37197k69719
9983g52776k0831K10628J93879J6143j03744K6646J85152L41506j5625l00084
9973b19106j08241j02811J70048R2779J9087P4353j9464k14506k8986L16608K84623
$$ plain form
10045 52507 148904 322675 363679 299088 298318 380163 376697 345150 280025 -18225 -305951 -399537
10033 -399537 -375341 -329557 -307073 -212249 61371 227973 196194 10631 -262169 -578165
10023 -578165 -756852 -844281 -694651 -401594 -281319 -669725 -1172714 -1329716 -1114630 -631567
10013 -631567 -248308 -67556 23329 166966 219829 113995 -134131 -86984 237043 214555
10003 214555 73682 -63224 -260365 -271320 -36244 11274 -189245 -228392 -382223 -550776
9993 -550776 -745196 -872118 -784786 -643656 -576571 -306645 -151730 -245860 -483057 -752776
9983 -752776 -773607 -562979 -369100 -352957 -456701 -430055 -244903 96603 80978 -219106
9973 -219106 -327347 -430158 -260110 -167331 -148244 -73891 -93355 -307861 -336847 -20239 264384
9962B64384l7104j74290k25151l6351R6161k6625j9846L2413J13315J08680J24065
9951B19651m5808p5876j37803j12137j21867j538J75615Q5710J18934O7878l3794
9940A38965R2257K3232o8555j18543r2731j6223K7232R2227J20401K4924l3747
9929A89439q5930m3768n290L229j9651P8465K2499k2877j80859p5008m2946j85266
9917c67963R1040K40003K17420L5041p1604k70574j73367J27960K58740K98670
9907C85366l2887r3586l5797J08400O8885r4713l06622k81341j95298j29031o899
9896f13523J41889K94682J9413k76151l39595p7907K96919K58870J9510l9700
9886c15593j45552P7916K56543K92130j9519k44304o1496j05095p3213J5386Q493
$$ plain form
9962 264384 227280 52990 -172161 -208512 -112351 -138976 -158822 -126409 -13094 95586 219651
9951 219651 173843 97967 -39836 -151973 -273840 -275378 -99763 -14053 104881 172759 138965
9940 138965 231222 254454 185899 67356 -25375 -41598 -14366 77861 198262 223186 189439
9929 189439 103509 59741 54451 57680 38029 116494 138993 116116 -64743 -139751 -182697 -367963
9917 -367963 -276923 -36920 180500 215541 143937 -126637 -300004 -172044 86696 385366
9907 385366 352479 258893 223096 331496 400381 305668 -954 -282295 -477593 -606624 -613523
9896 -613523 -471634 -176952 -157539 -433690 -773285 -851192 -554273 -295403 -275893 -315593
9886 -315593 -461145 -383229 -126686 165444 145925 -98379 -159875 -264970 -338183 -322797 -314304
9875c14304Q6801L04449j589m03961m48595n1895K37662K50572P9992k12612J14204
9864c59276K42276J62803j29311j90585k1062K1216J15285R853n2581j01657j39895
9853d42934N7875J07220l2758j51540k08912Q8647J62839J251l9056O2993K08433
9842a85942J73514K78117q5832m31682l79770j18556n4305J12295J09929P0872
9832e11360r8521j53793M6046J97638J7690j54318J23333K01924Q7568P3457Q1627
9821h8709N3779J27871r7278k03409j31517J01776L05511J21522j772l7211j83079
9810c2516k63955N6813L8817O754R5961J16830L0408L562k5443k17831k35184
9799d25784j03302k69956j28201J00928M8658N0982K35745L90706K27387j30971
$$ plain form
9875 -314304 -227503 76946 75357 -328604 -777199 -829094 -591432 -340860 -260868 -473480 -359276
9864 -359276 -117000 45803 -83508 -274093 -295155 -273939 -158654 -148801 -201382 -303039 -442934
9853 -442934 -385059 -277839 -310597 -462137 -671049 -582402 -419563 -418312 -457368 -394375 -185942
9842 -185942 -12428 265689 179857 -251825 -631595 -750151 -804456 -692161 -582232 -511360
9832 -511360 -609881 -763674 -717628 -519990 -502300 -656618 -533285 -331361 -243793 -170336 -88709
9821 -88709 -34930 92941 -4337 -207746 -339263 -237487 68024 189546 187774 150563 -32516
9810 -32516 -296471 -239658 -200841 -194087 -98126 18704 49112 52674 27231 -190600 -425784
9799 -425784 -529086 -799042 -927243 -826315 -777657 -726675 -490930 -100224 127163 -3808
9789c808j15401J15491J09101J75700J55129N2752N9942j77938m11242k23775
9779b64049j8648r9188j88506k31178K4743J93238K84892Q5929q837Q3272J07419
9768c0913p4302j87922k3566j19283J5751O2480M8960K194l4542R2645J6824L36540
9756A04866L79330K5978k08487l05567l88612l673L00197K36317J70328l7285
9746B73392J01337K90064J11276k58258k29975j96282j05606j33488j32809J95829
$$ plain form
9789 -3808 -119209 -3718 105383 281083 436212 488964 548906 370968 -40274 -264049
9779 -264049 -282697 -381885 -570391 -801569 -776826 -583588 -298696 -212767 -221604 -138332 -30913
9768 -30913 -105215 -293137 -316703 -435986 -420235 -357755 -308795 -306601 -341143 -248498 -231674 104866
9756 104866 484196 510174 301687 -3880 -392492 -396165 -95968 140349 310677 273392
9746 273392 374729 664793 776069 517811 287836 91554 -14052 -147540 -280349 -84520
$$ [...]
##END NTUPLES=NMR SPECTRUM
##END=
