##TITLE=C13_SL30-Dau(-B)
 CDCl3, 23150 sc

 7.2.2022
##JCAMPDX= 6.0         $$ Bruker NMR JCAMP-DX V2.0
##DATA TYPE= NMR SPECTRUM
##DATA CLASS= NTUPLES
##ORIGIN= UXNMR, Bruker Analytische Messtechnik GmbH
##OWNER= root
$$ XWIN-NMR		Version 3.5
$$ Tue Feb  8 11:33:09 2022 Russian Standard Time (UT+4h)  she@DPX200
##.OBSERVE FREQUENCY= 50.327896
##.OBSERVE NUCLEUS= ^13C
##.ACQUISITION MODE= SIMULTANEOUS
##.ACQUISITION SCHEME= undefined
##.AVERAGES= 23150
##.DIGITISER RES= 17
##SPECTROMETER/DATA SYSTEM= spect
##.PULSE SEQUENCE= zgpg30
##.SOLVENT NAME= CDCl3
##.SHIFT REFERENCE= (INTERNAL, CDCl3, 0, 222.961)
##AUDIT TRAIL= $$ (NUMBER, WHEN, WHO, WHERE, WHAT)
$$ ##TITLE= Audit trail, XWIN-NMR		Version 3.5
$$ ##JCAMPDX= 5.01
$$ ##ORIGIN= Bruker BioSpin GmbH
$$ ##OWNER= she
$$ F:/spectra/data/she/nmr/c13/1/pdata/1/auditp.txt
$$ ##AUDIT TRAIL=  $$ (NUMBER, WHEN, WHO, WHERE, WHAT)
(   1,<2022-02-08 11:30:38.96 +0400>,<she>,<DPX200>,
      <created by zg, POWCHK disabled, PULCHK disabled
       terminated by command 'halt'
       configuration hash MD5:
       00 E9 B6 7A A2 85 ED C7 34 08 36 98 17 FE 4E 26
       data hash MD5: 32K
       E1 2F 71 F4 C2 F8 CF 48 2A A3 36 AA 60 68 09 30>)
(   2,<2022-02-08 11:30:43.68 +0400>,<she>,<DPX200>,
      <Start of raw data processing
       efp BC_mod = 2 LB = 1 FT_mod = 6 PKNL = 1 PHC0 = -344.1143 PHC1 = 39.36232 SI = 32K 
       data hash MD5: 32K
       C0 79 C0 13 B4 EA 2E FE 35 04 87 7A CC C8 E5 5A>)
(   3,<2022-02-08 11:31:38.92 +0400>,<she>,<DPX200>,
      <pk PHC0 = 12.90485 PHC1 = -3.6 
       data hash MD5: 32K
       E2 EC 9B AB 97 CE 34 D1 F9 61 F1 4B 95 BA 1E CB>)
(   4,<2022-02-08 11:31:43.34 +0400>,<she>,<DPX200>,
      <abs ABSG = 5 
       data hash MD5: 32K
       8E D9 48 F5 2F D7 20 AB 97 B7 3A 95 15 9A 6E 3D>)
$$ ##END=
$$ 
$$ hash MD5
$$ 54 8F 69 C6 71 89 AC 23 4B AF 7C A4 E6 B8 AB EA
##$RELAX= 
##$RELAX= 
##$RELAX= 
##$RELAX= 
##$RELAX= 
##$RELAX= 
##$RELAX= 
##$RELAX= 
$$ Bruker specific parameters
$$ --------------------------
##$DU= <F:/spectra>
##$EXPNO= 1
##$NAME= <c13>
##$PROCNO= 1
##$TYPE= <nmr>
##$USER= <she>
##$AMP= (0..31)
100 100 100 100 100 100 100 100 100 100 100 100 100 100 100 100 100 100 
100 100 100 100 100 100 100 100 100 100 100 100 100 100 
##$AQSEQ= 0
##$AQ_mod= 1
##$AUNM= <au_zg>
##$AUTOPOS= <>
##$BF1= 50.322709
##$BF2= 200.13
##$BF3= 50.322709
##$BF4= 500.13
##$BF5= 500.13
##$BF6= 500.13
##$BF7= 500.13
##$BF8= 500.13
##$BYTORDA= 1
##$CFDGTYP= 0
##$CFRGTYP= 5
##$CHEMSTR= <none>
##$CNST= (0..31)
1 1 145 1 1 1 1 1 1 1 1 1 1 1 1 1 1 1 1 1 1 1 1 1 1 1 1 1 1 1 1 1 
##$CPDPRG= <waltz16>
##$CPDPRG1= <>
##$CPDPRG2= <waltz16>
##$CPDPRG3= <>
##$CPDPRG4= <mlev>
##$CPDPRG5= <mlev>
##$CPDPRG6= <mlev>
##$CPDPRG7= <mlev>
##$CPDPRG8= <mlev>
##$CPDPRGB= <>
##$CPDPRGT= <>
##$D= (0..31)
0 2 0.00345 0 0 0 0 0 0 0 0 0.03 2e-05 3e-06 0 0 0 0 0 0 0 0 0 0 0 0 0 
0 0 0 0 0 
##$DATE= 1644226440
##$DBL= (0..7)
120 120 120 120 120 120 120 120 
##$DBP= (0..7)
150 150 150 150 150 150 150 150 
$$ [...]
##$SUBNAM4= <"">
##$SUBNAM5= <"">
##$SUBNAM6= <"">
##$SUBNAM7= <"">
##$SUBNAM8= <"">
##$SUBNAM9= <"">
##$SW= 239.972175391363
##$SWIBOX= (0..15)
0 1 3 0 0 0 0 0 0 0 0 0 0 0 0 0 
##$SW_h= 12077.2946859903
##$TD= 32768
##$TD0= 1
##$TE= 0
##$TE2= 300
##$TE3= 300
##$TEG= 300
##$TL= (0..7)
120 120 120 120 120 120 120 120 
##$TP= (0..7)
150 150 150 150 150 150 150 150 
##$TP07= 0
##$TPNAME0= <>
##$TPNAME1= <>
##$TPNAME2= <>
##$TPNAME3= <>
##$TPNAME4= <>
##$TPNAME5= <>
##$TPNAME6= <>
##$TPNAME7= <>
##$TPOAL= (0..7)
0.5 0.5 0.5 0.5 0.5 0.5 0.5 0.5 
##$TPOFFS= (0..7)
0 0 0 0 0 0 0 0 
##$TUNHIN= 0
##$TUNHOUT= 0
##$TUNXOUT= 0
##$USERA1= <user>
##$USERA2= <user>
##$USERA3= <user>
##$USERA4= <user>
##$USERA5= <user>
##$V9= 5
##$VALIST= <valist>
##$VCLIST= <CCCCCCCCCCCCCCC>
##$VD= 0
##$VDLIST= <DDDDDDDDDDDDDDD>
##$VPLIST= <PPPPPPPPPPPPPPP>
##$VTLIST= <TTTTTTTTTTTTTTT>
##$WBST= 1024
##$WBSW= 4
##$XGAIN= (0..3)
0 0 0 0 
##$XL= 0
##$YL= 0
##$YMAX_a= 145360874
##$YMIN_a= -34217984
##$ZGOPTNS= <>
##$ZL1= 120
##$ZL2= 120
##$ZL3= 120
##$ZL4= 120
##$ABSF1= 222.961
##$ABSF2= -17.03589
##$ABSG= 5
##$ABSL= 3
##$ALPHA= 0
##$AQORDER= 0
##$ASSFAC= 0
##$ASSFACI= 0
##$ASSFACX= 0
##$ASSWID= 0
##$AUNMP= <proc_1d>
##$AZFE= 0.1
##$AZFW= 0.5
##$BCFW= 0
##$BC_mod= 2
##$BYTORDP= 0
##$COROFFS= 0
##$CY= -3
##$DATMOD= 1
##$DC= 0
##$DFILT= <>
##$DTYPP= 0
##$F1P= 0
##$F2P= 0
##$FCOR= 0.5
##$FTSIZE= 32768
##$FT_mod= 6
##$GAMMA= 0
##$GB= 0
##$INTBC= 1
##$INTSCL= 4.134877e-10
##$ISEN= 128
##$LB= 1
##$LEV0= 0
##$LPBIN= 0
##$MAXI= 10000
##$MC2= 0
##$MEAN= 0
##$ME_mod= 0
##$MI= 0.1934396
##$NCOEF= 0
##$NC_proc= 3
##$NLEV= 6
##$NOISF1= 120.0001
##$NOISF2= 80.00006
##$NSP= 0
##$NTH_PI= 0
##$NZP= 0
##$OFFSET= 222.961
##$PC= 1.4
##$PHC0= -331.2094
##$PHC1= 35.76232
##$PH_mod= 1
##$PKNL= yes
##$PPARMOD= 0
##$PSCAL= 0
##$PSIGN= 0
##$REVERSE= no
##$SF= 50.3227146458226
##$SI= 32768
##$SIGF1= 140
##$SIGF2= 120
##$SINO= 11.81781
##$SIOLD= 32768
##$SREGLST= <13C.CDCl3>
##$SSB= 0
##$STSI= 32768
##$STSR= 0
##$SW_p= 12077.2946859903
##$SYMM= 0
##$S_DEV= 0
##$TDeff= 32768
##$TDoff= 0
##$TI= <>
##$TILT= no
##$TM1= 0
##$TM2= 0
##$TOPLEV= 0
##$USERP1= <user>
##$USERP2= <user>
##$USERP3= <user>
##$USERP4= <user>
##$USERP5= <user>
##$WDW= 1
##$XDIM= 32768
##$YMAX_p= 290138185
##$YMIN_p= -1234030
$$ End of Bruker specific parameters
$$ ---------------------------------
##NTUPLES= NMR SPECTRUM
##VAR_NAME=  FREQUENCY,     SPECTRUM/REAL,   SPECTRUM/IMAG
##SYMBOL=    X,             R,               I
##VAR_TYPE=  INDEPENDENT,   DEPENDENT,       DEPENDENT
##VAR_FORM=  AFFN,          ASDF,            ASDF
##VAR_DIM=   32768,         32768,           32768
##UNITS=     HZ,            ARBITRARY UNITS, ARBITRARY UNITS
##FACTOR=    0.368581032318806, 1,           1
##FIRST=     11220.0027064323, 0,            0
##LAST=      -857.291979557962, 0,           0
##MIN=       -857.291979557962, -1234030,    0
##MAX=       11220.0027064323, 290138185,    0
$$ Real data points
##PAGE= N=1
##DATA TABLE= (X++(R..R)), XYDATA
$$ [...]
15831I1665q2360j6761N7860j76505j32416J06317K46964K79678J79249J21824
15821F75515O213k48596k61366L9287Q5291j29725l94158k08499n2144K7349J43127
15810c17706K95000J27007O2840r5771j00467j44629j12151j7326q8373Q0496
15800c11080p3790Q2335K54384M5970J0514j7307j55669j31579q1350R278L23285
15789d5009M17337J89221r8059k16601N1203N2308j05299j13300j43087j25847
15779a37133J3596o0725P440L35160K64000J63254p8784q1267L87j86553r8606
15768A40769J2092J76247R6101K7046n4677k8229l0485K2552j97033r1972J36222
15757B08633K4525j08041q5208N7081k0466L5524J47996k9469N2819M4341o9550
$$ y = [91665, 9305, -7456, 50404, -126101, -258517, -152200, 94764, 374442, 553691, 675515, 681728, 433132, 171766, 211053, 296344, 166619, -227539, -436038, -488182, -460833, -317706, -22706, 104301, 167141, 71370, -29097, -173726, -285877, -303203, -391576, -311080, -384870, -302535, -48151, -2181, 8333, -8974, -164643, -296222, -377572, -368294, -45009, 372328, 561549, 463490, 246889, 298092, 350400, 245101, 131801, -11286, -137133, -123537, -184262, -176822, 158338, 422338, 585592, 506808, 425541, 425928, 239375, 140769, 152861, 329108, 425209, 452255, 397578, 369349, 338864, 361416, 164383, 72411, 208633, 233158, 125117, 39909, 96990, 76524, 112048, 260044, 230575, 283394, 327735, 258185]
15746B58185q8016k29394k98033M3077L33361L74020J75844K6641j51448l82825
15736F1412j35514j67863k62478j23946J76639J44474j9501J927L86643L37120
15726C98913K28667J19784j43181j24939k4870l7164j60202j30650m7702k5358
15716E3298J71322O8326j77707L2579J74411J12909L4915m8797j05464k3734j59046
15705A33012k10479j39798J0214K17401K8517J41718Q1135j62189m0618J6749
15695G5662L9742J20345J88412K56694o6399l33260k16582R242Q5795P257o0983
15684A05925m4214o833k725J7575K22915J08045n9607m2637K3632O3715n4942
15673C30849o6609j7537j8273k3449m3758K8372m2799p0716J17820R5696m4447
$$ y = [258185, 170169, -59225, -357258, -314181, 19180, 393200, 569044, 595685, 444237, 61412, -74102, -241965, -504443, -628389, -451750, -307276, -326777, -324850, 61793, 398913, 627580, 747364, 604183, 479244, 454374, 417210, 257008, 126358, 78656, 53298, 224620, 292946, 115239, 147818, 322229, 435138, 470053, 421256, 315792, 292058, 133012, -77467, -217265, -207051, 10350, 38867, 180585, 261720, 99531, 58913, 75662, 115404, 235749, 424161, 680855, 614456, 281196, 64614, 73856, 159651, 166908, 105925, 61711, 54878, 52153, 69728, 292643, 400688, 341081, 298444, 322076, 385791, 330849, 264240, 246703, 228430, 204981, 161223, 189595, 146796, 76080, 193900, 289596, 245149]
15662B45149M21J95057L2934k45719k43034k21478j35515O5466L6038l0338L9676
15651b61343j44699r4400J26931j12410j07213J40997K35359M8240Q1372J04956
15641A7790J4130q8262k98368k33736N577J45395K39762J02006k02047j08107
15631d05860R50j02821K22066K27223j7652j58679O1646K18622J68110O4546l2999
15620B45152j26674j75660n5611P733Q1869K4703l6857j51061j46791J6788J12703
15609b03706j08330k20547j61984m4761K76671J87743p6128j06997J1807J15804
15599c30428K02431K06731k9130l0471L8842j23301j53463j16938j10147P5125
15589c70749K22159l014j90558j26700j402K24140L14314K05802R1274J55094
$$ y = [245149, 245570, 440627, 473561, 227842, -15192, -236670, -372185, -306719, -270681, -301019, -261343, -406042, -500442, -373511, -485921, -593134, -452137, -216778, -168538, -87166, 17790, 31920, -56342, -354710, -588446, -582869, -437474, -197712, -95706, -297753, -405860, -404910, -507731, -285665, -58442, -76094, -234773, -173127, 45495, 213605, 278151, 245152, 118478, -57182, -112793, -105060, -23191, 1512, -35345, -186406, -333197, -316409, -203706, -312036, -532583, -694567, -739328, -462657, -274914, -351042, -458039, -446232, -330428, -127997, 78734, 49604, 19133, 57975, -65326, -218789, -335727, -445874, -370749, -148590, -151604, -342162, -468862, -470264, -246124, 68190, 273992, 365266, 520360]
15579E20360O5014o4967j92689o7724p7945j47952j16833J9439l1895N3280M9718
15568G806K7057j06258j23342M9272J18318K1733j15693r0527r9537l6403M9932
15557b97642j0119k20148q8604J35188J80926K75106N8758j44425j03238J73128
15547d1070J61051j46572k08448j6594K07958J03894l9476j17721j5397M7426
15537f4949j9882O6187J19777M038j23559J34257L69705j6630j60724j06375k38883
15526c7038j39365n0878j48960P3126L23754K06156l6333j11951o5395J17220
15516A30336J45908n0271q5131l8612j78674L2681K62284J83190k40709j11147
15506D9855K92568J69341l19889k50899J34955L4331k26864k38242j24839n3840
$$ y = [520360, 585374, 520407, 327718, 259994, 182049, 34097, -82736, -63297, -95192, -41912, 7806, 34863, -71395, -194737, -145465, -27147, -5414, -121107, -211634, -311171, -347574, -297642, -307761, -527909, -616513, -481325, -300399, -25293, 33465, -110960, -214198, -41070, 119981, -26591, -235039, -251633, -43675, 60219, 20743, -96978, -112375, -64949, -84831, -18644, 101133, 105171, -18388, 115869, 485574, 468944, 308220, 201845, -37038, -176403, -227281, -376241, -303115, 20639, 226795, 190462, 78511, 13116, 130336, 276244, 225973, 140842, 102230, -76444, -43763, 218521, 401711, 161002, 49855, 342423, 511764, 191875, -59024, 75931, 110262, -116602, -354844, -479683, -533523]
15496e33523n0857m7392R4003J36498R6172K86126K59614J03255k09938j78227
15486d4269k79644l98823J10503K18522m7168m9803j96092n7970L27786N04864
15476H7906J40573j15386P9675O9773m1103k47732l03003K3317L24517O2080j68136
15465h7519o5833J34360N3622J25487M8794k58605j84025q6638J9781J62244J03692
15454c4640P6368j21500k38774k2102K5687J01445j21204j84477N5801L0435r6008
15443e28969n136L17357J15644j24310J9669K5602p5423M6767L26136J4575k46932
15432a15020k1823l6969P64L166M0761Q4300J58468J36772r204Q0300j56925k61674
15420i7084l1441J00117N0560k07566j78260N309J21933J00898j24551j55141
$$ y = [-533523, -584380, -631772, -537769, -401271, -305099, -18973, 240641, 343896, 133958, -44269, -323913, -722736, -612233, -393711, -440879, -490682, -686774, -744744, -416958, 87906, 228479, 113093, 192768, 262541, 221438, -26294, -329297, -305980, 18537, 80617, -87519, -153352, -18992, 34630, 160117, 208911, -49694, -233719, -320357, -300576, -138332, -34640, 41728, -79772, -318546, -340648, -314961, -213516, -334720, -519197, -463396, -432961, -528969, -534105, -216748, -101104, -225414, -205745, -180143, -255566, -208799, 117337, 131912, -115020, -136843, -173812, -173048, -169882, -129121, -44821, 113647, 250419, 241215, 321515, 164590, -97084, -128525, -28408, 22152, -185414, -363674, -358365, -236432, -135534, -260085, -415226]
15410d15226P9394L08963L10552M201k53823k01497J1137L0347l2073l2913m5743
15399b36681J84582J55419j45866r9701J79596K01284m3349l3458p7238o5584
15389A9004p7739O2333R712m3955j48404j34126J06365k7323j10716P7080J18374
15378a49395P3547k7193p8932n6932J5500J07568p7218q6115j16704K7460N3232
15367c15182j22287L1525K8269l1015l5323P8954J79279q3210l27981k00376J08298
15356f89049M4118K34422Q2600j36863M0256J69210N8366k7167k8552K4216Q2027
15345a46416l6429M6169R3786j21068k02676J29240N9717j80765r8266J53490
15335c03218K56L9640J95346o3030p0535M3029J89000j84531l15388Q7291K25213
$$ y = [-415226, -335832, -26869, 283683, 287884, 34061, -167436, -156299, -125952, -158025, -190938, -236681, -52099, 103320, -42546, -142247, 37349, 238633, 195284, 161826, 84588, 19004, -58735, 3598, 13310, -30645, -179049, -313175, -206810, -234133, -344849, -267769, -149395, -75848, -103041, -181973, -238905, -223405, -115837, -193055, -279170, -395874, -368414, -315182, -437469, -405944, -377675, -408690, -444013, -365059, -185780, -268990, -596971, -797347, -689049, -644931, -410509, -327909, -464772, -424516, -255306, -196940, -224107, -252659, -228443, -146416, -182845, -136676, -42890, -163958, -366634, -237394, -177677, -358442, -456708, -303218, -302962, -263322, -67976, -131006, -201541, -158512, 30488, -154043, -469431, -382140, -156927]
15324a56927J77747J54047n8343q9233K00162K36134o2989j24082l141j28720
15314A44655j55814k08123l29058k09199p1267Q7681J90137K56514L02885N8957
15304F7368p0283l3609J14830N1088k27011k62438j65472K07221L89167J92304
15294B63165Q9143J91488j57899j19296k0764j70008j43747J0893n6507j4723
15284a28255J57928J1367j72354j05837j41552k96332k0637K10666M56519J36376
15274A07889j09121L7088o3714l14656r7277J22617K50142K79166P9348k89358
15264B124l98592N3682K04058k6064P84N8767o3675j94239k3157J87438J16891
15253h1983J03044J96968j6197k89807l37934j14036J99004J62643K10378L09319
$$ y = [-156927, 20820, 174867, 116524, 27291, 227453, 463587, 400598, 276516, 273375, 144655, -11159, -219282, -548340, -757539, -828806, -741125, -550988, -294474, 8411, 67368, -2915, -36524, 78306, 129394, -97617, -360055, -525527, -318306, 70861, 263165, 352308, 543796, 385897, 266601, 245837, 75829, -67918, -57025, -113532, -128255, 29673, 41040, -131314, -237151, -378703, -675035, -695672, -485006, -28487, 107889, -1232, 35856, -27858, -342514, -439791, -317174, -67032, 212134, 291482, 2124, -396468, -342786, -138728, -164792, -164008, -105241, -168916, -363155, -386312, -198874, -81983, 21061, 218029, 201832, -87975, -425909, -539945, -340941, -178298, 32080, 341399]
15243C41399j1117j45673r2327l6804J24507J64939M7640r848j32201l04530j45072
15232a99087n932l29777j39469K08898K47234J93646K39637J89092Q7389q2287
15222D09344p8303r789k02997l4339P2360o0653Q3130N6433R9982J37853p3744
15211C99277l28843j76435L2444K37091Q4264j22339q9340j47661k53852j10105
15201d75499K43251L85299K82122K71054R5151j58291r2353j52826r6393l2325
15191B69190o1735J59776M1346q1586L0853m8348j14612J45813L31389J13394
15181G85480j24928n9453j1010n5333j06434j99606r2794r331r2981j88842j74288
15170c29520n979P1666L21703L28622j36120l76555k99279k02615R6137K09043
$$ y = [341399, 330282, 184609, 92282, 55478, 179985, 344924, 392564, 382716, 250515, -54015, -199087, -205019, -534796, -674265, -465367, -218133, -24487, 215150, 404242, 491631, 409344, 331041, 321252, 118255, 83916, 156276, 95623, 178753, 235186, 335168, 473021, 399277, 70434, -106001, -73557, 163534, 247798, 125459, 36119, -111542, -365394, -475499, -232248, 153051, 435173, 706227, 801378, 643087, 550734, 397908, 301515, 269190, 207455, 367231, 408577, 326991, 357844, 309496, 194884, 340697, 672086, 785480, 660552, 601099, 590089, 534756, 428322, 228716, 135922, 126591, 33610, -155232, -329520, -335499, -263833, 57870, 386492, 250372, -126183, -425462, -628077, -531940, -322897]
15160c22897J34711j1090j34821K6991J44416J51786Q2024j1202k9002J27962
15150A58878l5954j21235k2834Q8101R5697O8895J0528j15997j39979q207j85415
15139b07522k49520l3673J51094J34927J89672J16118j45569j97092o9533j9643
15129c30741j09335j38622M2263J34359j9824J70398J01504r9597j32648q2286
15119d64529O6286m1693K5708J39354L9450p129l9032K2101K55367L12379J35426
15108D43688l03695l84463M4986K83060k327j12755j24967k10485p5019J16825
15098c25152K55695J19k30766j76506M6997j2780p1250R4295J78851O1085j6875
15087a96287p593r0067J23799J10698P8702J8600n1762Q1598M8581q6322N6518
$$ y = [-322897, -188186, -199276, -334097, -307106, -162690, -10904, 71120, 59918, 30916, 158878, 122924, 1689, -21145, 66956, 162653, 231548, 242076, 126079, -13900, -22107, -207522, -457042, -490715, -339621, -204694, -15022, 101096, -44473, -241565, -311098, -330741, -440076, -578698, -536435, -402076, -421900, -251502, -149998, -249595, -382243, -464529, -398243, -439936, -414228, -274874, -235424, -242553, -281585, -259484, -4117, 308262, 443688, 139993, -244470, -199484, 83576, 81249, -31506, -156473, -366958, -441977, -325152, -69457, -69338, -300104, -476610, -429613, -442393, -513643, -419348, -240497, -179412, -196287, -203880, -293947, -170148, -59450, 19252, 37852, -13910, 67688, 116269, 29947, 86465]
15076H6465j7482k01900k58723j88980m6789K61567M21630O0359q4718J27572
15066A59001Q330j49946j3121M0483J03221L4257j88457k64998j64564K3771K14655
15055a97368J66347K8274n017m7533Q8067Q0159J0344J0074J37833J288j90732
15044H1736M5227M2071J7738J5184k80800k57912N3320K64221L95089K83380n7209
15033F02045p0713J27388j9616k08182k06645k06999P2383J34548m0851j61178
15023B2180k53092j79294P508J33854K01706J06075J48739M7479k95932k03300
15013b64077J2539r7485p7035j06538k4871J80184K10203M9598j51403j7591m2582
15002c29058n6936N9542K68236L97682J27837j17735k45902l28129j90810k4453
$$ y = [86465, 68983, -132917, -391640, -580620, -627409, -365842, 55788, 116147, 31429, 159001, 167331, 17385, 4264, 44747, 147968, 182225, -6232, -271230, -435794, -412023, -197368, -31021, -2747, -7764, -55297, 32770, 112929, 123273, 133347, 271180, 272468, 81736, 126963, 169034, 186772, 201956, -78844, -336756, -283436, -19215, 375874, 659254, 602045, 531332, 658720, 639104, 430922, 224277, 17278, 89661, 224209, 183358, 22180, -230912, -410206, -402698, -268844, -67138, 38937, 187676, 235155, -60777, -264077, -251538, -349023, -426058, -532596, -557467, -377283, -167080, -117482, -268885, -286476, -329058, -385994, -326452, -58216, 339466, 467303, 349568, 103666, -224463, -415273, -439726]
14992d39726K42751J96264J64759k9955j306K93332K52340j32931l08555j49467
14982H7506j19082r6361J33141R1088j57313j76167j47329K9326P1087n7098J2940
14971c28262Q2438j30186J24947K69667L8402j41472O1112J13549J19972K70880
14961D81047M2189j30589j16685j59555N6318p3658k42141o3298n0955Q3597K35393
14950F1663L6461n8841j0097l822k9065o0570j22402j02398l1737j48950k28585
14939f98343R2622L55210O290k16080J97245K61932J21444K9912j83157q0322
14929a13247p3202k70782J85136K62137J07549j51809k05603k1202j32906l5519
14919d49448J34133K19594L3885j46959M7414J89697k2530j52023P0741J8741
$$ y = [-439726, -196975, -711, 164048, 134093, 132787, 426119, 678459, 545528, 236973, 87506, -31576, -127937, 5204, 96292, -61021, -237188, -384517, -355191, -284104, -341202, -328262, -245824, -376010, -251063, 18604, 57006, -84466, -23354, 90195, 210167, 481047, 523236, 392647, 275962, 116407, 172725, 99067, -143074, -206372, -257327, -173730, 61663, 98124, 39283, 29186, 25364, -3701, -64271, -186673, -289071, -320808, -469758, -698343, -605721, -250511, -244221, -460301, -263056, -1124, 120320, 150232, -32925, -113247, -186449, -457231, -272095, -9958, 97591, -54218, -259821, -281023, -413929, -449448, -315315, -95721, -61836, -208795, -161381, 28316, 5786, -146237, -75496, -56755]
14909e6755q7914K28843J82799J6699j28754k10092k07599p0224J01272K26684
14899e041J11923p7021j06920j98755j84068o6000j68390j93881j8232j1522M7050
14888h70857J99031L19565L78890K37310j7100j02142j25408k68088j34768o3930
14878d47497k3838k7882P1328J80609K5825j09962J1706J51905J85552J81318
14868A99064q5479p7336J25691J55547N1061J07969R513j69974j86447l46540
14858b16931k08780N2174J00486Q9319J94310J21439J86003J71430q3843j33895
14848B71712r9060J1704M8419o9684R6451J00784r0998j13406l5678j02007j32358
14837a14121N1733M9013j21737N4029J04191r1932j80305o7114j1667J96592K56551
$$ y = [-56755, -144669, 84174, 266973, 283672, 154918, -55174, -262773, -332997, -231725, -5041, 106882, 29861, -77059, -275814, -459882, -525882, -694272, -888153, -906385, -917907, -870857, -671826, -352261, 26629, 263939, 246839, 144697, 19289, -248799, -383567, -447497, -471335, -499217, -427889, -247280, -221455, -331417, -319711, -167806, 17746, 199064, 113585, 36249, 161940, 317487, 368548, 476517, 486030, 316056, 129609, -216931, -425711, -373537, -273051, -183732, 10578, 132017, 318020, 489450, 405607, 271712, 172652, 184356, 232775, 163091, 259542, 360326, 269328, 155922, 120244, 18237, -114121, -62388, -13375, -135112, -81083, 23108, -68824, -249129, -316243, -327910, -131318, 125233]
14826A25233Q4932j99494p0039J81284o0026n0259l3927j03205j0204o413m1736
14815a83854Q6669j75221l80532k52518J96714L64781J99981J26695Q0955j32722
14805f9052k9759K38562P4735l6612O6398J72473m227k44534j96996j52357q2288
14794b63657k73362j99817J97197L04774J78606O6045j97880j11588J061O3248
14784b35373k403p4088J96371J25597J4949j45219k44858p0741j7677j96577Q9261
14773e60758K50059K57557J32979N2386j54j06492k01883j641P201n9341N9586
14762a70501J19397Q1341K00293O9505K52962M6078k56774k77808k13271j58388
14752c07166m9368j19545N0599J69225M2087J36247P0305k00107k51648m8631
$$ y = [125233, 210165, 10671, -59368, 121916, 61890, 11631, -22296, -125501, -135705, -142118, -183854, -97185, -272406, -652938, -905456, -708742, -343961, -143980, -17285, 63670, -69052, -98811, 139751, 214486, 177874, 244272, 416745, 412518, 167984, -29012, -181369, -263657, -537019, -736836, -539639, -234865, -56259, 9786, -188094, -299682, -298621, -235373, -237776, -311864, -115493, 10104, 25053, -120166, -365024, -435765, -453442, -650019, -560758, -310699, -53142, 79837, 132223, 132069, 25577, -176306, -177947, -170746, -230087, -170501, -51104, 30237, 230530, 300035, 552997, 599075, 342301, 64493, -148778, -307166, -356534, -476079, -425480, -256255, -214168, -77921, -7616, -207723, -459371, -508002]
14742e08002K35319J31829M0990J6055j42424L7684J24802K930p8799J67927L90253
14731D18564K4336k78346j50938O8234J78184M9324J23031J04376l8916j3631
14721D84218j15549m5110N0292p3240j54328j54742m6016Q3793J24812N6907J4768
14710B25805k47418j94580Q856R142M4892j8475l9899L9587N7135q4972J54004
14699d5923J42211J32857J06617q0684j93372j24054k16982o5312J47384J97178
14689h0L19977K13953n7897r7636N8485J28146R6176n4857j29521l23764k59835
14678a06853q7192J41964Q9664j88554l07235k00604j08867P3607K51060J20329
14668c22681K8759q4808n0271J34268J24246L178k93475j7796J06726J86923J47421
$$ y = [-508002, -272683, -140854, -99864, -83809, -226233, -188549, -63747, -60817, -139616, 28311, 418564, 442900, 164554, 13616, 81850, 260034, 309358, 432389, 536765, 497849, 484218, 368669, 323559, 373851, 300611, 146283, -8459, -54475, 29318, 154130, 211037, 225805, -21613, -216193, -207337, -198195, -153303, -171778, -211677, -172090, -114955, -199927, -45923, 96288, 229145, 335762, 255078, 61706, -62348, -279330, -344642, -197258, -80, 319897, 533850, 475953, 378317, 436802, 564948, 661124, 606267, 476746, 152982, -106853, -194045, -52081, 37583, -150971, -458206, -658810, -767677, -694070, -443010, -322681, -293922, -378730, -429001, -294733, -170487, -167309, -460784, -478580, -371854, -184931, -37510]
14657c7510N5715l3536j72474J06271J45706n8847k82546j58990R3892Q7067K4675
14646b30577j31525j6502K67253L68355J96622J31489M3470l761J17300n9239
14636F82885l14709m06317j60643K49080K80537K11325m0909k60729k41746q7757
14626h8983P2972K21225M0466Q669J06266K04947J37427M3770j36561k63261k82788
14615F4149p3413k8304k01351l9397K19726L6605k71319j63306R9113j34439l01127
14604g93063r1105L00645N45184L61144J21938P485q7969k19037k09281m5474
14594a09533J58374R5757k4026p8457m0262K05424K86665Q6855k19491j77270
14584A84036J23583J15002J5423Q3626n2756l87827k11007J03975K86448N8573
$$ y = [-37510, 18205, -15331, -187805, -81534, 64172, 5325, -277221, -436211, -342319, -255252, -230577, -362102, -378604, -111351, 257004, 453626, 585115, 628585, 624824, 742124, 682885, 368176, -38141, -198784, 50296, 330833, 542158, 501249, 240520, -1226, -88983, -16011, 205214, 245680, 254349, 360615, 565562, 702989, 746759, 610198, 346937, 64149, -9264, -37568, -238919, -278316, -58590, -21985, -293304, -456610, -357497, -491936, -793063, -884168, -583523, -38339, 322805, 444743, 452228, 364259, 145222, -64059, -109533, 48841, 144598, 120572, 42115, 1853, 207277, 493942, 580797, 361306, 184036, 307619, 422621, 438044, 521670, 468914, 81087, -129920, -25945, 260503, 319076]
14574C19076j76294j73242j18748j49628j62300J73704K04677R3436L5589J87659
14564B33929J10495j53213l42227l22764p1992K12911R4811j56525j80987l1062
14554f06624P3219J9376R6734Q048N301J61764L4603J72041J55183N6143p5862
14543I9926j58688j52960l3766J96726L97480J05247n3358%j26492k06626k24260
14532a56771N1341m5051k71038k69336p4621O0547J52133J3742l9375J35393K42338
14521b00698J33620j18696k04987j73815J9424K37212J81068m7857J23390J01940
14511E0601l31211m41121K0233J82349L2390P1206K07365P3671J07420J25693
14501I8596K6157K7194K4825O6181j82092k28610L9703R2928J61404Q6958j41547
$$ y = [319076, 142782, -30460, -149208, -298836, -461136, -287432, -82755, 10681, 46270, 233929, 344424, 191211, -151016, -473780, -545772, -332861, -238050, -394575, -575562, -606624, -533405, -514029, -417295, -409247, -403946, -242182, -207579, -35538, 119645, 175788, 99926, -58762, -211722, -245488, -48762, 348718, 453965, 400607, 400607, 274115, 67489, -156771, -105430, -150481, -421519, -690855, -765476, -704929, -552796, -539054, -578429, -443036, -200698, -67078, -185774, -390761, -564576, -545152, -307940, -126872, -174729, -51339, 50601, -280610, -721731, -701498, -519149, -486759, -415553, -208188, -134517, -27097, 98596, 124753, 151947, 176772, 242953, 60861, -167749, -128046, -35118, 126286, 213244, 71697]
14490G1697l8224j60035k19321k18486j24660J27508J40961Q633j09331k9507
14480e50765K11340K18863K49866J63516m3501l75226l29343o6201N8715K68341
14470a94395K75784o83j25079K310R9300q9068j02356r2024J46526J91530n9846
14459E1999l6414o5868J1423R1754M2938O1716J5857K5158J8078p4101r6684k4980
14447B0876j8589j84525j1455N3959n5488k1388N1524M11455K65020M005j94696
14436C20698k93144j70274k6479n237J88356J39500N221j2870q7856k57549j48916
14425c48550n6927J7989Q9009K9199J70202J77634K9307r8390q4994K28048N1869
14414B04396j62880p1851j45425k47831j2862L49681K34593k2702k99055k23833
$$ y = [71697, 33473, -126562, -345883, -564369, -689029, -561521, -420560, -411927, -521258, -550765, -339425, -120562, 129304, 292820, 249319, -125907, -455250, -521451, -462736, -194395, 81389, 80706, -44373, -42063, 57237, -31831, -134187, -226211, -79685, 111845, 51999, 15585, -50283, -38860, 52894, 95832, 157548, 173405, 198563, 216641, 142540, 45856, 20876, 2287, -182238, -193693, -139734, -195222, -216610, -165086, 246369, 511389, 515394, 320698, 27554, -142720, -169199, -174436, 13920, 153420, 158641, 145771, 57915, -199634, -348550, -405477, -387488, -298479, -269280, -99078, 78556, 107863, 9473, -75521, 152527, 204396, 41516, -30335, -175760, -423591, -436453, -86772, 147821, 125119, -173936, -397769]
14404c97769j16442J09233Q0996Q0570q6594p4256L4107Q3288Q4563n9020r4037
14393c55361l3103J69916J78438J81504J28216L3609O7415P0534L3553J88162
14383F62883R2716j71384j99521l18466k19731j3754j12516k4366J39878j69057
14373c33318j99002J47041J93644K96961O7732k5314N7850K0464m1995j9744L575
14362A67894j59851j35078j08033M0266J40862j47587k11582N8478J17464J59322
14352g7845J62748j3567N6174O4855j46421k25202k2283N1853j5043j55307p1330
14341c91368J06093J28294o135j17699o6447o863K38326K07251M638J6459J92549
14330C05098K70235J40422K76j38195j24181q4979j46902j17432J97020O8939
$$ y = [-397769, -514211, -404978, -323982, -243412, -330006, -404262, -370155, -286867, -202304, -261324, -355361, -388464, -218548, -40110, 141394, 269610, 303219, 370634, 441168, 474721, 662883, 755599, 584215, 384694, 66228, -153503, -167257, -279773, -304139, -164261, -333318, -532320, -385279, -191635, 105326, 173058, 147744, 205594, 226058, 184063, 164319, 167894, 8043, -127035, -235068, -194802, -53940, -201527, -413109, -354631, -237167, -77845, 84903, 71336, 127510, 192365, 45944, -179258, -201541, -149688, -164731, -320038, -391368, -285275, -156981, -163116, -280815, -347262, -354125, -115799, 91452, 96090, 112549, 305098, 575333, 715755, 716031, 577836, 453655, 368676, 221774, 104342, 301362, 370301]
14320C70301j19827q0050j05304J29795K03541n6277j49630k2259j762J29100
14310B97628J86042j02163l16684k80813j26617J32679J14198o7858j96424p4526
14300d34538p0238j15221J22390J04498q3570r447o4725k7337J27477J72327J22148
14289a56236L0642k1352m972j47716m7309P3570n763P0313P9423k5072n0026j53741
14277c58239k73843j68692N8736J08440J09106J91148K23905K4747j33480J26869
14267i1303K62057J79434K10738O5514o6654j96492j72262k5557O1100J46005
14257C72580R9397j04162m3689J45281l3033k09605j75024N7197J66803O3366
14247C39111j25527j38615m0525o0406K514J54027Q9192l4954j60263m08181k69511
$$ y = [370301, 250474, 170424, 65120, 194915, 398456, 342179, 192549, 170290, 168528, 297628, 483670, 381507, 64823, -215990, -342607, -209928, -95730, -163588, -360012, -434538, -504776, -619997, -497607, -393109, -476679, -486126, -550851, -578188, -450711, -278384, -156236, -125594, -146946, -151918, -299634, -346943, -273373, -279136, -208823, -129400, -154472, -204498, -358239, -632082, -800774, -742038, -633598, -524492, -333344, -109439, -84692, -218172, -91303, 170754, 350188, 560926, 626440, 559786, 363294, 191032, 165475, 226575, 372580, 471977, 367815, 324126, 469407, 436374, 226769, 51745, 108942, 275745, 339111, 213584, 74969, 34444, -25962, -23448, 130579, 219771, 184817, 24554, -383627, -653138]
14236f53138J36399J51773J7224J59336K89418J2308m4970J9003m0008j52718
14226a05373J7846j1868o4865r1923O9466J44188J7639j05539j9763J4837m5748
14215a81103Q9472K14742K39939J61585r7082k31714j62594j03332p3863j10248
14205b54198j87021j76735k1537J05486J15600R6946J34709L5513j09966j21029
14195c82232K53578K21908J69910K42974J05272K893q8079o5880j77680j93465
14185H9199m8551j89911n7907J90232J35760n4500L4044P8511K0374j33941k26026
14174a62716J30288M75403K84548j80568l19132q7361j06839j05763p5507r4260
14164b41907o8691J5234J40507L4359k83047j12790J39824j43965n0388J94574
$$ y = [-653138, -516739, -364966, -347742, -188406, 101012, 113320, 68350, 87353, 47345, -105373, -87527, -99395, -164260, -256183, -186717, -42529, -24890, -130429, -150192, -135355, -181103, -91631, 123111, 363050, 524635, 427553, 195839, 33245, -70087, -143950, -254198, -441219, -617954, -639491, -534005, -418405, -321459, -186750, -151237, -261203, -382232, -128654, 93254, 263164, 506138, 611410, 614303, 526224, 460344, 282664, 89199, 40648, -149263, -207170, -16938, 118822, 64322, 98366, 176877, 197251, 63310, -162716, -32428, 442975, 727523, 546955, 227823, 140462, 33623, -72140, -147647, -241907, -310598, -295364, -154857, -120498, -403545, -516335, -376511, -520476, -570864, -376290]
14154c76290K35372K58705N2448k88377j93309j08807K616O9323L5557o3618J01568
14143b74812K01565L5086m0334j9627q5085j25885o2245N07J19790J95015j1172
14132f7197k42037l158M2718j14843j7166J57305P6345k33496j75158J31165J33474
14121c12048J47421K96759K62093J3624J3990j76784l20661o8155L06737K69141
14111D32117k1644k28732r5699P0895J5927j51069j89779j78378r9465Q1770L3724
14100c30333J49M016K3671o8238N6390J46811O4472k26201j85781j01921K3691
14089e93274M2719k05906K2822K10526j9019J56056L09652K5284P7428P3601m445
14078I5444J14895j00222j47144k47422j69965J5608M3244P7187J69481Q6250
$$ y = [-376290, -140918, 117787, 170235, -118142, -311451, -420258, -417642, -348319, -312762, -376380, -274812, -73247, -38161, -78495, -98122, -183207, -309092, -371337, -370830, -251040, -56025, -67197, -309234, -312392, -269674, -384517, -401683, -244378, -168033, -401529, -576687, -445522, -312048, -164627, 132132, 394225, 407849, 421839, 245055, -75606, -143761, 162976, 432117, 410473, 181741, 86042, 156937, 172864, 21795, -167984, -346362, -445827, -364057, -330333, -330184, -326168, -302497, -370735, -314345, -167534, -103062, -329263, -515044, -616965, -593274, -550555, -756461, -733639, -523113, -542132, -386076, -76424, -51140, 26288, 99889, 95444, 210339, 110117, -37027, -284449, -454414, -438806, -395562, -318375, -148894, -62644]
14068f2644J25433J07004j2254j71254j26850L6130P8751K12552J28556j98869
14058A16555l09199L8093N6938r7014O128J81715K10534R2027p9150j03906j57814
14047d5093j07593j07300J4775J37212J59893R3604k42836k41060J74042K31459
14037F7103n8504p1196k3392o9603J29738K5660j46715j16493j89715k4339j30
14026d77586N0643K21428J10301k17543j14534N3638N7320k9446j3461J17357
14016b41883M6940L8701J35818J77191j19037l58168k11242j09529j04915J43041
14006f03083J86038L4329L4012J58690J73957R4615O0381j0094p89n6565l17678
13995b46187j89230J09648J07766p569J15560n9816j25744p5120J26898P6314
$$ y = [-62644, 62789, 169793, 157539, -13715, -140565, -104435, -25684, 186868, 315424, 116555, -192644, -154551, -97613, -194627, -188499, -6784, 203750, 295777, 216627, 112721, -45093, -152686, -259986, -245211, -107999, 51894, 145498, -97338, -338398, -164356, 67103, 8599, -62597, -85989, -155592, -25854, -194, -146909, -263402, -453117, -477456, -477586, -426943, -205515, -95214, -312757, -427291, -373653, -316333, -345779, -359240, -241883, -194943, -156242, -20424, 156767, 37730, -320438, -531680, -641209, -746124, -603083, -417045, -382716, -348704, -190014, -16057, 78558, 138939, 128845, 128056, 71491, -246187, -435417, -325769, -218003, -225572, -110012, -169828, -295572, -370692, -243794, -167480]
13985a67480J0960j11694j98348o4536L58241K02724n4985j42500j02279J60116
13975a09781J12991q2929l9471R2448K92888J60559j87790k37183l5169J06997
13965G3560q7155j8818L9913j16473l23184p4299K42608L34347J72207k9314j56028
13954E7364k40838r8683N6825K86054l1158j83756n3408R5984J32401N0032o9886
13943I31k35329j37596J76918N3404o123J06409o8451j63929q4674j45276N1065
13932d52651r0012k5835O6892P8526K45111r0454k70146j5413K39759Q3689M8576
13921a81958J50917J53530J64362q8843l22572k63052j19170q0918N3900K47520
13911b86284q999q8360M9782K45692L6354K4579J26618O0262o6335k8906j13114
$$ y = [-167480, -156520, -268214, -466562, -531098, -172857, 29867, -25118, -167618, -269897, -109781, 3210, -79719, -119190, -26742, 266146, 426705, 238915, 1732, -33437, 73560, -13595, -32413, 7500, -108973, -432157, -506456, -263848, 70499, 242706, 213392, 57364, -183474, -282157, -225332, 60722, 29564, -154192, -207600, -111616, 20785, 70817, 931, -234398, -371994, -195076, -141672, -147795, -41386, -109837, -273766, -358440, -503716, -452651, -542663, -568498, -501606, -423080, -177969, -268423, -538569, -553982, -314223, -230534, -181958, -31041, 122489, 286851, 198008, -124564, -387616, -506786, -587704, -533804, -286284, -295283, -383643, -333861, -88169, -51815, -27236, 99382, 159644, 93309, 64403, -48711]
13900d8711k65552m9603Q2974J82186M03555K65516L6592L5899N1306j57692k79555
13889B56915j65954R623p3581M0914J33741L029j09162o5866j13884j25570j9550
13878b29345J47371N952p9460J66893q9914r6842r493J37493K84309J21669J68278
13867E26911q125k33748k04644j29544O8719o1668j85652n6255M3210J54536p3973
13856a60233K1598j6938j80919k32738k84300j12799K35458K77896N0173k0770
13846d23572k1862J2191J05562N0914R8625R43o3078j66987K5029l7028m0097
13835d59360L4356J2890M9355l9068K9493j40735j43775m219J36021J24422J15353
13824b85267J5701n5705n3015j00617M7883j4487O9278Q3772K6442J03870K86204
$$ y = [-48711, -314263, -363866, -280892, -98706, 304849, 570365, 606957, 642856, 694162, 536470, 256915, 90961, 100584, 27003, 67917, 201658, 204687, 95525, 29659, -84225, -209795, -229345, -81974, -76022, -155482, 11411, -78503, -175345, -184838, -47345, 236964, 358633, 526911, 518786, 285038, 80394, -49150, 19569, -42099, -227751, -284006, -240796, -86260, -160233, -138635, -155573, -336492, -569230, -853530, -966329, -730871, -452975, -402802, -423572, -445434, -433243, -327681, -276767, -178142, -177199, -240277, -407264, -382235, -419263, -459360, -425004, -412114, -362759, -401827, -372334, -513069, -656844, -661063, -525042, -400620, -285267, -269566, -325271, -378286, -478903, -431020, -445507, -376229, -292457, -266015, -162145, 124059]
13813A24059J09997m7593L4923j63113j95225l0783M6606J75706P9228k52484
13803a18679j37882J20087J74140J65415L07078m7938r3785m4013k06688l41781
13793b24046o8041P9419P2487j4265J04961O4300j38851m1567M9429K7205o016
13782i4985k940r8979k49263m30797k5208L70840M53035m4580k13841O8745J38946
13771a29027R2752L0521P876K30162J00487j63762k24379j72898p9592J10622
13761a97238n9632j97398k1422J26917M25436J73535O009L03858L4914k74935
13751C20044l69809k47833J10634K77897J89659N4477j18984k11738j25539k0077
13741a41269J26438N2761J298j973k8442J03606K75142P9371k51259j34357M108
$$ y = [124059, 234056, 186463, 221386, 58273, -136952, -167735, -121129, 54577, 133805, -118679, -256561, -136474, 37666, 203081, 510159, 462221, 368436, 324423, 117735, -224046, -292087, -212668, -140181, -154446, -49485, 14815, -124036, -165603, -116174, -88969, -94985, -97925, -196904, -446167, -876964, -902172, -531332, -78297, -122877, -336718, -267973, -129027, -36275, -5754, 2122, 232284, 332771, 169009, -55370, -228268, -307860, -197238, -256870, -454268, -475690, -348773, 76663, 250198, 256207, 560065, 594979, 320044, -49765, -297598, -186964, 90933, 280592, 335069, 216085, 4347, -121192, -141269, -14831, 37930, 39228, 37255, 8813, 112419, 387561, 466932, 215673, 81316, 85424]
13730H5424Q3037l6083j53226k67852k66854j99659j40326R7675L88259K57776
13720a51829K9517P4556P1642K7173j66846k40387j40970K8596J52745N070Q811
13709c01922M7518L0538M1851P3491p5059j09291l1158j14495j04436m218M2364
13698e04817L7694J06722J50629J03251j4705k71250k92398m2144J38152K32527
13688c56339J50832J58795J45050m5796p1735J66956j46202j38267Q5868Q8109
13678C7271J04178L1319O6176r3161l12785m1191J51909K15912Q8930m6035j4184
13667A88339J39658L7789j00702k74105j72248l1262k3685J05413J43095p0754
13657e8462j75223j64951j11058p1287n7173J64902J69384Q3299Q0179k57534
$$ y = [85424, 168461, 132378, -20848, -288700, -555554, -755213, -895539, -797864, -409605, -151829, -122312, -47756, 23886, 51059, -115787, -356174, -497144, -468548, -315803, -310733, -301922, -254404, -223866, -182015, -108524, -183583, -292874, -324032, -438527, -542963, -547181, -504817, -467123, -360401, -209772, -106521, -121226, -392476, -684874, -727018, -588866, -356339, -205507, -46712, 98338, 52542, -19193, 147763, 1561, -136706, -50838, 37271, 141449, 172768, 238944, 145783, -167002, -208193, -56284, 159628, 248558, 202523, 188339, 327997, 365786, 265084, -9021, -181269, -212531, -236216, -130803, 12292, -58462, -233685, -398636, -509694, -580981, -638154, -473252, -303868, -220569, -140390, -397924]
13647c97924l42921j06617K37396K26929K48696J77142k0896P6364j02863k7304
13637c1998O5419J16579j54671k55851n8797Q4668K24001J11380o3789j35303
13627i8362k28036k70248o4977J98961K55807l1802L0259L29703J42943j3431
13617B50817m5859j75761m5373J25042k1308M054J69564O7757P1929K5047j26417
13606B99492k43879j76344J21959K47984k5389j57055m0757P9711J33715L6625
13596B76062j18914j07216j08994n8113J0451L1339J73919J57973J04616J54414
13586E15537r3515j84663j98176k92921j39563J10832M6749k36496k44531o6807
13576g83554J0101j02010l4449N5884R9692P7500N8012K15157J28844j11202j09415
$$ y = [-397924, -740845, -847462, -610066, -383137, -134441, 42701, 21805, 98169, -4694, -31998, 33421, 150000, -4671, -260522, -319319, -234651, -10650, 100730, 36941, -98362, -326398, -596646, -661623, -462662, -206855, -238657, -208398, 121305, 264248, 250817, 204958, 29197, -16176, 108866, 87558, 91612, 261176, 328933, 400862, 425909, 299492, 55613, -120731, 1228, 249212, 223823, 66768, 26011, 105722, 239437, 276062, 157148, 49932, -59062, -117175, -106724, -75385, 98534, 256507, 361123, 515537, 422022, 237359, 39183, -253738, -393301, -282469, -235720, -472216, -716747, -783554, -773453, -875463, -909912, -854028, -754336, -676836, -618824, -403667, -274823, -386025, -495440]
13565d95440P2859J10990l3016l6106K03845M5545p9933J65911J54456P8335o8393
13554A19053j19392J43655K3842k19320r6665K18647K45626j5688m4480j4951
13544B40327k7185k8752P5433m4805j06235O4099J7001K9685J17360l8985k62577
13533C5366j30005J55166J49009J41454m1721o7472l1521r7291r9611j0158L8289
13522D1505k24873k91137n1408K33628J00346j9265k7411j04703l8843j10539
13512d92700P3134K25267Q5467L779J68400K07249m4990r0877m8964m9830M1823
13501G7758L3765Q3250M7958o6546k38464k06996J884l0514k30992l5297K48936
13490c15258J26676j16826J997J45847O2033p9496p9249Q4909K42063K52795J80693
$$ y = [-495440, -422581, -311591, -344607, -380713, -176868, -131323, -211256, -45345, 109111, 187446, 119053, -339, 143316, 167158, -52162, -148827, 69820, 315446, 299758, 255278, 240327, 213142, 184390, 259823, 215018, 108783, 172882, 189883, 219568, 336928, 297943, 35366, -94639, 60527, 209536, 350990, 309269, 241797, 210276, 112985, 13374, 3216, 41505, -183368, -474505, -525913, -292285, -191939, -211204, -238615, -343318, -382161, -492700, -419566, -194299, -108832, -105053, 63347, 270596, 225606, 134729, 85765, 35935, 77758, 111523, 194773, 242731, 176185, -62279, -269275, -267391, -297905, -528897, -564194, -315258, -188582, -305408, -303411, -157564, -95531, -175027, -254276, -169367, 72696, 325491, 506184]
13479E06184J62861k66221m36224j04529N2660M9459L6093J10840J94474J1659
13469C17256j26168K7445K435J1827J03222J40168K24993J06853k93561l25552
13459A88918k07343K3987J16534Q1926j37995q8449J54200K3737k1722M4405J67898
13448C46096N7270n6447l4163j6445L5616r1991n3479m8917k12757j40746J67840
13437d8123R4821k78036k22705J62060J86369j9888K3934K38211K25069J14370
13427D76082K7396l41525k72542j10424l0597J65263J55333Q4449P0015N8295
13417B81745N371m5454l3883M1267j7683j23113k1844j75567j73576L7760J33322
13406i1655J18358k0262J03213J71180j87142j52798R2855K51009m8869q3071
$$ y = [506184, 669045, 402824, -33400, -137929, -85269, -35810, 283, 111123, 305597, 317256, 191088, 218533, 220968, 232795, 336017, 476185, 701178, 808031, 514470, 188918, -18425, 5562, 122096, 204022, 66027, -22422, 131778, 155515, 133793, 178198, 346096, 403366, 346919, 312756, 296311, 331927, 239936, 186457, 137540, -75217, -215963, -48123, 46698, -231338, -454043, -291983, -105614, -125502, -101568, 136643, 361712, 476082, 503478, 161953, -110589, -221013, -251610, -86347, 68986, 153435, 223450, 281745, 287116, 241662, 207779, 249046, 231363, 108250, 86406, -89161, -262737, -224977, -91655, 26703, 6441, 109654, 280834, 93692, -59106, 33749, 284758, 235889, 152818]
13396A52818j44637k80797o9379j27210m5168J70981K10990K69027J02106n9778
13386A78953j66947o3456R43o4251j17030m1852O8981n9782j60947J27406K11506
13375h6476L5789j59569j33795j52105O1159J11551J42740K24269J52503r2437
13365A03629j19379K9263K0859j94309j01803J03383J15972j6067j64289k16207
13355d38948R4654L19441R3375k03816j81483K32352L03220J75042J48784k05366
13345C37255k35229m1767M3221K78848j24612l55018o017J75381K5011p4348q3456
13334f0731J17776L3274q2641J11733J03002j32961p049Q5220K6752m6503j5391
13323A32481J10958J75292n1761r6865j71420j49542l1108K70822J57674R1276
$$ y = [152818, 8181, -272616, -341995, -469205, -514373, -343392, -132402, 136625, 238731, 178953, 12006, -51450, -50507, -114758, -231788, -273640, -204659, -264441, -425388, -297982, -86476, -50687, -210256, -344051, -496156, -434997, -323446, -180706, 43563, 196066, 103629, -15750, 13513, 34372, -159937, -261740, -158357, -42385, -58452, -222741, -438948, -344294, -24853, 68522, -135294, -316777, -84425, 218795, 393837, 542621, 337255, 102026, 60259, 103480, 382328, 257716, -97302, -103319, 72062, 97073, 22725, -60731, 57045, 90319, 7678, 119411, 222413, 89452, 82403, 167623, 194375, 147872, 132481, 243439, 418731, 366970, 270105, 98685, -50857, -81965, 188857, 346531, 437807]
13313D37807J15013M0713k0112Q8192J69057j67876l69962n0793N9984P4367j20880
13302B55510m27121k29459q7972p9803J18254K38981Q8644N6434K20778p282J1909
13291A58873j6822O9180P7681j62246j05580K1313K84571J90436N8300p6689j85206
13280C13811n3832r2456m0026n336j22333k9308j29790j62384K39882L49515m8556
13269B19187j86974k9832K1431k13744j17539J38043J77715J58231K7470J36651
13259C30639K05441J17046Q3174M4895J321P2438K07311J65880k57375k21321
13249G49449p0922J534o4943j61556k38887o1815K3253K01755L28419M0016r0552
13238F55751k08413k44439j47828j26399r0708O3230R1486J38735M8838j51599
$$ y = [437807, 552820, 593533, 573421, 661613, 830670, 662794, 292832, 242039, 302023, 376390, 255510, -171611, -401070, -489042, -568845, -450591, -211610, -122966, -66532, 154246, 146964, 158873, 142051, 211231, 288912, 126666, 21086, 42399, 326970, 517406, 575706, 499017, 313811, 259979, 167523, 127497, 122161, -172, -29480, -159270, -321654, -81772, 267743, 219187, 32213, 2381, 23812, -189932, -307471, -169428, 8287, 166518, 193988, 330639, 536080, 653126, 736300, 781195, 782516, 854954, 1062265, 1228145, 970770, 749449, 678527, 680061, 615118, 453562, 214675, 152860, 176113, 377868, 706287, 746303, 655751, 447338, 202899, 55071, -71328, -162036, -98806, -7320, 131415, 180253, 28654]
13228B8654J05756K78956K02069n9301j58571j93984j20279L242N421j1511J9669
13217A00121L3576k69797k18164k02881j83841L3996L57635K80417J07146J37969
13207A76177j65523n4976K16682J59647Q7931J41872K39858P5383p6983j40065
13197F60003l3378J42103J88167o5683o2145K43815K48669j40032k46191k12678
13187G22650j52899Q505P6131J16635r40j10907q5002j32705q3987L7640O8028
13176D63149J08591M4350J41767m8335k31452K6984M50353L91042k323l21005
13166A023121j40834O8032J45482J67749j6220l8050j06586j2306J57780J42857
13156A391025O3446J13424R2611j32641j8246J31350j04894n7580P9822K60154
$$ y = [28654, 134410, 413366, 615435, 556134, 397563, 203579, 83300, 86542, 91963, 80452, 100121, 133697, -136100, -354264, -557145, -740986, -706990, -349355, -68938, 38208, 176177, 10654, -44322, 172360, 332007, 419938, 561810, 801668, 877051, 800068, 660003, 626625, 768728, 956895, 891212, 829067, 1072882, 1321551, 1181519, 935328, 722650, 569751, 578256, 654387, 771022, 770082, 659175, 574173, 441468, 357481, 395121, 463149, 571740, 616090, 757857, 709522, 478070, 505054, 955407, 1346449, 1344126, 1023121, 882287, 950319, 1095801, 1263550, 1247330, 1209280, 1102694, 1090388, 1248168, 1391025, 1454471, 1567895, 1660506, 1527865, 1509619, 1640969, 1536075, 1478495, 1558317, 1818471]
13146A818471M14469M07345M88724P91702J162706J506698J862773J889287N23175
13137A0865350j179358j773504j411384j234286j020570o83285n45035n56168
13129B461760k99073r2459j08208k13843j53255M0974j30311l87903j44042n71
13119I73069M9187J90856K6702j85144l37443k77515l1928L0558K92672K98540
13109A029554J00751j10780L488J97069j3310l3170n7909j00497m5702L6393P7186
13098A083073J95551J39981O3959j71719r2647J04122K06041J32609k3011J3469
13088A651428j2867L9487J87328K69132L755k04093l11050J5517L45384O9830
13078B053851k10069k36715j38075P0962n0473j90567k19456n4556l0678j02468
$$ y = [1818471, 2232940, 2640285, 3129009, 3920711, 5083417, 6590115, 8452888, 10342175, 10865350, 9685992, 7912488, 6501104, 5266818, 4246248, 3562963, 3017928, 2461760, 2162687, 2070228, 1962020, 1748177, 1594922, 1635896, 1505585, 1117682, 973640, 973069, 1022256, 1213112, 1239814, 1054670, 717227, 439712, 407784, 438342, 731014, 1029554, 1130305, 1019525, 1023013, 1220082, 1206772, 1173602, 1115693, 1015196, 969494, 1005887, 1083073, 1278624, 1418605, 1482564, 1310845, 1218198, 1322320, 1528361, 1660970, 1637959, 1651428, 1638561, 1678048, 1865376, 2134508, 2138263, 1934170, 1623120, 1638637, 1984021, 2053851, 1843782, 1607067, 1468992, 1539954, 1489481, 1298914, 1079458, 1024902, 994224, 891756]
13068H91756M6408J33829n5607Q2408K90851R2578j06005J61687J76379j26743
13058A587541k82317j47910J1293K36816J26754j7535L27590L79379N9335j44099
13048B136847j10970m5403n5227k38642j57443Q1801J29459J11694J12871J7970
13038A982957l7284M3134Q5246R2438Q5904K71523L07219K17543J27503k58976
13028B917207l01322k1673J02244J89190m0925n5158K80917K27261J46080J1172
13018C454993o0924n8915J14052J19972J51245K05461M70521L43002J40723K24493
13008E104623K05533P8422J32784J42677J52700m130O8014M97256N74414N91838
12998G544131N03919M92650M49179M44191O61072R29099J074491J225547J637992
$$ y = [891756, 938164, 1071993, 1016386, 1098794, 1389645, 1482223, 1376218, 1537905, 1714284, 1587541, 1305224, 1157314, 1168607, 1405423, 1532177, 1514642, 1842232, 2221611, 2280946, 2136847, 2025877, 1980474, 1925247, 1686605, 1529162, 1610963, 1740422, 1852116, 1964987, 1982957, 1945673, 1988807, 2074053, 2166491, 2252395, 2523918, 2831137, 3048680, 3176183, 2917207, 2615885, 2594212, 2696456, 2885646, 2844721, 2789563, 3070480, 3297741, 3443821, 3454993, 3394069, 3335154, 3449206, 3569178, 3720423, 3925884, 4396405, 4739407, 4880130, 5104623, 5310156, 5388578, 5521362, 5664039, 5816739, 5812609, 5880623, 6377879, 6952293, 7544131, 8048050, 8540700, 8989879, 9434070, 10095142, 11024241, 12098732, 13324279, 14962271]
12989A4962271J870986K252620K659637L048965L611665M571818N771811P217267
12981D5967040R143821J1645506J4969836J9352084K5688102L4225284M3007422
12974B03999095M5579671L1012135k183882l3078366m4523852m0871010l2476076
12967A27457715k4815593j8684577j4314706j1436531r102739p140452n545182
12960C6417935m743454l873382k985458k624597k277140j967168j522544j515080
12952A4909112j377075j004407p61132r03636p74389n42164m25962n57197n98347
12943G964803l52778l91693l01737k36610j03243P7812J03175j81479j85866n2062
12933F340322n2046j97014k78097L8408K55124J83095J63574J39055J28558K72103
$$ y = [14962271, 16833257, 19085877, 21745514, 24794479, 28406144, 32977962, 38749773, 45967040, 55110861, 66756367, 81726203, 101078287, 126766389, 160991673, 203999095, 249578766, 280590901, 278407019, 245328653, 200804801, 159933791, 127457715, 102642122, 83957545, 69642839, 58206308, 49103569, 41963117, 36417935, 31674481, 27801099, 24815641, 22191044, 19913904, 17946736, 16424192, 14909112, 13532037, 12527630, 11766498, 10862862, 10088473, 9546309, 9120347, 8563150, 7964803, 7612025, 7220332, 6918595, 6681985, 6578742, 6656554, 6759729, 6578250, 6392384, 6340322, 6288276, 6091262, 5813165, 5851573, 6106697, 6289792, 6453366, 6592421, 6720979, 6993082]
12923F993082J19243O6686M14332P61967R16430R16488J132549J240401J234075
12914A3795253J138152K92383n96320q15845n55588k28812R0484O9316L25412
12905A3514435N95088R31807J334292J809161K427232K746298L350749M238799
12897C0947861N044931O019361P469938R437218J2239545J5943494K1016459K8309230
12889A36428037L7520091M6059568M5801038K4329451j3101631m0601734m6342165
12882A90092655l9474537l0311107k3024548j7443245j3371185j0336284p953410
12875D8178339o379272n128267m083403k988468k142463j729070j068492K47064
12867B4905968J734876J623177k012481m384272l289089k367185j993681j290090
$$ y = [6993082, 7112325, 7179011, 7593343, 8355310, 9271740, 10188228, 11320777, 12561178, 13795253, 14933405, 15225788, 14629468, 13813623, 13258035, 13029223, 13119707, 13189023, 13514435, 14109523, 15041330, 16375622, 18184783, 20612015, 23358313, 26709062, 30947861, 35992792, 42012153, 49482091, 58919309, 71158854, 87102348, 108118807, 136428037, 173948128, 220007696, 265808734, 290138185, 277036554, 236434820, 190092655, 150618118, 120307011, 97282463, 79839218, 66468033, 56131749, 48178339, 41799067, 36670800, 32587397, 29598929, 27456466, 25727396, 24658904, 24905968, 26640844, 28264021, 26251540, 21867268, 18578179, 16210994, 14217313, 12927223]
12859A2927223q37793r99619j132849p58994l95742k53577k80038k24634k86066
12850G757911k55323k89516l55427k82675k18880k0573r7492j3692m1050j6857
12840F166426l5389J0922Q7315O8384L21478K28986m0397N5866K88069N28469
12830G680129K78965O7814K6326l9202j0188L42067N36830M46161O49564J040364
12820A1018830J024075Q05552J159846J544909J643031J969204K323681K875813
12812B4364941L663732M433028N162589O336120P999711J0160265J3001672J7284060
12804I2406118K2915795L0058933L8979072M5624081M0052684J3758870k1488607
12797B62306946m2142770m3853737l6593538k8030923k1351725j6447172j2603541
$$ y = [12927223, 12089430, 11089811, 9956962, 9197968, 8802226, 8548649, 8268611, 8043977, 7757911, 7502588, 7213072, 6857645, 6574970, 6356090, 6335517, 6238025, 6224333, 6183283, 6166426, 6131037, 6141959, 6229274, 6297658, 6619136, 6848122, 6807725, 6863591, 7151660, 7680129, 7959094, 8026908, 8053234, 8014032, 8003844, 8345911, 8882741, 9328902, 9978466, 11018830, 12042905, 12848457, 14008303, 15553212, 17196243, 19165447, 21489128, 24364941, 28028673, 32461701, 37624290, 43960410, 51960121, 62120386, 75122058, 92406118, 115321913, 145380846, 184359918, 229983999, 270036683, 283795553, 262306946, 220164176, 176310439, 139716901, 111685978, 90334253, 73887081, 61283540]
12790F1283540r769795p674575o160857n056169m318377l628459k957479k452166
12782A9265663j991211j690562j427301j354087j374937j118418p02521p15995
12774H890631q39135q91497q02680o11492m88360k38597k31813m06928l01481
12765D078648r939j14104m00648k16953l4336P3552n5850j74291r4725j55944
12755B895410j96976p7544l8766M8212k17237n43183l46855o4437J9660Q6465
12745A564749J99229J86801O5559K4681k3453n2984j52541j78930j62067k65857
12735A205187k14842p9982J95230J13585k3831j31798q6855m610M5169k1318l3009
12724I62926J9065j68648l5732J92687J28519k26284j90151j95230j55156R4751
$$ y = [61283540, 51513745, 43839170, 37678313, 32622144, 28303767, 24675308, 21717829, 19265663, 17274452, 15583890, 14156589, 12802502, 11427565, 10309147, 9606626, 8890631, 8051496, 7159999, 6357319, 5745827, 5257467, 5018870, 4787057, 4380129, 4078648, 4068709, 3954605, 3553957, 3337004, 3302668, 3376220, 3320370, 3146079, 3051354, 2895410, 2698434, 2620890, 2582124, 2630336, 2413099, 1869916, 1523061, 1458624, 1478284, 1564749, 1763978, 1950779, 2016338, 2041019, 2017566, 1964582, 1812041, 1633111, 1471044, 1205187, 990345, 910363, 1105593, 1219178, 1195347, 1063549, 976694, 972084, 1017253, 995935, 962926, 981991, 813343, 777611, 970298, 1098817, 872533, 682382, 487152, 331996, 426747]
12714D26747J27064j6299k65661l25583O267J90408J89791M110k78363q2258J61123
12703A37346J25823N7169L7953q4547r0553j58729j2269K35924K76531L05598
12693H30246K85095J69568m7031K8746L2046q9973j07524j8580J38523J3961j61526
12682A073551k16726j40776j57826L5599j8692K659P2931K7207O8294J72277J12253
12671A030751k44717k79746j1151r0419J8531J74187L5733r4525j20927k22555
12661A95162n311L04689J05743q8613k53341j10168K6193K44565Q4348j09686
12651C93581r8540j73994j69851l1252P9900J48996L24466J12376j59475j58181
12641B68026j32447N0804K89703P8063k83142j83005k00601j42278j6208M0752
$$ y = [426747, 553811, 537512, 271851, -53732, -47465, 142943, 332734, 336844, 58481, -23777, 137346, 263169, 320338, 358291, 273744, 183191, 24462, 12193, 248117, 524648, 830246, 1115341, 1284909, 1237878, 1266624, 1298670, 1208697, 1101173, 1082593, 1221116, 1235077, 1073551, 856825, 716049, 558223, 593822, 575130, 577789, 650720, 677927, 746221, 918498, 1030751, 786034, 506288, 495137, 404718, 423249, 597436, 633169, 538644, 417717, 195162, 189851, 494540, 600283, 511670, 258329, 148161, 174354, 418919, 503267, 393581, 295041, 121047, -48804, -80056, -156, 148840, 473306, 585682, 426207, 268026, 135579, 186383, 476086, 554149, 271007, 88002, -112599, -254877, -271085, -230333]
12631b30333o101j96381q0554K04318J92500R8686O2273m1195j4836N3504J11995
12620A53876Q5506J23849J50200j1515j76082r9253J3863q8985j15480J637O8208
12609A05824j53872j59589o6399N7151R4669J27822N2594J59193J31719l5934
12599C13178N2081l5252q6068M8792K2837l29928k50858J36964L30491J96465
12589C98702N4852R7817M4725O0780O5380q7621j37033k33941j79140J42812j4713
12578B12620k63915j71200l9369K7687Q8437K09858K82371J64901P0283L3425
12568F15098r2180j30503j37968j27035j28874j6241M0453K1136j46124o2094
12558a64332J47846O1137J74595J13031K8234l2244J10922K15293j11144j27694
$$ y = [-230333, -236434, -432815, -513369, -309051, -116551, -17865, 44408, 3213, -11623, 41881, 153876, 239382, 363231, 513431, 501916, 325834, 226581, 240444, 151459, 35979, 37616, 105824, -48048, -207637, -274036, -216885, -122216, 5606, 58200, 217393, 349112, 313178, 365259, 330007, 243939, 292731, 315568, -14360, -265218, -128254, 202237, 398702, 453554, 551371, 596096, 656876, 722256, 634635, 497602, 263661, 84521, 227333, 212620, -51295, -222495, -261864, -234177, -145740, 64118, 346489, 511390, 581673, 615098, 522918, 392415, 254447, 127412, -1462, -17703, 22750, 43886, -102238, -164332, -16486, 44651, 219246, 332277, 360511, 328267, 439189, 654482, 543338, 415644]
12548D15644j46900j01203k8949k1246o5862o8038n6409n7750j38290J02399J37337
12537b9267o8160Q0009J43233O2846J83412J8006j10579R5938j11295k71087o0549
12526f7493j30326k3135j02745j0216q57l6052P7201J92243K67536J85016J37022
12515D88194q2041k22842p5275j204L482R144J08143K0628k03019k47296l2161
12504b34247J59922P1855n0114j74168p7214J7619K9129R8859j823k2269n1997
12493b34448j21756J58053K0202o4853k26262j38795R5507J62154K05959J25666
12483a8573k10008m6102J14137J6317J35943J77171j8470k4160J839P631k80877
12472a45152l31989n7397K49797L16691Q0835R6046N8592L0576j44885j12243
$$ y = [415644, 268744, 167541, 138592, 117346, 51484, -16554, -72963, -130713, -269003, -166604, -29267, -97427, -17418, 125815, 188661, 372073, 390079, 279500, 375438, 264143, -6944, -67493, -197819, -220954, -323699, -333915, -334772, -370824, -293623, -101380, 166156, 351172, 488194, 406153, 183311, 108036, 106832, 110314, 119458, 227601, 248229, 45210, -202086, -234247, -74325, -2470, -52584, -226752, -303966, -286347, -257218, -158359, -160182, -182451, -234448, -356204, -198151, -177949, -242802, -469064, -607859, -512352, -350198, -144239, -18573, -228581, -274683, -160546, -144229, -8286, 168885, 150415, 126255, 128094, 135725, -145152, -477141, -534538, -284741, 31950, 112785, 208831, 267423, 297999, 153114, 40871]
12462D0871K24589J85470j17344l24835m32869l42510p6664K00098K74740Q3940
12452b84514O2016J26813J14675K97034K44655Q3398j39417j50595M2399J60992
12442E57456j33854j79373k13406k04044m1804Q0386J88568J39945l9846j40840
12432A3188N4692J26738Q5816n241p6385j50507j06838j44124q9660M8460l6494
12421b80355m6326J1158j47786Q5903K16200P5889j2371Q5709Q367m7046j41289
12410a91947k48166p2314L04997L11562j07045j6020N2891q5353L6020J0420J877
12399c078O9309R3718R5745m1139j94043k03044q1117P7862R2557p0066k94298
12388d57594o86M9910j15403k26227r370R9140K29229M07773K21909k0849q5796
$$ y = [40871, 265460, 450930, 333586, 8751, -424118, -766628, -843292, -643194, -368454, -284514, -222498, -95685, 18990, 316024, 560679, 644077, 504660, 354065, 396464, 557456, 423602, 244229, 30823, -173221, -215025, -134639, 53929, 193874, 154028, 13188, 67880, 194618, 280434, 275193, 198808, 48301, -58537, -202661, -292321, -243861, -280355, -326681, -315523, -463309, -377406, -161206, -85317, -97688, -11979, -3612, -50658, -191947, -440113, -512427, -207430, 104132, -2913, -18933, 33958, -51395, -15375, -4955, -3078, 66231, 159949, 255694, 214555, 20512, -182532, -263649, -185787, -93230, -163296, -457594, -458280, -408370, -523773, -750000, -759370, -660230, -431001, -23228, 198681, 177832, 92036]
12377I2036M9449n8803k35483k62129J12064K20982j36487j32039J52645K37724
12367C9959L4052q0382P7911K16332L01514J13023j29596p8416l7119n2854M3716
12356D48140k43903m32757k75761Q458K48461K14567N6296L5181l0835m2312J52963
12345A38498n9535k28804j61237O9591K56160J9859l02403L5672J81234j219J91552
12334A39368N5949j56384o6892M5508N3920j4999R4673k2646j69775j30048l1841
12323b03167J23527j53937k00030K4660K21399J50700n9859j68876k09946l5629
12313e11158J29481L6033M5424J1679N6269q0364q6820J39430J20204O9616J30011
12302E9805J99799R3961j57759k09487o6560M8602m0317j16216j24801K33453
$$ y = [92036, 141485, 82682, -152801, -414930, -302866, -81884, -218371, -350410, -197765, 39959, 74011, -6371, 71540, 287872, 589386, 702409, 572813, 494397, 457278, 404424, 448140, 204237, -228520, -504281, -495823, -247362, -32795, 23501, 58682, 27847, -14465, 138498, 78963, -149841, -311078, -241487, 14673, 34532, -267871, -232199, -50965, -52184, 139368, 195317, 38933, -27959, 17549, 71469, 56470, 151143, 128497, -41278, -171326, -203167, -79640, -233577, -433607, -408947, -187548, -36848, -96707, -265583, -475529, -511158, -381677, -345644, -300220, -288541, -232272, -312636, -399456, -260026, -139822, -70206, 59805, 259604, 353565, 195806, -13681, -80241, -31639, -71956, -188172, -312973, -79520]
12292g9520L81438K01854m1826r0170Q8096j42074l06168p7518r2317K5934J59006
12281B6735J4571Q9103J0210k5069J37287J31973J22794M2620j09881l36557j93857
12270i0071J2632K71327K90996R6391Q2162l7544k34331j74927k33195j48709
12260a65269r6929M6303K78379K42547M7984p5107k9616j2203k39572l08051p8029
12249c89563k71243k18978Q442K60483L65709J53995J4418R7436J45525J71424
12239C37648j9723k23471j79175O9429K51259r0682k97553m9649m8638o7892J71109
12228a47338N0962J00825O5371j5742k11395o0512K38161P9666j31281O1465o4239
12217c4057l9313J63154K13413J44331j71936k38804k49735l9548Q8876p117P0702
$$ y = [-79520, 301918, 503772, 461946, 371776, 459872, 317798, 11630, -65888, -158205, -132271, 26735, 41306, 130409, 140619, 115550, 252837, 384810, 507604, 550224, 440343, 103786, -90071, -77439, 193888, 484884, 581275, 663437, 625893, 391562, 216635, -16560, -165269, -262198, -215895, 62484, 305031, 353015, 277908, 248292, 236089, -3483, -311534, -389563, -660806, -879784, -871342, -610859, -245150, -91155, -76737, 20699, 166224, 337648, 317925, 94454, -84721, -15292, 235967, 145285, -152268, -201917, -250555, -318447, -147338, -96376, 4449, 69820, 54078, -157317, -217829, 20332, 99998, -31283, 30182, -34057, -73370, 89784, 303197, 447528, 275592, 36788, -212947, -252495, -163619, -170736, -100034]
12206a00034k3389j49698Q9490M15920K27689j78243j74413k64484l56880k12809
12196g26851l8280J82301L24648K23427j44294l44128j39957J34252R4096R0095
12186c44691J96210K72593J84843k3247M7828j7397N03r7506r9589o4331n7295
12175b079k33549k70154r6287K7238J98408L01280J13027j8716J71001J94374
12165C84543j71440k48514k15326j39034J1519q9178j78454n8444L5531J69336
12155d99461J58604J23376J53064J40300j1519k11816j78269O4018K2848n2031
12145b90886K3355N299J8212M0324R6814L65564J07517k85689k04353O2971o5743
12134a26615L105K9555j9867J45199o3511k01130P8166J19729q6196k6257R6575
$$ y = [-100034, -123423, -273121, -183631, 232289, 459978, 281735, 107322, -157162, -514042, -726851, -765131, -582830, -258182, -34755, -179049, -523177, -663134, -528882, -434786, -344691, -148481, 124112, 308955, 285708, 333536, 316139, 316642, 219136, 119547, 55216, -2079, -235628, -505782, -602069, -574831, -376423, -75143, 37884, 19168, 190169, 384543, 213103, -35411, -250737, -389771, -378252, -467430, -645884, -704328, -668797, -499461, -340857, -217481, -64417, 75883, 64364, -147452, -325721, -261703, -238855, -290886, -267531, -262232, -244020, -203696, -106882, 258682, 366199, 80510, -123843, -60872, -126615, -123510, -93955, -113822, 31377, -32134, -233264, -155098, -35369, -121565, -147822, -51247]
12123e1247o4992M368k33525l63369p0464J4977r0583j31073J18137J17864J45484
12112f04423K28380P4669K6823M2986J02696K61185K18769k4487k06044j7446
12102A03108J40938J14168p1031r1166j9185n8417J1922K53968K30515j11176
12092E03644j75817k76432k61169m2599J60739J25977j36915j83399m8859L9636
12082b95194K42200J07146j87384J09532K16620O761j09100n6311o8673j28228
12072a62631j02189K9510Q1535J38557L28574K36167J14891J6448j69381k95549
12062B15932k31876j24414J27882K21566n980m681K66572j3892l30762j46899
12052b6552N8639J09825M5461k31007j87223K39185R8067q6840l2094n2186J12591
$$ y = [-51247, -116239, -111871, -345396, -708765, -779229, -764252, -854835, -985908, -867771, -749907, -604423, -376043, -301374, -274551, -231565, -128869, 132316, 351085, 326598, 120554, 103108, 244046, 358214, 287183, 196017, 176832, 118415, 130337, 384305, 614820, 503644, 327827, 51395, -209774, -252373, -91634, 34343, -102572, -285971, -334830, -295194, -52994, 54152, -133232, -23700, 192920, 199681, 90581, 34270, -34403, -162631, -264820, -235310, -153775, -15218, 313356, 549523, 664414, 680862, 511481, 215932, -15944, -140358, -12476, 209090, 203110, 198429, 465001, 451109, 120347, -26552, 32087, 141912, 187373, -43634, -230857, 8328, 106395, 19555, -12539, -64725, 47866]
12041D7866O4115j02111P280J52627P8949r7328j14983q939J95909J29392m0705
12030C12072m0712K31338K20694j08412j91388r9493k09432l31130j63351L36754
12020d3060K51320r3505k59134j44560K16690K08816J35868J48403O5400J2547
12010D98785J44887N7864j22305o0598r0948j29839j46611r6760k18423j39667
12000c03615L7817K16003J70258Q9695j1356k1214L4365j40803j61217J32868
11990D2801K34719K22482L9815j24727k20856n4912j72797k00463J86533m5876
11980i3281k85766m4404R2412K01931J63286J48333O0843j06789j90600j49455
11970b03490r8943l8030O3981q2742P7167K73651R3395j98157N2167K13576N2915
$$ y = [47866, 111981, 9870, 17150, 169777, 248726, 151398, 36415, 27476, 223385, 352777, 312072, 271360, 502698, 723392, 614980, 423592, 324099, 114667, -216463, -379814, -43060, 208260, 114755, -144379, -288939, -72249, 136567, 272435, 420838, 486238, 498785, 643672, 701536, 579231, 518633, 427685, 297846, 151235, 54475, -163948, -303615, -265798, -49795, 120463, 210158, 198802, 177588, 211953, 71150, -90067, 42801, 277520, 500002, 539817, 415090, 194234, 139322, -33475, -233938, -47405, -93281, -379047, -423451, -331039, -129108, 34178, 182511, 243354, 136565, -54035, -203490, -302433, -340463, -276482, -359224, -282057, -8406, 84989, -113168, -61001, 152575, 205490]
11959B05490j28713m7275m9320J0803N9733J19623Q6040J51212r192r4082p5487
11948B28832L3698J24104n3442q8895j47409l2416P6281o1775P7301J59595J59949
11937D75823j7654k73832l22046j05437m968N2569Q7604M3192Q6109L6178m74
11926E7064L1966J97763J73501J54137L03914l987j28347L3829n962J95013J32765
11915A141656J01662J65031j09017L9373K44135J07877J22656J70521J16007M33598
11905B533499P74655R94982J241058J489849J312657O16786l69075j138008j182784
11896F273619q32324o46513q96713q77369m35778l75015m80250l10420j13271
11887A305966k11485j53384r7911J49069J33533Q1149J00233j65529m23972l94140
$$ y = [205490, 76777, 29502, -19818, -9015, 50718, 170341, 256381, 407593, 398401, 304319, 228832, 262530, 386634, 333192, 244297, 96888, 64472, 140753, 78978, 156279, 315874, 475823, 458169, 184337, -137709, -243146, -248114, -195545, -107941, -64749, 21360, 57538, 57064, 89030, 286793, 460294, 614431, 918345, 914358, 786011, 819840, 813878, 1008891, 1141656, 1243318, 1408349, 1299332, 1338705, 1582840, 1690717, 1813373, 1983894, 2099901, 2533499, 3308154, 4303136, 5544194, 7034043, 8346700, 8963486, 8594411, 7456403, 6273619, 5441295, 4794782, 3898069, 3020700, 2584922, 2209907, 1729657, 1419237, 1305966, 1094481, 941097, 843186, 992255, 1125788, 1206937, 1307170, 1141641, 717669, 323529]
11877C23529n7481o5997l3870j02034p0671r9452l2124J95907J86422J1613L0392
11866B86234J18895M7359M7953j51265j09203K31586L62742K22621j40482k75941
11856F40499M017J65891l17270l60992Q7958K3590j04151N1645r0314j57760O7985
11845A1098J83942J48810K26201K12911n721q7962j32061r2784p2000k02121j57045
11834C3268j24474k35083j86201J31833J96276J03229J6497p097k5786N6957J26478
11823H5897Q2700K1473L0940j82638j28432j58410j63630j60632J6881K30497
11813c25354P7776k8744J20753K20219j31935l07736O6131J52397k1040J19533
11803e8000p880j06441j14964m1398J7134k4490J24532J2223p1512K0046J0255
$$ y = [323529, 266048, 200051, 166181, 64147, -6524, -105976, -138100, 57807, 244229, 255842, 286234, 405129, 452488, 500441, 349176, 239973, 471559, 834301, 1056922, 916440, 640499, 644516, 810407, 493137, 132145, 220103, 243693, 139542, 191187, 100873, -56887, 11098, 195040, 343850, 570051, 782962, 777241, 689279, 557218, 464434, 392434, 190313, 33268, -91206, -326289, -512490, -380657, -184381, -81152, -64655, -71752, -97538, -40581, 85897, 168597, 190070, 221010, 38372, -90060, -248470, -412100, -572732, -555851, -325354, -247578, -276322, -155569, 64650, -67285, -375021, -308890, -156493, -177533, -58000, -65880, -172321, -287285, -328683, -311549, -336039, -211507, -199284, -270796, -250750, -240495]
11792b40495K2435L1573p6958J09236J89906K63623J22645l9758K5505o6209m9782
11781B91721M9785q9547j56553k352j9826o8538L1623q1912j62999j27853R633
11770c26818J86015L5673p9199R4544O9200l4852J9041j1684P7438K76988k5835
11759B80511k64907j86187K709P2942K99381L07059J51820k2139j72972p3763
11749C94454j72486j60490j09120j77561n5012R5897J65240L12952K04705J73018
11739F71597J33655M1417j31440j80065l9799N6237j16353l09826k64504k6239
11729a65320K10595K49084J33430j1730m1030k41452r7635J41978j035k80203
11719a03318o7030M2791j114J80561K08431l2855j37208j07345K27352J00063
$$ y = [-240495, -218060, -186487, -263445, -154209, 35697, 299320, 421965, 382207, 407712, 341503, 291721, 341506, 251959, 95406, 93054, 73228, 4690, 36313, -45599, -208598, -336451, -326818, -140803, -105130, -184329, -89785, -20585, -55437, -36396, -48080, 29358, 306346, 280511, 15604, -170583, -167874, -94932, 204449, 511508, 663328, 641189, 468217, 394454, 221968, 61478, -47642, -225203, -280215, -184318, -19078, 293874, 498579, 671597, 805252, 846669, 715229, 535164, 495365, 551602, 435249, 125423, -139081, -165320, 45275, 294359, 427789, 416059, 375029, 133577, 35942, 177920, 176885, -103318, -170348, -127557, -128671, 51890, 260321, 227466, 90258, -17087, 210265, 310328]
11709C10328j57536J2892l7635m1260q8106k28504k59089J05650K96633K15631
11699A29004O595M7851K34200K51831J8455k17332k51558O5386J30734k6446k8054
11688C60666j35805k80511J9134J58610K2974j27515J75417J17326j19894l7098
11678A53304J8348K762l1003j69042n8109J32155n2260j9484P068K4645N5198
11667F3582j05216j45933j71109j4769K58793L12896K08583K0177j24777m7151
11657B55076K9519J33932J14458j73797l20736J0289J43660j12777k37616j77269
11647c35261R9052K54535L5492j44141k19649P2397K22882J11648n4915j06926
11637f4886j24212k12776j09296K9201J13851Q9082n556J83210M32080K44367
$$ y = [310328, 152792, 165684, 128049, 86789, -1317, -229821, -488910, -383260, -86627, 129004, 135599, 183450, 417650, 669481, 687936, 470604, 219046, 284432, 415166, 388720, 360666, 224861, -55650, -36516, 122094, 145068, 17553, 192970, 310296, 190402, 153304, 171652, 174414, 143411, -25631, -83740, 48415, -3845, -23329, -16261, 8384, 63582, -41634, -187567, -358676, -373445, -114652, 198244, 406827, 427004, 302227, 255076, 284595, 418527, 532985, 359188, 38452, 48741, 192401, 79624, -157992, -335261, -236209, 18326, 53818, -90323, -309972, -237575, -14693, 96955, 42040, -64886, -189098, -401874, -511170, -481969, -368118, -279036, -284592, -101382, 330698, 575065]
11627E75065j80091j69388j1761J07390J65640r959k73981j57852r813k8182K5697
11616C2765K11742J69584J3707n2843r5722j10837k742j40985j25966m2806J1301
11605a32802J1764l3354l2726j51032P0140n0083R9880L66419O5308j41286j02440
11594c0212M561j26921K6441Q7110m0616J02432J08007q1786j38118J70214J4518
11583I5630N729J75433K73064J12053k27506j19644k7892j46037j95303j77769
11573b32242J74017M03851J23991K26222Q5869P5303M05074K18333J56005M99133
11563B135556M11635J50769L64450O78944R10346J350887J268804Q58941K87826
11554H418158o71916j067902j000464r59817q09162n53216n03254m95482l03011
$$ y = [575065, 394974, 225586, 213825, 321215, 486855, 476896, 202915, 45063, 35250, 7068, 32765, 244507, 414091, 427798, 374955, 279233, 168396, 165654, 24669, -101297, -144103, -132802, -121038, -154392, -187118, -338150, -268010, -318093, -218213, 148206, 213514, 72228, -30212, -25651, -152572, -126131, -39021, -79637, 22795, 130802, 49016, -89102, 81112, 95630, 101359, 276792, 549856, 661909, 434403, 314759, 286867, 140830, -54473, -232242, -58225, 345626, 469617, 695839, 781708, 857011, 1262085, 1480418, 1636423, 2135556, 2547191, 2697960, 3062410, 3741354, 4651700, 6002587, 7271391, 8130332, 8418158, 7746242, 6678340, 5677876, 4718059, 3908897, 3355681, 2852427, 2356945, 2053934]
11545B053934k169N8656j07957q3763k7330j21301j21647j78671j26041m7335
11535A296376R1943J24793J63333m8254l04118m43674l56279m170q775k00599
11525C10576l09158k00858J03796K63133J62232R2558q2776N0735J42377j14161
11515D18454j69442l0377K20745J89724r6935j46580J49762K94130N6112O9878
11505I55471J99587K36405L77318K74934N4159O0705L60617L80315N95473P63471
11495D258455R89163J592621K015583J575521P2934j168717j601254j528426j313279
11486D892601r97289p08680o78002m27438k74450k70548K8955p5891k04158j72924
11476A112176j08355k3847k40230k05396n8584o9197k25309l62191l07503j08082
$$ y = [2053934, 2051765, 2110421, 2002464, 1918701, 1891371, 1770070, 1648423, 1469752, 1343711, 1296376, 1388319, 1513112, 1676445, 1628191, 1324073, 880399, 524120, 519950, 511175, 310576, 1418, -199440, -95644, 167489, 329721, 422279, 339503, 390238, 532615, 418454, 249012, 218635, 439380, 629104, 532169, 385589, 535351, 829481, 885593, 955471, 1155058, 1391463, 1768781, 2043715, 2097874, 2158579, 2519196, 2899511, 3494984, 4258455, 5247618, 6840239, 8855822, 10431343, 10504277, 9335560, 7734306, 6205880, 4892601, 3895312, 3186632, 2508630, 2081192, 1806742, 1536194, 1565149, 1489258, 1285100, 1112176, 1003821, 979974, 739744, 534348, 475764, 406567, 181258, -180933, -488436, -596518]
11466e96518K23771L53699J36105l5156l7027k25920k17005k3241J69442K67019
11456A5169J70004k57058l00161m653J74138M10825J30604j14441m0367J2048
11446A96108K5277j8954j59010q5118k697O4339k4223M8536q3726j61668M4622
11435a56514J93532J40165J9233M648r195k5084J7524K39740J63383j42763l39011
11424A05658k55754J22408K15749j11151l43405k62309J618J09679Q6566P7738
11414b53203k0453k01368l72206N7395K74448J43213K53122J65515j35312k09492
11404b98341k6351R2876j98855J60308O18915L66767j12369j52067J9447L7350
11394E07680J18833L5575j80880l82015m00849j33148P4488p5314P0333Q5068
$$ y = [-596518, -372747, -19048, 117057, 81901, 44874, -181046, -398051, -421292, -251850, 15169, 185173, -71885, -372046, -376699, -202561, 208264, 338868, 224427, 184060, 196108, 221385, 202431, 43421, -41697, -44394, 19945, -4278, 44258, -39468, -201136, -156514, 37018, 177183, 196416, 201064, 191869, 166785, 184309, 424049, 587432, 444669, 105658, -150096, -27688, 188061, 76910, -266495, -528804, -527186, -417507, -330941, -253203, -273656, -475024, -847230, -789835, -515387, -372174, -119052, 46463, -88849, -298341, -324692, -231816, -430671, -270363, 348552, 715319, 602950, 450883, 470330, 507680, 626513, 662088, 481208, 99193, -301656, -434804, -360316, -435630, -365297, -280229]
11384b80229j16664r6559Q9809k340k61370l00016o9665J23535K32759K02396
11374d78344J21923N6878l6023k27242j91996J4674M8018l6802q0396J29108K74822
11363d05380K26697J50284K17435q054j89838k2324R6680K6353M5158J35979o515
11352B66475k2535R0558K0064q9961k39213P4336M6630l14410k39087m8868L20103
11341a35908N09390L36202L14816K4417l95236l87176l25180r4681N7453K7049
11331f8854K4369m7085m0897P8315L01364K1428j09505j78508j93269q5550J74875
11320a23317K16095J26891Q8576o1212j32524j58467r9665J43009K78076N0212
11310C27674k8151J38347n571k93000k65311j29596N4296Q9805K98711K36926
$$ y = [-280229, -396893, -493452, -403643, -405983, -667353, -967369, -1037034, -913499, -680740, -478344, -356421, -299543, -335566, -562808, -754804, -740130, -692112, -728914, -809310, -680202, -405380, -178683, -28399, 189036, 180982, -8856, -31180, 65500, 91853, 137011, 272990, 266475, 243940, 334498, 354562, 264601, 25388, 99724, 146354, -168056, -407143, -456011, -135908, 373482, 709684, 1024500, 1048917, 653681, 266505, -58675, -153356, -95903, -68854, -44485, -91570, -132467, -54152, 247212, 268640, 159135, -19373, -212642, -298192, -123317, 92778, 219669, 308245, 247033, 114509, -43958, -143623, -614, 277462, 327674, 299523, 437870, 432299, 139299, -126012, -255608, -201312, -111507, 187204, 424130]
11300D24130j19082j19816j28649j45842P804j42958r9386R8789j28485j52026
11290e05521K63967L58202J31762k69306l27599p6478l1391O6439K91740K01471
11280A03286q2912k11669k59004q1971r0381q2337R1258J2926J67371L5625Q2837
11269c14971l6097O882R2618K51460J17153k53675k29133j55849k16539K04185
11259e33966L91587L27631J18716m7947k89537m47042k46328J69182L39077J99351
11249a9276N2004L8076Q8375q4561j05699Q1591P0627k00249M983J88717p2926
11238D1662j36810o4529N0962J03979M9111j1879l1884j30590j77791J36559Q3402
11227h7808k10912l2053Q9754K7278L05469R9936J23201J21167k91247l36297
$$ y = [424130, 305048, 185232, 56583, -89259, -81455, -224413, -323799, -225010, -353495, -505521, -241554, 116648, 248410, -20896, -348495, -424973, -456364, -389925, -98185, 103286, 20374, -191295, -450299, -532270, -622651, -704988, -613730, -600804, -433433, -397808, -314971, -351068, -344186, -251568, -108, 117045, -136630, -365763, -521612, -738151, -533966, -142379, 185252, 303968, 256021, -33516, -480558, -726886, -557704, -218627, -19276, 32728, 70804, 159179, 74618, -31081, 50510, 121137, -79112, -74129, 114588, 41662, -95148, -159677, -108715, -4736, 44375, 32496, 612, -129978, -307769, -171210, -87808, -298720, -330773, -241019, -213741, 91728, 191664, 314865, 436032, 144785, -191512]
11217a91512k09283n8660K44554M34040J94502q5474j20747j65439j29108J56642
11207F9515J50282r8488j04038p1131k35439j28560J19057L8149R0700J00274
11197f9679L7012J86246Q179p3458k3129j9972o3103K3577M08391K92828j06021
11186F00871k87545k03622K4028J17741k3450P3177J27186P2271j78104l34534
11176a1981l0581K20462R5852K14156J93873k38597k39463K30632J91072n9035
11166E66390j211j05083k11016q8461O9811J7793J81566Q536k33152p8629j09501
11155A7043k12819K9481J62547J25947N8201l1362q7612O9247r29N0028o9843
11144A09929k03643J21117j8187k31573K6070K56956J07956n2262j33140K8275
$$ y = [-191512, -400795, -459455, -214901, 219139, 413641, 328167, 207420, 41981, -87127, 69515, 219797, 121309, 17271, -53860, -289299, -417859, -298802, -260653, -169953, -69679, -32667, 153579, 161758, 88300, 65171, 45199, -17904, 5673, 414064, 706892, 600871, 313326, 109704, 133732, 251473, 228023, 301200, 428386, 500657, 322553, -11981, -42562, 177900, 273752, 487908, 681781, 443184, 203721, 434353, 625425, 566390, 565179, 460096, 249080, 160619, 230430, 248223, 429789, 438325, 205173, 126544, 17043, -195776, -166295, -3748, 122199, 180400, 149038, 61426, 130673, 129744, 179772, 109929, -93714, 27403, 9216, -222357, -196287, 60669, 168625, 116363, -16777, 11498]
11134A1498P0791J47874K32143K19555j09737k83990j79677j56810O3034J63827
11124A78508L2098k53340l45864k02943n2621J32207K30955K42614K03897P4476
11114B39987k7937o2783q7791j85307j04283J504J4125j54045k53476o6554K01460
11103d85100K32831j49046k46614j30973q8676p963l2623J72411K52319J48114
11093c35320J97221K17038J128k0185N2333k23447k85300k0165Q7460J66369J34642
11082b8226k8136K8838P4824p319p7714Q6238J32852n2103l02254k78890Q7657
11071c64233J45275m7901J99439K10920o1796k8013k2271o0376p124r8158P6860
11060e7378J71318n1174L7672O1509j06699k16772k29162k4279j7536M6844Q9394
$$ y = [11498, 82289, 230163, 462306, 681861, 572124, 288134, 108457, -48353, 14681, 178508, 210606, -42734, -388598, -591541, -644162, -511955, -281000, -38386, 165511, 239987, 212050, 149267, 61476, -123831, -228114, -226610, -212485, -366530, -620006, -686560, -485100, -252269, -401315, -647929, -778902, -867578, -875541, -908164, -735753, -483434, -335320, -138099, 78939, 80067, 59882, 112215, -111232, -396532, -416697, -329237, -162868, -28226, -56362, -27524, 47300, 39981, -37733, 48505, 181357, 129254, -173000, -451890, -364233, -218958, -266859, -67420, 143500, 81704, 53691, 31420, -28956, -36080, -134238, -57378, 113940, 62766, 100438, 161947, 55248, -161524, -390686, -414965, -432501, -385657, -296263]
11049b96263j2750Q1521K31690m979k2672J01307J40391q4280j99857j79901j21545
11038c67338K2717K2451J10302Q084P849K45319Q149j42133M5674J40172j56259
11027e5013j76204Q7985l3264q5678R3506K23870l94l3220J28529J07390l0151
11016B27356q8459Q9454k03017k45474K3222n4435J2923J19463l2366q7165J79948
11005e8550L0423j06220J55424K35762l4557k42886j30554O610J67308L08867
10995C31627K40926O4379k74986k76944n3198j90442k28300J0226K452j69427
10985e43687J704J02793J33958J3597k51210K1470J60316P3508q4556M9146J14431
10974b08530k6939j99460k19147Q7390L12824J88903J16896j4553m0798J23439
$$ y = [-296263, -309013, -227492, 4198, -781, -23453, 77854, 218245, 133965, -65892, -245793, -367338, -344621, -322170, -211868, -203784, -195935, 49384, 57533, -84600, -38926, 101246, -55013, -231217, -143232, -176496, -262174, -168668, 55202, 54808, 21588, 150117, 257507, 227356, 138897, 228351, 25334, -220140, -196918, -251353, -238430, -118967, -151333, -238498, -58550, -28127, -134347, 21077, 256839, 222282, -20604, -151158, -144548, 22760, 331627, 572553, 636932, 361946, 85002, 31804, -158638, -386938, -376712, -374260, -543687, -541983, -439190, -305232, -291635, -542845, -521375, -361059, -287551, -372107, -322961, -208530, -235469, -434929, -654076, -566686, -253862, -64959, 51937, 37384, -3414, 120025]
10964A20025K72961O9988j59436j71368j04347j81961j22607j17534j46231J04404
10954d36106N3057K8507j0262J13907K3901J988L42989J73577o2788l78971k74695
10943d24896j33684J41706L65227J39624J53464J99933L47444K59922J49275j28499
10933A069516k74621l09556m13905L1834J01038j69333j42852p8247P8696j63430
10923b70860k38561o7829R7129K16205K25000J77918o7776k99896k1403K14115
10913c5958R4089p2859j12244j17837k68620j05971K24038K47598q162n9887J13207
10902a02606J13364K08263J07826r3141j32267r0040J6233m0779L7115l9369n2461
10891f7862K00645J24848J20792N3811j76383m23353k67008L1257j44114r1542
$$ y = [120025, 392986, 462974, 303538, 132170, 27823, -154138, -276745, -394279, -540510, -436106, -383049, -354542, -364804, -250897, -226996, -225008, 117981, 291558, 228770, -150201, -424896, -558580, -416874, -51647, 87977, 241441, 441374, 788818, 1048740, 1198015, 1069516, 794895, 485339, 71434, 103268, 204306, 34973, -107879, -186126, -107430, -270860, -509421, -577250, -480121, -263916, -38916, 139002, 71226, -228670, -250073, -35958, 58131, -14728, -126972, -244809, -513429, -619400, -395362, -147764, -155926, -215813, -102606, 10758, 219021, 326847, 233706, 101439, 11399, 27632, -13147, 23968, -15401, -67862, 132783, 257631, 378423, 432234, 255851, -167502, -434510, -403253, -547367, -638909]
10881f38909k7618L3964K21498M11793M57222J43947j46582j86867r670J0563
10871B69341j02904j08047k9155M4799L1816K6507N6579J4469n0119j7976l505
10860A31805P5055J65063K8906l49047k43284q7986o6772J52175K68578m6123
10850B8370j27352k4034j47818M6678J66243m5862M3879l770k6056j16439o4266
10839b70427K1450J11817j60554l06624p8384L9597J8932K17519L03345M9084
10829e4245O5170r0377n2446o049Q7631J36164J17388o3708j04498j0356o9536
10818d4862k1302J16585J56942J92445L2197l37378l52032k74847o2864M7437
10808e47679q288j3348K6482N9684l037K7961P465J39202J71729O7885j64965
$$ y = [-638909, -666527, -632563, -411065, 728, 457950, 601897, 455315, 268448, 258778, 269341, 166437, 58390, 29235, 74034, 105850, 132357, 188936, 203405, 153286, 135310, 131805, 206860, 371923, 400829, 51782, -191502, -279488, -346260, -194085, 74493, 28370, -98982, -123016, -270834, -224156, -57913, -103775, -59896, -63666, -89722, -206161, -270427, -248977, -137160, -297714, -604338, -682722, -643125, -624193, -406674, -103329, -54245, 10925, -79452, -131898, -137947, -50316, 85848, 203236, 139528, 35030, 24674, -44862, -66164, 50421, 207363, 399808, 432005, 94627, -257405, -532252, -595116, -547679, -555967, -569315, -542833, -483149, -486186, -458225, -450760, -311558, -139829, -71944, -236909]
10797b36909l0643L6105K10522L18738O076l04322j57647o2022j84992j46722
10787e51816J49314L35915K55713L2862j29298q0304M4631J54396j20637l20974
10777b30198j7831K55737m7720j31418j33360p5208J62428j6808p7096j8098J10688
10766b18884J26423K7455j9743R3624M8796Q6091J22860o3047q7639N0192O152
10755A72280j9936J58840R8675j80886l74616j82279l0709p2792j36629j68865
10745g36917m1780N8844J64069J55410J08685K18273Q5705R3986J53683j09652
10735A50306j06475r4056m3878L5889m5518j95466l41499m7481J67053O5306L9324
10724d16495L4540J97685J23771j46224k16649k9145J29115J99307J82905J23286
$$ y = [-236909, -267552, -231447, -20925, 297813, 303889, -433, -158080, -220102, -405094, -551816, -402502, -66587, 189126, 221988, 92690, 12386, 57017, 211413, 90776, -230198, -248029, 7708, -40012, -171430, -304790, -379998, -217570, -234378, -311474, -329572, -218884, -92461, -65006, -84749, 8875, 57671, 143762, 266622, 203575, 115936, 166128, 172280, 152344, 311184, 409859, 228973, -145643, -327922, -358631, -431423, -568052, -736917, -778697, -719853, -555784, -400374, -291689, -73416, 12289, 106275, 259958, 150306, 43831, -50225, -94103, -58214, -103732, -299198, -640697, -688178, -521125, -455819, -416495, -381955, -184270, -60499, -206723, -423372, -452517, -323402, -124095, 58810, 182096]
10714A82096N8548j01222j75286L971P4677O5066L3082k47650m4726K97095P8889
10703B24540k90293k18197l6813k1238j95361j19621R6696K78563J40202J50276
10693H754K04513K73154J74910j44435j14503j38162j70314k45110k04963Q1930
10683b74226J34817J85002K1447k08517k8779K33382P3236k48547j43916j20363
10673c76464j46163j80583o2724J57555Q6514r105K3245J21575J84334J78074
10663b3742P3779n122M2236Q3791N9955j55113j21206J14808J01067L7198k77050
10652f9399J5296M7921k38942q1227J89650R7743l6569o5029Q4129P1893J89525
10641B04991J30901q6024l55355k55937K3288J51022L27207J1682j92439m2662
$$ y = [182096, 240644, 139422, -35864, -31893, 42784, 107850, 140932, -106718, -151444, 145651, 224540, -65753, -283950, -320763, -342001, -537362, -656983, -560287, -281724, -141522, 8754, 213267, 486421, 661331, 516896, 402393, 264231, 93917, -151193, -356156, -274226, -139409, 45593, 67040, -141477, -170256, 63126, 136362, -112185, -256101, -376464, -522627, -703210, -765934, -608379, -521865, -530970, -507725, -386150, -201816, -23742, 50037, 44915, 87151, 170942, 230897, 75784, -45422, 69386, 170453, 207651, -69399, -54103, -6182, -245124, -326351, -136701, -38958, -75527, -140556, -56427, 15466, 204991, 335892, 249868, -105487, -361424, -338136, -187114, 140093, 151775, -40664, -83326]
10631h3326J56155j25871j91381k64098k15340J0605Q9686K49803M10524J13548
10621A50305J152J01850K56665J3430k29132j12824J1532j4379j93369o3812L55292
10610B76710K94511P7696o8019L414j66203k97252j54120j8657J91845J31251
10600B71176j06094j28239m3386j08182j17794k1869J81900K09784p06j13073
10590B3517p6424r5517q6956o3720K01366L08198J28476k32947k81849l30700
10580e06556j90857J66959K21603K85904K15344o3355k22717l9878J18920J04965
10570I0332J22772Q4750m0776l9513j68862n8664k8197k3836j1389j31998j32654
10559c38035J20376K85099R2739L8713l52455l05451L6106r1066J8342R6860J8491
$$ y = [-83326, 72829, -53042, -244423, -508521, -723861, -713256, -623570, -373767, 36757, 150305, 151457, 253307, 509972, 523402, 294270, 181446, 192978, 178599, -14770, -78582, 276710, 571221, 648917, 580898, 584312, 418109, 120857, -33263, -51920, 139925, 271176, 165082, 36843, -6543, -114725, -232519, -254388, -72488, 137296, 136590, 23517, -52907, -148424, -235380, -299100, -97734, 210464, 338940, 105993, -175856, -506556, -697413, -530454, -308851, -22947, 192397, 129042, -93675, -133553, -14633, 90332, 213104, 297854, 257078, 217565, 48703, -9961, -38158, -61994, -73383, -205381, -338035, -217659, 67440, 160179, 198892, -153563, -459014, -422908, -513974, -495632, -398772, -380281]
10548c80281O861P8135J99237K56576K47723J29799M2115j26192j66233k48461
10538C9279k30332j89132j3413K41894K66937j06383k40653K9278J8016j66002
10528c50511P904K02229J98025j00654k51135O1200J19564r9436r4152l1136M1030
10517b97072R6595L5889m9123Q7504J29285P9560M6619R521k5759q2862o471j70610
10505a46924k82302j39912j58579j30532P6940J85748K25596J68469K44049K97689
10495C40242l2299j08153j15834j81160o7357J74849J13469J5350J53832k6018
10485B66921p837K9713k4384J2473m5363l20771j65965R0889R7843K8412Q1752
10474D3683J23573K36383J54121j42562j58161p8293k2244J10695j3469j64291
$$ y = [-380281, -373420, -295285, -96048, 160528, 408251, 538050, 580165, 453973, 287740, 39279, -191053, -380185, -393598, -151704, 115233, 8850, -231803, -202525, -184509, -350511, -342607, -140378, 57647, -43007, -294142, -232942, -113378, -212814, -306966, -338102, -297072, -200477, -164588, -213711, -126207, 3078, 82638, 129257, 138778, 113019, 30157, 23686, -146924, -429226, -569138, -727717, -858249, -781309, -595561, -369965, -201496, 42553, 340242, 307943, 199790, 83956, -97204, -164561, 10288, 123757, 139107, 292939, 266921, 259084, 288797, 264413, 276886, 231523, -89248, -255213, -164324, -66481, -38069, 43683, 167256, 403639, 557760, 415198, 257037, 178744, 156500, 267195, 253726, 89435]
10464H9435n2385J04034O5366n1651q1884J36617J13511o6528j49797L131J17274
10453B27123k7849j0980l4419q7007j790K3902L8419k85749l51057k99941O8350
10442g40998K95636J40328Q0374j6539k2893N3436O3787j44935j233M3711J13251
10431a36075P0937k3736j15454k517K79412J25515N921J8156q6075j91282L7682
10420a7516J45558N5539m3180j60165l6591k25327l40151J3478K08473p4305m8932
10409e23119j8146J0545L341M4053K15540P0082k2189P4935O291O9815J71169
10398A02317R5058n0938q4297j5843N4445P3182j163r1755l8575J30952J1552
10387A84935j23792k93121j18488Q4816J38676J91307J6115j97622l92408j93121
$$ y = [89435, 37050, 141084, 206450, 154799, 72915, 209532, 323043, 256515, 106718, 109849, 227123, 199274, 188294, 153875, 66868, 65078, 88980, 127399, -158350, -509407, -809348, -740998, -445362, -305034, -224660, -241199, -264092, -210656, -146869, -291804, -293037, -249326, -136075, -65138, -88874, -204328, -206845, 72567, 198082, 204003, 222159, 136084, -55198, -17516, 128042, 183581, 140401, -19764, -56355, -281682, -621833, -608355, -399882, -474187, -523119, -541265, -530720, -527379, -483326, -267786, -197704, -219893, -144958, -138667, -68852, 102317, 197375, 146437, 62140, 46297, 100742, 173924, 172761, 81006, 42431, 173383, 184935, 61143, -231978, -350466, -265650, -126974, 64333, 80448, -117174, -509582, -702703]
10377g02703J86782J49978R9361J40993j2610j93349m9955J14589K06171R5856
10367C5113L5825J95706J25442j42851k22544j43750j25137R0305K16778O0140
10357A25027n0340K9292k30569k53827N1189q4697k0314K22651Q1488m9278p5416
10346b54794m1015N6061q449P0703J39539Q6308Q3832k05941j96784J6703O7021
10335a86816j39211j29803N9993J96400L12835P3992k59933l38630m2948J91480
10325b62641J70186J08929j35898k23091r1534J17756K19602K8853r9824j13700
10315b81362m7576N6018M6519q2073J98707J08900M152j41232j30854q9070J0157
10304c47714J66150k4830O253j03431k43119j62032J83737K24783J22490K13836
$$ y = [-702703, -515921, -365943, -266582, -125589, -138199, -331548, -381503, -266914, -60743, 35113, 70938, 266644, 392086, 249235, 26691, -117059, -242196, -151891, 64887, 125027, 74687, 103979, -126590, -380417, -329228, -413925, -434239, -211588, -130100, -179378, -254794, -295809, -239748, -248197, -177494, -37955, 48353, 132185, -73756, -270540, -253837, -186816, -326027, -455830, -395837, -199437, 113398, 187390, -72543, -411173, -454121, -262641, -92455, 16474, -119424, -342515, -434049, -316293, -96691, -67838, -167662, -281362, -328938, -272920, -226401, -308474, -109767, -867, 3285, -137947, -268801, -357871, -347714, -181564, -206394, -200141, -303572, -546691, -708723, -524986, -300203, -177713, 36123]
10294C6123J3758j26373L5260Q3023M7239Q2147J15925K28927L2894J7949n714
10283E61158p2889j96624k75539R4791J00919n2895n6197P5471M0311k3800K9714
10272B24420K37308K22546j260j39057j60377m1646R7578j60229j08631J71899
10262C42551P3088j58345k68218l18955l86508j00152J67938L63270L66242J23267
10252B04178k2552P341j00767l57318k16138M781N0672k7274p4566j93774o6082
10241g91499K37539J96062P7761J6912j14792j61044R7746R7952j84327k01941
10231g29631j39308M8389J80770J78489J20284J14257J05651q816j18968k9499
10221b78382N6779j53882r5507l4218r6886j5584K2835M1791J81496q3141n8592
$$ y = [36123, 49881, -76492, -41232, 41791, 89030, 171177, 287102, 516029, 548923, 566872, 561158, 488269, 291645, 16106, 110897, 211816, 158921, 102724, 178195, 218506, 194706, 224420, 461728, 684274, 683014, 543957, 383580, 341934, 439512, 279283, 170652, 342551, 415639, 257294, -10924, -329879, -716387, -816539, -648601, -285331, 80911, 204178, 181626, 188967, 88200, -269118, -485256, -480475, -429803, -457077, -531643, -725417, -791499, -553960, -357898, -280137, -263225, -378017, -539061, -441315, -343363, -527690, -729631, -868939, -820550, -639780, -461291, -341007, -226750, -121099, -129915, -248883, -278382, -221603, -375485, -470992, -505210, -602096, -617680, -594845, -553054, -371558, -454699, -513291]
10210e13291K08246K03912Q7365J05132j4321k52614j47795J27287K15437k2738
10200c380j63575n8990R3127L33150J525m9990J03936j26862k03585j95292J98782
10189g1154L07933Q5632j29801k31234l3795J49734l1399R7949Q6378l8512L6321
10178B28052Q5476p3665j12923j16169k08547k46042L226K33345k0336k5051P9935
10167a72699J01555L1502j01905j94521r0685J07040O6943O5202r7885j04330
10157c89783k43742n4441R9320j15201m2131L09064J46198O697M1220r2608j6090
10146c51497r279J07559Q0314K62861L04382R22k09344o7635P0226p0226j43472
10135b5189l25207m245K82954R8340K7531K6300R3719J83747k0366m126J78007
$$ y = [-513291, -305045, -101133, -13768, 91364, 77043, -175571, -323366, -196079, 19358, -3380, -166955, -225945, -132818, 200332, 201857, 151867, 255803, 128941, -74644, -269936, -71154, 236779, 322411, 192610, -38624, -72419, 77315, 45916, 143865, 230243, 191731, 228052, 313528, 239863, 126940, 10771, -197776, -443818, -440592, -207247, -227583, -252634, -172699, -71144, -39642, -141547, -336068, -426753, -319713, -252770, -187568, -285453, -389783, -633525, -687966, -588646, -703847, -745978, -436914, -290716, -284019, -242799, -335407, -351497, -360776, -253217, -172903, 89958, 394340, 395262, 185918, 118283, 188509, 118283, -25189, -350396, -354641, -71687, 26653, 54184, 80484, 174203, 357950, 337584, 333458, 511465]
10124E11465K7276K9264k0102R2855K59146K81815J80928K90298J56710J60209
10114A969864L08838M63759O99756J014637J521724J931793K337055K757101J621506
10105A4626033j321859k709678k454874j749347j264048j083833o37357m15688
10097B989349n25616n89458m38948m60771k90160k76535r737l8098j58381l0779
10087A70866P0385p0903k22421j53082J31141K54130R6528j90429k14250Q0512
10077d7523J31279J556k6730O437L607r5617p8254O2445J11220P0884K29161k641
10065C65824k75895O3775L77391L10892k37665l04996j73019q5141N1502K4801
10055A17469K6631J48841J8458P8155K10183K9757k85439j69721o9084j04258
$$ y = [511465, 538741, 568005, 547903, 640758, 899904, 1181719, 1362647, 1652945, 1809655, 1969864, 2278702, 2742461, 3442217, 4456854, 5978578, 7910371, 10247426, 13004527, 14626033, 13304174, 10594496, 8139622, 6390275, 5126227, 4042394, 3405037, 2989349, 2463733, 1874275, 1435327, 974556, 684396, 407861, 398124, 360026, 201645, 170866, 241251, 170348, -52073, -205155, -74014, 180116, 276644, 86215, -128035, -47523, 83756, 85312, 58582, 65019, 68626, -26991, -105245, -42800, 68420, 139304, 368465, 365824, 89929, 153704, 531095, 841987, 604322, 299326, 126307, 41166, 92668, 117469, 144100, 292941, 311399, 389554, 599737, 629494, 344055, 174334, 105250, 992]
10045I92N2595N622J46299J46901L0145J62308K52469l28691l09662L4136K5172
10034B18286L5728J3148j32047o0776l1104J19459J36452k15835k22648J30665
10024h672n4710o1272J61757Q8647j89327j61676J20105J02520J43661K06391
10014C47424N9956k61608m28432j91460k597j18979O391O1719L5043Q9556K43043
10003a59944K36718K41861m8725N1981J51701J33607j60303l28702k37345k01952
9993c21103M928K98781J60470j96027r8677j9900N8681l3443j49473J8666n648
9982b82745n2935k4341J39453m4187k5458J60408J06409O0537n3682l85368m28143
9971h30052j87976q4272j3497J89385L90470L76845J63569J41574K12518j03128
$$ y = [992, 53587, 59209, 205508, 352409, 382554, 544862, 797331, 468640, 158978, 193114, 218286, 254014, 267162, 135115, 74339, 43235, 162694, 299146, 83311, -139337, -8672, -63382, -124654, 37103, 125750, -63577, -225253, -105148, -2628, 141033, 347424, 407380, 145772, -282660, -474120, -476717, -595696, -589305, -527586, -492543, -402987, -159944, 76774, 318635, 269910, 321891, 473592, 607199, 446896, 118194, -119151, -321103, -316175, -17394, 143076, -52951, -151628, -171528, -112847, -146290, -295763, -277097, -282745, -335680, -360021, -220568, -264755, -290213, -129805, -23396, 37141, -16541, -401909, -830052, -1018028, -1102300, -1115797, -926412, -535942, -159097, 4472, 146046, 358564, 255436]
9961B55436j55812j03883k16245j55094R4088L09829K8731l3216r6483k42801
9951c15450Q8344L08238l8170p9037l0019j15778j00134j7311J5032j65238j24893
9940e74416J8926j53571o5810J50924J2630J19422L49818J73186k560j7366j47277
9929a36094k32136q0489P963N7616J97727N7024k21896k03782q612N7912o9251
9918e74018J3670J06963J19987J14656K04422P0906j8664O2339M6275j16427k61921
9907b31812L1384K39087J84885p3538q1164p1157m5788n7993J37008K42777Q5122
9896C58811O240j24095k29078j13511j57102j47926k3100R7445J32609Q1243M924
9885a13540J7410J39329J30516J54085Q9953J39470M9763Q313l41918l33137j13609
$$ y = [255436, 99624, -4259, -220504, -375598, -281510, 28319, 57050, 23834, -72649, -315450, -227106, 81132, 42962, -36075, -66094, -181872, -282006, -299317, -284285, -449523, -574416, -555490, -709061, -774871, -623947, -611317, -491895, -142077, 31109, 28549, 11183, -136094, -368230, -448719, -440756, -383140, -185413, -128389, -350285, -554067, -562679, -504767, -574018, -560348, -453385, -333398, -218742, -14320, 56586, 37922, 100261, 146536, 30109, -231812, -200428, 38659, 223544, 150006, 68842, -2315, -48103, -106096, 30912, 273689, 358811, 365051, 240956, 11878, -101633, -258735, -406661, -429761, -332316, -199707, -118464, -113540, -96130, 43199, 173715, 327800, 417753, 557223, 606986, 615299, 273381, -59756, -173365]
9874a73365l3011j74606j06589N240j40654J23118J85918K20050M3649J0179o5833
9863a05904k8505Q3631L03861L08038n2918k34724k21313M6237K834k03750n0237
9852a52750M5633K2315k6509Q8689K97242R3398k4749J61094n634k08687p3612
9841B16430N8430m9215r8351l6005k3491r8482O2949K62671K11013j67449l43909
9830e409j91334q9232R68j843j4450J93925k9553q0442Q2185k3396l8561j02071
9818b99213k1836Q0347K19168K34420o2349o9366O1565n6693l9781o9551j20387
9807a43676j53084j6094J25345Q3507j11810k33732j86087l7335L0789K24504
9797d17673L27162L13604p3661l63848q2255J66071J29421J1200p2596k16791
$$ y = [-173365, -206376, -380982, -487571, -482331, -622985, -499867, -313949, -93899, -50250, -40071, -105904, -134409, -50778, 253083, 561121, 508203, 273479, 52166, 98403, 101237, -102513, -152750, -107117, -84802, -111311, -22622, 274620, 368018, 343269, 504363, 498729, 290042, 216430, 274860, 225645, 127294, 91289, 67798, -30684, 32265, 294936, 505949, 338500, -5409, -196743, -285975, -285007, -286850, -301300, -107375, -136928, -217370, -135185, -158581, -197142, -299213, -321049, -240702, -21534, 212886, 150537, 81171, 142736, 86043, 46262, -23289, -143676, -296760, -312854, -187509, -104002, -215812, -449544, -635631, -672966, -642177, -417673, -90511, 223093, 149432, -214416, -296671, -130600, -1179, 10021, -62575, -279366]
9787b79366k71027j76020o8619J18642J05513J26618J42191J21528M2125j48570
9777b86985j38873n3869J12587M2464j06940p3711J10438J03885J94812J54702
9767E8510k36015o8555J34991P0145p7793J48554K18021j50350j37129K659J01096
9756F4134J4605p9889k94781j10768J74934J42322K7210M7994J94171J08594L9570
9745C28096P7200P0402J45022P3191j05714j06769j19179j56061j90363l38340
9735c22515j94564P9284n8445j17852R4148J33022J14085O2655N4413r8989p2452
9724c27210O2294J18936N9443J25189J62851n3768q7358q040j11673j49534R7789
9713a11081L08587J41808J11888O8080k8193k21727l60010k87713k20810k98039
$$ y = [-279366, -550393, -726413, -795032, -676390, -570877, -444259, -302068, -180540, -138415, -286985, -425858, -479727, -367140, -324676, -431616, -505327, -394889, -291004, -96192, 58510, -177505, -246060, -111069, -40924, -118717, 29837, 247858, 97508, -39621, -36962, 64134, 78739, -1150, -295931, -406699, -231765, -89443, -62233, -14239, 179932, 288526, 328096, 405296, 475698, 620720, 693911, 588197, 481428, 362249, 206188, 15825, -322515, -517079, -437795, -496240, -614092, -519944, -386922, -272837, -210182, -155769, -254758, -327210, -264916, -145980, -86537, 38652, 201503, 147735, 60377, 52337, -59336, -208870, -111081, 197506, 339314, 451202, 519282, 491089, 269362, -90648, -378361, -599171, -897210]
$$ [...]
##END NTUPLES=NMR SPECTRUM
##END=
