##TITLE=C13_SL30(pure)
 CDCl3, 22500sc

 19.11.2021
##JCAMPDX= 6.0         $$ Bruker NMR JCAMP-DX V2.0
##DATA TYPE= NMR SPECTRUM
##DATA CLASS= NTUPLES
##ORIGIN= UXNMR, Bruker Analytische Messtechnik GmbH
##OWNER= root
$$ XWIN-NMR		Version 3.5
$$ Fri Nov 19 15:18:48 2021 Russian Standard Time (UT+4h)  she@DPX200
##.OBSERVE FREQUENCY= 50.327896
##.OBSERVE NUCLEUS= ^13C
##.ACQUISITION MODE= SIMULTANEOUS
##.ACQUISITION SCHEME= undefined
##.AVERAGES= 2262
##.DIGITISER RES= 17
##SPECTROMETER/DATA SYSTEM= spect
##.PULSE SEQUENCE= zgpg30
##.SOLVENT NAME= D2O
##.SHIFT REFERENCE= (INTERNAL, D2O, 0, 223.62)
##AUDIT TRAIL= $$ (NUMBER, WHEN, WHO, WHERE, WHAT)
$$ ##TITLE= Audit trail, XWIN-NMR		Version 3.5
$$ ##JCAMPDX= 5.01
$$ ##ORIGIN= Bruker BioSpin GmbH
$$ ##OWNER= she
$$ F:/spectra/data/she/nmr/c13/1/pdata/1/auditp.txt
$$ ##AUDIT TRAIL=  $$ (NUMBER, WHEN, WHO, WHERE, WHAT)
(   1,<2021-11-19 15:17:55.12 +0400>,<she>,<DPX200>,
      <created by zg, POWCHK disabled, PULCHK disabled
       terminated by command 'halt'
       configuration hash MD5:
       00 E9 B6 7A A2 85 ED C7 34 08 36 98 17 FE 4E 26
       data hash MD5: 32K
       6B 3B 98 42 6B 25 68 67 D2 5A 2D 22 D2 C7 67 50>)
(   2,<2021-11-19 15:17:56.45 +0400>,<she>,<DPX200>,
      <Start of raw data processing
       efp BC_mod = 2 LB = 1 FT_mod = 6 PKNL = 1 PHC0 = -302.8318 PHC1 = -7.037634 SI = 32K 
       data hash MD5: 32K
       0D E8 11 9E 48 A2 DF DC E2 CA 5D 4E 5C 95 40 73>)
(   3,<2021-11-19 15:17:59.95 +0400>,<she>,<DPX200>,
      <abs ABSG = 5 
       data hash MD5: 32K
       9D 61 ED 05 60 09 2E 68 1B 08 FB E7 E9 D2 5E 44>)
$$ ##END=
$$ 
$$ hash MD5
$$ CC D0 BF 10 C2 E3 0C C7 5B BE 6A 3E 63 D9 5F 20
##$RELAX= 
##$RELAX= 
##$RELAX= 
##$RELAX= 
##$RELAX= 
##$RELAX= 
##$RELAX= 
##$RELAX= 
$$ Bruker specific parameters
$$ --------------------------
##$DU= <F:/spectra>
##$EXPNO= 1
##$NAME= <c13>
##$PROCNO= 1
##$TYPE= <nmr>
##$USER= <she>
##$AMP= (0..31)
100 100 100 100 100 100 100 100 100 100 100 100 100 100 100 100 100 100 
100 100 100 100 100 100 100 100 100 100 100 100 100 100 
##$AQSEQ= 0
##$AQ_mod= 1
##$AUNM= <au_zg>
##$AUTOPOS= <>
##$BF1= 50.322709
##$BF2= 200.13
##$BF3= 50.322709
##$BF4= 500.13
##$BF5= 500.13
##$BF6= 500.13
##$BF7= 500.13
##$BF8= 500.13
##$BYTORDA= 1
##$CFDGTYP= 0
##$CFRGTYP= 5
##$CHEMSTR= <none>
##$CNST= (0..31)
1 1 145 1 1 1 1 1 1 1 1 1 1 1 1 1 1 1 1 1 1 1 1 1 1 1 1 1 1 1 1 1 
##$CPDPRG= <waltz16>
##$CPDPRG1= <>
##$CPDPRG2= <waltz16>
##$CPDPRG3= <>
##$CPDPRG4= <mlev>
##$CPDPRG5= <mlev>
##$CPDPRG6= <mlev>
##$CPDPRG7= <mlev>
##$CPDPRG8= <mlev>
##$CPDPRGB= <>
##$CPDPRGT= <>
##$D= (0..31)
0 2 0.00345 0 0 0 0 0 0 0 0 0.03 2e-05 3e-06 0 0 0 0 0 0 0 0 0 0 0 0 0 
0 0 0 0 0 
##$DATE= 1637313011
##$DBL= (0..7)
120 120 120 120 120 120 120 120 
##$DBP= (0..7)
150 150 150 150 150 150 150 150 
##$DBP07= 0
##$DBPNAM0= <>
##$DBPNAM1= <>
##$DBPNAM2= <>
##$DBPNAM3= <>
##$DBPNAM4= <>
##$DBPNAM5= <>
##$DBPNAM6= <>
##$DBPNAM7= <>
##$DBPOAL= (0..7)
0.5 0.5 0.5 0.5 0.5 0.5 0.5 0.5 
$$ [...]
##$SUBNAM4= <"">
##$SUBNAM5= <"">
##$SUBNAM6= <"">
##$SUBNAM7= <"">
##$SUBNAM8= <"">
##$SUBNAM9= <"">
##$SW= 239.972175391363
##$SWIBOX= (0..15)
0 1 3 0 0 0 0 0 0 0 0 0 0 0 0 0 
##$SW_h= 12077.2946859903
##$TD= 32768
##$TD0= 1
##$TE= 0
##$TE2= 300
##$TE3= 300
##$TEG= 300
##$TL= (0..7)
120 120 120 120 120 120 120 120 
##$TP= (0..7)
150 150 150 150 150 150 150 150 
##$TP07= 0
##$TPNAME0= <>
##$TPNAME1= <>
##$TPNAME2= <>
##$TPNAME3= <>
##$TPNAME4= <>
##$TPNAME5= <>
##$TPNAME6= <>
##$TPNAME7= <>
##$TPOAL= (0..7)
0.5 0.5 0.5 0.5 0.5 0.5 0.5 0.5 
##$TPOFFS= (0..7)
0 0 0 0 0 0 0 0 
##$TUNHIN= 0
##$TUNHOUT= 0
##$TUNXOUT= 0
##$USERA1= <user>
##$USERA2= <user>
##$USERA3= <user>
##$USERA4= <user>
##$USERA5= <user>
##$V9= 5
##$VALIST= <valist>
##$VCLIST= <CCCCCCCCCCCCCCC>
##$VD= 0
##$VDLIST= <DDDDDDDDDDDDDDD>
##$VPLIST= <PPPPPPPPPPPPPPP>
##$VTLIST= <TTTTTTTTTTTTTTT>
##$WBST= 1024
##$WBSW= 4
##$XGAIN= (0..3)
0 0 0 0 
##$XL= 0
##$YL= 0
##$YMAX_a= 15959658
##$YMIN_a= -3953432
##$ZGOPTNS= <>
##$ZL1= 120
##$ZL2= 120
##$ZL3= 120
##$ZL4= 120
##$ABSF1= 223.6203
##$ABSF2= -16.37674
##$ABSG= 5
##$ABSL= 3
##$ALPHA= 0
##$AQORDER= 0
##$ASSFAC= 0
##$ASSFACI= 0
##$ASSFACX= 0
##$ASSWID= 0
##$AUNMP= <proc_1d>
##$AZFE= 0.1
##$AZFW= 0.5
##$BCFW= 0
##$BC_mod= 2
##$BYTORDP= 0
##$COROFFS= 0
##$CY= -3
##$DATMOD= 1
##$DC= 0
##$DFILT= <>
##$DTYPP= 0
##$F1P= 0
##$F2P= 0
##$FCOR= 0.5
##$FTSIZE= 32768
##$FT_mod= 6
##$GAMMA= 0
##$GB= 0
##$INTBC= 1
##$INTSCL= 4.134877e-10
##$ISEN= 128
##$LB= 1
##$LEV0= 0
##$LPBIN= 0
##$MAXI= 10000
##$MC2= 0
##$MEAN= 0
##$ME_mod= 0
##$MI= 0.1934396
##$NCOEF= 0
##$NC_proc= -1
##$NLEV= 6
##$NOISF1= 120.0001
##$NOISF2= 80.00006
##$NSP= 0
##$NTH_PI= 0
##$NZP= 0
##$OFFSET= 223.6203
##$PC= 1.4
##$PHC0= -302.8318
##$PHC1= -7.037634
##$PH_mod= 1
##$PKNL= yes
##$PPARMOD= 0
##$PSCAL= 0
##$PSIGN= 0
##$REVERSE= no
##$SF= 50.3226814732359
##$SI= 32768
##$SIGF1= 140
##$SIGF2= 120
##$SINO= 11.81781
##$SIOLD= 32768
##$SREGLST= <13C.CDCl3>
##$SSB= 0
##$STSI= 32768
##$STSR= 0
##$SW_p= 12077.2946859903
##$SYMM= 0
##$S_DEV= 0
##$TDeff= 32768
##$TDoff= 0
##$TI= <>
##$TILT= no
##$TM1= 0
##$TM2= 0
##$TOPLEV= 0
##$USERP1= <user>
##$USERP2= <user>
##$USERP3= <user>
##$USERP4= <user>
##$USERP5= <user>
##$WDW= 1
##$XDIM= 32768
##$YMAX_p= 417799288
##$YMIN_p= -5791187
$$ End of Bruker specific parameters
$$ ---------------------------------
##NTUPLES= NMR SPECTRUM
##VAR_NAME=  FREQUENCY,     SPECTRUM/REAL,   SPECTRUM/IMAG
##SYMBOL=    X,             R,               I
##VAR_TYPE=  INDEPENDENT,   DEPENDENT,       DEPENDENT
##VAR_FORM=  AFFN,          ASDF,            ASDF
##VAR_DIM=   32768,         32768,           32768
##UNITS=     HZ,            ARBITRARY UNITS, ARBITRARY UNITS
##FACTOR=    0.368581032318806, 1,           1
##FIRST=     11253.1731425924, 0,            0
##LAST=      -824.121543397872, 0,           0
##MIN=       -824.121543397872, -5791187,    0
##MAX=       11253.1731425924, 417799288,    0
$$ Real data points
##PAGE= N=1
##DATA TABLE= (X++(R..R)), XYDATA
$$ [...]
15648F20264m92440j63936P30639M29209k62515n67396J17128M31993p64997j368007
$$ 620264 127824 -36112 694527 1123736 861221 293825 410953 842946 77949 -1290058
15638a290058N47811J221735j94648o94439k01643l65591j36133K04383N00255
$$ -1290058 -742247 479488 284840 -409599 -611242 -976833 -1112966 -908583 -408328
15629d08328J347420P53677j6923o8799p55670n97429p15940m78375L68058K09518
$$ -408328 939092 1692769 1675846 1607047 851377 253948 -461992 -940367 -572309 -362791
15619c62791R31083J164227l66478q63208l98540J065809O57928q6164k529k32621
$$ -362791 568292 1732519 1366041 502833 104293 1170102 1828030 1741866 1739337 1506716
15609A506716j291633k86200p01248j188079j69929K33968M33612Q31418N18655
$$ 1506716 215083 -71117 -772365 -1960444 -2130373 -1896405 -1462793 -631375 -112720
15600a12720M55171j80409m38611N53614Q99132P52088J104466K72111m57916
$$ -112720 342451 162042 -276569 277045 1176177 1928265 3032731 3304842 2846926
15591B846926j219911p79438k17222j97158K59069Q90367J286130j90586j360738
$$ 2846926 1627015 847577 630355 433197 692266 1582633 2868763 2678177 1317439
15582A317439N1431K73396k1896J241152p1404k454275j694097r04866o83646
$$ 1317439 1368870 1642266 1620370 2861522 2790118 335843 -1358254 -2263120 -2946766
15573b946766M07526J563673J817151J181299k04053n80808o81730q48515m33855
$$ -2946766 -2539240 -975567 841584 2022883 1818830 1238022 556292 -292223 -726078
15564g26078K7783R19897J372928L23614J032381L18298j498166q7275O17949
$$ -726078 -698295 221602 1594530 1918144 2950525 3268823 1770657 1683382 2301331
15555B301331L29739R3223k99601L78639M11634k93554j35598p2563q31380o90320
$$ 2301331 2631070 2724293 2424692 2803331 3214965 2921411 2785813 2713250 1881870 1191550
15545A191550j623361q81646Q35590J709710Q96367p34517l15014Q24347M21056
$$ 1191550 -431811 -1313457 -477867 1231843 2128210 1393693 1078679 1903026 2324082
15536B324082l90224k98383J94808l81879r04848k98917o30795p24181n6715J82492
$$ 2324082 1933858 1635475 1830283 1448404 543556 244639 -386156 -1110337 -1167052 -984560
15526i84560n71525M09744M67237o26000n76171k37999m02697L58310P63199P70681
$$ -984560 -1556085 -1146341 -679104 -1305104 -1881275 -2119274 -2521971 -2163661 -1400462 -629781
15516f29781R04304j19267j460451j047682M56506K016174J418167J007669k27143
$$ -629781 274523 155256 -1305195 -2352877 -1896371 119803 1537970 2545639 2318496
15507B318496j205690j014518n79116j275506j666942l99591J159699J563986
$$ 2318496 1112806 98288 -480828 -1756334 -3423276 -3822867 -2663168 -1099182
15499a099182N97752j23272l74881m71455o2749p6910O14080J212196J166329
$$ -1099182 -501430 -624702 -999583 -1471038 -1533787 -1610697 -996617 215579 1381908
15490A381908L33907M35501M52842r0095p05639J34961J5014j412710j360443
$$ 1381908 1715815 2151316 2604158 2514063 1808424 1943385 1958399 545689 -814754
15481h14754p53891Q3618J90244L22289l52566j266705m85216M03898J106266
$$ -814754 -1568645 -1485027 -1294783 -972494 -1325060 -2591765 -3076981 -2673083 -1566817
15472a566817J3084n25429m38858j69109J445346K333475J188711J45823o72761
$$ -1566817 -1553733 -2079162 -2518020 -2687129 -1241783 1091692 2280403 2426226 1753465
15463A753465M90527L17910p83899n50005n98650l1687K92939j01506l6873l05908
$$ 1753465 2243992 2561902 1778003 1227998 629348 597661 890600 789094 752221 446313
15453D46313j030703m86114O29159N08936j13265j88962M9632J39974K22328J6984
$$ 446313 -584390 -1070504 -441345 67591 -45674 -234636 -185004 -45030 177298 194282
15443A94282P5929J41521k43843o0259N92903J67795p57270n57189L74524M50343
$$ 194282 270211 411732 167889 107630 700533 868328 111058 -446131 -71607 378736
15433C78736o06846j14781J160762l15248l5011j67129p55693N87565K78666m7294
$$ 378736 -228110 -342891 817871 502623 467612 300483 -455210 132355 411021 363727
15423C63727J60455j52244J088152K005545J51929q88184r96093k84260n14652
$$ 363727 524182 371938 1460090 3465635 3617564 2729380 1733287 1449027 934375
15414I34375j119600p54555l41632K67416O37295M54616p40561q68955M53872
$$ 934375 -185225 -939780 -1281412 -1013996 -376701 77915 -662646 -1531601 -1077729
15405a077729J143655J62257n19329L59544K8209j16893l94220p01593q23544
$$ -1077729 65926 228183 -291146 68398 96607 -20286 -414506 -1116099 -1939643
15396a939643k11152O01285m60535L24939Q01689M2060O10801N59396j18390j75217
$$ -1939643 -2150795 -1549510 -2010045 -1685106 -883417 -841357 -230556 328840 210450 35233
15386C5233m28199n89729N46594K083711K76707o1700o0201j233138j324601l59408
$$ 35233 -392966 -982695 -436101 1647610 1924317 1862617 1802416 569278 -755323 -1114731
15376a114731P34878N97558K02170L75945N44727r24100q73618l06778k34343
$$ -1114731 -379853 217705 419875 795820 1340547 416447 -457171 -763949 -998292
15367i98292J57215j49039j121292r65741p01796l82843J11172J122631J235639
$$ -998292 -841077 -990116 -2111408 -3077149 -3778945 -4161788 -4050616 -2927985 -1692346
15358a692346J049327o4758O6910O46989M45306K05457K89639k70184l57990o04146
$$ -1692346 -643019 -707777 -640867 6122 451428 656885 946524 676340 318350 -285796
15348b85796j522988q83728l49314p13374L99442J080411Q55903L75706j23693
$$ -285796 -1808784 -2692512 -3041826 -3755200 -3355758 -2275347 -1419444 -1043738 -1167431
15339a167431P86334K12633j148791q89085N93017J043368R77428J02253o04879
$$ -1167431 -381097 -168464 -1317255 -2206340 -1613323 -569955 407473 509726 -95153
15330i5153n49156j1995M13882J76935j52938J95978l0209p21885q62826k41947
$$ -95153 -644309 -656304 -242422 -65487 -218425 -22447 -52656 -774541 -1637367 -1879314
15320a879314K16350K29165R21474J163655K66435J18132k76083q95593r74513
$$ -1879314 -1662964 -1433799 -512325 651330 917765 1035897 759814 -135779 -1110292
15311a110292Q147P20642o56280r55927K53757N19862L36392o33815j80254R59706
$$ -1110292 -1102145 -381503 -1037783 -1993710 -1739953 -1220091 -883699 -1517514 -1697768 -738062
15301g38062J469315J981984K176629R64500p12471j837270j474352j120767L90123
$$ -738062 731253 2713237 4889866 5854366 5141895 3304625 1830273 709506 1099629
15292A099629J081487j12655p93718j158118n00073p64864N080J647258M78773
$$ 1099629 2181116 2068461 1274743 116625 -383448 -1148312 -1143232 504026 982799
15283I82799j343411j023297n63038j95086Q57905M85493n10374o09421K05740
$$ 982799 -360612 -1383909 -1946947 -2142033 -1284128 -798635 -1309009 -1918430 -1712690
15274a712690L4576m28304P97232Q60176J57994K59677L63391o06726o20330N171
$$ -1712690 -1678114 -2106418 -1309186 -449010 -291016 -31339 332052 -274674 -895004 -889833
15264h89833J175500R73048O20671k52935j032438o39461K56855O43960J21353
$$ -889833 285667 1258715 1879386 1626451 594013 -45448 211407 855367 976720
15255I76720q8915o53886j20583m30063j752013k77181J641205J270771J27496
$$ 976720 887805 233919 113336 -316727 -2068740 -2345921 -704716 566055 693551
15246F93551J50664P73336j303667j125253M63849Q95025N52001R76838O51119
$$ 693551 844215 1617551 313884 -811369 -347520 547505 1099506 2076344 2727463
15237B727463q72152p31842j303812r05832k35136l9213l29388J69287P69690
$$ 2727463 1855311 1123469 -180343 -1086175 -1321311 -1360524 -1689912 -1520625 -750935
15228g50935N96990k98791o32497K16430R74939R48554J125874L16571l37159
$$ -750935 -153945 -452736 -1085233 -868803 106136 1054690 2180564 2497135 2159976
15219B159976r57332j694529l71016K71698J99984L74555M02085P54392N54010
$$ 2159976 1202644 -491885 -862901 -591203 -391219 -16664 385421 1139813 1693823
15210A693823P33452j128014j575615j075992o67615K30871N9392l33538M51362
$$ 1693823 2427275 1299261 -276354 -1352346 -2019961 -1789090 -1729698 -2063236 -1611874
15201a611874J71057j92595j09122q57944L38536J154171K45036N40189K65466
$$ -1611874 -1440817 -1633412 -1742534 -2600478 -2261942 -1107771 -862735 -322546 -57080
15192e7080K09270r35089j006107j61220L87246K16138J72084J10810O772K31008
$$ -57080 152190 -782899 -1789006 -1950226 -1562980 -1346842 -1174758 -1063948 -1057176 -826168
15182h26168j4424P98029L52041q97911q66163O97165J340484N88460n96249l89180
$$ -826168 -840592 -42563 309478 -588433 -1454596 -757431 583053 1171513 575264 186084
15172A86084m57502q0187J28241m25500J48523j82668j58699R46330o5425q67275
$$ 186084 -271418 -351605 -223364 -648864 -500341 -683009 -841708 104622 39197 -828078
15162h28078n67919k16818P29060L92203l12646K11905L72407O6895k70313r06938
$$ -828078 -1395997 -1612815 -883755 -491552 -804198 -592293 -219886 -152991 -423304 -1330242
15152a330242j133989j53706P64307J161790J616032J531016R9393r57022o09370
$$ -1330242 -2464231 -2617937 -1853630 -691840 924192 2455208 2554601 1597579 988209
15143I88209N638l57166n29258l55518l87403l29076o40222k67312N9303N18156
$$ 988209 993847 636681 107423 -248095 -635498 -964574 -1604796 -1872108 -1812805 -1294649
15133a294649N84158p9314K60458J23060k28874l98067P37567J265872M48295
$$ -1294649 -710491 -789805 -529347 -406287 -635161 -1033228 -295661 970211 1418506
15124A418506j53208n08677n67874Q51039Q14139O79384J167733m71005j512673
$$ 1418506 1265298 756621 188747 1039786 1853925 2533309 3701042 3230037 1717364
15115A717364j785461r69198m70870r79338J05087K50706q82934j441580Q2007
$$ 1717364 -68097 -1037295 -1508165 -2487503 -2382416 -2131710 -3014644 -4456224 -4374217
15106d374217P51272J125429O58234k13662J92781J828007K104921N94262q83384
$$ -4374217 -3622945 -2497516 -1839282 -2052944 -1860163 -32156 2072765 2667027 1783643
15097A783643j788998j062339l74799N01981j08091j0127K60356k82612p58238
$$ 1783643 -5355 -1067694 -1442493 -940512 -1048603 -1058730 -798374 -1080986 -1839224
15088a839224j170697j159156n84313J440694J505732N99069J387212l61073r47399
$$ -1839224 -3009921 -4169077 -4753390 -3312696 -1806964 -1207895 179317 -181756 -1129155
15079a129155r55233j336409K55185J75832J337823J692337m82786o28836j35833
$$ -1129155 -2084388 -3420797 -3165612 -2989780 -1651957 40380 -442406 -1071242 -1207075
15070a207075o88749m35635J16133K60624m04501l96887M57923m77309p63124
$$ -1207075 -1895824 -2331459 -2215326 -1954702 -2359203 -2756090 -2298167 -2775476 -3538600
15061c538600L48708J074549K57876m74610m29019m82139J57405R41681R32817
$$ -3538600 -3189892 -2115343 -1857467 -2332077 -2761096 -3243235 -3085830 -2144149 -1211332
15052a211332K87641k88125P18153R98327O13272l74564j089780n54307K80383
$$ -1211332 -923691 -1211816 -493663 504664 1117936 743372 -346408 -900715 -620332
15043f20332P19741j088102j071593M45926J69836l7687L98692L63067M95636
$$ -620332 99409 -988693 -2060286 -1614360 -1444524 -1482211 -1083519 -720452 -224816
15034b24816k82924j58892L92140O36600K52285n30460n88284K97889K09624N94464
$$ -224816 -507740 -666632 -274492 362108 614393 83933 -504351 -206462 3162 597626
15024E97626P09364n92558n39149o17303J54068N71007k38040j043177j034610
$$ 597626 1306990 714432 175283 -442020 -287952 283055 45015 -998162 -2032772
15015b032772m27234j66004J90943J064382N13827k87507N99389Q03852m14431
$$ -2032772 -2460006 -2626010 -2435067 -1370685 -856858 -1144365 -544976 258876 -155555
15006a55555l6514k76377o55142L92238m9461K6603n54263m64295l72873K7587
$$ -155555 -192069 -468446 -1123588 -731350 -780811 -754208 -1308471 -1772766 -2145639 -2118052
14996b118052J002728O27318q5476r98272m72525J84938j50476M71677N00937
$$ -2118052 -1115324 -488006 -573482 -1571754 -2044279 -1859341 -2009817 -1538140 -1037203
14987a037203J32909N64374N97319r25658j128941O034M19987K66231P59370O13508
$$ -1037203 -904294 -339920 257399 -668259 -1797200 -1791166 -1371179 -1104948 -345578 267930
14977B67930k63526K69575K62520m62151p36127j2474J11838m89551p68604q93872
$$ 267930 4404 273979 536499 74348 -661779 -674253 -562415 -1051966 -1820570 -2714442
14967b714442n15762J35820N57447K08975k69462R3496L8032K91423R60513J131794
$$ -2714442 -3230204 -3094384 -2536937 -2327962 -2597424 -2503928 -2465896 -2174473 -1213960 -82166
14957h2166P09358K31965Q3601j45138j551396p81147k45461r74412K02716O67232
$$ -82166 627192 859157 942758 797620 -753776 -1534923 -1780384 -2754796 -2552080 -1884848
14947a884848j59000K01738M12881Q98270J190313K07818j27352p42908j69093
$$ -1884848 -2043848 -1842110 -1429229 -530959 659354 867172 739820 -3088 -172181
14938a72181j8964J30957J263251K77287l75717o84279O8815K40775n76122J86915
$$ -172181 -191145 -60188 1203063 1480350 1104633 420354 489169 729944 153822 340737
14928C40737Q5603n29731K96270j9482r30387j109089P5892l26881q18714n10334
$$ 340737 426340 -103391 192879 173397 -756990 -1866079 -1790187 -2117068 -2935782 -3446116
14918c446116K84456J691257J069730r6843N26143J547256M6599n83958j58750
$$ -3446116 -3161660 -1470403 -400673 -497516 28627 1575883 1622482 1038524 879774
14909H79774q70028p16805Q54840O98734J79655J5721k98510m43282P8150J08457
$$ 879774 9746 -707059 147781 846515 1026170 1041891 743381 300099 378249 486706
14899D86706p86828p04288q81345j76521m59860r08189n31848L78726L69603N23772
$$ 486706 -300122 -1004410 -1885755 -2062276 -2522136 -3430325 -3962173 -3583447 -3213844 -2690072
14889b690072J440307J129785K63570k87086r1516j6458q86201r30167j309657
$$ -2690072 -1249765 -119980 143590 -143496 -235012 -251470 -1137671 -2067838 -3377495
14880c377495m57276O03434J222148M12881K39689R72642j98233J15882L16407
$$ -3377495 -3834771 -3231337 -2009189 -1596308 -1356619 -383977 -582210 -466328 -149921
14871a49921k3285l31532q50479m37290o92599J98976N94116k58990P67805N91355
$$ -149921 -173206 -504738 -1355217 -1792507 -2485106 -2286130 -1692014 -1951004 -1183199 -591844
14861e91844m48836L39863O86534J22154O56621N10355J94061m84729m20634m52284
$$ -591844 -1040680 -700817 -14283 107871 764492 1274847 1468908 984179 563545 111261
14851A11261n28858k16056K61759l03621K44585M70726j64412L326o2904j37595
$$ 111261 -417597 -633653 -371894 -675515 -430930 39796 -124616 -121290 -184194 -321789
14841c21789L6803O68391R56178L70437N37748J78589p26531p46124j67582N16521
$$ -321789 -284986 383405 1339583 1710020 2247768 2426357 1699826 953702 786120 1302641
14831A302641L89452n7783r8889q20679l53295K61108J43288j063005k41852L4609
$$ 1302641 1692093 1634310 1535421 714742 361447 622555 765843 -297162 -539014 -504405
14821e04405N19164R78829j45001k25283L83404Q06125o02224j618614o01656
$$ -504405 14759 993588 848587 623304 1006708 1812833 1210609 -408005 -1009661
14812a009661L4497O99897J010934k82184l31821J98822J10753O01880J483924
$$ -1009661 -975164 -275267 735667 453483 121662 320484 431237 1033117 2517041
14803B517041J331059j90950j426441q50030L29876P49110j34544m61939q86520
$$ 2517041 3848100 3657150 2230709 1380679 1710555 2459665 2325121 1863182 976662
14794I76662j494919j278382j03159P19026K54649K06625N05961R99581N65895
$$ 976662 -518257 -1796639 -1899798 -1180772 -926123 -719498 -213537 786044 1351939
14785A351939j14356o60055n38074l79223n78360j61325k82894l32120l74280
$$ 1351939 1237583 577528 39454 -339769 -918129 -1079454 -1362348 -1694468 -2068748
14776b068748l19743p07330N01931J186876N63618J40724L6369m22306m95253
$$ -2068748 -2388491 -3095821 -2593890 -1407014 -843396 -702672 -666303 -1088609 -1583862
14767a583862l81314K46602N1302j10252Q72594L87928j012688r63817M53108
$$ -1583862 -1965176 -1718574 -1667272 -1777524 -904930 -517002 -1529690 -2493507 -2040399
14758b040399K50574K99646M44656m08732j110167k32975M64099J040597O56291
$$ -2040399 -1789825 -1490179 -1045523 -1454255 -2564422 -2797397 -2333298 -1292701 -636410
14749f36410L5587l66080n81201n46134J84116J12230N86056J574832J069140
$$ -636410 -600823 -966903 -1548104 -2094238 -1910122 -1797892 -1211836 362996 1432136
14740A432136L00333j48890l67722J1709J52594p26171o99428O47792Q07093P27502
$$ 1432136 1732469 1583579 1215857 1227566 1380160 653989 -45439 602353 1409446 2136948
14730B136948M73323J80905J99343p03839j340105j121159p83681Q35995Q54171
$$ 2136948 2610271 2791176 2990519 2286680 946575 -174584 -958265 -122270 731901
14721G31901m28089m43215p18644N39010J300539J17610j56884O89862O79951
$$ 731901 303812 -139403 -858047 -319037 981502 1099112 942228 1632090 2312041
14712B312041q58262r19177J89377j563685o12412l2529K2072J017393r6814J55297
$$ 2312041 1453779 534602 723979 -839706 -1452118 -1484647 -1462575 -445182 -541996 -386699
14702c86699Q6935m85392n35248o96438j092407K10122Q39754k77376j571655
$$ -386699 -299764 -785156 -1320404 -2016842 -3109249 -2899127 -2059373 -2336749 -3908404
14693c908404j010488P23531J334373J690125P23957K20367J95670K09473Q79848
$$ -3908404 -4918892 -4195361 -2860988 -1170863 -446906 -226539 -30869 178604 1058452
14684A058452J084467L95048m95773j220660r63804k25370l03684j115157k69751
$$ 1058452 2142919 2537967 2042194 821534 -142270 -367640 -671324 -1786481 -2056232
14675b056232N64928Q56133R71146L10539n76054M376R12832J055589k35712j201576
$$ -2056232 -1491304 -635171 335975 646514 70460 74836 987668 2043257 1807545 605969
14665F05969l39173l00318q12208j94931L36073p3857J65298Q131m43700l70369
$$ 605969 266796 -33522 -845730 -1040661 -704588 -778445 -613147 -605016 -1048716 -1419085
14655a419085p34114l09046J010460J244440K44816j1950o27593o3034J127316
$$ -1419085 -2153199 -2462245 -1451785 -207345 37471 25521 -602072 -665106 462210
14646D62210R67146k28873r62964k10653R95469O14319J3752j014849j846157
$$ 462210 1429356 1200483 237519 26866 1022335 1636654 1650406 635557 -1210600
14637a210600l84530N78147Q13070N86929L05648K02420L78514o28421p51852
$$ -1210600 -1595130 -1016983 -203913 383016 688664 891084 1269598 641177 -110675
14628a10675j311110j002892O64432N51406J74561k52838l50055M13854j4271
$$ -110675 -1421785 -2424677 -1760245 -1208839 -1034278 -1287116 -1637171 -1223317 -1237588
14619a237588M18716P10456Q93644K7529r19755k63781J113309J436228R4646
$$ -1237588 -818872 -108416 785228 812757 -106998 -370779 742530 2178758 2273404
14610B273404M15742k15125k34784j108311n70393P58888K31477j025379j126542
$$ 2273404 2689146 2474021 2239237 1130926 560533 1319421 1550898 525519 -601023
14601f01023P9852Q71324L69285o14304j19788j21643m74205M65501J207040R72833
$$ -601023 -521171 350153 719438 105134 -14654 -136297 -610502 -145001 1062039 2034872
14591B034872l8720k38171O9843K30480K17907m58692j462510j538984l20164
$$ 2034872 1996152 1757981 1827824 2058304 2276211 1817519 355009 -1183975 -1504139
14582a504139K09817N14847J231960j67082p23001J90642J542402J047306j306581
$$ -1504139 -1294322 -779475 452485 285403 -437598 -246956 1295446 2342752 1036171
14573A036171j067707m48560j60987M89808O11991m20714O57272J224365L42680
$$ 1036171 -31536 -480096 -641083 -151275 460716 40002 697274 1921639 2264319
14564B264319R8461q32966j400225j004333r01226r84427m42834K13213P23124
$$ 2264319 2362780 1529814 129589 -874744 -1775970 -2760397 -3203231 -2990018 -2266894
14555b266894k99699n80648R35266J476146R15298J298866P48456L89618K33478
$$ -2266894 -2566593 -3147241 -2211975 -735829 179469 1478335 2226791 2616409 2849887
14546B849887o71378m09717j00256k81742n96853l67180n60749j324459j629309
$$ 2849887 2178509 1768792 1668536 1386794 789941 422761 -137988 -1462447 -3091756
14537c091756j404862p73527r9596N56917J015282K131547J980211P47696k93987
$$ -3091756 -4496618 -5270145 -5369741 -4812824 -3797542 -1665995 314216 1061912 767925
14528G67925O53590P88298p88969p54862r8155k95899K93820J005948l59362r99651
$$ 767925 1421515 2209813 1420844 665982 567827 271928 565748 1571696 1212334 212683
14518B12683j046298R4381q08125p71608N14265R17141Q45880j7714j80539o27574
$$ 212683 -833615 -739234 -1547359 -2318967 -1804702 -887561 -41681 -59395 -239934 -867508
14508h67508k11285M70800K7261J060998P97812j163028j524664P9878N90638
$$ -867508 -1078793 -607993 -580732 480266 1278078 115050 -1409614 -1329736 -739098
14499g39098l15537o31094q54452o07230M04040Q93949M50444N59992O76476J24272
$$ -739098 -1054635 -1685729 -2540181 -3147411 -2743371 -1849422 -1398978 -838986 -162510 -38238
14489c8238k63844J6142O19317O14762p92947q17626q4547l79301M28315O32047
$$ -38238 -302082 -285940 333377 948139 155192 -662434 -746981 -1126282 -697967 -65920
14479f5920l17546p67632K24084O68689O73433N88794q29836j51676l9315l96231
$$ -65920 -383466 -1151098 -927014 -258325 415108 1003902 174066 22390 -16925 -413156
14469d13156p00164n52138j68811P7149P15481L01695J97629J68774m27518k19578
$$ -413156 -1113320 -1665458 -1834269 -1757120 -1041639 -739944 -542315 -373541 -801059 -1020637
14459a020637k64976J35038O03582R35057L29009m98782m54665l08995m33202
$$ -1020637 -1285613 -1150575 -546993 388064 717073 218291 -236374 -545369 -978571
14450i78571q47203m17190P40105K7674Q8917Q00141Q20951n82095j018622J68443
$$ -978571 -1825774 -2242964 -1502859 -1475185 -1386268 -586127 234824 -347271 -1365893 -1197450
14440a197450K69902n5072n00789j515318j101684N09600K124573P26915l19962
$$ -1197450 -927548 -982620 -1483409 -2998727 -4100411 -3590811 -1466238 -739323 -1059285
14431a059285J304483N45806j078246j312019j025070r6907R89019J182589M98077
$$ -1059285 245198 791004 -287242 -1599261 -2624331 -2721238 -1732219 -549630 -51553
14422e1553K06116k27801q9069J718608J616076o26112j853934n23504j50070
$$ -51553 154563 -73238 -162307 1556301 3172377 2546265 692331 168827 18757
14413A8757M57474J338705J426562K79776j049488m77497j43975m25498n17395
$$ 18757 476231 1814936 3241498 3521274 2471786 1994289 1850314 1424816 907421
14404I07421m51090O5230R47558L03719K63395j81413j102657j66624n41679p72114
$$ 907421 456331 521561 1469119 1772838 2036233 1854820 752163 585539 43860 -728254
14394g28254m13925q83066l14290J787447J180730L74231j27595R3171N53102
$$ -728254 -1142179 -2025245 -2339535 -552088 628642 1002873 875278 968449 1521551
14385A521551M0870m32578K39455k7471o4058m03305P3779n78784l89731O41007
$$ 1521551 1562421 1129843 1369298 1341827 1277769 874464 948243 369459 -20272 620735
14375F20735K57434q32803p26268j50179j77511j97055K77539M85188J335905
$$ 620735 878169 45366 -680902 -831081 -1008592 -1205647 -928108 -442920 892985
14366H92985P81170q46830p14444m33696J169333J032209j159990j327135m45810
$$ 892985 1674155 827325 112881 -320815 848518 1880727 720737 -606398 -1052208
14357a052208M00106N53966R47327M72043l0589L6824o53501j118647n55848n17893
$$ -1052208 -652102 -98136 849191 1321234 1290645 1327469 673968 -444679 -1000527 -1518420
14347a518420j298974m38988O42632R65852P82515P22454J01598R33129J406520
$$ -1518420 -2817394 -3256382 -2613750 -1647898 -865383 -142929 -41331 891798 2298318
14338B298318K88865q41392j335061k87785P92479K48312k084673j394251O85692
$$ 2298318 2587183 1745791 410730 122945 915424 1163736 -920937 -2315188 -1629496
14329a629496N17845J512587N62366j016765K1920L84874M11676L31082J65821
$$ -1629496 -1111651 400936 963302 -53463 -31543 353331 765007 1096089 1261910
14320A261910L92252n55884j635316j326211N11777P30017N76788Q48494Q5917
$$ 1261910 1654162 1098278 -537038 -1863249 -1351472 -621455 -44667 803827 889744
14311H89744J56582J099m65636m4327M31200l46559j567286j538202o52684R16210
$$ 889744 1046326 1047425 581789 537462 968662 622103 -945183 -2483385 -3136069 -2219859
14301b219859J072705Q19967N59079K53377n9878n67936k69447L10061J29549
$$ -2219859 -1147154 -327187 231892 485269 425391 -142545 -411992 -101931 27618
14292B7618J85484p75707j720647p04225L22557O06820R6633p18557q69519L16871
$$ 27618 213102 -562605 -2283252 -2987477 -2664920 -2058100 -1961467 -2680024 -3549543 -3232672
14282c232672J966095J514305j89032m93453k14615O81766L95850j18086l42744
$$ -3232672 -1266577 247728 58696 -434757 -649372 32394 428244 310158 -32586
14273c2586l988L03992m13858j47226l68348j62286o83075Q5382Q81978M99704
$$ -32586 -36574 267418 -146440 -293666 -662014 -824300 -1507375 -1421993 -540015 -40311
14263d0311M71710l0753q14689n75134n18059J40698J330743N79361o51467L3345
$$ -40311 431399 400646 -414043 -989177 -1507236 -1366538 -35795 543566 -107901 -74556
14253g4556K4958K70375J002094R82994O139j200341j69294P83422j61929p58233
$$ -74556 -49598 220777 1222871 2205865 2212004 1011663 842369 1625791 1463862 705629
14243G05629l06754o63419r64185k55235P43966P84658N43785k64795l60531L01089
$$ 705629 398875 -264544 -1228729 -1483964 -739998 44660 588445 323650 -36881 264208
14233B64208q33099j304799J48324J400643P93908p17045j413659m40884P57670
$$ 264208 -568891 -1873690 -1725366 -324723 469185 -247860 -1661519 -2102403 -1344733
14224a344733J015762J397763P37617q21875j763666o42479P97276J421935N85982
$$ -1344733 -328971 1068792 1806409 984534 -779132 -1421611 -624335 797600 1383582
14215A383582k22488j818306k204755m90147R5175J83780q1659P0626O60391m97437
$$ 1383582 1161094 -657212 -2861967 -3352114 -3256939 -3073159 -3154818 -3084192 -2423801 -2921238
14205b921238k97426J234489R46602K17739k41214m04748M66744k6509r1450n74093
$$ -2921238 -3218664 -1984175 -1037573 -819834 -1061048 -1465796 -999052 -1025561 -1117011 -1691104
14195a691104j054898m1454N02355j23788K98841N57836n355M20620J16010P8049
$$ -1691104 -2746002 -2787456 -2285101 -2408889 -2110048 -1552212 -1557567 -1136947 -1020937 -942888
14185i42888q8057m72357M51840O96482p55234l26870P08589N6452K44716L35665
$$ -942888 -1030945 -1503302 -1051462 -354980 -1110214 -1437084 -728495 -672043 -427327 -91662
14175i1662j76472K89284Q53319O88244p89007j123105J24362P00116L23072N7927
$$ -91662 -268134 21150 874469 1562713 773706 -349399 -225037 475079 798151 856078
14165H56078k45028j141694m30569j0559j008336o24163N72303Q79383j59092
$$ 856078 611050 -530644 -961213 -971772 -1980108 -2604271 -2031968 -1152585 -1311677
14156a311677M16885K74193r43996m69269N27311K025123J705267l04441j212578
$$ -1311677 -894792 -620599 -1564595 -2033864 -1506553 518570 2223837 1919396 706818
14147G06818j460046l08709l53590o62592L3418N49927L20774J10117Q35736K11357
$$ 706818 -753228 -1061937 -1415527 -2078119 -2044701 -1494774 -1174000 -1063883 -228147 -16790
14137a6790k18356j65686K81952j4818q3826n8870p87176p01380o17215Q2366
$$ -16790 -235146 -400832 -118880 -133698 -217524 -276394 -1063570 -1764950 -2382165 -2299799
14127b299799o7733L00458J156039l77785j832341k032317l14408J523502Q44573
$$ -2299799 -2367532 -2067074 -911035 -1288820 -3121161 -5153478 -5467886 -3944384 -3099811
14118c099811L61252O9042R19770R57751j45021J120l94961m60860l18902q5083
$$ -3099811 -2738559 -2669517 -1749747 -791996 -937017 -935897 -1330858 -1791718 -2110620 -2195703
14108b195703O47924n826m20772o2007N53670J408753O57261m71156j311225n91185
$$ -2195703 -1547779 -1553605 -1974377 -2036384 -1482714 -73961 583300 112144 -1199081 -1790266
14098a790266j47914K54562Q78483M0785j329340j271126M85178J544497Q46071
$$ -1790266 -1938180 -1683618 -805135 -764350 -2093690 -3364816 -2879638 -1335141 -489070
14089d89070J39687L6073J97741O9148q92175k62499M67221J088932J288302P89846
$$ -489070 -349383 -313310 -115569 -46421 -938596 -1201095 -733874 355058 1643360 2433206
14079B433206P47393K78768r31477n53743o64963o96095o15674j447846n98379
$$ 2433206 3180599 3459367 2527890 1974147 1309184 613089 -2585 -1450431 -2048810
14070b048810J056586J098128N92332N98324P59098o2723j345424j147490q44961
$$ -2048810 -992224 105904 698236 1296560 2055658 1992935 647511 -499979 -1344940
14061a344940n96590M98586P19570J310158J252775R96554N7390q36831l99776
$$ -1344940 -1941530 -1442944 -723374 586784 1839559 2836113 2893503 2056672 1656896
14052A656896L08408O23256m45047j653243j549646o72787O40594J369101k03410
$$ 1656896 1965304 2588560 2143513 490270 -1059376 -1732163 -1091569 277532 74122
14043G4122r63726J83915J36593j35594N95338k32685o38792p35518j5302O92847
$$ 74122 -889604 -705689 -569096 -704690 -109352 -342037 -980829 -1716347 -1731649 -1038802
14033a038802P02338M65705P9414J8258k84907p0445L4193r5112k47811p89939
$$ -1038802 -336464 129241 208655 226913 -57994 -128439 -94246 -189358 -437169 -1227108
14023a227108K69902O40506K76422N26951k87962j292214m55380L85247l84689
$$ -1227108 -957206 -316700 -40278 486673 198711 -1093503 -1548883 -1163636 -1548325
14014a548325n06368r43439o67323R1524M73570P60209J512852Q52334k155K99668
$$ -1548325 -2054693 -2998132 -3665455 -3573931 -3100361 -2340152 -827300 25034 22879 322547
14004C22547k56021j264854r81741m84067L97512k0583l91643l78874L02067K336945
$$ 322547 66526 -1198328 -2180069 -2664136 -2266624 -2287207 -2678850 -3057724 -2755657 -418712
13994d18712J280574l05788p03273p09143j83071K20190P65766J170642J80584
$$ -418712 861862 556074 -147199 -856342 -1039413 -819223 -53457 1117185 1297769
13985A297769j155950p37466Q57423P76777j59197j71977k05562m09296O5272
$$ 1297769 141819 -595647 261776 1038553 879356 707379 501817 92521 157793
13976A57793N18295J13785k51325K52899K84741L8871k89525r36998n25075l3067
$$ 157793 676088 789873 538548 791447 1076188 1115059 825534 -111464 -636539 -669606
13966f69606j10330n32707n40146k14114O26184P55145M15056l09878j281265
$$ -669606 -779936 -1312643 -1852789 -2066903 -1440719 -685574 -270518 -580396 -1861661
13957a861661M73330J537425O88341m29109m76807o01531n68611l75196P77148
$$ -1861661 -1388331 149094 837435 408326 -68481 -670012 -1238623 -1613819 -836671
13948h36671J275774L70369K55706J96769K43726j43094o79015j603903n48706
$$ -836671 439103 809472 1065178 1261947 1505673 1362579 683564 -920339 -1469045
13939a469045J37861O35066R67414p17648n37392K03990K06780M31517K81513
$$ -1469045 -1331184 -696118 271296 -446352 -983744 -779754 -572974 -141457 140056
13930A40056N15722J298451K20777r05367j88313k99726j69293K46298j86909
$$ 140056 655778 1954229 2175006 1269639 1081326 781600 612307 858605 671696
13921F71696n51730q13350l19141P98345O98345K74638m14237j123896n81839
$$ 671696 119966 -693384 -1012525 -214180 484165 758803 344566 -779330 -1361169
13912a361169L68586J137806J105956J602099O3925k11640L84892J2241j35836
$$ -1361169 -992583 145223 1251179 2853278 2917203 2705563 3090455 3102696 2966860
13903B966860p75426o88945L23291L79272k38455j111506k106875j092065P71493
$$ 2966860 2191434 1502489 1825780 2205052 1966597 855091 -1251784 -2343849 -1572356
13894a572356L96992M54836Q43088J00795m33210J70622j11781k93831m51572
$$ -1572356 -1175364 -720528 122560 223355 -209855 -39233 -151014 -444845 -896417
13885h96417j032329p79809L32119J005848O78017J484796O80580K5117L57939
$$ -896417 -1928746 -2708555 -2376436 -1370588 -692571 792225 1472805 1497922 1855861
13876A855861J29384j65702n41306l46918j28053k34940P77064L02118p85150
$$ 1855861 1985245 1819543 1278237 931319 803266 568326 1345390 1647508 862358
13867H62358q56844q06034p40225J65260K25288M65504m56930r26883J53544P18300
$$ 862358 5514 -800520 -1540745 -1375485 -1150197 -684693 -1141623 -2068506 -1914962 -1196662
13857a196662Q62936M01166K99772L14258J45225Q30907Q92957j04529j090107
$$ -1196662 -333726 67440 367212 681470 826695 1657602 2550559 2446030 1355923
13848A355923j304259o80244M92638J140443P33972n97676m90596J51123K7402
$$ 1355923 51664 -628580 -135942 1004501 1738473 1140797 650201 801324 828726
13839H28726j216797n23081J172787J204547J725429J84771j273266q25151N4727
$$ 828726 -388071 -911152 261635 1466182 3191611 3376382 2103116 1277965 1332692
13830A332692L02815l79671j532686p16293k66613l73126q911R98247K62552r5966
$$ 1332692 1635507 1255836 -276850 -993143 -1259756 -1632882 -1641793 -643546 -380994 -476960
13820d76960o61638r54225J71934J79934J199423P77892m62321q6066N43672R73122
$$ -476960 -1138598 -2092823 -1920889 -1740955 -541532 236360 -225961 -312027 231645 1204767
13810A204767j6972r06206m57275l69181K12707Q70611N77882M01103l52037l00029
$$ 1204767 1187795 281589 -175686 -544867 -332160 538451 1116333 1517436 1165399 865370
13800H65370M70853O88857q23746o66006M36703L29835l64263q65866m77553J96418
$$ 865370 1336223 2025080 1201334 535328 972031 1301866 937603 71737 -405816 -209398
13790b09398K06871K63157l77540j385620m92875j97886Q03540J234855N65248
$$ -209398 -2527 260630 -116910 -1502530 -1995405 -2193291 -1389751 -154896 410352
13781D10352N51329O99167O50229o76397m87010Q9793M6955N62010P40511j30932
$$ 410352 961681 1660848 2311077 1634680 1147670 1237463 1284418 1846428 2586939 2456007
13771B456007j112106k53789N54930Q18484J07459l67544j274392j688618j483192
$$ 2456007 1343901 1090112 1645042 2463526 2570985 2203441 929049 -759569 -2242761
13762b242761n17143M56418j2571J79623Q84827R63427L39396J93832m49008m92027
$$ -2242761 -2759904 -2303486 -2316057 -2136434 -1251607 -288180 51216 245048 -203960 -695987
13752f95987k90955n23945p47728P31M30297O60800L44802m5343l87013k77652
$$ -695987 -986942 -1510887 -2258615 -2257884 -1827587 -1166787 -821985 -867328 -1254341 -1531993
13742a531993R76140R83759L10433o99123p29143J34070P82983K30735O60885
$$ -1531993 -555853 427906 738339 39216 -689927 -555857 227126 457861 1118746
13733A118746K16041j029621l09143M68857O1640j086737o22105O26848J297555
$$ 1118746 1334787 305166 -3977 464880 526520 -560217 -1182322 -555474 742081
13724G42081J43359m56145n39224J59074J184189J190886Q09799k57215j066645
$$ 742081 885440 429295 -109929 49145 1233334 2424220 3234019 2976804 1910159
13715A910159n01154R28627J042355r14153j145872p679J9171k66143p68839L38098
$$ 1910159 1409005 2337632 3379987 2465834 1319962 1312283 1331454 1065311 296472 634570
13705F34570R47988J74803K02290K1751j202129j862608p435J366924Q95964P53232
$$ 634570 1582558 1757361 1959651 1981402 779273 -1083335 -1090770 276154 1172118 1925350
13695A925350k09997o31220o31673n25880N4451K379N45937P85087K85000m37820
$$ 1925350 1715353 1084133 452460 -73420 -18969 -16590 529347 1314434 1599434 1161614
13685A161614k99962j183387j098842M00840q7882j294873j017193J27500J217369
$$ 1161614 861652 -321735 -1420577 -1019737 -1107619 -2402492 -3419685 -3292185 -2074816
13676b074816R46760N54935P30369l13331o39637J24087Q12254j48992k86021
$$ -2074816 -1128056 -573121 157248 -156083 -795720 -671633 140621 -8371 -294392
13667b94392L29185j98393j53593L62786j6360j67465N83843N25031J30081K71763
$$ -294392 34793 -163600 -317193 45593 29233 -138232 445611 970642 1100723 1372486
13657A372486M00485M38584R68100L95462J51115J45574k97457p59767n88619
$$ 1372486 1772971 2211555 3179655 3575117 3726232 3871806 3574349 2814582 2225963
13648B225963n21204m82630r31803o73434m64796k94415r3100j02427M91302L67385
$$ 2225963 1704759 1222129 290326 -383108 -847904 -1142319 -1235419 -1337846 -846544 -479159
13638d79159n80673j053117M98352R02277O25897P8699l45647K43413L95033r60464
$$ -479159 -1059832 -2112949 -1614597 -712320 -86423 -7724 -353371 -109958 285075 -675389
13628f75389q67140n16991m06455m39027O30736Q19652K40702N98598Q31920R56559
$$ -675389 -1542529 -2059520 -2465975 -2905002 -2274266 -1454614 -1213912 -615314 216606 1173165
13618A173165L40475p71062p29737L68397M07362p14770j89873J71376O53835
$$ 1173165 1513640 742578 12841 381238 788600 73830 -116043 55333 709168
13609G09168L95927K04103K96626n20235o40215O54732N42571q6963n75706m75281
$$ 709168 1105095 1309198 1605824 1085589 445374 1100106 1642677 1555714 980008 504727
13599E04727o50379o29688q5880m94588N79429J150300m69577j227956m85170
$$ 504727 -145652 -775340 -861220 -1355808 -776379 373921 -95656 -1323612 -1808782
13590a808782k96268q32590j81372J239839J504907J188761L81023m36291j429369
$$ -1808782 -2105050 -2937640 -3119012 -1879173 -374266 814495 1195518 759227 -670142
13581f70142j107446k84148o85365r55096l89306P3546N51374J185061P29195
$$ -670142 -1777588 -2061736 -2747101 -3702197 -4091503 -4017957 -3466583 -2281522 -1552327
13572a552327M56892R78721J81887n99260j229039j108315M36454J1723R5888
$$ -1552327 -1095435 -116714 65173 -534087 -1763126 -2871441 -2434987 -2423264 -2327376
13563b327376J373033J489865M96911k11784o81667j522953r78573L30487K00676
$$ -2327376 -954343 535522 1032433 820649 138982 -1383971 -2362544 -2032057 -1831381
13554a831381k72484j41203L4197N46853O8676j36987m3446O6891Q87438M81725
$$ -1831381 -2103865 -2245068 -2210871 -1664018 -1595342 -1732329 -1775775 -1708884 -821446 -339721
13544c39721O1065k7396l26875L20120L74833l00076r31687k08539n2054J00568
$$ -339721 -278656 -306052 -632927 -312807 62026 -238050 -1169737 -1378276 -1430330 -1329762
13534a329762J116265Q44156j6957q39212l23778P24330J464626K34877j422746
$$ -1329762 -213497 630659 613702 -225510 -549288 175042 1639668 1874545 451799
13525D51799r52922Q94750J475598M62916k16086j032093m04137o0077j55259
$$ 451799 -501123 393627 1869225 2332141 2116055 1083962 679825 619748 464489
13516D64489N75420p08907m34784Q82626J549559J016914l73085q85854j003443
$$ 464489 1039909 331002 -103782 778844 2328403 3345317 2972232 2086378 1082935
13507A082935j410305n31047k82384k05061J386150N61864j411654p62447J23321
$$ 1082935 -327370 -858417 -1140801 -1345862 40288 602152 -809502 -1571949 -1448628
13498a448628P27669J639972J435526M56361j64943j023388j399630j4434J191384
$$ -1448628 -720959 919013 2354539 2810900 2645957 1622569 222939 208505 1399889
13489A399889L01016n65610k10587q7791k4753N41929K9438m89608p35596j00065
$$ 1399889 1700905 1135295 924708 836917 812164 1354093 1383531 893923 158327 58262
13479E8262M36188K18523J71417M88934J696979Q78723l89754j72156O0244q21915
$$ 58262 494450 712973 884390 1373324 3070303 3949026 3559272 3387116 3447360 2625445
13469B625445q61957j949025j515929L93094N54309l53638k86997K4297n5133
$$ 2625445 1763488 -185537 -1701466 -1308372 -754063 -1107701 -1394698 -1370401 -1425534
13460a425534J97768P86025P25103M59643o77557r90111M06691L07680l63732
$$ -1425534 -1227766 -441741 283362 743005 65448 -924663 -517972 -210292 -574024
13451e74024r58966m20277j31866l89697m13221L07709L16028R64156Q26749m21770
$$ -574024 -1532990 -1953267 -2085133 -2474830 -2888051 -2580342 -2264314 -1300158 -473409 -895179
13441h95179j65312M32809J130582N26442m89047n71764l46866J214615J034065
$$ -895179 -1060491 -627682 502900 1029342 540295 -31469 -378335 836280 1870345
13432A870345R75341K31887o53749j173305j581494n30370l369J43276J082680
$$ 1870345 2845686 3077573 2423824 1250519 -330975 -861345 -864714 -721438 361242
13423C61242N85712Q5670K17336r03602j418932M42312J776486Q7683j35093L44727
$$ 361242 946954 1032624 1249960 346358 -1072574 -630262 1146224 1233907 1098814 1443541
13413A443541J71084l42797o80631k48748L03976k34156j770546p83519J003538
$$ 1443541 1614625 1271828 591197 342449 646425 412269 -1358277 -2141796 -1138258
13404a138258Q02754J019986N21591j53127p32356j66913r7086j154952j389182
$$ -1138258 -335504 684482 1206073 1052946 320590 153677 56591 -1098361 -2487543
13395b487543k36233N86219O59535R2473m87497m27936o44858p40069M57415J470952
$$ -2487543 -2723776 -2137557 -1478022 -1385549 -1873046 -2300982 -2945840 -3685909 -3228494 -1757542
13385a757542J421760J156238M35058L80230N99880r31709j611794k46298r10747
$$ -1757542 -335782 820456 1255514 1635744 2235624 1303915 -307879 -554177 -1464924
13376a464924p72756K64667k62275m16538P15123Q08319J57176o3947r37350J45574
$$ -1464924 -2237680 -1973013 -2235288 -2651826 -1936703 -1128384 -971208 -1035155 -1972505 -1826931
13366a826931R25731J629681R03461K07153l76903o18757l2925n05734p35146
$$ -1826931 -901200 728481 1631942 1839095 1462192 843435 810510 304776 -430370
13357d30370r9750N38705P31801o97723l09894O47252J9953q48176o70128k47670
$$ -430370 -530120 8585 740386 42663 -267231 380021 399974 -448202 -1118330 -1366000
13347a366000j00517L28629R69339J070088M76439j297769j796479q47439p76438
$$ -1366000 -1466517 -1137888 -168549 901539 1377978 80209 -1716270 -2563709 -3340147
13338c340147n97347m23090M62505N14127m64431L5192J010575P76137J61787
$$ -3340147 -3937494 -4360584 -3898079 -3383952 -3848383 -3813191 -2802616 -2026479 -1864692
13329a864692O15929N2080p38787n61357J8353o54K94288m31290Q9126O83066
$$ -1864692 -1248763 -1196683 -1935470 -2496827 -2478474 -2479128 -2184840 -2616130 -2527004 -1843938
13319a843938Q45563k20486j184003o6064O47013L39738P0658M82632j00110r40283
$$ -1843938 -998375 -1218861 -2402864 -2468928 -1821915 -1482177 -1411519 -928887 -1028997 -1969280
13309a969280k83575J53742N33913K97770N63961L8308j068828k83144R35317
$$ -1969280 -2252855 -2099113 -1565200 -1267430 -703469 -665161 -1733989 -2017133 -1081816
13300a081816j5920m6185M95131L04257K46977K34598P08882K49949j229950p11422
$$ -1081816 -1097736 -1143921 -648790 -344533 -97556 137042 845924 1095873 -134077 -845499
13290h45499j92201O63275N93108j329128r97515M71463J061962L70382j64979
$$ -845499 -1037700 -374425 218683 -1110445 -2107960 -1636497 -574535 -204153 -369132
13281c69132j088233K87496J459211P40418p13195j15425J60579k26073J20020
$$ -369132 -1457365 -1169869 289342 1029760 316565 201140 361719 135646 255666
13272B55666n78085p26283q0576J86225N7578J93643L96414o14543n51761o04589
$$ 255666 -322419 -1048702 -1129278 -943053 -885475 -691832 -295418 -909961 -1461722 -2066311
13262b066311q02507K98486J230424N93222l94331n25761R27008j12020O43118
$$ -2066311 -2868818 -2570332 -1339908 -746686 -1141017 -1666778 -739770 -851790 -208672
13253b08672J185554M95375k43947m43911J43058j82958j26936p01938p43134
$$ -208672 976882 1472257 1228310 784399 927457 744499 617563 -84375 -827509
13244h27509N79903P9696o37204O31009M39268K56412m11077q11817l08758m18981
$$ -827509 -247606 -167910 -805114 -174105 265163 521575 110498 -701319 -1010077 -1429058
13234a429058m55432m15326m52031j05131l71361K08782J812617J654123m07889
$$ -1429058 -1884490 -2299816 -2751847 -2856978 -3228339 -3019557 -1206940 447183 39294
13225C9294p48720l33691P38691J223636J32265r0699k72560j198668j074821
$$ 39294 -709426 -1043117 -304426 919210 1051475 960776 688216 -510452 -1585273
13216a585273o78475o42585m01830l46341Q86670J682766R98682Q0229o013n22919
$$ -1585273 -2263748 -2906333 -3308163 -3654504 -2767834 -1085068 -86386 -6157 -12170 -535089
13206e35089m03167O46228N49305k67861n37273M48467q8204n57432l82785J13630
$$ -535089 -938256 -292028 257277 -10584 -547857 -99390 -187594 -745026 -1127811 -1014181
13196a014181M52361l65671M5466N63287k03975j303636k01867M89063J059440
$$ -1014181 -561820 -927491 -882025 -318738 -522713 -1826349 -2028216 -1539153 -479713
13187d79713R12149M17867K20697m30766j410053j610964k57132P88737J53503
$$ -479713 432436 850303 1071000 640234 -769819 -2380783 -2637915 -1849178 -1695675
13178a695675J81886J031659L59241n47271j84197L64321l08452o14701r32852
$$ -1695675 -1513789 -482130 -122889 -670160 -854357 -490036 -798488 -1413189 -2346041
13169b346041k53662R87461Q28895J051135l9223K03927O73498L95776M06734
$$ -2346041 -2599703 -1612242 -783347 267788 228565 432492 1105990 1501766 1908500
13160A908500k12800j291020j219876p9827K05525K97841P97112N51620L89073
$$ 1908500 1695700 404680 -815196 -895023 -689498 -391657 405455 957075 1346148
13151A346148o40988L97639J808062Q69563o79655q06063n38388j021256j50880
$$ 1346148 705160 1102799 2910861 3780424 3100769 2294706 1756318 735062 584182
13142E84182L27395J08826j23813N66932l45235q55925O68411M65446p31799M30944
$$ 584182 911577 1020403 896590 1463522 1118287 262362 930773 1396219 664420 1095364
13132A095364N07510k07828j195528k283112j070503k2820O85765Q24068J087009
$$ 1095364 1602874 1395046 199518 -2083594 -3154097 -3176917 -2491152 -1667084 -580075
13123e80075J487449O41605j11101L88500N181l04231m21043n70682j718428j018963
$$ -580075 907374 1548979 1437878 1826378 1831559 1527328 1106285 535603 -1182825 -2201788
13113b201788P37044Q16469O2897M2520L70679P87738O90922j79831j14786l72394
$$ -2201788 -1464744 -648275 -585378 -542858 -172179 615559 1306481 1126650 1011864 639470
13103F39470p11087N07964J562725J038619N27870o2759j270246q22311k45371
$$ 639470 -71617 436347 1999072 3037691 3565561 3502802 2232556 1410245 1164874
13094A164874o90367k71457L83524L04715m1596L24442J029005l14470n87044
$$ 1164874 474507 203050 586574 891289 849693 1174135 2203140 1888670 1301626
13085A301626K56104R60147O16916N71750L07469l75003q58897j180781j439759
$$ 1301626 1557730 2517877 3134793 3706543 4014012 3639009 2780112 1599331 159572
13076A59572j163498m24658M30145J712717J435703j88537j37909N06352N45540
$$ 159572 -1003926 -1428584 -998439 714278 2149981 1961444 1823535 2329887 2875427
13067B875427J07473M50036O05013J440754J794942K63301j050037j259974J5652
$$ 2875427 2982900 3432936 4037949 5478703 7273645 7536946 6486909 5226935 5242587
13058E242587P6522n51218j069281r62767J08035o4007n83524M77605J79097J89750
$$ 5242587 5319109 4767891 3698610 2735843 2843878 2779871 2196347 2673952 2853049 3042799
13048C042799J25093k18107m09064q50270n74649k38166M86641J376157P34590
$$ 3042799 3167892 2949785 2540721 1690451 1115802 877636 1364277 2740434 3475024
13039C475024j32029l05675K94115j39512K23980k73813m78834L05476M12125
$$ 3475024 3342995 3037320 3331435 3191923 3415903 3142090 2663256 2968732 3380857
13030C380857o72475l35872J772321J020256m05818J41207M85881K03809J4988
$$ 3380857 2708382 2372510 4144831 5165087 4759269 4900476 5386357 5590166 5605154
13021E605154r20719r19960N8929k98822j05084K32415Q2367j42636L79503L21420
$$ 5605154 4684435 3764475 3823404 3524582 3419498 3651913 3734280 3591644 3971147 4292567
13011D292567m43007P02145J311593R79923Q35317j11981n06675j49492L70321
$$ 4292567 3849560 4551705 5863298 6843221 7678538 7566557 7059882 6910390 7280711
13002G280711k0262l89621O59903R23893J243793J937870J338438J177783J060614
$$ 7280711 7260449 6870828 7530731 8454624 9698417 11636287 12974725 14152508 15213122
12993A5213122L71595J205763K966624L368028M120345M020233L986967N994708
$$ 15213122 15584717 16790480 19757104 23125132 27245477 31265710 35252677 41247385
12985D1247385Q107877R804929J0985485J3783825J7865249K3803036L2304668
$$ 41247385 49355262 59160191 70145676 83929501 101794750 125597786 157902454
12978A57902454M2602349N6107939O6564372O0441178K2345290k8443471n8892589
$$ 157902454 200504803 256612742 323177114 383618292 405963582 377520111 318627522
12971C18627522o2933817n3320023l9688147k8861328k2755589j8821933j4928565
$$ 318627522 255693705 202373682 162685535 133824207 111068618 92246685 77318120
12964G7318120j1122514q572692p645475p064217n246947m097910m836648l090342
$$ 77318120 66195606 57622914 49977439 42913222 37666275 33568365 28731717 25641375
12956B5641375n45115k10158j753934k794732k009418j147770r73920j458592
$$ 25641375 25096260 24886102 23132168 20337436 18328018 17180248 16206328 14747736
12948A4747736n88993o52068j195210j602422j572048q23497p42700j20093J333074
$$ 14747736 14158743 13506675 12311465 10709043 9136995 8313498 7570798 7450705 8783779
12939H783779J585922L5685r34469q68837p34487o37319l25507o3931l9319M93634
$$ 8783779 10369701 10405386 9470917 8602080 7867593 7230274 6904767 6840836 6801517 7295151
12929G295151J035403N97426N15094K88737L54212Q02803J726155K787298K93727
$$ 7295151 8330554 8927980 9443074 9731811 10086023 10888826 12614981 15402279 15696006
12920A5696006j259733p69757J24520K445736K956792Q85044R0281l11806j157924
$$ 15696006 14436273 13666516 13791036 16236772 19193564 20078608 20168889 19857083 18699159
12911A8699159o72131M18348j27489P26134L95624j23777J240121K389241L283543
$$ 18699159 18027028 18445376 18317887 19044021 19439645 19315868 20555989 22945230 26228773
12902B6228773K959995K766621N601248O853931P173774Q946518J2843890J6559813
$$ 26228773 29188768 31955389 37556637 44410568 51584342 60530860 73374750 89934563
12894H9934563K0966959K7379810L5913535M7302922O0989576O9516293N5656660
$$ 89934563 110901522 138281332 174194867 221497789 282487365 352003658 407660318
12887D07660318J0138970m2961042o6624460o2950814n0714456l8569856k8436625
$$ 407660318 417799288 374838246 308213786 245262972 194548516 155978660 127542035
12880A27542035k0752247j6454862j3615115j1081578q776798o663784n920043
$$ 127542035 106789788 90334926 76719811 65638233 56861435 50197651 44277608
12873D4277608n086869m266865l042147l481209l523470l282275j675400j012810
$$ 44277608 39190739 34923874 31881727 28400518 24877048 21594773 19919373 18906563
12865A8906563r84135j661588j828563n40474k10017j84915q00893m26185r0870
$$ 18906563 17922428 16260840 14432277 13891803 13681786 13496871 12695978 12269793 12178923
12856A2178923J58415l95682p19165m78459p96526J645191K523188K835016K532089
$$ 12178923 12337338 11941656 11222491 10744032 9947506 11592697 14115885 16950901 19482990
12847A9482990K422898L649360N418668Q207025J4476315K1108002K0934951K10266
$$ 19482990 21905888 25555248 30973916 39180941 53657256 74765258 95700209 95910475
12839I5910475k0837780j9130921j2905284q701229n661041l586875l412041l324116
$$ 95910475 75072695 55941774 43036490 34335261 28674220 25087345 21675304 18351188
12831A8351188k664539j142363K94053O82028k7161p9843q86593m77007J293386
$$ 18351188 15686649 14544286 14838339 15520367 15493206 15413363 14526770 14049763 15343149
12822A5343149K401595K116741J318437N53388J566511K254240L127189M604841
$$ 15343149 17744744 19861485 21179922 21733310 23299821 25554061 28681250 33286091
12814C3286091N265648N092391O067006Q353662J0918521J4241368J6872342K1695618
$$ 33286091 38551739 43644130 49711136 58064798 68983319 83224687 100097029 121792647
12806A21792647K7778222L6101150M9080636O1524683O4754936M3548435n143546
$$ 121792647 149570869 185672019 234752655 296277338 361032274 404580709 399437163
12799C99437163m8588348o3868367n7945629m5982912l5132051k7012788k0184173
$$ 399437163 350848815 286980448 229034819 183051907 147919856 120907068 100722895
12792A00722895j6324488j2653646q663409p550015o506387o041426n050307l962909
$$ 100722895 84398407 71744761 63081352 55531337 49024950 42983524 37933217 33970308
12784C3970308l566543k733942k057481k331266l051235j937787m92414P4233
$$ 33970308 30403765 27669823 25612342 23281076 20229841 18292054 17799640 17873873
12776A7873873k92594j559020j400174j334337j702828l05796n90744j088913
$$ 17873873 17581279 16022259 14622085 13287748 11584920 11279124 10688380 9599467
12768I599467m40538N0628L60587M8912L42274P01875P67251O52943k60765j785113
$$ 9599467 9158929 9209557 9570144 9619056 9961330 10663205 11430456 12083399 11822634 10037521
12758A0037521p98730r33474j33623K23993j105794k396536j158185q57195q41298
$$ 10037521 9238791 8305317 8171694 8395687 7289893 4893357 3735172 2877977 2036679
12749B036679P0955J076597J374344J066624j84503l41866J35924o56539o80410
$$ 2036679 2107634 3184231 4558575 5625199 5440696 5098830 5234754 4578215 3897805
12740C897805m12385o49469o35230m05737N27219p6802n8553J029287O94646R83830
$$ 3897805 3485420 2835951 2200721 1794984 2322203 2245401 2186848 3216135 3910781 4894611
12730D894611L00521m79635K15134M77695p7593K97830n70214j173198p825J058635
$$ 4894611 5195132 4715497 4930631 5408326 5330733 5628563 5058349 3885151 3877326 4935961
12720D935961m09568q39739l60284j105301O1413O92880o96754j664258j048008
$$ 4935961 4526393 3686654 3326370 2221069 2282482 2975362 2278608 614350 -433658
12711d33658K33711J390057J486459R8855L93376J354027Q02019l36057n94485
$$ -433658 -199947 1190110 2676569 2775424 3168800 4522827 5324846 4988789 4394304
12702D394304j048928n02902r8371j69771P4082l87440l96226j05217J97287M49716
$$ 4394304 3345376 2842474 2744103 2574332 2648414 2260974 1864748 1759531 1956818 2406534
12692B406534O16815M64557M32852P8247n39064j145956j371040j93883R94872
$$ 2406534 3023349 3487906 3920758 3999005 3459941 2313985 942945 749062 1743934
12683A743934R78L02875k1429P2952M08452m64863l84568R82374O34666k46978
$$ 1743934 1744912 2047787 2026358 2099310 2507762 2042899 1658331 2640705 3275371 3028393
12673C028393p73083r74665r7320K46796J69750n32143m82052j03895J110915
$$ 3028393 2255310 1280645 1183325 1430121 1599871 1067728 585676 481781 1592696
12664A592696J36397k52591R95402Q22771l72564K21973O51197j775622j887047
$$ 1592696 1729093 1476502 2471904 3294675 2922111 3144084 3795281 2019659 132612
12655A32612R03309R39618L43883k57365j644998k310980j648625Q30773J412399
$$ 132612 1035921 1975539 2319422 2062057 417059 -1893921 -3542546 -2711773 -1299374
12646a299374O68785Q78789P94418O5363l51055J30976m22098L49943j27870p58381
$$ -1299374 -630589 248200 1042618 1107981 756926 887902 465804 815747 687877 -70504
12636g0504R60981J671529K51208r63196m89299q01522j065603L06708J166918
$$ -70504 890477 2562006 2813214 1850018 1360719 559197 -506406 -199698 967220
12627I67220L19181N79706j42066j35726J48433m60909n76749O67173J391671
$$ 967220 1286401 1866107 1724041 1588315 1736748 1275839 699090 1366263 2757934
12618B757934L78471j141730j306509o19965P45617P13900k51089j44316R1233
$$ 2757934 3136405 1994675 688166 68201 813818 1527718 1276629 1132313 1223546
12609A223546O09236O82917j79423j498142o0272O71143o93085q27744m32560
$$ 1223546 1832782 2515699 2336276 838134 777862 1449005 755920 -71824 -504384
12600e04384P08954J587530J133847L77574k63994q93900j555016r94036R4116
$$ -504384 204570 1792100 2925947 3303521 3039527 2145627 590611 -403425 -309309
12591c09309L05224m29348m40811J021371J602996K26923o65559l92905L77344
$$ -309309 -4085 -433433 -874244 147127 1750123 1977046 1311487 918582 1295926
12582A295926Q84691Q78323O96040r4605r72701j038737k39738L22124N26048
$$ 1295926 2180617 3058940 3754980 3660375 2687674 1648937 1409199 1731323 2257371
12573B257371n90992q67763j93970O18575P14496p09846j724882j009241L74656
$$ 2257371 1666379 798616 604646 1223221 1937717 1227871 -497011 -1506252 -1131596
12564a131596P53693J931579J011171N60462K68933r04468p36020o68264k99125
$$ -1131596 -377903 1553676 2564847 3125309 3394242 2489774 1753754 1085490 786365
12555G86365K3509M03116J61351j41151l28075O19461J536406M40246l69127k161896
$$ 786365 809874 1212990 1374341 1233190 905115 1524576 3060982 3501228 3132101 970205
12545I70205j018827n73878p01974O82386M49838l17020m88517k38996r4088n25264
$$ 970205 -48622 -622500 -1324474 -642088 -192250 -509270 -997787 -1236783 -1330871 -1856135
12535a856135M99558J093106M12087N86790L53874R2235k88068o58476l97783
$$ -1856135 -1356577 -263471 148616 735406 1089280 1181515 893447 234971 -162812
12526a62812N57666O41887L29640O21464P1304o32840l50727L50027R26595N7034
$$ -162812 394854 1036741 1366381 1987845 2059149 1426309 1075582 1425609 2352204 2409238
12516B409238P06609J123682m22999j955726j296942n46362k78488j62681O31047
$$ 2409238 3115847 4239529 3816530 1860804 563862 17500 -260988 -423669 207378
12507B07378K08725M28809J671007J165536p21381j758098n00375M3071m38883
$$ 207378 416103 844912 2515919 3681455 2960074 1201976 701601 744672 305789
12498C05789k51710m34901m83137o68595l28145J61492J91071Q74458L68734k80499
$$ 305789 54079 -380822 -863959 -1532554 -1860699 -1699207 -1508136 -633678 -264944 -545443
12488e45443j23725l04595m65138k34762j35273M38263O00388O68916l0353K91868
$$ -545443 -669168 -973763 -1438901 -1673663 -1808936 -1370673 -770285 -101369 -131722 160146
12478A60146P15314L60251m55530j043783J69767J248184L18214j66963K9603
$$ 160146 875460 1235711 780181 -263602 -93835 1154349 1472563 1305600 1335203
12469A335203k28987o69339J70714N55459J14629n59958l9192J132327N04920
$$ 1335203 1106216 436877 607591 1163050 1277679 717721 678529 1810856 2315776
12460B315776R301j23121L36448j67883o79490o97713K78363N72976M86475J31080
$$ 2315776 2325077 2201956 2538404 2370521 1691031 993318 1271681 1844657 2331132 2462212
12450B462212l22907N54858M71699m67407j4191M06739N7851O03747k42082j340256
$$ 2462212 2139305 2694163 3165862 2698455 2684264 3091003 3148854 3752601 3510519 2170263
12440B170263j243305J1090P27830N97345P95145k64513n13181k40946j907385
$$ 2170263 926958 938048 1665878 2263223 3058368 2793855 2280674 2039728 132343
12431A32343k112062J43315K206001K162924J037411k42937o65919m15486n89394
$$ 132343 -1979719 -1836404 369597 2532521 3569932 3326995 2661076 2245590 1656196
12422A656196l63550j773540j916399R3953K91912n13951M57626J050698O41372
$$ 1656196 1292646 -480894 -2397293 -2303340 -2011428 -2525379 -2067753 -1017055 -375683
12413c75683M80623J51544L28911j88952p78738m62761r35974p29692R90079R67481
$$ -375683 104940 256484 585395 396443 -382295 -845056 -1781030 -2510722 -1520643 -553162
12403e53162J30047R15201J332277k29126q46316o01191j60997N48542P65139
$$ -553162 -423115 492086 1824363 1595237 748921 147730 -13267 535275 1300414
12394A300414n02792j217685L44495J033021l15557j026277r76005j67147Q29725
$$ 1300414 797622 -420063 -75568 957453 641896 -384381 -1360386 -1527533 -697808
12385f97808M7289J08357O04828P65577K58534r12449o20669j81292r30337j587758
$$ -697808 -650519 -542162 62666 828243 1086777 174328 -446341 -627633 -1557970 -3145728
12375c145728J75015R51635K03827R21348Q37541K38493J57496M5835M97430P35603
$$ -3145728 -2970713 -2019078 -1815251 -893903 -56362 182131 339627 385462 882892 1618495
12365A618495j27619j400825j077215Q7692N15916Q25553K66555n29269o6485
$$ 1618495 1490876 90051 -987164 -899472 -383556 441997 708552 179283 112798
12356A12798r29655n43326Q05987Q40102l09033n98632n7409O33873K00517L36720
$$ 112798 -816857 -1360183 -554196 285906 -23127 -621759 -679168 -45295 155222 491942
12346D91942K709j238907K6482K85205j77466N83452N15892J68952q2652j64929
$$ 491942 494651 -744256 -717774 -432569 -610035 -26583 489309 658261 575609 410680
12336D10680k70810K96395J09985J83285R96115P80043n0310m08991J55193P85439
$$ 410680 139870 436265 546250 729535 1725650 2505693 2455383 2046392 2201585 2987024
12326B987024O23340o81932p53067j706094k98764M22226k16088l21248p12949
$$ 2987024 3610364 2928432 2175365 469271 170507 592733 376645 55397 -657552
12317f57552L5838J23006n75440o90966K76863R98946K58730M3082J52405L09632
$$ -657552 -621714 -498708 -1074148 -1765114 -1488251 -489305 -230575 -187493 -35088 274544
12307B74544j79137k1195n58179o33594N63185J171072K62735l66806K45400J38471
$$ 274544 95407 74212 -483967 -1117561 -554376 616696 879431 512625 758025 896496
12297H96496p57447K69213L40993l91271N84794J55032n40485m72513p50217j451586
$$ 896496 139049 408262 749255 357984 942778 1097810 557325 84812 -665405 -2116991
12287b116991K85675J499659o9007l47801N245n2807N22822J339414J249591K81504
$$ -2116991 -1831316 -331657 -400664 -748465 -743220 -796027 -273205 1066209 2315800 2597304
12277B597304n93732p53455J018343J047775p00996j049364J54239k24910j038042
$$ 2597304 2003572 1250117 2268460 3316235 2615239 1565875 1720114 1495204 457162
12268D57162m70477J53156M20339J640005J243732k97073k90109k40052o46209
$$ 457162 -13315 139841 560180 2200185 3443917 3146844 2856735 2616683 1970474
12259A970474k6112p21624n14855J23353r60232j187351l40575O62737J264680
$$ 1970474 1944362 1222738 707883 831236 -128996 -1316347 -1656922 -994185 270495
12250B70495P43313R94445L51279p93945m73295m69470M62447J240800J114769
$$ 270495 1013808 2008253 2359532 1565587 1092292 622822 1085269 2326069 3440838
12241C440838k96032p28844r82486j021534L58047O43320k03147m66948l3864
$$ 3440838 3144806 2415962 1433476 411942 769989 1413309 1210162 743214 709350
12232G09350q5332k14019L79479L76838K66654M4514M41629m07549j870876j707804
$$ 709350 624018 409999 789478 1166316 1432970 1477484 1919113 1511564 -359312 -2067116
12222b067116N89209L76032p93794M00804O31104J68923P11498O63243J28854
$$ -2067116 -1477907 -1101875 -1895669 -1494865 -863761 -694838 16660 679903 808757
12213H08757J63694o66521n86894P46363R62171P62688j47327j095702l67199
$$ 808757 972451 305930 -280964 465399 1427570 2190258 2042931 947229 580030
12204E80030r98713j75708o4667l48199j91047j70712J83873l143R03729J014798
$$ 580030 -418683 -594391 -659058 -1007257 -1198304 -1369016 -1185143 -1188286 -284557 730241
12194G30241j092k82913n90569m26164o65056J48658P52900K19237N72433N62440
$$ 730241 729149 446236 -144333 -570497 -1235553 -1086895 -333995 -114758 457675 1020115
12184A020115l67244j63072n9857M12544J209793P29589k08619q21590r65968
$$ 1020115 652871 489799 429942 842486 2052279 2781868 2573249 1751659 785691
12175G85691m29741l27165j74935J509L55286J189359o7799k17000L1915L40070
$$ 785691 355950 28785 -146150 -144641 210645 1400004 1332205 1115205 1147120 1487190
12165A487190Q671j709581j218821L05660J146465J046027J44272l08562K44923
$$ 1487190 1495861 -213720 -1432541 -1126881 19584 1065611 1209883 901321 1146244
12156A146244P22337l76519n9459j47391j082996l58713k81671m88438M01256
$$ 1146244 1868581 1492062 1432603 1285212 202216 -156497 -438168 -926606 -525350
12147e25350j77975j23663l95514j395502K64686J238550k35600k98608k07043
$$ -525350 -703325 -826988 -1222502 -2618004 -2353318 -1114768 -1350368 -1648976 -1856019
12138a856019R52061J632926J398716K42342o59939m72676m33225j50894j89711
$$ -1856019 -903958 728968 2127684 2370026 1710087 1237411 804186 653292 463581
12129D63581q36896R8948J11438o085M84172n01396l25632M25524O31353K65842
$$ 463581 -373315 -274367 -162929 -169014 315158 -186238 -511870 -86346 545007 810849
12119H10849n52629j78623K57053k0267k4753p40664j873446q73648P64847J646021
$$ 810849 258220 79597 336650 316383 291630 -449034 -2322480 -3196128 -2431281 -785260
12109g85260J690533R06503m07561m38591n31633n04027j24474K95387m52234
$$ -785260 905273 1811776 1404215 965624 433991 -70036 -194510 100877 -351357
12100c51357j056844q94506J28178Q9299J125131J350986J45165p8164L31719
$$ -351357 -1408201 -2302707 -2174529 -2085230 -960099 390887 536052 457888 789607
12091G89607J581167N5051j519656r49653K46111R50747k4433p7267M61246j360496
$$ 789607 2370774 2425825 906169 -43484 202627 1153374 1128941 1051674 1512920 152424
12081A52424j584738l97042k61890M3139J30589Q6936M81506K10023L34549R03401
$$ 152424 -1432314 -1829356 -2091246 -2048107 -1917518 -1830582 -1349076 -1139053 -804504 98897
12071I8897L51728j535228j025439m69560n03462R15584J433721J35518L45699
$$ 98897 450625 -1084603 -2110042 -2579602 -3083064 -2167480 -733759 -598241 -252542
12062b52542K10440J5067q63872j737399q65315M53879q0853j4422p8080P09659
$$ -252542 -42102 -27035 -890907 -2628306 -3493621 -3039742 -3120595 -3135017 -3213097 -2503438
12052b503438J010591R41190Q29967J05796P55583J70716k99147r12203j120139
$$ -2503438 -1492847 -551657 278310 384106 1139689 1310405 1011258 99055 -1021084
12043a021084n31720O54284J155393O41570j540194j183352L46232N84028k57643
$$ -1021084 -1552804 -898520 256873 898443 -641751 -1825103 -1478871 -894843 -1152486
12034a152486o15870m8582N99094O79583L63373N73122M30091l57234l57629r4790
$$ -1152486 -1768356 -1816938 -1217844 -538261 -174888 398234 828325 471091 113462 18672
12024A8672n6199P94980n21088o49017O56369M98907l86648o02203q41065r63884
$$ 18672 -37527 757453 236365 -412652 243717 742624 355976 -246227 -1087292 -2051176
12014b051176L40299Q14205j6663l84615k59434L41292L55567Q96467K28686j632042
$$ -2051176 -1710877 -896672 -913335 -1297950 -1557384 -1216092 -860525 35942 264628 -1367414
12004a367414j223388O07260J251118M40584O39715Q00686j17746l80484j419461
$$ -1367414 -2590802 -1983542 -732424 -291840 347875 1148561 1030815 650331 -769130
11995g69130P3556K02563L7108N87539J97369l43653L13282N62375K50373j67939
$$ -769130 -695574 -493011 -455903 131636 329005 -14648 298634 861009 1111382 943443
11985I43443k89714N29792N36855J126349O52943K67623N23732J95244O31039
$$ 943443 653729 1183521 1720376 2846725 3499668 3767291 4291023 4486267 5117306
11976E117306j33941p25436o99072j309580r91433M7242l12527J1439L9555n33616
$$ 5117306 4983365 4257929 3558857 2249277 1257844 1305086 992559 1003998 1043553 509937
11966E09937p09730L42289j22038r7960k27591j218383m43506N35615K44955m70598
$$ 509937 -199793 142496 20458 -77502 -305093 -1523476 -1966982 -1431367 -1186412 -1657010
11956a657010N93285J681609R36499M26751K89626m34233o25858j350439m51466
$$ -1657010 -1063725 617884 1554383 1981134 2270760 1836527 1210669 -139770 -591236
11947e91236o99940M81505J176011l66977j533444j408206p84694j75051J3581
$$ -591236 -1291176 -809671 366340 -637 -1534081 -2942287 -3726981 -3902032 -3888451
11938c888451p53640m46063K6161J663914J817579R16803M10122l64328J72621
$$ -3888451 -4642091 -5088154 -5061993 -3398079 -1580500 -663697 -253575 -617903 -445282
11929d45282L77565n96786r85206j77060J895596J799588r31393j634414Q68330
$$ -445282 -67717 -664503 -1649709 -1826769 68827 1868415 937022 -697392 170938
11920A70938R76932l07437l38276q43575j428709q1074P34851J554095J287573
$$ 170938 1147870 840433 502157 -341418 -1770127 -1851201 -1116350 437745 1725318
11911A725318l25841K49628l1134j789392j278252P26556J450860R46399l27732
$$ 1725318 1399477 1649105 1617971 -171421 -1449673 -723117 727743 1674142 1346410
11902A346410o39608j027097l41338j52698K85441m55746R3788R38930m62497
$$ 1346410 706802 -320295 -661633 -814331 -528890 -984636 -890848 48082 -414415
11893d14415p09656p57507n19590J1488p2280R45379J215917K60573J99235M17769
$$ -414415 -1124071 -1881578 -2401168 -2389680 -2461960 -1516581 -300664 -40091 159144 576913
11883E76913j08668P31026M9368j1653M73357J18654L05747m20961o70683l59772
$$ 576913 468245 1199271 1248639 1236986 1710343 1828997 2134744 1713783 1043100 683328
11873F83328k64124J01425o20254p45912L497L24242M99825M2712l7807R19786
$$ 683328 419204 520629 -99625 -845537 -842040 -517798 -17973 24739 -13068 906718
11863I06718J147917L50569l19388l43531m28965j41714J62663r8852j92945j32301
$$ 906718 2054635 2405204 2085816 1742285 1313320 1171606 1334269 1235417 1042472 910171
11853I10171l00345m13350k29402K6212L37924R00600P1027r37370p34930J83176
$$ 910171 609826 196476 -32926 -6714 331210 1231810 1302837 365467 -369463 -186287
11843a86287R35158M42608o1725O744L53962k85494p55362r46221n50347L01961
$$ -186287 748871 1191479 1129754 1136498 1490460 1204966 449604 -496617 -1046964 -745003
11833g45003l05023o32409L88145J529123O47042l76296j337543p33418O59012
$$ -745003 -1050026 -1682435 -1294290 234833 881875 505579 -831964 -1565382 -906370
11824i06370O26142p51924q14086J35416m2907J087993J152139N61142m3116o7071
$$ -906370 -280228 -1032152 -1846238 -1710822 -1753729 -665736 486403 1047545 1004429 937358
11814I37358j278444j157082Q1040N58070M93912l64461j11084N08794O7307l50065
$$ 937358 -341086 -1498168 -1417128 -859058 -365146 -729607 -840691 -331897 -264590 -614655
11804f14655o33238o77846k97590j43434L38086J48205P20669J504743r5037J40310
$$ -614655 -1247893 -1925739 -2223329 -2366763 -2028677 -1880472 -1159803 344940 249903 390213
11794C90213N56214j116473j127823m948R47549q4772l56100M12906J04535k57489
$$ 390213 946427 -170046 -1297869 -1302817 -355268 -440040 -796140 -383234 -278699 -536188
11784e36188j87128q6386L6172m2759n03907n81030P34611Q04973N90663K85699
$$ -536188 -723316 -809702 -773530 -816289 -1320196 -1901226 -1166615 -361642 229021 514720
11774E14720P36918J022822J370477J4065o48649o00656n48038m70802m1876l68948
$$ 514720 1251638 2274460 3644937 3659002 3010353 2409697 1861659 1390857 1348981 980033
11764I80033j277162o09602N2575J364827J704317O93430j097280j291667l62760
$$ 980033 -297129 -906731 -854156 510671 2214988 2908418 1811138 519471 156711
11755A56711j94515r0095N7302N04074o46887j267558p54339J12837J505220J448322
$$ 156711 -37804 -127899 -70597 433477 -213410 -1480968 -2235307 -2122470 -617250 831072
11745H31072P95000M01775J4177p75563k80214k27460l12759p02829K12985R46698
$$ 831072 1626072 2027847 2042024 1266461 986247 758787 446028 -256801 -43816 902882
11735I02882O19148o394p10129m89780k6604O72784M95283N96785J627386J189651
$$ 902882 1522030 1515636 805507 315727 289123 961907 1457190 2053975 3681361 4871012
11725D871012r28391k017099o04876m61753N37199j4829j26024R30079K22522
$$ 4871012 3942621 1925522 1320646 858893 1396092 1381263 1255239 2185318 2407840
11716B407840n75006k84582o45928j477511m21014M31431j78954j96391k50032
$$ 2407840 1832834 1548252 902324 -575187 -996201 -564770 -743724 -940115 -1190147
11707a190147O52508R78871k46724p21168o3185P84897O75518k84898q20260p99528
$$ -1190147 -537639 441232 194508 -526660 -589845 195052 870570 585672 -234588 -1034116
11697a034116k26894j10194m20946n00058K90884J01872J04896M28398K31351
$$ -1034116 -1261010 -1371204 -1792150 -2292208 -2001324 -1899452 -1794556 -1366158 -1134807
11688a134807J10051N62203O18311n8660o90498n73550M06856N1595l34903m84289
$$ -1134807 -1024756 -462553 155758 97098 -593400 -1166950 -760094 -708499 -1043402 -1527691
11678a527691j83698l26029j2298J328205P70015j27715l68272K01282k2857m61498
$$ -1527691 -1711389 -2037418 -2049716 -721511 48504 -79211 -447483 -246201 -269058 -730556
11668g30556M32019j98145o83183J130365J220606P83873J73066L9180j58761
$$ -730556 -298537 -496682 -1179865 -49500 1171106 1954979 2128045 2167225 2008464
11659B008464r25857j214687j242919j86998M17968Q80082R21722P53400l7337
$$ 2008464 1082607 -132080 -1374999 -1561997 -1144029 -263947 657775 1411175 1373838
11650A373838q16400j52243o3813o85039j154534m86483K75100J22726p66983
$$ 1373838 557438 405195 341382 -343657 -1498191 -1984674 -1709574 -1586848 -2353831
11641b353831k50630O71335L96447Q21338Q21525q27282j224669j19924L51092
$$ -2353831 -2604461 -1933126 -1536679 -715341 106184 -721098 -1945767 -2065691 -1714599
11632a714599R49380P89871K41118J27942j274210j011997J28248J369996J320089
$$ -1714599 -765219 24652 265770 393712 -880498 -1892495 -1764247 -394251 925838
11623I25838Q09930o638o9931J83418o42212l37298M4806k51716j386304r04198
$$ 925838 1735768 1729130 1659199 1842617 1200405 863107 907913 656197 -730107 -1634305
11613a634305J23559J237069R76611L66697N54722L46528n76033o11821n16719
$$ -1634305 -1510746 -273677 702934 1069631 1624353 1970881 1394848 783027 266308
11604B66308l76139L0278o4292q62148r30224M4590O37q73544J54533M47444J16102
$$ 266308 -109831 -79553 -143845 -1005993 -1936217 -1891627 -1890990 -2764534 -2610001 -2162557 -2046455
11593b046455L75631R51331J155757O87042P18902n4485j058702q12416j390735
$$ -2046455 -1670824 -719493 436264 1123306 1842208 1787723 729021 -83395 -1474130
11584a474130J01909J297205Q30323J92136k76761j07789J636276J177613m81008
$$ -1474130 -1372221 -75016 755307 947443 670682 562893 2199169 3376782 2895774
11575B895774m86663J06495p8471p34418o99457j96078K23041O34542m65871p19426
$$ 2895774 2409111 2515606 2437135 1702717 1003260 807182 1030223 1664765 1198894 479468
11565D79468p19852p90207r65476l24270O84937P27971K66739k77660r21971R5579
$$ 479468 -240384 -1030591 -1996067 -2320337 -1635400 -907429 -640690 -918350 -1840321 -1744742
11555a744742J344509J033494r1661j2756p00268j451627k58939o559q85985l39311
$$ -1744742 -400233 633261 541600 528844 -171424 -1623051 -1881990 -1888549 -2774534 -3113845
11545c113845J650588J308407L05686l31319r94714L04961O17527l29651o42971
$$ -3113845 -1463257 -154850 150836 -180483 -1175197 -870236 -252709 -582360 -1225331
11536a225331n33006r5524N07840K93151k11253J053421P10023K81130J188151
$$ -1225331 -1758337 -1853861 -1346021 -1052870 -1264123 -210702 499321 780451 1968602
11527A968602P39573r6547k50329j037228j379698n89108R41731M45925j506255
$$ 1968602 2708175 2611628 2361299 1324071 -55627 -644735 296996 742921 -763334
11518g63334j370557J00681N41367K47881K75303M12867r72250j135007m82850
$$ -763334 -2133891 -2033210 -1491843 -1243962 -968659 -555792 -1528042 -2663049 -3145899
11509c145899j21389L11071R63869N46972K29895P51654R50684k48534j761620
$$ -3145899 -3267288 -2956217 -1992348 -1445376 -1215481 -463827 486857 238323 -1523297
11500a523297q45057N09272Q56218J272333K56547l45172J71809L36590K54076
$$ -1523297 -2368354 -1859082 -1002864 269469 526016 180844 352653 689243 943319
11491I43319J84830K00930l17325l09421J05091j410J07619K59035k57677J23146
$$ 943319 1128149 1329079 1011754 702333 807424 806014 913633 1172668 914991 1038137
11481A038137r9131p3226L50591m67178n69985J065866J798329L76635p19450
$$ 1038137 939006 865780 1216371 749193 179208 1245074 3043403 3420038 2700588
11472B700588n57842l67554l86281j212495j133497m37400O65253J931847P28159
$$ 2700588 2142746 1775192 1388911 176416 -957081 -1394481 -729228 1202619 1930778
11463A930778p11668q70170k40409K95163l50484l13966O37778N00762j80416
$$ 1930778 1219110 348940 108531 403694 53210 -260756 377022 877784 697368
11454F97368J99905N67514p68542p85712o5906P58023R34565P82066K8586k91175
$$ 697368 897273 1464787 696245 -89467 -155373 602650 1537215 2319281 2347867 2056692
11444B056692l4080k027306k598882J75514J791476J397510K57241o80570p71287
$$ 2056692 2022612 -4694 -2603576 -2428062 -636586 760924 1018165 337595 -433692
11435d33692k64841M5110k00379p14967q61296j66022O37238O37815J116758J455132
$$ -433692 -698533 -653423 -853802 -1568769 -2430065 -2596087 -1958849 -1321034 -204276 1250856
11425A250856L5743j003878n30492k42168R1281Q11796J196468r72160j632651
$$ 1250856 1286599 282721 -247771 -489939 -398658 413138 1609606 637446 -995205
11416i95205p85387n94388N25409O61602n37104l33202K77820L1088J73750P47288
$$ -995205 -1780592 -2374980 -1849571 -1187969 -1725073 -2058275 -1780455 -1749367 -1575617 -828329
11406h28329J94262j77336O22662N10995K26369l32269r66728m21495m21039j102454
$$ -828329 -634067 -811403 -188741 322254 548623 216354 -750374 -1171869 -1592908 -2695362
11396b695362L57548Q23395k51428O04904J354697J09225K10349O6766k42616
$$ -2695362 -2337814 -1514419 -1765847 -1160943 193754 302979 513328 580094 337478
11387C37478j01620n32728k97461R8901M75094L88354J08620K33133J040779K64645
$$ 337478 235858 -296870 -594331 -495430 -20336 368018 476638 709771 1750550 2015195
11377B015195q35866m67615o23420o8109K49553p81883q35550J20046P92229J303621
$$ 2015195 1179329 711714 88294 20185 269738 -512145 -1347695 -1227649 -435420 868201
11367H68201J646206K55282j313918j093118J124039J074016l15690n42380p14519
$$ 868201 2514407 2769689 1455771 362653 1486692 2560708 2245018 1702638 988119
11358I88119j482998j008371j3381r3539J24937O56916N50396k94278P19312R09383
$$ 988119 -494879 -1503250 -1516631 -1610170 -1485233 -828317 -277921 -572199 147113 1056496
11348A056496P6062p57882m93082m68504n32006L5544J422436J473082q8347m13597
$$ 1056496 1132558 374676 -118406 -586910 -1118916 -1083372 339064 1812146 1723799 1310202
11338A310202L02335J88306j007732p90308N02773L04075j220591j384883j750680
$$ 1310202 1612537 1800843 793111 2803 505576 809651 -410940 -1795823 -3546503
11329c546503q51954J114704R14847P74014K44530K22795N94910J099225Q05219
$$ -3546503 -4398457 -3283753 -2368906 -1594892 -1350362 -1127567 -532657 566568 1371787
11320A371787R0261o152n16684N65352M82875r06220n18856O8499m74982j158329
$$ 1371787 1462048 1455896 939212 1504564 1987439 1081219 562363 630862 155880 -1002449
11310a002449j486968R4508J446494L47366l74784r09761O5203J63556L1744O13319
$$ -1002449 -2489417 -2394909 -948415 -601049 -975833 -1885594 -1820391 -1656835 -1625091 -1011772
11300a011772J262619L04237j76698J058865P6394k30338p42608J57037J7330
$$ -1011772 250847 555084 378386 1437251 1513645 1283307 540699 697736 715066
11291G15066o06573M20819L74703L19106k56690j223501l63865J364401R97976
$$ 715066 108493 529312 904015 1223121 966431 -257070 -620935 743466 1741442
11282A741442Q1706m35253j213454r22590n24877J037571J447538O19531k86871
$$ 1741442 1823148 1387895 174441 -748149 -1273026 -235455 1212083 1831614 1544743
11273A544743n28038K72534j59965j465857j892836m82012Q52303l6470p29398
$$ 1544743 1016705 1289239 1129274 -336583 -2229419 -2711431 -1859128 -1895598 -2624996
11264b624996L13089J587419N29700j116115l95038q95963k60249Q12792P24678
$$ -2624996 -2311907 -724488 -194788 -1310903 -1705941 -2601904 -2862153 -2049361 -1324683
11255a324683O77366q7656q32614r38219j3018O85464l0846k9240O91049O31386
$$ -1324683 -647317 -734973 -1567587 -2505806 -2518824 -1833360 -1864206 -1893446 -1202397 -571011
11245e71011L56015M96774N65687j2853L56256p75944j283037p64026m22343p28686
$$ -571011 -214996 281778 847465 834612 1190868 414924 -868113 -1632139 -2054482 -2783168
11235b783168l55954R48640O50935J035285O32969p72717r45840n14142m75318
$$ -2783168 -3139122 -2190482 -1539547 -504262 128707 -644010 -1589850 -2103992 -2579310
11226b579310J08861J110504J566265Q01563l13208l88894k22803P68989L22274
$$ -2579310 -2470449 -1359945 206320 1007883 694675 305781 82978 851967 1174241
11217A174241j67374O2017m06078p07253J98141M30258j85421l57663n83571n31515
$$ 1174241 1006867 1068884 662806 -44447 153694 583952 398531 40868 -542703 -1074218
11207a074218k5586m92487J62954q8126j036453M18002P70944P96164R03120M06257
$$ -1074218 -1099804 -1592291 -1429337 -1517463 -2553916 -2135914 -1364970 -568806 334314 740571
11197G40571M85612l42820j319932N5159J383286P82323r18576q02282p15763
$$ 740571 1226183 883363 -436569 -381410 1001876 1784199 865623 63341 -652422
11188f52422L82096O78438J42824O73802N95864O02011o54537j058829R02350
$$ -652422 -270326 408112 550936 1224738 1820602 2422613 1768076 709247 1611597
11179A611597J27929j414599q16207L1023K82474O41753J082419J357853J106919
$$ 1611597 1739526 324927 -491280 -460257 -177783 463970 1546389 2904242 4011161
11170D011161j90682n50250m46419p14836m37305J65524k8958K68105j01540p99385
$$ 4011161 3820479 3270229 2823810 2108974 1671669 1837193 1808235 2076340 1974800 1175415
11160A175415j503175j225284m45410M06212N67725J98165J30511j55723j07888
$$ 1175415 -327760 -1553044 -1998454 -1592242 -1024517 -826352 -695841 -851564 -959452
11151i59452L52762J460309M84890l63900r79510j419056l55584N66896m08648
$$ -959452 -606690 853619 1338509 974609 -4901 -1423957 -1779541 -1212645 -1621293
11142a621293q9266N14504Q18073O58553P37026J132534O57242o28398j752798
$$ -1621293 -1710559 -1196055 -377982 280571 1017597 2150131 2807373 2178975 426177
11133D26177j073119L80872L01841R52527Q71870p19426n79092j204824m06226
$$ 426177 -646942 -266070 35771 988298 1860168 1140742 561650 -643174 -1049400
11124a049400M35697M83492r0972p23050j84558j02104J67914J95245m38156J00002
$$ -1049400 -613703 -130211 -221183 -944233 -1128791 -1230895 -1062981 -867736 -1305892 -1205890
11114a205890L17002N64964J356069O54203J15919p52838j058622L41248J309269
$$ -1205890 -888888 -323924 1032145 1686348 1802267 1049429 -9193 332055 1641324
11105A641324J041047M16352K08516r59309j902266j306471k06036k76745q75290
$$ 1641324 2682371 3098723 3307239 2347930 445664 -860807 -1066843 -1343588 -2218878
11096b218878o30556L83213R48985N62615K69077K60573Q14049K12327k32297
$$ -2218878 -2849434 -2466221 -1517236 -954621 -685544 -424971 389078 601405 369108
11087C69108N13310M6764J1952M83570p30729j258804N59488J150817J265862
$$ 369108 882418 929182 941134 1424704 693975 -564829 -5341 1145476 2411338
11078B411338J94483K15445L24885m9580l03428j003808O9551q3796K100j12036
$$ 2411338 2605821 2821266 3146151 3096571 2793143 1789335 1858886 1775090 1777190 1665154
11068A665154o42376j675956r67949N65302O47499j57390M19597J320979J208074
$$ 1665154 1022778 -653178 -1621127 -1055825 -408326 -565716 -146119 1174860 2382934
11059B382934l46213n45986o71607j168216K96079M10396l34421N70628Q53075
$$ 2382934 2036721 1490735 819128 -349088 -53009 357387 22966 593594 1446669
11050A446669J36396o43673l26350k94412l16439m29609m43551r6244l68364Q28960
$$ 1446669 1583065 939392 613042 318630 2191 -427418 -870969 -967213 -1335577 -506617
11040e06617J437577J287792P16665k23624k14165K5469p82632j353689j85470
$$ -506617 930960 2218752 2935417 2711793 2497628 2523097 1740465 386776 201306
11031B01306M69449M72981k45393j4036M54645q30438j038918M6520J231555l537
$$ 201306 670755 1143736 898343 884307 1338952 508514 -530404 -483884 747671 744134
11021G44134m77130j28346k22300J42944J58367m07745l91730K38449l75911K4097
$$ 744134 267004 138658 -83642 59302 217669 -190076 -581806 -343357 -719268 -695171
11011f95171O14978M92593P68044N63021n76967m46762J40236Q30398j17696r88985
$$ -695171 -80193 412400 1180444 1743465 1166498 719736 859972 1690370 1572674 583689
11001E83689k3823l26570N61294J026615Q07675J33960j62113n75369j033383
$$ 583689 559866 233296 794590 1821205 2628880 2762840 2600727 2025358 991975
10992I91975j207163L46061P05315O2598K47639k02591m91114j794163j53316
$$ 991975 -215188 130873 836188 898786 1146425 943834 452720 -1341443 -1494759
10983a494759P30523j64249M9218j70052M75422M55548J49922o77184j556264
$$ -1494759 -764236 -928485 -879267 -1049319 -573897 -118349 31573 -645611 -2201875
10974b201875o45148J106130J710444K6598j553737j039837l14216J217318J193133
$$ -2201875 -2847023 -1740893 -30449 -3851 -1557588 -2597425 -2911641 -1694323 -501190
10965e01190r4259r73159j000247m85878k78670O86360J219408Q74409Q31382
$$ -501190 -595449 -1568608 -2568855 -3054733 -3333403 -2647043 -1427635 -553226 278156
10956B78156L32289N92438j98434p49850J49343L99708O36974J69316J90419j71223
$$ 278156 610445 1202883 1004449 254599 403942 803650 1440624 1609940 1800359 1629136
10946A629136J92139j295801r70859O01036J115663R54004R51452K02410j176392
$$ 1629136 1821275 525474 -445385 155651 1271314 2225318 3176770 3379180 2202788
10937B202788j519146j038974j17366k29768j068432j4499J213796K67907n91380
$$ 2202788 683642 -355332 -472698 -702466 -1770898 -1785397 -571601 -303694 -895074
10928h95074J73749J224670M27284K25301L01717j249862j397436q33327j418678
$$ -895074 -721325 503345 930629 1155930 1457647 207785 -1189651 -2022978 -3441656
10919c441656r72195J019231P86894m4305M65245Q28548O63883L41485l4692m32101
$$ -3441656 -4413851 -3394620 -2607726 -2652031 -2186786 -1358238 -694355 -352870 -387562 -819663
10909h19663K02386K66332k73888o65332n53008j83005P27202R88529O63705P11941
$$ -819663 -617277 -350945 -624833 -1290165 -1843173 -2026178 -1298976 -310447 353258 1065199
10899A065199M95077o860m90917m83759K2808m89907j72614K55428j248636j718118
$$ 1065199 1560276 1553416 1062499 578740 601548 111641 -60973 194455 -1054181 -2772299
10889b772299J4581J238320J641826L04708m14141J91152o05656l22896N99880
$$ -2772299 -2757718 -1519398 122428 427136 12995 204147 -401509 -724405 -124525
10880a24525J72759N99209O47870O8272r72908j079656P3478P1100N0107N38526
$$ -124525 48234 647443 1295313 1363585 390677 -688979 -615501 -544401 -494294 44232
10870D4232j16055P40308P32836J132578O01386p30485j062570p26885K23848
$$ 44232 -71823 668485 1401321 2533899 3135285 2404800 1342230 615345 839193
10861H39193l09260j125509M00830R90484j94601K04181N08693p18205N4012l78895
$$ 839193 529933 -595576 -194746 795738 601137 805318 1314011 595806 649818 270923
10851B70923m56832K49302o84792r99600R37381J511688n19040q1500K0039j322080
$$ 270923 -185909 63393 -621399 -1620999 -683618 828070 309030 227530 247569 -1074511
10841a074511j223779l54910Q1306J70299J06220P66359J083097R68559J77805
$$ -1074511 -2298290 -2653200 -2571894 -2401595 -2295375 -1529016 -445919 522640 700445
10832G00445n20310r81434j6292K60451l94432p78964r33427n83579m32007L19945
$$ 700445 180135 -801299 -817591 -557140 -951572 -1730536 -2663963 -3247542 -3679549 -3359604
10822c359604K78282N92531J818809K39140o15586N06664N95545K11443O10703
$$ -3359604 -3081322 -2488791 -669982 -430842 -1046428 -539764 55781 267224 877927
10813H77927K81057j27883M43424o9417R1335J344398k15431j115630r00082n85271
$$ 877927 1158984 1031101 1474525 1405108 1496443 2840841 2625410 1509780 609698 24427
10803B4427O74918P48521J345658o450j236646k23981J41114j14785N13407L98946
$$ 24427 699345 1447866 2793524 2787074 1550428 1326447 1467561 1352776 1866183 2265129
10793B265129j09317p22220q23630n91047j40589J22669N75398M18175L6731M14365
$$ 2265129 2155812 1433592 609962 18915 -121674 995 576393 994568 1031299 1445664
10783A445664J140390O63867K21248k88458j79449q54365j130770n70554k47018
$$ 1445664 2586054 3249921 3471169 3182711 3003262 2148897 1018127 447573 200555
10774B00555K06499K75336j52599J75869J159397J098255M02307n456r49445j365500
$$ 200555 407054 682390 529791 705660 1865057 2963312 3365619 3360163 2410718 1045218
10764A045218l07480N7565M09564N60218K59472r32614o98323M99370J30843r75368
$$ 1045218 737738 795303 1204867 1765085 2024557 1091943 393620 892990 1023833 48465
10754D8465M6003k75741k90158J71803N55418l39891L38971J132716j214130q74521
$$ 48465 94468 -181273 -471431 -299628 255790 -84101 254870 1387586 173456 -701065
10744g01065J55586n64596O59531J817078J16615k127371j788510M72589J629868
$$ -701065 -545479 -1110075 -450544 1366534 1483149 -644222 -2432732 -1960143 -330275
10735c30275M5994L00799O20115J88854r13909r80694m23940k61157J21994J157620
$$ -330275 -284281 16518 636633 825487 -88422 -1069116 -1493056 -1754213 -1632219 -474599
10725d74599Q56185r49125l79581K05160K77624M46989J151343J302423M18548
$$ -474599 381586 -567539 -947120 -741960 -464336 -17347 1133996 2436419 2854967
10716B854967m27327q65235L05625M0686N07584q8657j194365q30025o58842r402
$$ 2854967 2427640 1562405 1868030 1908716 2416300 2327643 1133278 303253 -355589 -364991
10706c64991N20897L03677K41719q81694j257642q04866m28492l43100J33104
$$ -364991 155906 459583 701302 -180392 -1438034 -2242900 -2671392 -3014492 -2881388
10697b881388L19039Q43388N58126Q79285K68947j97224j01089K40927Q94958
$$ -2881388 -2562349 -1718961 -1160835 -281550 -12603 -209827 -310916 -69989 824969
10688H24969P78636q1382o34246o76326q02652m10151L33426L06888l43301n1956
$$ 824969 1603605 1522223 887977 211651 -591001 -1001152 -667726 -360838 -704139 -756095
10678g56095N13669J171517q1501j49319k06125r2541O8985k00670l00565q63332
$$ -756095 -242426 929091 847590 698271 492146 399605 468590 267920 -32645 -895977
10668h95977o11429J21907M86605J631629R93486J30334n06881j85315M4944k06068
$$ -895977 -1507406 -1385499 -898894 732735 1726221 1856555 1349674 1164359 1209303 1003235
10658A003235j272816o79761n1414P80257J572563k57337j582649m47768Q83499
$$ 1003235 -269581 -949342 -1000756 -220499 1352064 1094727 -487922 -935690 -52191
10649e2191M10519k00451o63083j043838M10905J111897l24944Q30408J861246
$$ -52191 358328 157877 -505206 -1549044 -1138139 -26242 -351186 479222 2340468
10640B340468O03477j48020m92137k11475l49615J041269J274018o65664k040178
$$ 2340468 2943945 2795925 2303788 2092313 1742698 2783967 4057985 3392321 1352143
10631A352143j928966K4043L45797r32979p07217J33881J02596M26664l32996
$$ 1352143 -576823 -552780 -206983 -1139962 -1847179 -1713298 -1610702 -1184038 -1517034
10622a517034q95524N54520R70835J47284k68576N3433J86362Q7862K72518j076439
$$ -1517034 -2412558 -1858038 -887203 -739919 -1008495 -955062 -768700 -680838 -408320 -1484759
10612a484759j089904R10464J429804J015821n5754p79505j040613j045550r17787
$$ -1484759 -2574663 -1664199 -234395 781426 725672 -53833 -1094446 -2139996 -3057783
10603c057783k55408O22899P11195O39366N86116R49948j15545n82809Q6810j388289
$$ -3057783 -3313191 -2690292 -1979097 -1339731 -753615 196333 80788 -502021 -415211 -1803500
10593a803500r95829M31868O63259J497525R38036j53562j0169m31028n50880
$$ -1803500 -2799329 -2367461 -1704202 -206677 731359 577797 567628 136600 -414280
10584d14280n23277k96874j84008L62422Q66220n1611m58271m48905L10086J480475
$$ -414280 -937557 -1234431 -1418439 -1056017 -189797 -241408 -699679 -1148584 -838498 641977
10574F41977L37774j271837j936987j050645O03768K00619M34317Q64190p7933
$$ 641977 979751 -292086 -2229073 -3279718 -2675950 -2475331 -2041014 -1176824 -1254757
10565a254757n04690M4817N04163J054305J370307P34799j49939k21265j28235
$$ -1254757 -1759447 -1714630 -1210467 -156162 1214145 1948944 1799005 1577740 1449505
10556A449505O18278R00674M3468P941j611130j387294K14255Q66026J023777
$$ 1449505 2067783 2968457 3011925 3019866 1408736 21442 235697 1101723 2125500
10547B125500K65884j496173j430354j80918M20101N34687k80483l95587l43306
$$ 2125500 2391384 895211 -535143 -716061 -295960 238727 -41756 -437343 -780649
10538g80649j42092n59633l29532M48695L48319K77271l076p18826m18125N35184
$$ -780649 -922741 -1482374 -1811906 -1363211 -1014892 -737621 -740697 -1459523 -1877648 -1342464
10528a342464J1312P90383J401581L36065K38396J8854o97330o47762L87288R53411
$$ -1342464 -1331152 -540769 860812 1196877 1435273 1454127 756797 109035 496323 1449734
10518A449734o84387j437724q11976m41206j99518N14864J613358J914003R8285
$$ 1449734 765347 -672377 -1484353 -1925559 -2125077 -1610213 3145 1917148 2015433
10509B015433j09039N3062q24116j008943o41283N10301Q64783J057487r09863
$$ 2015433 1906394 1959456 1135340 126397 -514886 -4585 860198 1917685 1007822
10500A007822j384921j233304l00614J073634J376533R09424K5724j81821j52856
$$ 1007822 -377099 -1610403 -1911017 -837383 539150 1448574 1474298 1292477 1139621
10491A139621m49770q20183o63489J87502P58210N18260J58543L08359j79675
$$ 1139621 689851 -130332 -793821 -606319 151891 670151 828694 1137053 957378
10482I57378p60068m23210o3710m90461p82477j357859r0542M29580k21719P0533
$$ 957378 197310 -225900 -289610 -780071 -1562548 -2920407 -3010949 -2581369 -2803088 -2732555
10472b732555J486575P40591j180978r34283r16660k37344J062937J879695J327702
$$ -2732555 -1245980 -505389 -1686367 -2620650 -3537310 -3774654 -2711717 -832022 495680
10463D95680j9368Q6457L92431J19307k94882K79956N03544Q89577J530554j15156
$$ 495680 476312 562769 955200 1074507 779625 1059581 1563125 2452702 3983256 3868100
10453C868100j482464o12430j72987M40261l51747q27852J6433j459439j130435
$$ 3868100 2385636 1773206 1600219 2040480 1688733 860881 877314 -582125 -1712560
10444a712560Q4796J40726J87997K12175k26529j8864O92627L62963K10198O6397
$$ -1712560 -1627764 -1487038 -1299041 -1086866 -1313395 -1332259 -639632 -276669 -66471 -74
10434g4j59684N32914Q8428j08176J16483l5361n8909p28624j245287n15233j23731
$$ -74 -159758 373156 461584 353408 469891 434530 375621 -353003 -1598290 -2113523 -2237254
10423b237254J93675J61945j75566M64756J131197m72961p98635M76246J203575
$$ -2237254 -2043579 -1881634 -2057200 -1592444 -461247 -934208 -1732843 -1256597 -53022
10414e3022m8384m80211o62686r64844n4157J478973J106434o62778m50178Q8761
$$ -53022 -101406 -581617 -1244303 -2209147 -2263304 -784331 322103 -340675 -790853 -702092
10404g02092o49317L01223J743178Q14820l76146o95961l06344j90674M35539
$$ -702092 -1351409 -1050186 692992 1507812 1131666 435705 129361 -61313 374226
10395C74226k02579p0998j44648Q66447J339363l54991n96082j077672o06211
$$ 374226 171647 100649 -43999 822448 2161811 1806820 1210738 133066 -473145
10386d73145N64451N97805n3853l30833n89158n41958j60467k88283O90935J242070
$$ -473145 91306 689111 635258 304425 -284733 -826691 -987158 -1275441 -584506 657564
10376F57564J246780q091m25758o68718l9036j63383n96669j96988j17208J67495
$$ 657564 1904344 1896253 1470495 801777 762741 599358 2689 -194299 -311507 -144012
10366a44012o23599p6652J455160Q61024N31201N703p72014j064662j404754o86749
$$ -144012 -767611 -844263 610897 1471921 2003122 2008825 1236811 172149 -1232605 -1919354
10356a919354j88250p32970n33561Q18093N69370k69492k16852J422825J526925
$$ -1919354 -2107604 -2840574 -3374135 -2556042 -1986672 -2256164 -2473016 -1050191 476734
10347D76734Q47336M85681p84486l88340J971j444080p82428P87039Q81487L39967
$$ 476734 1324070 1809751 1025265 636925 638896 -805184 -1587612 -800573 80914 420881
10337D20881M08853N91524n23024m21802l49698n55129K33179k77885P14442r7764
$$ 420881 829734 1421258 898234 476432 126734 -428395 -195216 -473101 241341 143577
10327A43577j186737p88610j14993J394539R69603j53154L07259N89986J56125
$$ 143577 -1043160 -1831770 -1946763 -552224 417379 264225 571484 1161470 1317595
10318A317595j087081R4616J645878J889794N7204m46852m11229j445959j454911
$$ 1317595 230514 325130 1971008 3860802 3918006 3471154 3059925 1613966 159055
10309A59055n86192N71479J185548K69485j021545l66358N34685N69481O00308
$$ 159055 -427137 144342 1329890 1599375 577830 211472 746157 1315638 1915946
10300A915946O12270J61630p08386l81126m12773r98495n42556k14113K01922
$$ 1915946 2528216 2689846 1981460 1600334 1187561 189066 -353490 -567603 -365681
10291c65681o22297K06756J36795R11001L06157l87806K54919Q11956k11166k01720
$$ -365681 -987978 -781222 -644427 266574 572731 184925 439844 1251800 1040634 838914
10281H38914K05319J86112R28476m18028j193515m18750o87189j047030n94601
$$ 838914 1044233 1230345 2158821 1740793 547278 128528 -558661 -1605691 -2200292
10272b200292M2482j54439L92473N27240Q09618P26635j1129k75666p61718q31840
$$ -2200292 -2157810 -2312249 -1919776 -1392536 -582918 143717 132588 -143078 -904796 -1736636
10262a736636l48666P45644R80345J070361K29071k77107j103095p22465p2268
$$ -1736636 -2085302 -1339658 -359313 711048 940119 663012 -440083 -1162548 -1234816
10253a234816N14298P40957J84762J43740o06498j351340P1290J277241J127233
$$ -1234816 -720518 20439 205201 348941 -257557 -1608897 -1537607 -260366 866867
10244H66867L51559j71874k19107N44957j53602m76375M87115K04680J20315j36624
$$ 866867 1218426 1046552 827445 1372402 1218800 742425 1229540 1434220 1554535 1417911
10234A417911M2083j263843q56107L09901r00557o35818R46651K471676J676718
$$ 1417911 1459994 196151 -659956 -350055 -1250612 -1886430 -939779 1531897 3208615
10225C208615k60324r52878k69951r90713n85217K64533o82745p23273o84121
$$ 3208615 2948291 1995413 1725462 734749 149532 414065 -268680 -991953 -1676074
10216a676074l52915K33417R29393J80566p79606m12169o33146k00651l1858K55378
$$ -1676074 -2028989 -1795572 -866179 -685613 -1465219 -1877388 -2510534 -2711185 -2743043 -2487665
10206b487665L12930M82245L07655K91474J167917J85720j38162R5284m41411
$$ -2487665 -2174735 -1692490 -1384835 -1093361 74556 260276 122114 217398 -224013
10197b24013K62565M78796M87478m26557K83050J895550J045921o05361j728653
$$ -224013 38552 517348 1004826 578269 861319 2756869 3802790 3197429 1468776
10188A468776j312068p93928K04330O46959L38778m14318K81710L31605K85884
$$ 1468776 156708 -637220 -432890 214069 552847 138529 420239 751844 1037728
10179A037728J65129j27501J40823J4119n10104j18716p71713J88717O02795m87282
$$ 1037728 1202857 1075356 1216179 1230298 720194 601478 -170235 18482 621277 133995
10169A33995n48760J86761N61532j096037k116643j123118p04494Q22422J130480
$$ 133995 -414765 -228004 333528 -762509 -2879152 -4002270 -4706764 -3884342 -2753862
10160b753862P22802J274699K94455M50463j24942m63148K00701K78769j34575
$$ -2753862 -2031060 -756361 -461906 -11443 -136385 -599533 -398832 -120063 -254638
10151b54638q6461n33321j340068j437943o53113K00800O16969M70011P5586M58627
$$ -254638 -341099 -874420 -2214488 -3652431 -4305544 -4104744 -3487775 -3017764 -2942178 -2483551
10141b483551J096558m32862j86434J083808J160846N45987J20245Q18257O25543
$$ -2483551 -1386993 -1819855 -2006289 -922481 238365 784352 904597 1722854 2348397
10132B348397K2036O54123j24866m11542Q568L26134l45215n35024J7021o37715
$$ 2348397 2370433 3024556 2899690 2488148 2496716 2822850 2477635 1942611 1959632 1321917
10122A321917j277820n65758k39954K54870k86120j44527j70114l20436k57166
$$ 1321917 44097 -521661 -761615 -506745 -792865 -937392 -1107506 -1427942 -1685108
10113a685108r06692J20433J211253O22974m57860p54745M60328P60222o51853
$$ -1685108 -2591800 -2471367 -1260114 -637140 -1095000 -1849745 -1389417 -629195 -1281048
$$ [...]
##END NTUPLES=NMR SPECTRUM
##END=
