##TITLE=C13_SL3-DAU(forC13)
 CDCl3, 22300 sc

 26.10.2022
##JCAMPDX= 6.0         $$ Bruker NMR JCAMP-DX V2.0
##DATA TYPE= NMR SPECTRUM
##DATA CLASS= NTUPLES
##ORIGIN= UXNMR, Bruker Analytische Messtechnik GmbH
##OWNER= root
$$ XWIN-NMR		Version 3.5
$$ Thu Oct 27 13:38:05 2022 Russian Standard Time (UT+4h)  she@DPX200
##.OBSERVE FREQUENCY= 50.327896
##.OBSERVE NUCLEUS= ^13C
##.ACQUISITION MODE= SIMULTANEOUS
##.ACQUISITION SCHEME= undefined
##.AVERAGES= 18335
##.DIGITISER RES= 17
##SPECTROMETER/DATA SYSTEM= spect
##.PULSE SEQUENCE= zgpg30
##.SOLVENT NAME= CDCl3
##.SHIFT REFERENCE= (INTERNAL, CDCl3, 0, 222.653)
##AUDIT TRAIL= $$ (NUMBER, WHEN, WHO, WHERE, WHAT)
$$ ##TITLE= Audit trail, XWIN-NMR		Version 3.5
$$ ##JCAMPDX= 5.01
$$ ##ORIGIN= Bruker BioSpin GmbH
$$ ##OWNER= she
$$ F:/spectra/data/she/nmr/c13/1/pdata/1/auditp.txt
$$ ##AUDIT TRAIL=  $$ (NUMBER, WHEN, WHO, WHERE, WHAT)
(   1,<2022-10-27 10:21:49.46 +0400>,<she>,<DPX200>,
      <created by zg, POWCHK disabled, PULCHK disabled
       terminated by command 'halt'
       configuration hash MD5:
       00 E9 B6 7A A2 85 ED C7 34 08 36 98 17 FE 4E 26
       data hash MD5: 32K
       F9 90 65 85 D5 63 54 A5 50 0E A6 2E CD 77 52 3E>)
(   2,<2022-10-27 13:36:10.06 +0400>,<she>,<DPX200>,
      <Start of raw data processing
       efp BC_mod = 2 LB = 1 FT_mod = 6 PKNL = 1 PHC0 = -300.4371 PHC1 = 34.56394 SI = 32K 
       data hash MD5: 32K
       63 7F 24 25 62 39 6D 63 38 CE E5 51 87 9D 31 C3>)
(   3,<2022-10-27 13:36:12.53 +0400>,<she>,<DPX200>,
      <abs ABSG = 5 
       data hash MD5: 32K
       BD 96 E9 A8 C5 1C 7C A1 83 4A AB EA 04 79 E7 C8>)
(   4,<2022-10-27 13:37:01.54 +0400>,<she>,<DPX200>,
      <pk PHC0 = 0.8625188 PHC1 = -5 
       data hash MD5: 32K
       6A 1F AD 65 61 02 BF A2 AF 3B 9D 5A C4 68 5C E0>)
(   5,<2022-10-27 13:37:04.54 +0400>,<she>,<DPX200>,
      <abs ABSG = 5 
       data hash MD5: 32K
       03 0A EF 19 95 ED 75 5C ED 11 E0 C0 BE 22 11 3C>)
$$ ##END=
$$ 
$$ hash MD5
$$ FC BB 95 65 A8 56 59 58 D8 A9 CE F6 57 F6 F2 70
##$RELAX= 
##$RELAX= 
##$RELAX= 
##$RELAX= 
##$RELAX= 
##$RELAX= 
##$RELAX= 
##$RELAX= 
$$ Bruker specific parameters
$$ --------------------------
##$DU= <F:/spectra>
##$EXPNO= 1
##$NAME= <c13>
##$PROCNO= 1
##$TYPE= <nmr>
##$USER= <she>
##$AMP= (0..31)
100 100 100 100 100 100 100 100 100 100 100 100 100 100 100 100 100 100 
100 100 100 100 100 100 100 100 100 100 100 100 100 100 
##$AQSEQ= 0
##$AQ_mod= 1
##$AUNM= <au_zg>
##$AUTOPOS= <>
##$BF1= 50.322709
##$BF2= 200.13
##$BF3= 50.322709
##$BF4= 500.13
##$BF5= 500.13
##$BF6= 500.13
##$BF7= 500.13
##$BF8= 500.13
##$BYTORDA= 1
##$CFDGTYP= 0
##$CFRGTYP= 5
##$CHEMSTR= <none>
##$CNST= (0..31)
1 1 145 1 1 1 1 1 1 1 1 1 1 1 1 1 1 1 1 1 1 1 1 1 1 1 1 1 1 1 1 1 
##$CPDPRG= <waltz16>
##$CPDPRG1= <>
##$CPDPRG2= <waltz16>
##$CPDPRG3= <>
##$CPDPRG4= <mlev>
##$CPDPRG5= <mlev>
##$CPDPRG6= <mlev>
##$CPDPRG7= <mlev>
##$CPDPRG8= <mlev>
##$CPDPRGB= <>
##$CPDPRGT= <>
##$D= (0..31)
$$ [...]
##$SUBNAM4= <"">
##$SUBNAM5= <"">
##$SUBNAM6= <"">
##$SUBNAM7= <"">
##$SUBNAM8= <"">
##$SUBNAM9= <"">
##$SW= 239.972175391363
##$SWIBOX= (0..15)
0 1 3 0 0 0 0 0 0 0 0 0 0 0 0 0 
##$SW_h= 12077.2946859903
##$TD= 32768
##$TD0= 1
##$TE= 0
##$TE2= 300
##$TE3= 300
##$TEG= 300
##$TL= (0..7)
120 120 120 120 120 120 120 120 
##$TP= (0..7)
150 150 150 150 150 150 150 150 
##$TP07= 0
##$TPNAME0= <>
##$TPNAME1= <>
##$TPNAME2= <>
##$TPNAME3= <>
##$TPNAME4= <>
##$TPNAME5= <>
##$TPNAME6= <>
##$TPNAME7= <>
##$TPOAL= (0..7)
0.5 0.5 0.5 0.5 0.5 0.5 0.5 0.5 
##$TPOFFS= (0..7)
0 0 0 0 0 0 0 0 
##$TUNHIN= 0
##$TUNHOUT= 0
##$TUNXOUT= 0
##$USERA1= <user>
##$USERA2= <user>
##$USERA3= <user>
##$USERA4= <user>
##$USERA5= <user>
##$V9= 5
##$VALIST= <valist>
##$VCLIST= <CCCCCCCCCCCCCCC>
##$VD= 0
##$VDLIST= <DDDDDDDDDDDDDDD>
##$VPLIST= <PPPPPPPPPPPPPPP>
##$VTLIST= <TTTTTTTTTTTTTTT>
##$WBST= 1024
##$WBSW= 4
##$XGAIN= (0..3)
0 0 0 0 
##$XL= 0
##$YL= 0
##$YMAX_a= 129812199
##$YMIN_a= -33008103
##$ZGOPTNS= <>
##$ZL1= 120
##$ZL2= 120
##$ZL3= 120
##$ZL4= 120
##$ABSF1= 222.6533
##$ABSF2= -17.34351
##$ABSG= 5
##$ABSL= 3
##$ALPHA= 0
##$AQORDER= 0
##$ASSFAC= 0
##$ASSFACI= 0
##$ASSFACX= 0
##$ASSWID= 0
##$AUNMP= <proc_1d>
##$AZFE= 0.1
##$AZFW= 0.5
##$BCFW= 0
##$BC_mod= 2
##$BYTORDP= 0
##$COROFFS= 0
##$CY= -3
##$DATMOD= 1
##$DC= 0
##$DFILT= <>
##$DTYPP= 0
##$F1P= 0
##$F2P= 0
##$FCOR= 0.5
##$FTSIZE= 32768
##$FT_mod= 6
##$GAMMA= 0
##$GB= 0
##$INTBC= 1
##$INTSCL= 4.134877e-10
##$ISEN= 128
##$LB= 1
##$LEV0= 0
##$LPBIN= 0
##$MAXI= 10000
##$MC2= 0
##$MEAN= 0
##$ME_mod= 0
##$MI= 0.1934396
##$NCOEF= 0
##$NC_proc= 2
##$NLEV= 6
##$NOISF1= 120.0001
##$NOISF2= 80.00006
##$NSP= 0
##$NTH_PI= 0
##$NZP= 0
##$OFFSET= 222.6533
##$PC= 1.4
##$PHC0= -299.5746
##$PHC1= 29.56394
##$PH_mod= 1
##$PKNL= yes
##$PPARMOD= 0
##$PSCAL= 0
##$PSIGN= 0
##$REVERSE= no
##$SF= 50.322730123286
##$SI= 32768
##$SIGF1= 140
##$SIGF2= 120
##$SINO= 11.81781
##$SIOLD= 32768
##$SREGLST= <13C.CDCl3>
##$SSB= 0
##$STSI= 32768
##$STSR= 0
##$SW_p= 12077.2946859903
##$SYMM= 0
##$S_DEV= 0
##$TDeff= 32768
##$TDoff= 0
##$TI= <>
##$TILT= no
##$TM1= 0
##$TM2= 0
##$TOPLEV= 0
##$USERP1= <user>
##$USERP2= <user>
##$USERP3= <user>
##$USERP4= <user>
##$USERP5= <user>
##$WDW= 1
##$XDIM= 32768
##$YMAX_p= 463708389
##$YMIN_p= -2266061
$$ End of Bruker specific parameters
$$ ---------------------------------
##NTUPLES= NMR SPECTRUM
##VAR_NAME=  FREQUENCY,     SPECTRUM/REAL,   SPECTRUM/IMAG
##SYMBOL=    X,             R,               I
##VAR_TYPE=  INDEPENDENT,   DEPENDENT,       DEPENDENT
##VAR_FORM=  AFFN,          ASDF,            ASDF
##VAR_DIM=   32768,         32768,           32768
##UNITS=     HZ,            ARBITRARY UNITS, ARBITRARY UNITS
##FACTOR=    0.368581032318806, 1,           1
##FIRST=     11204.5221812756, 0,            0
##LAST=      -872.772504714734, 0,           0
##MIN=       -872.772504714734, -2266061,    0
##MAX=       11204.5221812756, 463708389,    0
$$ Real data points
##PAGE= N=1
##DATA TABLE= (X++(R..R)), XYDATA
$$ [...]
15857a7129R7954o3623j67539K64752k278J51660Q5573n43569k67699K20518P1278
$$ -17129 80825 17202 -150337 114415 112137 263797 349370 -194199 -461898 -241380 -170102
15846a70102j43522N0712K88075L00562P7972k61727j93556K4688J33249o41183
$$ -170102 -313624 -262912 25163 325725 403697 141970 -51586 -26898 106351 -534832
15836e34832m99066O8690L09640K62862M54785M51742N0687J5521J96587l34048
$$ -534832 -1033898 -965208 -655568 -392706 62079 513821 564508 580029 776616 442568
15826D42568l24962M3426K25911M2713k55848J14679J08019o6410J39556j69932
$$ 442568 117606 161032 386943 429656 173808 288487 396506 330096 469652 299720
15816B99720j02964j67967p8435J82305j50707o7553J91751K98982J79083M29
$$ 299720 196756 28789 -49646 132659 -18048 -85601 106150 405132 584215 584644
15806E84644N8102k84605m74775m61244l22531k5085L08427L52904O3076j44648
$$ 584644 642746 358141 -116634 -577878 -900409 -925494 -617067 -264163 -201087 -345735
15796c45735j41575K34146M97749J08956k6316P5935q3571J37689N6190j72737
$$ -345735 -487310 -253164 244585 353541 327225 403160 319589 457278 513468 340731
15786C40731l05928k75075K57846M28732M8620j36134j3422m2040o2121J05725
$$ 340731 34803 -240272 17574 446306 494926 358792 345370 303330 241209 346934
15776C46934k71693k9668K3092K3506K28750n896r0471J07271L26175J22791m19785
$$ 346934 75241 45573 68665 92171 320921 315025 224554 331825 658000 780791 361006
15765C61006m12083m5531j77440j15665K37668L3676m36818o2758J45782K10799
$$ 361006 -51077 -96608 -274048 -389713 -152045 -118369 -555187 -617945 -472163 -261364
15755b61364O20036K03122m31496o47995l72176K52873O77120M45698J68180k3972
$$ -261364 358672 561794 130298 -517697 -889873 -637000 40120 485818 653998 630026
15745F30026l6871J73453n9483k96234l04752j17648J39769J18403J41475K97069
$$ 630026 593155 766608 707125 410891 106139 -11509 128260 246663 388138 685207
15735F85207M21940j46674n97481l85772l78597m59812j98738K87916L10883j0537
$$ 685207 1107147 960473 362992 -22780 -401377 -861189 -1059927 -772011 -461128 -471665
15725d71665j02594K31013M24688k71319l88526J20706J88599J90682k15515k01925
$$ -471665 -574259 -343246 81442 -189877 -578403 -457697 -269098 -78416 -293931 -495856
15715d95856J33256L64455K04827j61693N64J91212L79677J26794j02720m01751
$$ -495856 -362600 1855 206682 44989 45553 236765 616442 743236 640516 238765
15705B38765m44384K0894Q1646q987l49972n93947P5199J80815l20147J13062
$$ 238765 -205619 -184725 -103079 -112066 -462038 -1055985 -980786 -799971 -1120118 -1007056
15695a007056Q38705P47655M81088o2022p6261j91309j19135q8430l89004j1188
$$ -1007056 -168351 579304 1060392 998370 922109 730800 611665 523235 134231 123043
15685A23043J54231J38748l35248r4610R6235J13831J81577K3773k04506l34844
$$ 123043 277274 416022 80774 -13836 82399 196230 377807 401580 197074 -137770
15675a37770o980j915m5622O9153M46967L29702P6151j72856j93699L31750k26736
$$ -137770 -144750 -146665 -192287 -123134 323833 653535 729686 556830 363131 694881 468145
15664D68145l74597m3086M1143J38133J37171K02625q6412j0104l9778j36696
$$ 468145 93548 50462 91605 229738 366909 569534 483122 473018 433240 296544
15654B96544J33035J16642q5422k46571k86229M9597k3679k93495l64158k72575
$$ 296544 429579 546221 460799 214228 -72001 -22404 -46083 -339578 -703736 -976311
15644i76311L8317P0867K5830K81965M92198O22131M09994k16324l76621l4586
$$ -976311 -937994 -867127 -841297 -559332 -67134 554997 964991 748667 372046 337460
15634C37460K50304q2938k70730l77355k16863J2450l17772k36325L8407j55305
$$ 337460 587764 504826 234096 -143259 -360122 -347672 -665444 -901769 -863362 -1018667
15624a018667o3074K05490N88813N65342K41211J94775K8012k5121J48790J68275
$$ -1018667 -1081741 -876251 -287438 277904 519115 713890 741902 716781 865571 1033846
15614A033846m30136n49051l67849L25086L60426R6762K69998J27536k67431m22926
$$ 1033846 603710 54659 -313190 11896 372322 469084 739082 866618 599187 176261
15604A76261o29146l84963K46742K92109O9235J38547k6299J57625K11742J07655
$$ 176261 -452885 -837848 -591106 -298997 -229762 -91215 -117514 40111 251853 359508
15594C59508J96905L1926l94832J7608j5675o02810q95448l77514J67650L60217
$$ 359508 556413 588339 193507 211115 195440 -407370 -1302818 -1680332 -1512682 -1152465
15584a152465O06276P87955L14988k49635k54464l75200l49095j11878J05763
$$ -1152465 -546189 241766 556754 307119 52655 -322545 -671640 -783518 -677755
15575f77755R8911K23798N0292K72333K72544L89624L59272J22110k54909l49184
$$ -677755 -578844 -355046 -304754 -32421 240123 629747 989019 1111129 856220 507036
15565E07036o1763j39420k23623J6073J36056k07528j12462K23015J52948j38866
$$ 507036 445273 305853 82230 98303 234359 26831 -85631 137384 290332 151466
15555A51466j81258j38407Q7434K10234k07830j38468L9640j38296l5251o1440
$$ 151466 -29792 -168199 -80765 129469 -78361 -216829 -177189 -315485 -350736 -412176
15545d12176l91594l35115m4140K34567K13597L91242L39377j80209q576M23399
$$ -412176 -803770 -1138885 -1183025 -948458 -734861 -343619 -4242 -184451 -193027 230372
15535B30372N59055R6265l11913j42610j03841O773K7393j07021j4283Q7620n3608
$$ 230372 789427 885692 573779 431169 327328 334101 361494 254473 240190 327810 274202
15524B74202l7358J55207J52485l17699o60479m10832m169j9997K72055M21094
$$ 274202 236844 392051 544536 226837 -433642 -844474 -848643 -868640 -596585 -175491
15514a75491N50655M85620P7549k77597m29778k62377j05929M2511J75897M3289
$$ -175491 375164 860784 938333 660736 230958 -31419 -137348 -94837 81060 124349
15504A24349m7840l70656j63725K38802L11792K37435j53737k45190q8882P0050
$$ 124349 76509 -294147 -457872 -219070 92722 330157 176420 -68770 -157652 -87602
15494h7602k86298k50822j04106m7865o4134K85411J06435K7005O3763J47338
$$ -87602 -373900 -624722 -728828 -776693 -840827 -555416 -448981 -421976 -358213 -210875
15484b10875J16140l02644j17373N1812j64921l33345K11739L03487J52111r5645
$$ -210875 -94735 -397379 -514752 -462940 -627861 -961206 -749467 -445980 -293869 -389514
15474c89514j32831J51282N8640j7372P5841K82316M26706k7629J91831P5961
$$ -389514 -522345 -371063 -312423 -329795 -253954 28362 455068 427439 619270 695231
15464F95231j63720l31835m11122j348M82936K72552l0827k49514m86117o73604
$$ 695231 531511 199676 -211446 -212794 270142 542694 511867 262353 -223764 -897368
15454h97368k9537K93767J40145J5039Q3236J73k11184J73439L82459l6967l38488
$$ -897368 -926905 -633138 -492993 -477954 -394718 -394545 -605729 -432290 -49831 -86798 -425286
15443d25286M3362L99792R3240J515K11577K98933O1130k25112j98187n8750j54238
$$ -425286 -381924 17868 111108 112623 324200 623133 684263 459151 260964 202214 47976
15432D7976l32583q0385K77776K30381O771J78464L2196j75572l31152j95912
$$ 47976 -284607 -364992 -87216 143165 149936 328400 360596 185024 -146128 -342040
15422c42040K01222N83073M17142K70515O70596L34319k63696j49611k404k89862
$$ -342040 -140818 442255 859397 1129912 1800508 2134827 1871131 1721520 1719116 1429254
15412A429254j10910k26316k93391k60188m59479m35045l35916N7048Q9511J29447
$$ 1429254 1318344 1092028 798637 538449 78970 -356075 -691991 -634943 -545432 -415985
15402d15985K19201M04011L19336M5042k86575l86378l4601R6447J75978P4367
$$ -415985 -196784 207227 526563 571605 285030 -101348 -135949 -39502 136476 210843
15392B10843j22442j64427j02308J73517L20620R4104N2094O8778J46466p9289
$$ 210843 88401 -76026 -178334 -4817 315803 409907 462001 530779 677245 597956
15382E97956k73774m38068j74919L9941J11641K00500m3746k06559L46269J66588
$$ 597956 324182 -113886 -288805 -248864 -137223 63277 19531 -187028 159241 325829
15372C25829m13722k12165p6007M0154q409p1949k76861K9183L86328L87819R7029
$$ 325829 -87893 -300058 -376065 -335911 -344320 -416269 -693130 -663947 -277619 110200 207229
15361B07229L6271k4722J06609m17809l59461k14103l46544k20303j90317k25964
$$ 207229 243500 218778 325387 -92422 -451883 -665986 -1012530 -1232833 -1423150 -1649114
15351a649114j40637K36495K54751M65370O32396O53271M07648K43100J31437
$$ -1649114 -1789751 -1553256 -1298505 -833135 -200739 452532 860180 1103280 1234717
15342A234717k10314m10216n35752o43412j46257J99352l8498L7589K09387o4314
$$ 1234717 1024403 614187 78435 -564977 -711234 -511882 -550380 -512791 -303404 -367718
15332c67718j65106j54738m09138n8338K20274J86732k35631j71337J59738J93881
$$ -367718 -532824 -687562 -1096700 -1155038 -934764 -748032 -983663 -1155000 -995262 -801381
15322h01381K92j0876l33254J97836O92772K73932K91819L73445J71131r5751
$$ -801381 -801089 -811965 -1145219 -947383 -254611 19321 311140 684585 855716 759965
15312G59965k80138k71869k84607l4578L90370L5451l37531l15931m4246L01845
$$ 759965 479827 207958 -76649 -111227 279143 314594 -22937 -338868 -383114 -81269
15302h1269O02248n0797k82402J39516j3817k40973k88345k79347l93676L83111
$$ -81269 520979 470182 187780 327296 313479 72506 -215839 -495186 -888862 -505751
15292e05751L03547k75293j83676J213K41319L89844K26508j19670J48394L1668
$$ -505751 -202204 -477497 -661173 -659960 -418641 -28797 197711 78041 226435 258103
15282B58103R661o5452N8392q1102o14887l78284k09926p2743j90760R4934M5576
$$ 258103 267764 202312 260704 179602 -435285 -813569 -1023495 -1096238 -1286998 -1192064 -1146488
15271a146488J58333L40624k432k92870j08275M0272K50385L94597N19228N43015
$$ -1146488 -988155 -647531 -649963 -942833 -1051108 -1010836 -760451 -365854 153374 696389
15261F96389m10625m92656k09339K50835L17811J27180j42363l07346O7471P9898
$$ 696389 285764 -206892 -416231 -165396 152415 279595 137232 -170114 -102643 -22745
15251b2745j70347l65589k4486M18974J47791r8570K9344j37793j63024n35046
$$ -22745 -193092 -558681 -583167 -164193 -16402 -114972 -85628 -223421 -386445 -921491
15241i21491j15211M72616N58443J59210o9104m2552r8747l23673l14790l24280
$$ -921491 -1036702 -564086 -5643 153567 84463 41911 -56836 -380509 -695299 -1019579
15231a019579o1733K25951j1070j10173P6362j41407n22649M61561R14003K73900
$$ -1019579 -1081312 -855361 -866431 -976604 -900242 -1041649 -1564298 -1102737 -188734 85166
15221H5166Q8019n8266K3658R0409j66869l99719j52089l6849j40841J9136l64609
$$ 85166 173185 114919 138577 228986 62117 -337602 -489691 -526540 -667381 -648245 -1012854
15210a012854J30572O54850N05950k29957n66388k62694L33970L19160N409K01906
$$ -1012854 -882282 -227432 278518 48561 -517827 -780521 -446551 -127391 -121982 79924
15200G9924l9327l1999K23552L7629k45813j86639J46081L39976J78360j03013
$$ 79924 40597 8598 232150 269779 23966 -162673 -16592 323384 501744 398731
15190C98731l46623J23792L00730j09907j88988o7192J43616L47670K31116J95084
$$ 398731 52108 175900 476630 366723 177735 110543 254159 601829 832945 1028029
15180A028029k65470n15214q5721J30246j09929k66722O6362M9546m25592m22718
$$ 1028029 762559 247345 161624 291870 181941 -84781 -18419 31127 -394465 -817183
15170h17183R9833M5259L6744L23120J53699k50743n0352j39674l5809j22175
$$ -817183 -717350 -672091 -635347 -312227 -158528 -409271 -459623 -599297 -635106 -757281
15160g57281L65000L10915R0898Q8091k18030l18354k07471k15202o0673J43504
$$ -757281 -392281 -81366 9532 97623 -120407 -438761 -646232 -861434 -922107 -778603
15150g78603K11910l6390k34960l37271O8902K87882p6508K96463P10891K04872
$$ -778603 -566693 -603083 -838043 -1175314 -1106412 -818530 -895038 -598575 112316 317188
15140C17188j93087n5683K2503j5602j9147q4468J71790J36244M6998j07450p7743
$$ 317188 124101 68418 90921 75319 56172 -28296 143494 279738 326736 219286 141543
15129A41543k96873k99417j76396J33219q2988k47077j7725J30520Q0821J83626
$$ 141543 -155330 -454747 -631143 -497924 -580912 -827989 -845714 -715194 -634373 -450747
15119d50747M03079L15620K90842K96093O07873J87723m10927m49085k97795m920
$$ -450747 -47668 267952 558794 854887 1462760 1650483 1239556 790471 492676 487756
15109D87756J2526j3923J5038m93252l19947j63356j02934l21797J5798J26778
$$ 487756 500282 486359 501397 8145 -311802 -475158 -578092 -899889 -884091 -757313
15099g57313J75895L37842L25305K07950l73223o90121n3571O22488Q07176L21921
$$ -757313 -581418 -243576 81729 289679 -83544 -773665 -827236 -204748 602428 924349
15089I24349k21969k33602k5899j43878N5390j43569j64832j60100j22839J23867
$$ 924349 702380 468778 442879 299001 354391 210822 45990 -114110 -236949 -113082
15079a13082L28367K84903Q3862k18245k98464L9729J07877m8446k57895J74797
$$ -113082 215285 500188 584050 365805 67341 107070 214947 166501 -91394 83403
15069H3403J1650m49395N6906M11070L60047J93212M12827j86408n53864N3648
$$ 83403 95053 -354342 -297436 113634 473681 666893 1079720 893312 339448 393096
15059C93096P3046l54247l760L46129l8305l51947o60796l56780n1886O0071N08826
$$ 393096 466142 111895 108135 454264 415959 64012 -596784 -953564 -1005450 -945379 -436553
15048d36553L58065J52081J68588O2450p3694j78256k14727L9563R0643l58701
$$ -436553 -78488 73593 242181 304631 230937 52681 -162046 -122483 -31840 -390541
15038c90541j18585L83708L53486K75507K89773p9650k94260K2557O2846r9781
$$ -390541 -509126 -125418 228068 503575 793348 713698 419438 441995 504841 405060
15028D05060q4882P5105q0177r8349K80073M02049j19910j93561k1822J13542
$$ 405060 320178 395283 315106 216757 496830 898879 778969 585408 563586 677128
15018F77128J48347r193k51654n42661m5782N33997O02721K30284j69443o7181
$$ 677128 825475 816282 564628 21967 -23815 510182 1112903 1343187 1173744 1106563
15008A106563j88567m53420m63528p3229J24252J38192n2921J58331j76719n97987
$$ 1106563 917996 464576 1048 -72181 52071 190263 137342 295673 118954 -479033
14998d79033q7045K08693J39740J32047J05465M89997J5762o19818n57933L4920
$$ -479033 -566078 -357385 -217645 -85598 19867 509864 525626 -94192 -652125 -617205
14988f17205M28667J72530K9923K8740N2339n5036q8531K28660K08456N8804R2013
$$ -617205 -188538 -16008 13915 42655 94994 39958 -48573 180087 388543 447347 539360
14977E39360q01k57511m28463k85273o7679K5539j54517K53701L52656L06820
$$ 539360 538559 281048 -147415 -432688 -500367 -474828 -629345 -375644 -22988 283832
14967B83832Q1028p4930m44484n09121k19519J27514L16657J3043J10315J70214
$$ 283832 364860 289930 -154554 -663675 -883194 -755680 -439023 -425980 -315665 -145451
14957a45451J9752k98763n659M21736J37411j18153k34521o7680L7743J0104l5593
$$ -145451 -125699 -424462 -430121 -8385 129026 10873 -223648 -291328 -253585 -243481 -279074
14946b79074M06798N16557j49967n41833Q9548J06814Q3517j23180j32638J12094
$$ -279074 127724 644281 494314 -47519 42029 148843 232360 109180 -23458 88636
14936H8636j33423q240P3145L09722L17131j53381m57197j284L39919j92981k55015
$$ 88636 -44787 -53027 20118 329840 646971 493590 36393 35109 375028 182047 -72968
14925g2968k51027j86151J52864J84837m03726q0592M16252J25662k42218K86500
$$ -72968 -323995 -510146 -357282 -172445 -576171 -656763 -240511 -114849 -357067 -70567
14915g0567M98264P1620n49430o10954l74878K02849O43954J61566j98609j48017
$$ -70567 427697 499317 -50113 -661067 -1035945 -833096 -189142 -27576 -226185 -374202
14905c74202K6046L19600O1614J95267J15703l11191j75083J47124M43211L04710
$$ -374202 -348156 -28556 33058 228325 344028 32837 -142246 4878 448089 752799
14895G52799l1127n7928m43305n28563k71784q3166M27951O84596K1430j17035
$$ 752799 721672 663744 220439 -308124 -579908 -663074 -235123 449473 470903 353868
14885C53868l02448l28509P6060J36966p8358m1418J59959M20457M36051K17159
$$ 353868 51420 -277089 -201029 -64063 -142421 -183839 -23880 396577 832628 1049787
14875A049787J73260j97701k88743n05841m8662M46688N52830K91063k44554l05382
$$ 1049787 1223047 1025346 736603 230762 182100 628788 1181618 1472681 1228127 922745
14865I22745l79734m14437K02103R2641q8723J64667n0857p0871k56544k13631
$$ 922745 543011 128574 330677 423318 334595 499262 448405 377534 120990 -92641
14855i2641o90L22019P61601J9375m69961l75481l67599k00506N018Q9905J41012
$$ -92641 -93331 228688 990289 1009664 539703 164222 -203377 -403883 -398865 -308960 -167948
14844a67948L1178l0507J28070j5574k91034n17719l13932k9405J74637J08760
$$ -167948 -136770 -167277 -39207 -54781 -345815 -863534 -1177466 -1206871 -1032234 -923474
14834i23474j82875j89432J07846L24410M78199M61798J35735m7539J5681K8182
$$ -923474 -1106349 -1295781 -1187935 -863525 -385326 76472 212207 164668 180349 208531
14824B08531Q7549o2390J49113J55106j32078q4077j74737m7829L63566N8066
$$ 208531 296080 233690 382803 537909 405831 321754 147017 99188 462754 520820
14814E20820n06103m88174j62149J05962K33880J52044j04385m7888l22P0945
$$ 520820 14717 -473457 -635606 -529644 -295764 -143720 -248105 -295993 -296315 -225370
14804b25370K9883L00299K31571l39942k54822K76324L74339j2178j95514k25078
$$ -225370 -195487 104812 336383 -3559 -258381 17943 392282 380104 184590 -40488
14794d0488j26654Q8149J7135J26499j32788m0898J58201k69705o93506j87090
$$ -40488 -167142 -78993 -61858 64641 -68147 -109045 49156 -220549 -914055 -1101145
14784a101145L30437M58145K81386O7478k1368j61817j91102l6632J0873j00388
$$ -1101145 -770708 -312563 -31177 36301 14933 -146884 -337986 -374618 -363745 -464133
14774d64133m7194J86883J39275j65980l73130l06364j82913j40946j06177J94593
$$ -464133 -511327 -324444 -185169 -351149 -724279 -1030643 -1213556 -1354502 -1460679 -1266086
14764a266086K79836O31493N72206K23135k30433j02269P1935j49176l38993k28217
$$ -1266086 -986250 -354757 217449 440584 210151 107882 179817 30641 -308352 -536569
14754e36569K61209M07540R4454q7819n9184j27519M4351j20458j64391J00279
$$ -536569 -275360 132180 226634 138815 79631 -47888 -3537 -123995 -288386 -188107
14744a88107q8153k2496J23839k3018M5713L60529J15662o8039l60103l47817
$$ -188107 -276260 -298756 -174917 -197935 -152222 208307 323969 255930 -104173 -451990
14734d51990k66251K1737K84174R8883L44967K31863j2218l39876k30459m2394
$$ -451990 -718241 -696504 -412330 -313447 31520 263383 251165 -88711 -319170 -361564
14724c61564j23380j9953K77141L33857L49162j77968p39084O485M00421J72544
$$ -361564 -484944 -504897 -227756 106101 455263 277295 -461789 -455304 -54883 117661
14714A17661l60880m61452k31404O72463R37502M02272j69339m56360k61649L3244
$$ 117661 -243219 -704671 -936075 -263612 673890 1076162 906823 450463 188814 222058
14704B22058J9556j4810p3599j44170m37384n22832J46033L36571K63557J93688
$$ 222058 241614 226804 153205 9035 -428349 -951181 -805148 -468577 -205020 -11332
14694a1332K58942O6955j43686J65925J6248Q108J61892j97439J5051l26067o79378
$$ -11332 247610 314565 170879 336804 353052 361160 523052 325613 340664 14597 -664781
14683f64781n84872j43911j04340K09354O12362O33275K0263k26030l8439J56128
$$ -664781 -1249653 -1393564 -1497904 -1288550 -676188 -42913 -22650 -248680 -287119 -130991
14673a30991j23306n44751j04192N13556L29973K28070M49604L26934K42746J34641
$$ -130991 -254297 -799048 -903240 -389684 -59711 168359 617963 944897 1187643 1322284
14663A322284j81665m86837l46601j16373L14423L45778L2537J6069k80247k50983
$$ 1322284 1140619 653782 307181 190808 505231 851009 883546 899615 619368 368385
14653C68385l12521k62236k0377o0387K20977K59464J32782N41114K90777l64730
$$ 368385 55864 -206372 -226749 -287136 -66159 193305 326087 867201 1157978 793248
14643G93248l84705j60948K8364K28801j5823l78929l31404m1976k27228l17997
$$ 793248 408543 247595 275959 504760 488937 110008 -221396 -263372 -490600 -808597
14633h08597p2492m09400k06591K52709R6899j20302L59771L35107K02100J65334
$$ -808597 -881089 -1290489 -1497080 -1244371 -1147472 -1267774 -908003 -572896 -370796 -205462
14623b05462J12089j60563j73859j79361k53924K39806L60228j43623k68329m03560
$$ -205462 -93373 -253936 -427795 -607156 -861080 -621274 -261046 -404669 -672998 -1076558
14613a076558j79122K20651K24368L02145L41978P5201p0022Q3826l83572o8826
$$ -1076558 -1255680 -1035029 -810661 -508516 -166538 -91337 -161359 -77533 -461105 -529931
14603e29931M9648J30156J13751k52228j16730R2786J70030m2404J27262K26776
$$ -529931 -480283 -350127 -236376 -488604 -605334 -512548 -342518 -384922 -257660 -30884
14593c0884j32046j99833m32558R2458M55906j72223O1746k9194k28811k32701
$$ -30884 -162930 -362763 -795321 -702863 -246957 -419180 -357434 -386628 -615439 -848140
14583h48140m9003K72081K73533M40059J68988J1303j84680J80331M39506k47481
$$ -848140 -897143 -625062 -351529 88530 257518 268821 84141 264472 703978 456497
14573D56497l95810l22948l83161R2037J93156l01785J5930J74722K52294K58559
$$ 456497 60687 -262261 -645422 -553385 -360229 -662014 -646084 -471362 -219068 39491
14563C9491M1557m92767n39584l35572k76933M572L96524N61637L87621k29963
$$ 39491 81048 -411719 -951303 -1286875 -1563808 -1559236 -1162712 -601075 -213454 -443417
14553d43417l03443j11086J71903J55433l7973p1707r6043R7543K87721K34326
$$ -443417 -746860 -857946 -686043 -530610 -568583 -640290 -736333 -638790 -351069 -116743
14543a16743O5999j20311j35121J54901N12193m3651l72088j24955J16933L04015
$$ -116743 -50744 -171055 -306176 -151275 360918 317267 -54821 -179776 -62843 241172
14533B41172R6429l81866m44117j6343J32654K18704J11419J21430J48368m07401
$$ 241172 337601 -44265 -488382 -504725 -372071 -153367 -41948 79482 227850 -179551
14523a79551n48576N7755J58450J24212P4089j09952K09332K55846o8143K57439
$$ -179551 -728127 -670372 -511922 -387710 -313621 -423573 -214241 41605 -26538 230901
14513B30901L73860J09850L52288J55246m44732k88855M1942K92708j34645k66392
$$ 230901 604761 714611 1066899 1222145 777413 488558 530500 823208 688563 422171
14503D22171J08515J38339P5274k11883l44712J35135p7032J62218J88873m15221
$$ 422171 530686 669025 744299 532416 187704 322839 245807 408025 596898 181677
14493A81677p43347k87600J22798N93007K15386M1309j29514j41930k5888j77
$$ 181677 -561670 -849270 -726472 -133465 81921 123230 -6284 -148214 -174102 -174279
14483a74279J04499K56776j27015l44821J27083K84987m5966J2627N27243J76855
$$ -174279 -69780 186996 59981 -284840 -157757 127230 81264 93891 621134 797989
14473G97989R504j54093j72681O7463l34262n05897j95722J366N42780Q09289
$$ 797989 807493 653400 480719 548182 213920 -291977 -487699 -486333 56447 865736
14463H65736N21581r2247n52317l69498n0664k78506m68717k28782K53367L91722
$$ 865736 1387317 1295070 742753 373255 322591 44085 -424632 -653414 -400047 -8325
14453h325j01386J88603M10660K84888K23590k34415o39117M3577K59966j21502
$$ -8325 -109711 78892 489552 774440 998030 763615 124498 168075 428041 306539
14443C06539j2276L4674l55408k98462P7971P7347L48474K05772k48103o04110
$$ 306539 294263 328937 -26471 -324933 -246962 -169615 178859 384631 136528 -467582
14433d67582m31347N5815J64980L4835J61079L00570K39202P2302J01323j8579
$$ -467582 -898929 -843114 -678134 -643299 -482220 -181650 57552 129854 231177 212598
14423B12598K06561J89232m2347J72779P0372k22384l79124n95443j90982j2719
$$ 212598 419159 608391 566044 738823 809195 586811 207687 -387756 -578738 -591457
14413e91457j45133J44286J73771K99708N51403K06570r8294l19561k30870j0071
$$ -591457 -736590 -592304 -418533 -118825 432578 639148 540854 221293 -9577 -19648
14403a9648J31782Q144J67430J47097n1993l42888j01890M58094K2530n95454
$$ -19648 112134 120278 287708 434805 382812 39924 -61966 396128 418658 -176796
14393a76796o02235M4841L35412J79077Q7036l45086n84622l8500K48927p0655
$$ -176796 -779031 -734190 -398778 -219701 -132665 -477751 -1062373 -1100873 -851946 -922601
14383i22601L04325N07876K93480O9032K03876K69839k27646k25372q8097j46917
$$ -922601 -618276 -110400 183080 252112 455988 725827 498181 272809 184712 37795
14373C7795k05769j94013M2657K28161J78616M81331O56728m451o71652o22099
$$ 37795 -167974 -361987 -319330 -91169 87447 568778 1225506 1221055 549403 -72696
14363g2696k28714j5625J28447L71595J00960P0071J97664o5757j10827k23846
$$ -72696 -301410 -317035 -188588 183007 283967 354038 551702 485945 375118 151272
14353A51272J99519L04695l7956k33502j72194m0320R645p2246o8235K76434K85944
$$ 151272 350791 655486 617530 384028 211834 171514 181159 108913 40678 317112 603056
14342F03056K9177k97235j83112J81550L06263J0416K29055l8139m26586n21519
$$ 603056 632233 334998 151886 333436 639699 650115 879170 841031 414445 -107074
14332a07074k52149L07683K80998l46241l3754L07623J91203q1445k60851j66522
$$ -107074 -359223 -51540 229458 -116783 -150537 157086 348289 266844 5993 -160529
14322a60529K54903j03896j39438j44814k08768J22707j64643k23761k3280L50345
$$ -160529 94374 -9522 -148960 -293774 -502542 -379835 -544478 -768239 -791519 -441174
14312d41174O31289J83241j27643M8728l74906o86332n13746J69045M57957K20415
$$ -441174 190115 373356 245713 294441 -80465 -766797 -1280543 -1111498 -653541 -433126
14302d33126K29198M80122J09867j97020J47380J7431k22530q3792K95306J04760
$$ -433126 -203928 276194 386061 189041 336421 353852 131322 47530 342836 447596
14292D47596j01831o7410Q6450J01664J57002M6662j87951j84384k65359K6724
$$ 447596 345765 278355 364805 466469 623471 670133 482182 297798 32439 59163
14282E9163L90207L14513M7923p6745k04759k62445m28177l55710P8011L52682
$$ 59163 449370 763883 811806 735061 530302 267857 -160320 -516030 -438019 -85337
14272h5337L54851K33137p5442m89409k56289J39290J28738L01957Q6195j64755
$$ -85337 269514 502651 427209 -62200 -318489 -179199 -50461 251496 337691 172936
14262A72936k87074O7759p6826j0357O2090q5034k11847k05391p6710L87002J76174
$$ 172936 -114138 -46379 -123205 -133562 -71472 -156506 -368353 -573744 -650454 -263452 -87278
14251h7278k05640j39410O5507K7762q555n0380O884R6847p6538J43673K29734
$$ -87278 -292918 -432328 -366821 -339059 -347614 -397994 -391110 -294263 -370801 -227128 2606
14240B606Q4882j07267j0673L92128K16167j52620j33758O0512K75102J17077
$$ 2606 87488 -19779 -30452 361676 577843 425223 291465 351977 627079 744156
14230G44156J83709K9824j27367k00588m9661K37075m6551l00163k34502L7851
$$ 744156 927865 957689 830322 629734 580073 817148 770597 470434 235932 273783
14220B73783J36874p725l89396m26449j30903m453J19725J76271j00567r4926
$$ 273783 410657 402932 13536 -412913 -543816 -548269 -428544 -252273 -352840 -447766
14210d47766M0392n3728J42054j87599l96583n2709L01108L39682j82488r2318
$$ -447766 -407374 -461102 -319048 -506647 -903230 -955939 -654831 -315149 -497637 -589955
14200e89955L8836j18369m59706j69672O77786O18758J89459K6405J18874L6028
$$ -589955 -551119 -669488 -1129194 -1298866 -621080 -2322 187137 213542 332416 368444
14190C68444r6436l45380l04517k03769J12828K68409J77691r2992k91474k07816
$$ 368444 272008 -73372 -377889 -581658 -468830 -200421 -22730 -115722 -407196 -615012
14180f15012k5020K72734L84503j15533o03943k96929O1442O42715M37626j85934
$$ -615012 -640032 -367298 17205 -98328 -702271 -999200 -937758 -295043 142583 -43351
14170d3351j67402q2743j17694j62708l77020k47615k79281K93098L19927N04001
$$ -43351 -210753 -293496 -411190 -573898 -950918 -1198533 -1477814 -1184716 -864789 -360788
14160c60788N67933j03652j66971J11672O441L5512L50444L946l07023m2143K50056
$$ -360788 207145 103493 -63478 48194 54635 90147 440591 444537 137514 95371 345427
14149C45427J03789k55266k81076k71773j53751M3281N3171J98829K89707J26572
$$ 345427 449216 193950 -87126 -358899 -512650 -469369 -416198 -217369 72338 198910
14139A98910k2250J08557k39212l06923k15487j49605P7295O93821P03148l7995
$$ 198910 176660 285217 46005 -260918 -476405 -626010 -548715 145106 848254 810259
14129H10259l43980k05405K3737q4723J3652J31046N13615N85343q3361j67946
$$ 810259 466279 260874 284611 199888 213540 344586 858201 1443544 1360183 1192237
14119A192237l26169m70753l51102m988L04317J35010J49966L57210J53090k15249
$$ 1192237 866068 395315 44213 39225 343542 478552 628518 985728 1138818 923569
14109I23569O470P6926J34300L64746O52607M51256P69229M78689R7108N3516
$$ 923569 930039 1006965 1141265 1506011 2158618 2609874 3379103 3857792 3954900 4008416
14099D008416l94072m64742l09530n97977p67011L9067j60679m64387k16395l22656
$$ 4008416 3614344 3149602 2840072 2242095 1475084 1514151 1353472 889085 672690 350034
14089C50034j91304M4939k87030k44746j51702J89316K42054j90760m47044k35163
$$ 350034 158730 203669 -83361 -328107 -479809 -290493 -48439 -239199 -686243 -921406
14079i21406L12425L6644k3364M22035o9461k06169l0118j1516n4012J30097K5665
$$ -921406 -608981 -572337 -595701 -173666 -243127 -449296 -479414 -490930 -544942 -414845 -389180
14068c89180N5233r10k57386k64510q4037J11031N47178P46769M45553o6871m55033
$$ -389180 -333947 -334857 -592243 -856753 -940790 -829759 -282581 464188 909741 842870 387837
14057C87837m35756l56183m43541n9248N24944N76913L21778l65971l18505J58888
$$ 387837 -47919 -404102 -847643 -906891 -381947 194966 516744 150773 -167732 -8844
14047h844M33574K47049m4079j93034k28684j39972l94259k27541L28918M28727
$$ -8844 424730 671779 627700 434666 205982 66010 -328249 -555790 -226872 201855
14037B01855K17887J7696j87239k38163l04693l29597O2954K73066K47132J30526
$$ 201855 419742 437438 250199 12036 -292657 -622254 -559300 -286234 -39102 91424
14027I1424j00375l31618k20961K14688P32959N80534J99350r2927m68589m08995
$$ 91424 -8951 -340569 -561530 -346842 386117 966651 1166001 1073074 604485 195490
14017A95490j2603J23585K03650M2140j25715l0501M9395j39292l52207n45310
$$ 195490 182887 306472 510122 552262 426547 396046 445441 306149 -46058 -591368
14007e91368k50098j21469n0738K94518M11299M506o6447P73658Q32271K79982
$$ -591368 -841466 -962935 -1013673 -719155 -307856 -303350 -369797 403861 1236132 1516114
13997A516114n6296j51279k85801l68795k92530J31931J02081q0793j68906j09611
$$ 1516114 1459818 1308539 1022738 653943 361413 493344 595425 514632 345726 236115
13987B36115j27623p7316J3772R8466q4270j63039n4050j19084n36705m58533
$$ 236115 108492 31176 44948 143414 59144 -103895 -157945 -277029 -813734 -1272267
13977a272267m6952J92709K09267L83170L9365J46332M36158L2307m52461J08536
$$ -1272267 -1319219 -1126510 -917243 -534073 -494708 -348376 87782 120089 -332372 -223836
13967b23836O36361N48064K1150k23238k86599m82924n07020j53285K08042J69815
$$ -223836 412525 960589 981739 758501 471902 -11022 -518042 -671327 -463285 -293470
13957b93470n0291k16477j68454j17245K92097Q76720O29667k76544l81202p3914
$$ -293470 -343761 -560238 -728692 -845937 -553840 322880 952547 676003 294801 220887
13947B20887J06251k85026m05484k71356l28383k87788P675L18948K74801L51373
$$ 220887 327138 42112 -363372 -634728 -963111 -1250899 -1243224 -924276 -649475 -298102
13937b98102K20574r4062j1338K4704o3947l29508j3646N17896O19713R2285l09143
$$ -298102 -77528 -171590 -182928 -158224 -222171 -551679 -565325 -47429 572284 664569 355426
13926C55426k63170p2768J41005N5593j70459j39029k0070n9526j13424k29896
$$ 355426 92256 19488 160493 216086 45627 -93402 -113472 -172998 -286422 -516318
13916e16318K75470P42267J97054m40831m39887j49055j8390m9366Q7489l4920
$$ -516318 -240848 501419 698473 257642 -182245 -331300 -349690 -399056 -311567 -346487
13906c46487J06820N21364m9980m69246J76426N08301K65275n7013m59668k41574
$$ -346487 -239667 281697 231717 -237529 -61103 447198 712473 655460 195792 -45782
13896d5782j60685j08894K97452J58135O642J18740J67211j3654n0885K68536
$$ -45782 -206467 -315361 -17909 140226 146868 265608 432819 419165 368280 636816
13886F36816j9284l22403k00341j13732l11778l17766R7727L41317Q5807P508
$$ 636816 617532 295129 94788 -18944 -330722 -648488 -550761 -209444 -123637 -116129
13876a16129o7064j49267j87195o3033M64776O03875O9582n19505l13920q7985
$$ -116129 -183193 -332460 -519655 -582688 -117912 485963 555545 36040 -277880 -365865
13866c65865q4970K58569J60643q4766k1945j8511J73033k02549l35140N38424
$$ -365865 -450835 -192266 -31623 -116389 -138334 -156845 16188 -186361 -521501 16923
13856A6923L49263O3792L12514k81858l77708l08585k00663O0012j00097L245
$$ 16923 366186 429978 742492 460634 82926 -225659 -426322 -366310 -466407 -463162
13846d63162L69722M77892j12040j1436J0962Q5794K64914J7940j86620k09033
$$ -463162 -93440 384452 272412 260976 271938 357732 622646 640586 453966 244933
13836B44933n22200l77890N16034M26934j00256j30027J58136K39484o3717l78669
$$ 244933 -277267 -655157 -139123 287811 187555 57528 215664 455148 391431 12762
13826A2762l07996k47737j18910K64580K13437j30366L95819M43099J64190O5453
$$ 12762 -295234 -542971 -661881 -397301 -183864 -314230 81589 524688 688878 754331
13816G54331j51322l03935R295J35774l00135p9409r8917k81237k30291j78410
$$ 754331 603009 299074 308369 444143 144008 64599 -34318 -315555 -545846 -724256
13806g24256n16150k78239L15716K79941K46958L78017L86767j45615K4535L83674
$$ -724256 -1240406 -1518645 -1202929 -922988 -676030 -298013 88754 -56861 -32326 351348
13796C51348q5958K2217M75841K80721j1680o5476j43564k20646j56178J64863
$$ 351348 265390 287607 763448 1044169 1032489 967013 823449 602803 446625 611488
13786F11488J22384j27640k40985k14803j70117K07825K1811k64585k14794r3192
$$ 611488 733872 606232 365247 150444 -19673 188152 209963 -54622 -269416 -362608
13776c62608k81852j47057j09734L1741L41218J96169p2701k20255r4920n7159
$$ -362608 -644460 -791517 -901251 -869510 -528292 -332123 -404824 -625079 -719999 -777158
13766g77158J73385M0138j61420J53395N41158J84385k93712l78945m08361k95266
$$ -777158 -603773 -563635 -725055 -571660 -30502 153883 -139829 -518774 -927135 -1222401
13756a222401K2108L88459O82424J02067n2694j94768j71600K31221L94211K09615
$$ -1222401 -1200293 -811834 -129410 -27343 -80037 -274805 -446405 -215184 179027 388642
13746C88642j85939q9520K55191J5903m44795q8325q8313m63893l86955M96603
$$ 388642 202703 113183 368374 384277 -60518 -148843 -237156 -701049 -1088004 -591401
13736e91401Q44790Q2118l78441j30952j13307J77636L51181J01559q9103m26744
$$ -591401 253389 335507 -42934 -173886 -287193 -109557 241624 343183 254080 -172664
13726a72664l65179j43245l14636j17126L31184K32808L20911j558k18174L91900
$$ -172664 -537843 -681088 -995724 -1112850 -781666 -548858 -227947 -229505 -447679 -55779
13716e5779R27n86249l21313K90142L44835J73636m8344l18925N4848o7239L4323
$$ -55779 -54852 -641101 -962414 -672272 -327437 -153801 -202145 -521070 -466222 -533461 -499138
13705d99138K42276k1125K50769L73328j63254l35805m45500j41570K64416L30745
$$ -499138 -256862 -277987 -27218 346110 182856 -152949 -598449 -740019 -475603 -144858
13695a44858K85424J98335J88736J77071r877k05719m818k71368k09355n0168
$$ -144858 140566 338901 527637 704708 694831 489112 484294 212926 3571 -46597
13685d6597k53509n6008J21315J1381j77779N0869K81592J1405l7851K43133L80261
$$ -46597 -300106 -356114 -234799 -223418 -401197 -350328 -68736 -57331 -95182 147951 528212
13674E28212k38999l29517j93036o4642l3276K70047L16111j63617o8919r164
$$ 528212 289213 -40304 -233340 -297982 -331258 -61211 254900 91283 22364 13200
13664A3200j76286k38864n9196K72890l0315k8597K42782J9582j46299j17900
$$ 13200 -163086 -401950 -461146 -188256 -218571 -247168 -4386 15196 -131103 -249003
13654b49003j33354M8693K34486J49097j79952k13630k8435M05941L8258m68486
$$ -249003 -382357 -333664 -99178 49919 -130033 -343663 -372098 33843 72101 -396385
13644c96385o7264N0017j01463j4971L44459K91149N7048L20732j33399p5575
$$ -396385 -463649 -413632 -515095 -530066 -185607 105542 162590 483322 349923 274348
13634B74348N1008k22736q7462m1669R8349m1420O4546J23526l0935l99082n88054
$$ 274348 325356 102620 15158 -26511 71838 30418 94964 218490 187555 -211527 -799581
13623g99581j460N23220M46787L86792l5014j42202K26132K00726m25077M9960
$$ -799581 -801041 -277821 168966 555758 520744 378542 604674 805400 380323 430283
13613D30283M02195K46576j90931k94316r3224k05478j98452M6199N2186m1384
$$ 430283 832478 1079054 888123 593807 500583 295105 96653 142852 195038 153654
13603A53654j95957j39338J29264J9781k36848K15184M73912L25004l3267o03972
$$ 153654 -42303 -181641 -52377 -32596 -269444 -54260 419652 744656 711389 107417
13593A07417l20148j7926K27441j56080j98264J98444j44308l63471K67418M34724
$$ 107417 -212731 -230657 -3216 -159296 -357560 -159116 -303424 -666895 -399477 35247
13583C5247r4367M0876K11123j75934k34832j64009p9539J92393K68398r6407
$$ 35247 -59120 -18244 192879 16945 -217887 -381896 -461435 -269042 -644 -97051
13573i7051m54339n58001n48321l7408N5064M18714N70766M06466L8962j86377
$$ -97051 -551390 -1109391 -1657712 -1695120 -1640056 -1221342 -650576 -244110 -205148 -391525
13563c91525j88227k15053K1622k2026K55873o6246P5836M23165K93739K5031
$$ -391525 -579752 -794805 -773183 -795209 -539336 -605582 -529746 -106581 187158 212189
13553B12189j31122j19044j27752j60539j65203J77037M39858K36462K7406j00703
$$ 212189 81067 -37977 -165729 -326268 -491471 -314434 125424 361886 389292 288589
13543B88589k2459J06962j44043j48544k643k65903m2014J65830n1313l60645
$$ 288589 266130 373092 229049 80505 77862 -188041 -230055 -64225 -115538 -476183
13533d76183j48561P1746k44511j80368m6976J56654M90627N70611R8072n75337
$$ -476183 -624744 -552998 -797509 -977877 -1024853 -868199 -377572 193039 291111 -284226
13523b84226l21793K42148K67846N9056L14913J77265m0954j38544j55231J52401
$$ -284226 -606019 -363871 -96025 -36969 277944 455209 414255 275711 120480 272881
13513B72881p4830j93845J491J14983o3509k6104j03693k44615k9548o905J40086
$$ 272881 198051 4206 5697 120680 57171 31067 -72626 -317241 -346789 -353694 -213608
13502b13608N66354L26409k3568m89038p80481m15682Q0700J62878L65364K80967
$$ -213608 352746 679155 655587 166549 -613932 -1029614 -948914 -786036 -420672 -139705
13492a39705J81227J7626k9876K49764M4397l03774j12320J01097M5776L37996
$$ -139705 41522 59148 29272 279036 323433 19659 -92661 8436 54212 392208
13482C92208L88726j47948m02016k33380J42364K06096k12970l43501j62965J93097
$$ 392208 780934 632986 230970 -2410 139954 346050 133080 -210421 -373386 -180289
13472a80289J37296k36904j43416K76897K31037n84815l50116M80691M47280O305
$$ -180289 -42993 -279897 -423313 -146416 84621 -500194 -850310 -369619 77661 83966
13462H3966l9519J99547J27408q872L5041j9405J04518l17064p0658K73827Q7530
$$ 83966 44447 243994 371402 362530 397571 378166 482684 165620 94962 368789 456319
13451D56319L87098K88498j47863J2422j66997J41806j61422q43723l28798K77278
$$ 456319 843417 1131915 984052 996474 829477 971283 809861 -33862 -362660 -85382
13441h5382K9401K55174L22051J65987Q4542l33239k83915k93055j40456J96354
$$ -85382 -55981 199193 521244 687231 771773 438534 154619 -138436 -278892 -82538
13431h2538J72063m6900o2651J09866l41154j92309J56240R2147n5167j9061K87260
$$ -82538 89525 42625 -20026 89840 -251314 -443623 -287383 -195236 -250403 -269464 17796
13420A7796K38055O5708r4774J21565k5244k56535J31127O3946J41366j5529l81157
$$ 17796 255851 321559 226785 348350 323106 66571 197698 261644 403010 387481 6324
13409F324k63571J62958M1691J7917P3529k15849j35026j37070r6439J46072l0277
$$ 6324 -257247 -94289 -52598 -34681 38848 -177001 -312027 -449097 -545536 -399464 -429741
13398d29741J31045K64134K64171j3057o11800l77256j15232j58624J91911L83809
$$ -429741 -298696 -34562 229609 216552 -395248 -772504 -887736 -1046360 -854449 -470640
13388d70640j91508k83299M598L27260M81125o3010o1162N33794J69539l81972
$$ -470640 -662148 -945447 -940849 -613589 -132464 -195474 -256636 277158 446697 64725
13378F4725K67668M80191J97086R5389n1315l24041r8451q5425l04156j88460
$$ 64725 332393 812584 1009670 1105059 1053744 729703 631252 545827 241671 53211
13368E3211N5788j82577M8288O18442Q9466j46711j87984m30567j28128J58838
$$ 53211 108999 -73578 -25290 593152 682618 535907 347923 -82644 -210772 -51934
13358e1934j24801n03253l27748L98780L94487K70116l62332k61604Q7163L18677
$$ -51934 -176735 -679988 -1007736 -608956 -214469 55647 -306685 -568289 -481126 -162449
13348a62449K18757J14405j2742k55711l93999k85060K05013K82902K93240J65828
$$ -162449 56308 170713 157971 -97740 -491739 -776799 -571786 -288884 4356 170184
13338A70184l80516k54307o7226j69863j20557L75221M88823L53420M4923k25592
$$ 170184 -210332 -464639 -531865 -701728 -822285 -447064 41759 395179 440102 214510
13328B14510l33922O4867K2550l74117M6825N65254M9919k25104J80749R530l40571
$$ 214510 -119412 -54545 -31995 -406112 -359287 205967 255886 30782 211531 221061 -119510
13317a19510q2249J47591l8018j34664j1041k71411j33422K99988L85992j2999
$$ -119510 -201759 -54168 -92186 -226850 -237891 -509302 -642724 -342736 43256 30257
13307C0257K13570J52300m2654J08441J47414K56706M2114L594j06844j14462
$$ 30257 243827 396127 353473 461914 609328 866034 908148 911742 804898 690436
13297F90436o3822j86323M1632K34423P1733k96873k81564k16178K08633j67200
$$ 690436 626614 440291 481923 716346 788079 491206 209642 -6536 202097 34897
13287C4897j19321Q5954J08317j01745k48983K00448K35426J17327k9250k49448
$$ 34897 -84424 1530 109847 8102 -240881 -40433 194993 312320 283070 33622
13277C3622j05832K16268K83886K12576m1383m70503j53094K23458M66169K84177
$$ 33622 -72210 144058 427944 640520 599137 128634 -24460 198998 665167 949344
13267I49344L588k01993k1743K47330q942j85296l30443j46064N2708j00842j34759
$$ 949344 952932 750939 729196 976526 967584 782288 451845 305781 358489 257647 122888
13256A22888k07033K88893K55976j10171K19670J54010l33888l70314P6309J68102
$$ 122888 -84145 204748 460724 350553 570223 724233 390345 20031 96340 264442
13246B64442j45771Q2856N60900K62285r1678Q4993J5964q6643l82499q3807J33059
$$ 264442 118671 201527 762427 1024712 933034 1018027 1033991 947348 564849 481042 614101
13235F14101L21928K76700j68564j85096l83640p8466J11773J09941K11087J31178
$$ 614101 936029 1212729 1044165 859069 475429 396963 508736 618677 829764 960942
13225I60942k9437J13986r2896j86137J95464K72406L4904Q5391J61868J0468
$$ 960942 931505 1045491 952595 766458 961922 1234328 1269232 1354623 1516491 1526959
13215A526959m01497k39252J7159j65522K16146O5167K765J92237q425r9200J32562
$$ 1526959 1125462 886210 903369 737847 953993 1019160 1021925 1214162 1205737 1106537 1239099
13204A239099J64446m10138j95087K84194Q9177j59052N604j17462J22005J38650
$$ 1239099 1403545 993407 798320 1082514 1171691 1012639 1018243 900781 1022786 1161436
13194A161436k17532j95962N4455Q9355j83311p6082k6309m3203j04866l08508
$$ 1161436 943904 747942 802397 891752 708441 632359 606050 562847 457981 149473
13184A49473K62337L55934J30060R9670K51947L3034j37760k60473K69156O6918
$$ 149473 411810 767744 897804 997474 1249421 1282455 1144695 884222 1153378 1220296
13174A220296m50572k45279J45217P3723l30732K70842M26942J53202k48068l31972
$$ 1220296 769724 524445 669662 743385 412653 683495 1110437 1263639 1015571 683599
13164F83599q546o9407J72866L05393L17942k93259k45625J92521N03220M73436
$$ 683599 675053 605646 778512 1083905 1401847 1108588 862963 1055484 1558704 2032140
13154B032140K4812k24988k19933J80268K38651J7033M58782N90429N6544j7397
$$ 2032140 2056952 1831964 1612031 1792299 2030950 2047983 2506765 3097194 3153738 3136341
13144C136341K00775N46472J050692Q99777K19261o48069q64374n06348J06193
$$ 3136341 3337116 3883588 4934280 5834057 6053318 5405249 4540875 4034527 4140720
13135D140720J66547o8925k14057k61116r3191J29904P54781J449752J210280
$$ 4140720 4307267 4238342 4024285 3763169 3669978 3799882 4554663 6004415 7214695
13126G214695P57716Q78213J281931J694367K211652L253937L516515J322635
$$ 7214695 7972411 8850624 10132555 11826922 14038574 17292511 20809026 22131661
13118B2131661k163816l701028l102245k408660j736913j209398j158993j186527
$$ 22131661 19967845 16266817 13164572 10755912 9018999 7809601 6650608 5464081
13110E464081p92807m37290l27946k06124L9526L19922J74648l82665k90718J00808
$$ 5464081 4671274 4233984 3906038 3699914 3739440 4059362 4234010 3851345 3560627 3661435
13100C661435l72325m31594p2200L0126j93321j81027Q8927J10742N6838k5982
$$ 3661435 3289110 2857516 2785316 2815442 2622121 2441094 2530021 2640763 2697601 2671619
13090B671619k01946l0690M87564L08590J36907M27205N3706m96352k34118l1561
$$ 2671619 2469673 2438983 2926547 3235137 3372044 3799249 3852955 3356603 3122485 3090924
13080C090924p3962J16940J9300k54314j07036J04391J55401R1320K7632j73511
$$ 3090924 3016962 3133902 3153202 2898888 2791852 2896243 3051644 3142964 3170596 2997085
13070B997085j37945L2843J77045J79841M4918J77581j02149l97126o3099K95568
$$ 2997085 2859140 2891983 3069028 3248869 3293787 3471368 3369219 2972093 2908994 3204562
13060C204562L42205O6219J34403M1867J53696l30385l96832k85506o9217J79042
$$ 3204562 3546767 3612986 3747389 3789256 3942952 3612567 3215735 2930229 2861012 3040054
13050C040054Q6965K18658L04052K08487J83267j48090k89319p7383k9783M7359
$$ 3040054 3127019 3345677 3649729 3858216 4041483 3893393 3604074 3526691 3496908 3544267
13040C544267l14588j84094J66906J88045K17620L59002L72646N3221R1510K6156
$$ 3544267 3229679 3045585 3212491 3400536 3618156 3977158 4349804 4403025 4494535 4520691
13030D520691Q1806L06612l4859M3012L34703J73440k31100r5662K63757K76515
$$ 4520691 4602497 4909109 4874250 4917262 5251965 5425405 5194305 5098643 5362400 5638915
13020E638915k70735k00847M45506M14400J88899N1336K99323M48433L73108J29009
$$ 5638915 5368180 5167333 5612839 6027239 6216138 6267474 6566797 7015230 7388338 7517347
13010G517347k25059J27823K74976N08882Q16569Q96093N34587M73669N13544
$$ 7517347 7292288 7420111 7695087 8203969 9020538 9916631 10451218 10924887 11438431
13001A1438431M18610M81390P80209J332629J424750J388420J466727J719506
$$ 11438431 11857041 12338431 13118640 14451269 15876019 17264439 18731166 20450672
12993B0450672J898441K146715K705973L643426M284514M935153N882736P524974
$$ 20450672 22349113 24495828 27201801 30845227 35129741 40064894 45947630 53472604
12985E3472604R211425J1291165J4669966J8599013K3841131L1240902M1392913
$$ 53472604 62684029 73975194 88645160 107244173 131085304 162326206 203719119
12978B03719119N3245644O6190772P2512594N2987201L15008n3229345p4410598
$$ 203719119 256964763 323155535 395668129 448655330 448970338 395740993 321330395
12971C21330395o8568109n4010433m0354331l0155936k2820734j7534164j3606917
$$ 321330395 252762286 198751853 158397522 128241586 105420852 87886688 74279771
12964G4279771j0723013q430819o790672n717133m810383l814962l138392k950979
$$ 74279771 63556758 55125939 48335267 42618134 37807751 33992789 30854397 27903418
12956B7903418k292356j677978j568466j470792j124078j229829j603840j082464
$$ 27903418 25611062 23933084 22364618 20893826 19769748 18539919 16936079 15853615
12948A5853615p00455r51014n48499m67522q79892o93908n77513p57263p26215
$$ 15853615 15153160 14202146 13653647 13186125 12306233 11612325 11034812 10277549 9551334
12939I551334k18535M14196N80938j78592m35072o3076P7273J7541M79120M24749
$$ 9551334 9332799 9746995 10327933 10149341 9714269 9651193 9728466 9746007 10225127 10649876
12929A0649876R257K18435r2277k80428L89378P63162M63486L01016M52067P68519
$$ 10649876 10659133 10877568 10785291 10504863 10894241 11657403 12120889 12421905 12873972 13642491
12919A3642491J175823J599277J614132J035727K31703k94190m23451p6864M59429
$$ 13642491 14818314 16417591 18031723 19067450 19299153 19004963 18581512 18504648 18964077
12910A8964077R43912Q05463P48068J507779K033849K290856L095699L389489
$$ 18964077 19907989 20713452 21461520 22969299 25003148 27294004 30389703 33779192
12902C3779192L622387M960674O715752Q113477R740985J2261765J5322682J9493842
$$ 33779192 37401579 42362253 49078005 57191482 66932467 79194232 94516914 114010756
12894A14010756K5749221L3701375M4243114N7643548P0958050P3408168M3994157
$$ 114010756 139759977 173461352 217704466 275348014 346306064 419714232 463708389
12887D63708389j6552240o6039596p7773905o6516931n0779447l7289756k7118895
$$ 463708389 447156149 381116553 303342648 236825717 186046270 148756514 121637619
12880A21637619k0754106j5825735j1962714r607997q079759n874926m099643
$$ 121637619 100883513 85057778 73095064 63487067 55407308 49532382 45432739
12873D5432739k823574j723849k76348J642036L351334M020332K656375m599670
$$ 45432739 42609165 40885316 40608968 42251004 45602338 49622670 52279045 47679375
12865D7679375r082504p158995n223474l795555k974376k036580j349530p47703
$$ 47679375 38596871 31437876 26214402 22418847 19444471 17407891 16058361 15310658
12857A5310658p36947q31441q99945p45051o65761l59527l05171K1556J6063l27157
$$ 15310658 14573711 13742270 12842325 12097274 11431513 11071986 10766815 10788371 10804434 10477277
12847A0477277k00655j80338j23169k00526J36195M8976j88946r0895j54222P2630
$$ 10477277 10276622 10096284 9973115 9772589 9908784 9957760 9768814 9677919 9523697 9596327
12837I596327N19490Q51499N00458P5288k90087m66346j07671K80906O07890P46623
$$ 9596327 10115817 10967316 11467774 11543062 11252975 10786629 10678958 10959864 11567754 12314377
12827A2314377P37476R34625J228590J434338J049907O79349R34257J558141K594992
$$ 12314377 13051853 13986478 15215068 16649406 17699313 18378662 19312919 20871060 23466052
12818B3466052K940254K999097L770171M194661N334817P051598Q784428J0954337
$$ 23466052 26406306 29405403 33175574 37370235 42705052 49756650 58541078 69495415
12810F9495415J3284179J6641213K1074488K7316918L5954473M6858010N9948387
$$ 69495415 82779594 99420807 120495295 147812213 183766686 230624696 290573083
12803B90573083P0639591O5859044K8175613l0670003o9189265p3922938o1425633
$$ 290573083 361212674 427071718 455247331 424577328 355388063 281465125 220039492
12796B20039492m6619604l4687551k6090906j9593697j4860807j1769087r748884
$$ 220039492 173419888 138732337 112641431 93047734 78186927 66417840 56668956
12789E6668956q085059o899870n921784m834173l576349l010793k690515k048624
$$ 56668956 48583897 41684027 35762243 30928070 27351721 24340928 21650413 19601789
12781A9601789j705721j573108j667359j422786j311563j364057q87424n30473
$$ 19601789 17896068 16322960 14655601 13232815 11921252 10557195 9669771 9139298
12773I139298n04945m92417k75980k07898o51995q20663m92173j12791j33597
$$ 9139298 8634353 8141936 7865956 7658058 7006063 6185400 5693227 5580436 5446839
12764E446839j23223j7380l16942k54005k87433k86467J02585L08397L44428M7011
$$ 5446839 5323616 5306236 4989294 4735289 4447856 4161389 4263974 4572371 4916799 4963810
12754D963810K98381L61451L30900N52805O16704j6367r56381j061130o39168
$$ 4963810 5262191 5623642 5954542 6507347 7124051 7107684 6151303 5090173 4451005
12745D451005l66108l18616j65349L3137l55907k33154k5638l11863o86254n75341
$$ 4451005 4084897 3766281 3600932 3634069 3278162 3045008 3019370 2707507 2021253 1445912
12735A445912j29836L93103M7662j70366j97188m52775l48042k69727l48638R2173
$$ 1445912 1316076 1709179 1756841 1586475 1389287 936512 588470 318743 -29895 62278
12725F2278M53329K93746K13084l1694j42721p9161j47065k41478k09645N47728
$$ 62278 515607 809353 1022437 990743 848022 768861 621796 380318 170673 718401
12715G18401O91847J75048m09653k86396L05142Q3602j88385M6341j64890k76345
$$ 718401 1410248 1585296 1175643 889247 1194389 1277991 1089606 1135947 971057 694712
12705F94712l21883l16921J94532K80236j17780m46336l28065K18284K71466L66506
$$ 694712 372829 55908 250440 530676 412896 -33440 -361505 -143221 128245 494751
12695D94751N47492J32886J38018j02417l95595q7167J44360j6292k29864j19876
$$ 494751 1042243 1175129 1313147 1210730 815135 727968 872328 856036 626172 506296
12685E06296l86537n62574k07629N9351L59728K19542J1223k15031J0408K63879
$$ 506296 119759 -442815 -650444 -591093 -231365 -11823 -600 -215631 -205223 58656
12675E8656L4655l9067k03370l45555J2222R8665m362k4887K59975N87624O45203
$$ 58656 93311 54244 -149126 -494681 -482459 -383794 -388156 -413043 -153068 434556 1079759
12664A079759L60867k03717k35715j28371j86346k30258P4008J15016p5931k99269
$$ 1079759 1440626 1236909 1001194 872823 686477 456219 530227 645243 569312 270043
12654B70043M4007Q8398j16736l30229j11609K15067M3192l98218l51597N02283
$$ 270043 314050 402448 285712 -44517 -156126 58941 102133 -296085 -647682 -145399
12644a45399P84594J29447M4886M11865L04066j02702m85376o25808j75880k28392
$$ -145399 639195 768642 813528 1225393 1529459 1426757 941381 315573 139693 -88699
12634h8699l54752Q7435K15607L10719o4863k72645r300J92635J64710K98480
$$ -88699 -443451 -356016 -140409 170310 105447 -167198 -176498 16137 180847 479327
12624D79327K69938p7142o17072m85073p1093M21841Q14986M81198l14860p76694
$$ 479327 749265 672123 55051 -430022 -501115 -79274 735712 1216910 902050 125356
12614A25356m44201L56880L10058J72552J55099l17125L5464M73074J40083m37710
$$ 125356 -318845 38035 348093 520645 675744 358619 394083 867157 1007240 569530
12604E69530l79892j94058P7870N6914k4986l3372J4901j34897m0896R7079J29551
$$ 569530 189638 -4420 73450 130364 105378 72006 86907 -47990 -88886 8193 137744
12593A37744k6202k76930k63242O8531J75803Q5633N6934k09386k4249N40971
$$ 137744 111542 -165388 -428630 -360099 -184296 -98663 -41729 -251115 -275364 265607
12583B65607M00733L7125k62815j95757K42482J44604l58607l87543P7695M23876
$$ 265607 666340 703465 440650 244893 487375 631979 273372 -114171 -36476 387400
12573C87400M03606j08576k62502l31553j99548J1025J08654k50310j45236l70374
$$ 387400 791006 682430 419928 88375 -111173 -100148 8506 -241804 -387040 -757414
12563g57414j28524K54822N08153N19930M55850L20150l16157n21612k4672j51528
$$ -757414 -885938 -631116 -122963 396967 852817 1172967 856810 335198 310526 158998
12553A58998j19798J93461j45512p6981K16481j35867m33461n4944L88285K46985
$$ 158998 39200 232661 87149 10168 226649 90782 -342679 -397623 -9338 237647
12543B37647K56735J35522j08996j6332K1169J27565l15352o91816m57493N9908
$$ 237647 494382 629904 520908 504576 525745 653310 337958 -353858 -811351 -751443
12533g51443R629N5813M54778N42262K20970l50866m62344O1972K67512L79184
$$ -751443 -741814 -686001 -231223 311039 532009 181143 -281201 -219229 48283 427467
12523D27467K79468m11598n44343j16472J441Q5095K3709j44306l78856j07065
$$ 427467 706935 295337 -249006 -365478 -364037 -278942 -255233 -399539 -778395 -885460
12513h85460L00282K03929J54962J48428K05930J15777R2488J5097q0998J7319
$$ -885460 -585178 -381249 -226287 -77859 128071 243848 336336 351433 270435 287754
12503B87754P4408J3541j66520k07666J34176K5492m24658Q0431L78853J06015
$$ 287754 362162 375703 209183 1517 135693 161185 -263473 -183042 195811 301826
12493C01826j84284m341m6943k87376j81605J95585r4215n7130J27286J09759
$$ 301826 117542 113201 66258 -221118 -402723 -207138 -301353 -358483 -231197 -121438
12483a21438J78652K07054j39956J00704p525m21718k22698m4752R8793J99418
$$ -121438 57214 264268 124312 225016 217491 -204227 -426925 -471677 -372884 -173466
12473a73466N2573k7953J39856J32106n7064R5171M548j68917k61925m3949j45182
$$ -173466 -120893 -148846 -8990 123116 66052 161223 165771 -3146 -265071 -309020 -454202
12462d54202K8180M10715Q9545J43392l4135P1720J75764j60536j51855o7590
$$ -454202 -426022 -15307 74238 217630 183495 255215 430979 270443 118588 50998
12452E0998j7804n2671p5738m56384m82763Q9234M45453K67121O7360J65556k09281
$$ 50998 33194 -19477 -95215 -551599 -1034362 -945128 -499675 -232554 -165194 362 -208919
12441b08919J85218K10820m9126N0735L18039O2629m29389n54799j52718N0403
$$ -208919 -23701 187119 137993 188728 506767 569396 140007 -414792 -567510 -517107
12431e17107j8490j06834J51172K35994R2662J17109L1621O2813o409j60171n5496
$$ -517107 -535597 -642431 -491259 -255265 -162603 -45494 -13873 48940 42531 -117640 -173136
12420a73136p4956o6324k49124l04793J21831K91834L30780P7203j18921O7628
$$ -173136 -248092 -314416 -563540 -868333 -746502 -454668 -123888 -46685 -165606 -97978
12410i7978O4456L06444K03360j39784J27782m4700k81223k7393j02122k48965
$$ -97978 -33522 272922 476282 336498 464280 419580 138357 110964 8842 -240123
12400b40123j17685O0819J71416J41585R5201j37929j36708J19114J11412R6902
$$ -240123 -357808 -296989 -125573 16012 111213 -26716 -163424 -44310 67102 164004
12390A64004J65006J94086j56127l29624J34066J9084l16418l14313m39904O8995
$$ 164004 329010 523096 366969 37345 171411 190495 -125923 -440236 -880140 -811145
12380h11145L39381L37468J26825j64158K58236K81119N6532J17179k34028j57896
$$ -811145 -471764 -134296 -7471 -171629 86607 367726 424258 541437 307409 149513
12370A49513P1412j56484k57013R792K34960J91003o7932j39085Q5271J06661
$$ 149513 220925 64441 -192572 -182780 52180 243183 175251 36166 121437 228098
12360B28098R9944N3466M9465J97860j6209j88892k74589k21367P972L0208m1993
$$ 228098 328042 381508 430973 628833 612624 423732 149143 -72224 -64252 -34044 -76037
12349g6037j92446L07857M15889J0772J18873J22757M27633J78172k93317n08859
$$ -76037 -268483 39374 455263 466035 584908 707665 1135298 1313470 1020153 511294
12339E11294J9623m175m34818k68598j65984K4267J64135L14748M11426p521k13518
$$ 511294 530917 526742 91924 -176674 -342658 -318391 -154256 160492 571918 564397 350879
12328C50879m32354j96922M65j26841j06014M9603L4187O3058J80776K2946j31119
$$ 350879 -81475 -278397 -277932 -404773 -510787 -461184 -426997 -363939 -183163 -160217 -291336
12317b91336j43960k50774l65984j47825M85306N85153L18856K29063m8944k85465
$$ -291336 -435296 -686070 -1052054 -1199879 -714573 -129420 189436 418499 369555 84090
12307H4090k41178j10663j7351L2748O8700J38474Q3013J92273J28766Q9588R5011
$$ 84090 -157088 -267751 -285102 -252354 -183654 -45180 37833 230106 358872 448460 543471
12296E43471L6475p9543p4295L6147J62633Q4767j07404q4664J4028M547m3140
$$ 543471 579946 500403 426108 462255 624888 709655 602251 517587 531615 536162 493022
12285D93022l31780j98502Q9407j48883n3834n7522j91488M9912P8657L285k82847
$$ 493022 161242 -37260 52147 -96736 -150570 -208092 -399580 -349668 -271011 -267726 -550573
12274e50573j68749O09696O93129j62544q2387k2685m41472j39312k9690L8957
$$ -550573 -719322 -109626 583503 420959 338572 315887 -125585 -264897 -294587 -255630
12264b55630k15175k49999N41055K84821q1004j31336j66886j45368j52566K82842
$$ -255630 -470805 -720804 -179749 105072 24068 -107268 -274154 -419522 -572088 -289246
12254b89246L86205p1164n51160j15355K02439j02304j72695r7978m7123N6480
$$ -289246 96959 25795 -525365 -640720 -438281 -540585 -713280 -811258 -858381 -801901
12244h01901N05647M56282M08845J3885m93114j3237J47961j36478m47994k73644
$$ -801901 -296254 160028 568873 582758 89644 76407 224368 87890 -360104 -633748
12234f33748K4091J28018L03843o9529K47399N93165P6107j90312k48093n74254
$$ -633748 -609657 -481639 -177796 -247325 74 593239 669346 479034 230941 -343313
12224c43313j77546J43974K63857O56626L79904O619q2299p829o1215k06943m26322
$$ -343313 -520859 -376885 -113028 543598 923502 930121 847822 839993 778778 571835 145513
12213A45513m28104l12841M2894L59208L76517J79645K3748l5990J53602l64394
$$ 145513 -282591 -595432 -552538 -193330 183187 362832 386580 350590 504192 139798
12203A39798q05598k09482L46954P22196J91325q235k27350j92050k16269j02349
$$ 139798 -665800 -875282 -528328 193868 385193 376958 149608 -42442 -258711 -361060
12193c61060j8833J77483K3114J42132J19519j57577r5848O7347o585l12084l83258
$$ -361060 -379893 -202410 -179296 -37164 82355 -75222 -171070 -103723 -110308 -422392 -805650
12182h05650M6366J10622n5319K13213M8767Q6828K20069L65384J23425J13427
$$ -805650 -759284 -648662 -703981 -490768 -442001 -355173 -135104 230280 353705 467132
12172D67132m288l78296n11651K2648J72753M2290M80097N41068R6698l27319
$$ 467132 462844 84548 -427103 -404455 -231702 -189412 290685 831753 928451 601132
12162F01132n08024m48077m02133o57976j04316M88429J30191k11799j47769K86384
$$ 601132 93108 -354969 -757102 -1415078 -1519394 -1030965 -900774 -1112573 -1260342 -973958
12152i73958k04469m51648J15836N62346M96947K29109N4688j00529M4322L0495
$$ -973958 -1178427 -1630075 -1514239 -951893 -454946 -225837 -171149 -271678 -227356 -196861
12142a96861L59115M4027l2386k0557j69287J56028J43573q9590k18702l64208
$$ -196861 162254 206281 173895 153338 -15949 140079 283652 194062 -24640 -388848
12132c88848K6474K79627k56939q1079k25109k07071L92793N82508K35439j35872
$$ -388848 -362374 -82747 -339686 -420765 -645874 -852945 -460152 122356 357795 221923
12122B21923k16635j11111L3023j13148P0754N6714J12681L6246j88840K496J76860
$$ 221923 5288 -105823 -72800 -185948 -115194 -58480 54201 90447 -98393 -95897 80963
12111H0963l06181k79207K44278K34134k56313k36220J69989J01620J43755k04027
$$ 80963 -225218 -504425 -260147 -26013 -282326 -518546 -348557 -246937 -103182 -307209
12101c07209k89404O9361K36085J3412k8051R0719k31472P2040L57497J99515
$$ -307209 -596613 -527252 -291167 -277755 -305806 -215087 -446559 -374519 -17022 182493
12091A82493j21866p7632M18718N28785J77620j09484j52423m14797m52818Q475
$$ 182493 60627 -17005 401713 930498 1108118 998634 846211 431414 -21404 -12929
12081a2929P9605j09488Q5164M9025j55730k59695l7626j51837k9066J28997L31472
$$ -12929 66676 -42812 42352 91377 -64353 -324048 -361674 -513511 -542577 -413580 -82108
12070h2108Q2686l9177k16104j35105J54864J43872m9675m20269l20817J31756
$$ -82108 578 -38599 -254703 -389808 -234944 -91072 -140747 -561016 -881833 -750077
12060g50077M74585J82119j24100J27697L55363l3755M8314K70251K63725r367
$$ -750077 -275492 -93373 -217473 -89776 265587 231832 280146 550397 814122 804755
12050H04755l35232k01618O7501K33858K0576k05575J426J08397J33151k47794
$$ 804755 469523 267905 335406 569264 589840 384265 385691 494088 627239 379445
12040C79445k46206Q5610M92395J70060n3407m00981q65841n66940K26497M79269
$$ 379445 133239 218849 711244 881304 827897 426916 -438925 -1005865 -779368 -300099
12030c00099K21605r7833J76442R4751j60711M1941r0603Q4534Q3085j16046j30818
$$ -300099 -78494 -176327 115 94866 -65845 -23904 -114507 -29973 53112 -62934 -193752
12019a93752R4419L38716l2020l38230J25486M86614j49140m58847j43970k26760
$$ -193752 -99333 239383 207363 -130867 -5381 481233 332093 -126754 -270724 -497484
12009d97484l76263O1370K18832L75521L01633j64572j1442J12111j9517k10996
$$ -497484 -873747 -812377 -593545 -218024 83609 -80963 -92405 19706 189 -210807
11999b10807n9783r3450p6552J4954k22702l8462J33937J235J92108J3942j89021
$$ -210807 -270590 -364040 -440592 -425638 -648340 -686802 -552865 -551630 -359522 -345580 -534601
11988e34601K11957N81303J78665K55653r288k21122q0929L94478K40599n5379
$$ -534601 -322644 258659 437324 692977 683689 462567 381638 776116 1016715 961336
11978I61336n2988J94949K8964l01257l48404n95996l89968Q3702n9743k28970
$$ 961336 908348 1103297 1132261 831004 482600 -113396 -503364 -419662 -479405 -708375
11968g08375M50668N94654P3103l59212k24603j75960J30823N25353K22467r1369
$$ -708375 -257707 336947 410050 50838 -173765 -349725 -218902 306451 528918 437549
11958D37549j78423J97793N06394K37155J6685J22049q6697j60355k4715l59488
$$ 437549 259126 456919 963313 1200468 1217153 1339202 1252505 1092150 1067435 707947
11948G07947l58317J66660O6643l17812k12053j62088K37402L19749J35473K38802
$$ 707947 349630 516290 582933 265121 53068 -109020 128382 448131 583604 822406
11938H22406r6365l24354j38702K01025K46174j18006k85932j71191k81957j46267
$$ 822406 726041 401687 262985 464010 710184 592178 306246 135055 -146902 -293169
11928b93169M81190M25807J9241j58650l37400k77747j13675l5484L28591K92012
$$ -293169 188021 613828 633069 474419 137019 -140728 -254403 -289887 38704 330716
11918C30716r887L35146P46246J127963R98946N24053K93418Q66922J789341J943655
$$ 330716 320829 655975 1402221 2530184 3529130 4053183 4346601 5213523 7002864 8946519
11908H946519J934760K455450K762438J953123M71596j293674k744093k678082
$$ 8946519 10881279 13336729 16099167 18052290 18523886 17230212 14486119 11808037
11900A1808037k313511j949892j292502q89592n89744k77358j46657l80740n05302
$$ 11808037 9494526 7544634 6252132 5362540 4772796 4495438 4348781 3968041 3462739
11891C462739k90459l01299n88337p15743l50205K64542J70898k20185j6782K2962
$$ 3462739 3172280 2870981 2282644 1566901 1216696 1481238 1652136 1431951 1415169 1438131
11881A438131J08051L75968M13369M06830l5452l24849L56715J031945Q35104
$$ 1438131 1546182 1922150 2335519 2742349 2706897 2382048 2738763 3770708 4605812
11872D605812j72224p29629p51327o71186l75757n72675l07242m23k73714l80736
$$ 4605812 4433588 3703959 2952632 2281446 1905689 1333014 1025772 1025349 751635 370899
11862C70899L1104N23669J28775m59288m44881M3608J22951k11527j24680n3030
$$ 370899 402003 925672 1054447 595159 150278 193886 316837 105310 -19370 -72400
11852g2400j82975k7838j08919k8718J34698L85810N10678j65154j9597l2168
$$ -72400 -255375 -283213 -392132 -420850 -286152 99658 610336 445182 425585 393417
11842C93417j47535L11180J07411k33487k41336r5941r6111J0203J93405j03783
$$ 393417 245882 557062 664473 430986 189650 93709 -2402 7801 201206 97423
11832I7423l05596K41256K13766l14609n31375k45163J71692J20501j52237l6238
$$ 97423 -208173 33083 246849 -67760 -599135 -844298 -672606 -552105 -704342 -740580
11822g40580L7554r8751L31091N97362L0985m56573n0107L2256J44326R1591l1201
$$ -740580 -703026 -801777 -470686 126676 157661 -298912 -349019 -316763 -172437 -80846 -112047
11811a12047K1684k04435j93883j65482K3300J45606O6670k15029n05460k71242
$$ -112047 -90363 -294798 -488681 -654163 -630863 -485257 -418587 -633616 -1139076 -1410318
11801a410318N68736M11246J29030J39143j13209K15633O27114M07220Q0131j88030
$$ -1410318 -841582 -430336 -301306 -162163 -275372 -59739 567375 974595 1054726 866696
11791H66696n21157k22451j10595j12142q7800Q2061l7824p5307K88278l1647
$$ 866696 345539 123088 12493 -99649 -187449 -105388 -143212 -218519 69759 38112
11781C8112j49992Q9407M2264q1455q3576j47290l7750o870P6467K79731L97631
$$ 38112 -111880 -22473 19791 -61664 -145240 -292530 -330280 -337150 -260683 19048 416679
11770D16679K59677q8680J03276J18630k04357k60339l64040j75992K73560M70417
$$ 416679 676356 587676 690952 809582 605225 344886 -19154 -195146 78414 548831
11760E48831K11469k90510l82689k74169J07581L63045l5667l00557k4362L11876
$$ 548831 760300 469790 87101 -187068 -79487 283558 247891 -52666 -77028 234848
11750B34848L43257R7278m52284n39765m78261l9726l864R66953J245352J48987
$$ 234848 578105 675383 223099 -316666 -794927 -834653 -838517 128436 1373788 1522775
11740A522775l13760r36378q90317l15510M42204P66291L11922J50475J28376
$$ 1522775 1209015 272637 -617680 -933190 -490986 275305 587227 737702 866078
11731H66078p1997M9138K11087K17668o9453j08354l08174n70062l50038q5372
$$ 866078 794081 843219 1054306 1271974 1202521 1094167 785993 215931 -134107 -219479
11721b19479K44505J43817q0565J49830N86285M26098j74184m31814l06451l77306
$$ -219479 25026 168843 88278 238108 824393 1250491 1076307 644493 338042 -39264
11711c9264l87678J47323K59117L92313m8461j73254J1714J80055P1177K40395
$$ -39264 -426942 -279619 -20502 371811 323350 150096 161810 341865 413042 653437
11701F53437Q5337p71872m33168P576R8279K44371K85333J74097J18656l85326
$$ 653437 738774 -33098 -466266 -458690 -360411 -116040 169293 343390 462046 76720
11691G6720k88731L3956K14097J192N5333N33408J55913l77344o95960j67193
$$ 76720 -212011 -178055 36042 37234 92567 625975 781888 404544 -291416 -458609
11681d58609J52862J27182m0118r2478J26408q8750n24949l94940j9958J59332
$$ -458609 -305747 -178565 -218683 -311161 -184753 -273503 -798452 -1193392 -1213350 -1054018
11671a054018K8939q3272J7026K76722M51265O13762q2101m49533k16642J5808
$$ -1054018 -1025079 -1108351 -1091325 -814603 -363338 250424 168323 -281210 -497852 -482044
11661d82044r4761j03725J43467M70185L72127K03296j22413L6440J85783p0353
$$ -482044 -576805 -680530 -537063 -66878 305249 508545 386132 422572 608355 538002
11651E38002j49338k65725o86018n04858O5007n1574M3005L60748K80060N4960
$$ 538002 388664 122939 -563079 -1067937 -1002930 -1054504 -1011499 -650751 -370691 -315731
11641c15731j33459J36366M86261L96009J07295j25079k54253K00225k3816l53590
$$ -315731 -449190 -312824 173437 569446 676741 551662 297409 497634 473818 120228
11631A20228m34929l41323K1970O5945M3962k54024P8841j88952k18807M02167
$$ 120228 -314701 -656024 -634054 -568109 -524147 -778171 -699330 -888282 -1107089 -704922
11621g04922M54128L58923j7786k45517J25045J38280j40954k44713K1043J6713
$$ -704922 -250794 108129 90343 -155174 -30129 108151 -32803 -277516 -256473 -239760
11611b39760O6346J63784R8600O3219k76236j85622N0651M8780M03403N31336
$$ -239760 -173414 -9630 88970 152189 -124047 -309669 -259018 -210238 193165 724501
11601G24501K12982k45676j97451j32271j01665j7771m7405L3941J06886P8202
$$ 724501 937483 691807 494356 362085 260420 242649 195244 229185 336071 414273
11591D14273j66206l46289m51018m9099k8252j03936R898J406K8936M68286P18433
$$ 414273 248067 -98222 -549240 -598339 -626591 -730527 -720629 -719223 -690287 -222001 496432
11580D96432L31688P2146K88138L30141k17723n16654m34655j01014M0173L4704
$$ 496432 828120 900266 1188404 1518545 1300822 784168 349513 248499 288672 323376
11570C23376M51817K71432j50893K5528K09176K72584L62440n3253o57720j89719
$$ 323376 775193 1046625 895732 921260 1130436 1403020 1765460 1712207 1054487 864768
11560H64768K96825m5984L10518N14429L07919K44308P04867O19621J03090M59346
$$ 864768 1161593 1115609 1426127 1940556 2248475 2492783 3197650 3817271 3920361 4379707
11550D379707Q91692J426585J439136J782772K590206K783904J803624N00472
$$ 4379707 5271399 6697984 8137120 9919892 12510098 15294002 17097626 17598098
11542A7598098j504154k684833k742833k124660j250107r15702n03660l57943
$$ 17598098 16093944 13409111 10666278 8541618 7291511 6375809 5872149 5514206
11534E514206l18614n92421q37365n76744n37395l15470J63913J9516j26930j28896
$$ 5514206 5195592 4603171 3765806 3189062 2651667 2336197 2500110 2519626 2392696 2263800
11524B263800l50614p71293q53625k02594l529J10100J49427L06873K54145L53216
$$ 2263800 1913186 1141893 288268 85674 82145 192245 341672 648545 902690 1255906
11514A255906K27846Q5942j34152j98282J26524P7360O0944L4057N3918K31010
$$ 1255906 1483752 1569694 1435542 1237260 1363784 1441144 1502088 1536145 1590063 1821073
11504A821073L8608l8920K99044N12822L64677N50222Q28201R25583J099560J089638
$$ 1821073 1859681 1820761 2119805 2632627 2997304 3547526 4375727 5301310 6400870 7490508
11494G490508J875686K705866K717065L188904K366725k26619k879574l589926
$$ 7490508 9366194 12072060 14789125 17978029 20344754 20118135 17238561 13648635
11486A3648635k655919j811226j464893j394141r31675r17070j236239o81661
$$ 13648635 10992716 9181490 7716597 6322456 5390781 4473711 3237472 2555811
11478B555811k32741k82146j99700j84333J23115M01070J13400m89905j088479
$$ 2555811 2323070 2040924 1841224 1656891 1780006 2181076 2294476 1804571 716092
11469G16092n49461J26414M00015N03931K58133L1068k24773k25126k03354J57043
$$ 716092 166631 293045 693060 1196991 1455124 1486192 1261419 1036293 832939 989982
11459I89982M27347K79495m6645m74254n03928k33435r4511k79885j24284M12220
$$ 989982 1417329 1696824 1650179 1175925 671997 438562 344051 64166 -60118 352102
11449C52102K25331k54876o2630J73259l8019R0815M48873j60403l18785J22056
$$ 352102 577433 322557 259927 433186 395167 485982 934855 774452 455667 577723
11439E77723L82871M43283N809o78721q91239m92791j99884j95399K27506L33510
$$ 577723 960594 1403877 1409686 730965 -160274 -653065 -852949 -1048348 -820842 -487332
11429d87332j48305k53340M33159M70424L10007O2855j79462k43090l0158L90466
$$ -487332 -635637 -888977 -455818 14606 324613 387468 208006 -35084 -65242 325224
11419C25224M40274R4948j99167k0451k00058k36594m47283m16196P2060O96795
$$ 325224 765498 860446 661279 640828 440770 204176 -243107 -659303 -587243 109552
11409A09552R11769J32722l75679l21863n53940k88231M8534j23133l8856M09505
$$ 109552 1021321 1154043 778364 456501 -97439 -385670 -337136 -460269 -499125 -89620
11399h9620M93177J29164p1683j00107J28437j23622l15483N04495K35109m25970
$$ -89620 403557 532721 461038 360931 489368 365746 50263 554758 789867 363897
11389C63897o47046l35450J07005K90296L05529K53993K82100L54855O6550o2805
$$ 363897 -283149 -618599 -511594 -221298 84231 338224 620324 975179 1041729 978924
11379I78924j6576j42615l55722o83844n80077j81490J25363O83758M35392j19945
$$ 978924 962348 819733 464011 -219833 -799910 -981400 -856037 -172279 263113 143168
11369A43168l33656O6016K91471L10342O7690l16993k4429J02386k10159n40432
$$ 143168 -190488 -124472 166999 477341 545031 228038 203609 305995 95836 -444596
11359d44596k86193k28079R5804K92672j63191q1566r8159p7627J82029L54134
$$ -444596 -730789 -958868 -863064 -570392 -733583 -815149 -913308 -990935 -808906 -454772
11349d54772M95944J88426O95K213j3978r4000j41112j4490K56261k79992l63338
$$ -454772 41172 229598 230293 232506 218528 124528 -16584 -31074 225187 -54805 -418143
11338d18143j74228k88517k09153N6975L39091L48181Q8782j70497O0882n7314
$$ -418143 -592371 -880888 -1090041 -1033066 -693975 -345794 -257012 -427509 -366627 -423941
11328d23941j96695n2794P5957k56034k78077R1028L54598L59641J24715k39486
$$ -423941 -620636 -673430 -597473 -853507 -1131584 -1040556 -685958 -326317 -201602 -441088
11318d41088J50775O41254K91190L4396J91612j61980l68832j6885j07442k18087
$$ -441088 -290313 350941 642131 676527 868139 706159 337327 320442 213000 -5087
11308e087j05853n1037J04558N3393n298M27392L04916l27384l11054r9639k41485
$$ -5087 -110940 -161977 -57419 -4026 -9324 418068 722984 395600 84546 -15093 -256578
11297b56578k09326j33739k91271o1284j0769J32632J84580l2095k64371m0801
$$ -256578 -465904 -599643 -890914 -952198 -962967 -830335 -645755 -677850 -942221 -983022
11287i83022M18544N75900O28476R72292J044659O29591K57166l67597m05036
$$ -983022 -564478 11422 639898 1612190 2656849 3286440 3543606 3176009 2770973
11278B770973n51945m20233m09037n16055k7199J42908p5179k17350j4324k3460
$$ 2770973 2219028 1798795 1389758 873703 846504 989412 914233 696883 682559 659099
11268F59099j29716k17526j90999j43662k51929k94315k20779k7730J43244K63342
$$ 659099 529383 311857 120858 -22804 -274733 -569048 -789827 -817557 -674313 -410971
11258d10971N08085J10125k23101Q1738M6068J61818M6532m06897m00925m42608
$$ -410971 97114 207239 -15862 65876 111944 273762 320294 -86603 -487528 -930136
11248i30136j16843K83662l723m18143j78683L15818J78478j05908J59234o0239
$$ -930136 -1046979 -763317 -767040 -1185183 -1363866 -1048048 -869570 -975478 -816244 -876483
11238h76483k45440J22030J42403K68585Q6930N7534O76863L20661k40629j17389
$$ -876483 -1121923 -999893 -857490 -588905 -501975 -444441 232422 553083 312454 195065
11228A95065K05665L34857m7162k55280l7866r4898j86631r516j14637k43466
$$ 195065 400730 735587 688425 433145 395279 300381 113750 104234 -10403 -253869
11218b53869q6848L2949K88993M88450J54422p728k8049k54103n88783o60589
$$ -253869 -340717 -307768 -18775 469675 624097 616369 588320 334217 -254566 -915155
11208i15155p2061M21246K31849j23263r913J77045m3339l35530n39627J4490
$$ -915155 -987216 -565970 -334121 -457384 -467297 -290252 -333591 -669121 -1208748 -1194258
11198a194258N80793J71361N5078K24035O8070n5302p7498J63080j1109j27996
$$ -1194258 -613465 -442104 -387026 -162991 -94921 -150223 -227721 -64641 -75750 -203746
11188b03746o9981J43115L91147K4161j46714k80152K9722L68722K25840l1857
$$ -203746 -273727 -130612 260535 284696 137982 -142170 -112448 256274 482114 450257
11178D50257K79062J48573l93250n94013m22733m0149k9535j5482M56849M06229
$$ 450257 729319 877892 484642 -109371 -532104 -572253 -601788 -617270 -160421 245808
11168B45808O4616m2531Q6670Q8648J05818q2690j32959o7193o2688o6160l98546
$$ 245808 310424 267893 354563 443211 549029 466339 333380 266187 203499 137339 -261207
11157b61207m42300m61093N3255K73609M17929N94308L74980l9800j40106m59901
$$ -261207 -703507 -1164600 -1111345 -837736 -419807 174501 549481 509681 369575 -90326
11147i0326l25202O0046K36862L24261J00558j74577m96821o39695q5427L75433
$$ -90326 -415528 -355482 -118620 205641 306199 131622 -365199 -1004894 -1090321 -714888
11137g14888L29344j10523k60267L08628j11536l71672J12110J85142Q5738J09527
$$ -714888 -385544 -496067 -756334 -447706 -559242 -930914 -818804 -633662 -547924 -438397
11127d38397M44812N98659O68j74903k43348j54011l8658P2956R797o62461q41060
$$ -438397 6415 605074 605742 430839 187491 33480 -5178 67778 77575 -584886 -1425946
11116a425946m40117L0256L16868J46360J94373L23151j03569k4229P98108O22480
$$ -1425946 -1866063 -1835807 -1518939 -1372579 -1178206 -855055 -958624 -982853 -184745 437735
11106D37735k1458J27434l3622k72410n03608l48063O2287Q3375J02358J98618
$$ 437735 416277 543711 510089 237679 -265929 -613992 -551705 -468330 -365972 -167354
11096a67354q4665k12067j27933K83597J29792k66362k84922q4908j29645L64243
$$ -167354 -252019 -464086 -592019 -308422 -178630 -444992 -729914 -814822 -944467 -580224
11086e80224K72630n5235P1242K1845r2932l94881n52452j11879L71713M42415
$$ -580224 -307594 -362829 -291587 -269742 -362674 -757555 -1310007 -1421886 -1050173 -607758
11076f07758J78850K20726L58980M00834M20511J32527J15354J56738Q0663M61966
$$ -607758 -428908 -208182 150798 551632 972143 1104670 1220024 1376762 1457425 1919391
11066A919391L58274n47395j091650l93470J99389n96083n31032p8053k00834
$$ 1919391 2277665 1730270 638620 245150 444539 -151544 -682576 -760629 -961463
11057i61463l0799L13657K44469O2668q8904j50690j05265q4693k99948L1337
$$ -961463 -992262 -678605 -434136 -371468 -460372 -611062 -716327 -801020 -1100968 -1069631
11047a069631N4550k14835n1146K01013K19862j52745m47749j68178Q3305K34302
$$ -1069631 -1015081 -1229916 -1281062 -1080049 -860187 -1012932 -1460681 -1628859 -1545554 -1311252
11037a311252M87518L85836k01299m17769J16915K15679L3846j78867l2905j74885
$$ -1311252 -823734 -437898 -639197 -1056966 -940051 -724372 -690526 -869393 -902298 -1077183
11027a077183p2103J47921J40590M2505K2936J5626R4957r6959j74535K80083
$$ -1077183 -1149286 -1001365 -860775 -818270 -795334 -779708 -684751 -781710 -956245 -676162
11017f76162K38483k04525l18839k19999J7432l49282l52043M67679R83929J97726
$$ -676162 -437679 -642204 -961043 -1181042 -1163610 -1512892 -1864935 -1397256 -413327 -215601
11007b15601K25814M28344o5185k27174j88744j27052j30165J11112J44588k6916
$$ -215601 10213 438557 373372 146198 -42546 -169598 -299763 -188651 -44063 -70979
10997g0979J06818m5813k02858j95817q1081O3241q948r5340L10958N53363J49735
$$ -70979 35839 -9974 -212832 -408649 -489730 -426489 -435437 -530777 -219819 333544 483279
10986D83279k67925m4111R9744o5291P7927m8084k4199j16289J93684J54085k41719
$$ 483279 215354 171243 270987 205696 283623 235539 211340 95051 288735 442820 201101
10975B01101l99554n2913l9971l72537k62155N1329K63402J5716o0604L43004
$$ 201101 -198453 -251366 -291337 -663874 -926029 -874700 -611298 -595582 -656186 -313182
10965c13182J46189J83389M94911L60055M6738k13512k93953q0834M1115q6161
$$ -313182 -166993 16396 511307 871362 918100 704588 410635 329801 370916 284755
10955B84755l02166m30700l16278K63490J14918N8290L30060K23923l65288l46447
$$ 284755 -17411 -448111 -764389 -500899 -385981 -327691 2369 226292 -138996 -485443
10945d85443O2386K03446J14024Q8832M09602L04481m81597k67932J82018L5605
$$ -485443 -423057 -219611 -105587 -16755 392847 697328 215731 -52201 129817 165422
10935A65422j64359j77169k78514j44421o568l4180k6658p4955j44660R0224J44556
$$ 165422 1063 -176106 -454620 -599041 -605609 -639789 -666447 -741402 -886062 -795838 -651282
10924f51282j98312k63666j78327L4212J24682J3343J55811J89453L21906j31154
$$ -651282 -849594 -1113260 -1291587 -1257375 -1132693 -1119350 -963539 -774086 -452180 -583334
10914e83334j80487l7058J317K2594O1642J6407j56765K64769L18199K75838n7407
$$ -583334 -763821 -800879 -799562 -776968 -715326 -698919 -855684 -590915 -272716 3122 -54285
10903e4285m00184n81733l42203K56637K11649K25308M10115J96599M09608J41275
$$ -54285 -454469 -1036202 -1378405 -1121768 -910119 -684811 -274696 -78097 331511 472786
10893D72786j78564k05456K9590j81070j21080j59242l30637j16378k2216M2112
$$ 472786 294222 88766 118356 -62714 -183794 -343036 -673673 -790051 -812267 -770155
10883g70155j1271J02724L43032L34747J77696k20930l36207N8457M05608L90184
$$ -770155 -781426 -678702 -335670 -923 176773 -44157 -380364 -321907 83701 473885
10873D73885J96630p0391n3468L48939P4339j87559o31866l34583K93618N7176
$$ 473885 670515 600124 546656 895595 969934 782375 150509 -184074 109544 166720
10863A66720l66295P8320J34661n5261k8631k61154k25114j44137J38582J33586
$$ 166720 -199575 -121255 13406 -41855 -70486 -331640 -556754 -700891 -562309 -428723
10853d28723L21258L83120l5435j89799l08723k00956j0885J89192L59298q568
$$ -428723 -107465 275655 240220 50421 -258302 -459258 -470143 -280951 78347 69779
10843F9779k11646j73645J1854r5032j95311J55798K15567O8159m4389J98995
$$ 69779 -141867 -315512 -303658 -398690 -594001 -438203 -222636 -154477 -198866 129
10833A29K21046J08809O5132k27591k30930l08504k46511l8218M4091j59773l27513
$$ 129 221175 329984 395116 167525 -63405 -371909 -618420 -656638 -612547 -772320 -1099833
10822a099833j0692p3413L06554N31545K99784J85052K18730M91418J34887k08314
$$ -1099833 -1110525 -1183938 -877384 -345839 -46055 138997 357727 849145 984032 775718
10812G75718j72594k81609r7760l05851l51205j37912J32837K95679M50019L31584
$$ 775718 603124 321515 223755 -82096 -433301 -571213 -438376 -142697 307322 638906
10802F38906m7578J6672k4146l3266j42382K0828M1158n7588Q1236J08433R080
$$ 638906 591328 608000 583854 550588 408206 429034 470192 412604 493840 602273 611353
10791F11353l16122l82737k37947K1965k11935j42172L20400J97433n2150n34213
$$ 611353 295231 -87506 -325453 -303488 -515423 -657595 -337195 -139762 -191912 -726125
10781g26125m25062J12533L20835O06259K11290k51028K66045L70193Q5521j90353
$$ -726125 -1151187 -1038654 -717819 -111560 99730 -151298 114747 484940 570461 380108
10771C80108j9425P3670K40642J41066l07820k7663Q4887l75878n74616j97774
$$ 380108 360683 434353 674995 816061 508241 480578 565465 189587 -385029 -582803
10761e82803M9839J49580K83286j98848k30463J98884N25808M1222j86932L2181
$$ -582803 -532964 -383384 -100098 -298946 -529409 -330525 195283 236505 49573 81754
10751H1754Q6143j74766l58562P647J53963J18029k83870k65605l3128N99689
$$ 81754 167897 -6869 -365431 -357784 -203821 -85792 -369662 -635267 -668395 -68706
10741f8706R01132M87287k53261l76802J90765N0385j03352l05609n12781k40877
$$ -68706 832426 1319713 1066452 689650 880415 930800 827448 521839 9058 -231819
10731b31819J53041j6177j50056k03088l30422j84859j1163K29252K34417P4425
$$ -231819 -78778 -94955 -245011 -448099 -778521 -963380 -974543 -745291 -510874 -436449
10721d36449l61665l92034J84498j253k51130j06673K47781M71272L72302N0010
$$ -436449 -798114 -1190148 -1005650 -1006903 -1258033 -1364706 -1116925 -645653 -273351 -223341
10711b23341L12875J01898k88836l28204l53008J75341L63573L30211R2506Q3915
$$ -223341 89534 191432 -97404 -425608 -778616 -603275 -239702 90509 183015 266930
10701B66930K21935j62979l50402k94548j52150K2152J67307J31832k9127K55483
$$ 266930 488865 325886 -24516 -319064 -471214 -449062 -281755 -149923 -179050 76433
10691G6433L63099n16406p33060m01800k15561j79831M11977N22290L28448p3822
$$ 76433 439532 -76874 -809934 -1211734 -1427295 -1607126 -1195149 -672859 -344411 -418233
10681d18233M26023O48921J63998L05631j39470k95669J85646n6203p78743k19066
$$ -418233 7790 656711 820709 1126340 986870 691201 876847 820644 41901 -177165
10671a77165P19470N69863r3318k85956l60029k62461j06541k55022j27174Q590
$$ -177165 542305 1112168 1018850 732894 372865 110404 3863 -251159 -378333 -369743
10661c69743o28152k33951L17706K71446P33570M94314K41061L83219j34881n07687
$$ -369743 -997895 -1231846 -914140 -642694 90876 585190 826251 1209470 1074589 566902
10651E66902k12523L14286K99818j79773j15375j01182j29772n564r9155l496
$$ 566902 354379 668665 968483 788710 673335 572153 442381 436817 337662 334166
10641C34166L25499J21437j80856j52122r2710r0958j91310q7523O4552L73163
$$ 334166 659665 781102 600246 448124 355414 264456 73146 -14377 50175 423338
10631D23338o9143n8850M7520l56368J37076L58861K02237K57334M04873M11666
$$ 423338 354195 295345 342865 -13503 123573 482434 684671 942005 1346878 1758544
10621A758544J89883p3072O72112J353705J347404M01934j129263j176833j128801
$$ 1758544 1948427 1875355 2547467 3901172 5248576 5650510 4521247 3344414 2215613
10612B215613o31988l7663J40865K7065m09316m22680k47312n4512J0552k20838
$$ 2215613 1583625 1545962 1686827 1713892 1304576 881896 634584 580072 590624 369786
10602C69786m1633j35486n09566o00459l16072l09952K74071K71916J41120j90419
$$ 369786 328153 192667 -316899 -917358 -1233430 -1543382 -1269311 -997395 -856275 -1046694
10592a046694j85137J48178J50276R3650M01773N29534J30068j93451j17640J84493
$$ -1046694 -1231831 -1083653 -933377 -839727 -437954 91580 221648 28197 -89443 95050
10582I5050R7292o5746n5310L3475K73243L5558k08758j00296r0843K23824l94711
$$ 95050 192342 126596 71286 104761 378004 413562 204804 104508 13665 237489 -157222
10571a57222n77935J60278M58651M26822K38096j96398k63632o3317j108K96546
$$ -157222 -735157 -574879 -116228 310594 548690 352292 88660 25343 24235 320781
10561C20781L49976R14P3875O6273j011k63249k20694j33799n4902J96912K6961
$$ 320781 670757 671671 745546 811819 810808 547559 326865 193066 138164 335076 362037
10550C62037q9381j29109O3407j36382m83498q8372K34213J21090k41500p9807
$$ 362037 272656 143547 206954 70572 -412926 -501298 -267085 -145995 -387495 -467302
10540d67302j19987r2622j03558m2760j4455L70545L61703j76984m8386J58534
$$ -467302 -587289 -679911 -783469 -826229 -840684 -470139 -108436 -285420 -333806 -175272
10530a75272Q7587J16746j89817j35901Q9963j27735k54755J48538L30534K86714
$$ -175272 -87685 29061 -160756 -296657 -206694 -334429 -589184 -440646 -110112 176602
10520A76602L56409P2200k65276j18460o0177o8395J0277m30787k09256q9542
$$ 176602 533011 605211 339935 221475 161298 92903 103180 -327607 -536863 -626405
10510f26405j5386L80964L49603K34248J45921R6561q2155J699J55307r7190l46475
$$ -626405 -641791 -260827 88776 323024 468945 565506 483351 485050 640357 543167 196692
10499A96692n24829j74429L8193K89832R5176m12705Q4040K93066K69699K46269
$$ 196692 -328137 -502566 -464373 -174541 -79365 -492070 -408030 -114964 154735 401004
10489D01004k58081l20295k08211o8625k23517o87465n24099K56341M53205M37459
$$ 401004 142923 -177372 -385583 -454208 -677725 -1365190 -1889289 -1632948 -1179743 -742284
10479g42284M20272Q1164j66271R7335L44244K50443P8309k82778L9335K14404
$$ -742284 -322012 -240848 -407119 -309784 34460 284903 363212 80434 119769 334173
10469C34173j92151j91375J42655p8501K14599j67085k55905L32615J70314K221
$$ 334173 142022 -49353 93302 14801 229400 62315 -193590 139025 309339 311560
10459C11560M4877k80508m84601l27137R2379O90862N37279Q4978k93248m49075
$$ 311560 356437 75929 -408672 -735809 -643430 47432 584711 669689 376441 -72634
10449g2634j20875K94068L72671P0785q969j50619n64863p51701l84719J76570
$$ -72634 -193509 100559 473230 544015 535046 384427 -180436 -932137 -1316856 -1140286
10439a140286K42638N50822N46242L32358k1899l77218m97141l96859R427R8458
$$ -1140286 -897648 -346826 199416 531774 509875 132657 -364484 -761343 -751916 -653458
10429f53458Q5435R1059J99359J20626n6177j31041J12850J98896K80363M03267
$$ -653458 -568023 -476964 -277605 -156979 -213156 -344197 -231347 -32451 247912 651179
10419F51179j68252k23088p2532l02059l01105j90256M6603l8226j3964L75336
$$ 651179 482927 259839 187307 -114752 -415857 -606113 -559510 -597736 -611700 -236364
10409b36364J73890K4445K2590j24565j10524J17295J27802k26929k72950J57668
$$ -236364 -62474 -38029 -15439 -140004 -250528 -133233 -5431 -232360 -505310 -347642
10399c47642J26667j79584l15365j36571K65645N46937K66933k86666k10436Q8533
$$ -347642 -220975 -400559 -715924 -852495 -586850 -39913 227020 -59646 -270082 -181549
10389a81549L2827n32231n18866l5953K059J88599J26321J76080K81371K54627
$$ -181549 -148722 -680953 -1199819 -1235772 -1233713 -1045114 -918793 -742713 -461342 -206715
10379b06715L12933K3970M7210m4366j67992Q6268K52021K66688l15221l5271
$$ -206715 106218 130188 177398 133032 -34960 51308 303329 570017 254796 219525
10369B19525J59372J11872l5226k57887Q6221r2746m60962q3095N7268j17691
$$ 219525 378897 490769 455543 197656 283877 191131 -269831 -352926 -295658 -413349
10359d13349n5120P1736K61833L82445J04610k0666j21506l9824O0328L60176
$$ -413349 -468469 -396733 -134900 247545 352155 331489 209983 170159 230487 590663
10349E90663k67880n13748j96939j20434L24474M54601Q01865N30677j91392k82480
$$ 590663 322783 -190965 -387904 -508338 -183864 270737 1072602 1603279 1411887 1129407
10339A129407q5410m3003J1229j43994j48216K28438K59249J0770k30585L08188
$$ 1129407 1043997 1000994 1012223 868229 720013 948451 1207700 1218470 987885 1296073
10329A296073P88885P37915Q23889Q05629L18855o85067r32703r77600p53119
$$ 1296073 2084958 2822873 3646762 4452391 4771246 4086179 3153476 2175876 1422757
10320A422757m64321o53214L1268M2109k38152R6519O5556j43168j32734J53816
$$ 1422757 958436 305222 336490 378599 140447 236966 302522 159354 26620 180436
10310A80436K17435K90635K33133j31552o78920m59599Q9156L61446p2125j89595
$$ 180436 397871 688506 921639 790087 111167 -348432 -259276 102170 30045 -159550
10300a59550q5367k21477k72819r9144L93472P46067M24707j40068k19384k89158
$$ -159550 -244917 -466394 -739213 -838357 -444885 301182 725889 585821 366437 77279
10290G7279l03384k03227L40382L19307J09826J82066K11338j28831p07705j27042
$$ 77279 -226105 -429332 -88950 230357 340183 522249 733587 604756 -102949 -229991
10280b29991M29226L17660k02768l49755j49117o7074k14880L1446J28701N3245
$$ -229991 199235 516895 314127 -35628 -184745 -251819 -466699 -435253 -306552 -253307
10270b53307M276k6320K68066K51055J28505k73742j67182L1944N374J59424j18429
$$ -253307 -249031 -275351 -7285 243770 372275 98533 -68649 -36705 -31331 128093 9664
10259I664j93710l74558j24980L51618K74839j76106j66187R2443J48375N9146
$$ 9664 -184046 -558604 -683584 -331966 -57127 -233233 -399420 -306977 -158602 -99456
10249i9456k57264l6651L76728Q2681l52686j52338m2076Q21K24308Q5026m3191
$$ -99456 -356720 -393371 -16643 66038 -286648 -438986 -481062 -480241 -255933 -170907 -214098
10238b14098J10164M48459K83627q273q2946j98688l01469j96637o6965j1946
$$ -214098 -103934 344525 628152 619879 536933 338245 36776 -159861 -226826 -238772
10228b38772K25884k7487k38402r344j68332k18824j9378j16216l41102K24548
$$ -238772 -12888 -40375 -278777 -288121 -456453 -675277 -694655 -810871 -1151973 -927425
10218i27425O23615K26963M2686J4885K25501j7074N5469P326K25376J61130l52347
$$ -927425 -303810 -76847 -34161 -19276 206225 189151 244620 251946 477322 638452 286105
10207B86105k21340j89153j4289M8608J67275J34899j00056l73042j09409K9193
$$ 286105 64765 -124388 -138677 -90069 77206 212105 112049 -260993 -370402 -341209
10197c41209j15932j17330K2043J55532P9483K4311j77471J8024L07757K27783
$$ -341209 -457141 -574471 -552428 -396896 -317413 -293102 -470573 -452549 -144792 82991
10187H2991p2627P3010J91055j35130l30055r9491p290n9280K01322Q9033m27434
$$ 82991 10364 83374 274429 139299 -190756 -290247 -297537 -356817 -155495 -66462 -493896
10176d93896k59131N6160J56668q604p8356l07219q1408L75667P09668M95836
$$ -493896 -753027 -696867 -540199 -548803 -627159 -934378 -1015786 -640119 69549 565385
10166E65385j80941l06541k16687m3768L10608j95406l65417J77952J01973J43097
$$ 565385 384444 77903 -138784 -182552 128056 -67350 -432767 -254815 -152842 -9745
10156i745L33534J37359J96539J0166k91726j68455K42973J98968R4403j4750
$$ -9745 323789 461148 657687 667853 376127 207672 450645 649613 744016 729266
10146G29266l77173j17345P3411L56249L4330k28356j35751K555K42638Q6838
$$ 729266 352093 234748 308159 664408 698738 470382 334631 337186 579824 666662
10136F66662j38827k54544j17070J32246J2951J08605J47124J90462J49842r8451
$$ 666662 527835 273291 156221 288467 301418 410023 557147 747609 897451 799000
10126G99000k84355j56856M99151O77465L93408J67649K7236L1365j04622L28428
$$ 799000 514645 357789 856940 1534405 1927813 2095462 2122698 2154063 2049441 2377869
10116B377869Q04645N19506N09197Q45280Q12691J068262K130257K873804L567407
$$ 2377869 3182514 3702020 4211217 5056497 5869188 6937450 9067707 11941511 15508918
10107A5508918M986917O621307N749706p71659o293171o075386m410357k979924
$$ 15508918 20495835 27117142 32866848 32095189 25802018 19726632 15316275 12336351
10099A2336351j878176j793200j566014p65007q93261r85663q97131j170708p99197
$$ 12336351 10458175 8664975 7098961 6333954 5440693 4455030 3557899 2387191 1587994
10090A587994j42021L0232l09416j93470P6822N0155k47262J22948j24652m45252
$$ 1587994 1445973 1476205 1166789 973319 1050141 1100296 853034 975982 851330 406078
10080D06078l42172l03076J26316J56642k7266O7641M9549k55895k73915j6023
$$ 406078 63906 -239170 -112854 43788 16522 84163 133712 -122183 -396098 -412121
10070d12121L20298K3645m75285m675K69863N3438R6909J79293K8208m17629k95788
$$ -412121 -91823 -68178 -543463 -548138 -278275 -224837 -127928 51365 79573 -338056 -633844
10059f33844K0578J41818J61780j32973l51430N5667K09357l46855k07805N09878
$$ -633844 -613266 -471448 -309668 -442641 -794071 -738404 -529047 -875902 -1083707 -573829
10049e73829K41155j13089J73030k9076p0455J9382K45891M10578K47123j04983
$$ -573829 -332674 -445763 -272733 -301809 -372264 -352882 -106991 303587 550710 445727
10039D45727m21631l76040k03483j03345K75546N26048K53748n03985m63278J79201
$$ 445727 24096 -351944 -555427 -658772 -383226 142822 396570 -107415 -570693 -391492
10029c91492K76427L97059K24483J46688j83998n55689k58210K73710Q6474k90696
$$ -391492 -115065 281994 506477 653165 469167 -86522 -344732 -71022 15452 -275244
10019b75244j45123m9600j00519k34745j09807L73374K79722n3970P7993j8317
$$ -275244 -420367 -469967 -570486 -805231 -915038 -541664 -261942 -315912 -237919 -256236
10009b56236Q4753K46407J23546J5581k39051l18702j17369K1367J48917M6072
$$ -256236 -171483 74924 198470 214051 -25000 -343702 -461071 -439704 -290787 -244715
9999b44715J33393O5181R3993j52376r3319M3212L96380L44920J27785m01678
$$ -244715 -111322 -46141 47852 -104524 -197843 -154631 241749 586669 714454 312776
9989C12776o63202n4490M12171K10750j52189j41272j82847j779K26265j34133
$$ 312776 -350426 -404916 7255 218005 65816 -75456 -258303 -260082 -33817 -167950
9979a67950m33531j18377L62927L43988Q9010K52067M8623j75371k17269j62036
$$ -167950 -601481 -719858 -356931 -12943 76067 328134 376757 201386 -15883 -177919
9969a77919m0701K2789j89036l99481k14093M01046M47666P5027n4048k26865
$$ -177919 -218620 -195831 -384867 -784348 -998441 -597395 -149729 -74702 -128750 -355615
9959c55615l74608j40462j10984J93411K37929r8668M1065P07862M78026j7475
$$ -355615 -730223 -870685 -981669 -788258 -550329 -648997 -607932 99930 577956 560481
9949E60481k73513k37567n54073n24010k93171J39355K08519L43355O8171o0480
$$ 560481 286968 49401 -504672 -1028682 -1321853 -1182498 -973979 -630624 -562453 -622933
9939f22933k1370L2001J35961K33716L37770k72771l48590J28639L83198K9562
$$ -622933 -644303 -612302 -476341 -242625 95145 -177626 -526216 -397577 -14379 15183
9929A5183k9932N1545p0702Q0817J4387J83182L83110o3827Q8037J84167l90254
$$ 15183 -14749 36796 -33906 46911 61298 244480 627590 563763 651800 835967 445713
$$ [...]
##END NTUPLES=NMR SPECTRUM
##END=
