##TITLE=C13_SL2-5ID-B(f8)
 CDCl3,  20200 sc

 2.09.2021
##JCAMPDX= 6.0         $$ Bruker NMR JCAMP-DX V2.0
##DATA TYPE= NMR SPECTRUM
##DATA CLASS= NTUPLES
##ORIGIN= UXNMR, Bruker Analytische Messtechnik GmbH
##OWNER= root
$$ XWIN-NMR		Version 3.5
$$ Fri Sep 24 09:03:13 2021 Russian Standard Time (UT+4h)  she@DPX200
##.OBSERVE FREQUENCY= 50.327896
##.OBSERVE NUCLEUS= ^13C
##.ACQUISITION MODE= SIMULTANEOUS
##.ACQUISITION SCHEME= undefined
##.AVERAGES= 20200
##.DIGITISER RES= 17
##SPECTROMETER/DATA SYSTEM= spect
##.PULSE SEQUENCE= zgpg30
##.SOLVENT NAME= DMF
##.SHIFT REFERENCE= (INTERNAL, DMF, 0, 222.668)
##AUDIT TRAIL= $$ (NUMBER, WHEN, WHO, WHERE, WHAT)
$$ ##TITLE= Audit trail, XWIN-NMR		Version 3.5
$$ ##JCAMPDX= 5.01
$$ ##ORIGIN= Bruker BioSpin GmbH
$$ ##OWNER= she
$$ F:/spectra/data/she/nmr/c13/1/pdata/1/auditp.txt
$$ ##AUDIT TRAIL=  $$ (NUMBER, WHEN, WHO, WHERE, WHAT)
(   1,<2021-09-24 09:00:32.59 +0400>,<she>,<DPX200>,
      <created by zg, POWCHK disabled, PULCHK disabled
       terminated by command 'halt'
       configuration hash MD5:
       00 E9 B6 7A A2 85 ED C7 34 08 36 98 17 FE 4E 26
       data hash MD5: 32K
       43 F2 38 A5 62 38 FB C7 1E 48 FE BD 58 81 D7 20>)
(   2,<2021-09-24 09:00:47.82 +0400>,<she>,<DPX200>,
      <Start of raw data processing
       efp BC_mod = 2 LB = 1 FT_mod = 6 PKNL = 1 PHC0 = -333.5457 PHC1 = 28.36238 SI = 32K 
       data hash MD5: 32K
       E0 3B 86 EB 9A AA 5C BB 2F 8A 90 5C 1C 17 52 5B>)
(   3,<2021-09-24 09:00:56.98 +0400>,<she>,<DPX200>,
      <abs ABSG = 5 
       data hash MD5: 32K
       E3 51 A2 D4 78 D7 08 A6 AD 15 CD 91 8A 86 40 86>)
(   4,<2021-09-24 09:01:33.76 +0400>,<she>,<DPX200>,
      <pk PHC0 = -0.7431123 PHC1 = 0 
       data hash MD5: 32K
       8C 7B EE B5 24 8A 16 3A EB D3 EF CB 73 F4 3D 10>)
(   5,<2021-09-24 09:01:37.06 +0400>,<she>,<DPX200>,
      <abs ABSG = 5 
       data hash MD5: 32K
       77 A1 EA D5 59 94 3F 40 50 59 59 54 35 DB 71 2B>)
$$ ##END=
$$ 
$$ hash MD5
$$ 94 FE 40 EC B9 89 7B CE F0 D8 46 75 08 66 41 3B
##$RELAX= 
##$RELAX= 
##$RELAX= 
##$RELAX= 
##$RELAX= 
##$RELAX= 
##$RELAX= 
##$RELAX= 
$$ Bruker specific parameters
$$ --------------------------
##$DU= <F:/spectra>
##$EXPNO= 1
##$NAME= <c13>
##$PROCNO= 1
##$TYPE= <nmr>
##$USER= <she>
##$AMP= (0..31)
100 100 100 100 100 100 100 100 100 100 100 100 100 100 100 100 100 100 
100 100 100 100 100 100 100 100 100 100 100 100 100 100 
##$AQSEQ= 0
##$AQ_mod= 1
##$AUNM= <au_zg>
##$AUTOPOS= <>
##$BF1= 50.322709
##$BF2= 200.13
##$BF3= 50.322709
##$BF4= 500.13
##$BF5= 500.13
##$BF6= 500.13
##$BF7= 500.13
##$BF8= 500.13
##$BYTORDA= 1
##$CFDGTYP= 0
##$CFRGTYP= 5
##$CHEMSTR= <none>
##$CNST= (0..31)
1 1 145 1 1 1 1 1 1 1 1 1 1 1 1 1 1 1 1 1 1 1 1 1 1 1 1 1 1 1 1 1 
##$CPDPRG= <waltz16>
##$CPDPRG1= <>
##$CPDPRG2= <waltz16>
##$CPDPRG3= <>
##$CPDPRG4= <mlev>
##$CPDPRG5= <mlev>
##$CPDPRG6= <mlev>
##$CPDPRG7= <mlev>
##$CPDPRG8= <mlev>
##$CPDPRGB= <>
##$CPDPRGT= <>
##$D= (0..31)
$$ [...]
##$SUBNAM4= <"">
##$SUBNAM5= <"">
##$SUBNAM6= <"">
##$SUBNAM7= <"">
##$SUBNAM8= <"">
##$SUBNAM9= <"">
##$SW= 239.972175391363
##$SWIBOX= (0..15)
0 1 3 0 0 0 0 0 0 0 0 0 0 0 0 0 
##$SW_h= 12077.2946859903
##$TD= 32768
##$TD0= 1
##$TE= 0
##$TE2= 300
##$TE3= 300
##$TEG= 300
##$TL= (0..7)
120 120 120 120 120 120 120 120 
##$TP= (0..7)
150 150 150 150 150 150 150 150 
##$TP07= 0
##$TPNAME0= <>
##$TPNAME1= <>
##$TPNAME2= <>
##$TPNAME3= <>
##$TPNAME4= <>
##$TPNAME5= <>
##$TPNAME6= <>
##$TPNAME7= <>
##$TPOAL= (0..7)
0.5 0.5 0.5 0.5 0.5 0.5 0.5 0.5 
##$TPOFFS= (0..7)
0 0 0 0 0 0 0 0 
##$TUNHIN= 0
##$TUNHOUT= 0
##$TUNXOUT= 0
##$USERA1= <user>
##$USERA2= <user>
##$USERA3= <user>
##$USERA4= <user>
##$USERA5= <user>
##$V9= 5
##$VALIST= <valist>
##$VCLIST= <CCCCCCCCCCCCCCC>
##$VD= 0
##$VDLIST= <DDDDDDDDDDDDDDD>
##$VPLIST= <PPPPPPPPPPPPPPP>
##$VTLIST= <TTTTTTTTTTTTTTT>
##$WBST= 1024
##$WBSW= 4
##$XGAIN= (0..3)
0 0 0 0 
##$XL= 0
##$YL= 0
##$YMAX_a= 120969761
##$YMIN_a= -28599575
##$ZGOPTNS= <>
##$ZL1= 120
##$ZL2= 120
##$ZL3= 120
##$ZL4= 120
##$ABSF1= 222.6679
##$ABSF2= -17.32892
##$ABSG= 5
##$ABSL= 3
##$ALPHA= 0
##$AQORDER= 0
##$ASSFAC= 0
##$ASSFACI= 0
##$ASSFACX= 0
##$ASSWID= 0
##$AUNMP= <proc_1d>
##$AZFE= 0.1
##$AZFW= 0.5
##$BCFW= 0
##$BC_mod= 2
##$BYTORDP= 0
##$COROFFS= 0
##$CY= -3
##$DATMOD= 1
##$DC= 0
##$DFILT= <>
##$DTYPP= 0
##$F1P= 0
##$F2P= 0
##$FCOR= 0.5
##$FTSIZE= 32768
##$FT_mod= 6
##$GAMMA= 0
##$GB= 0
##$INTBC= 1
##$INTSCL= 4.134877e-10
##$ISEN= 128
##$LB= 1
##$LEV0= 0
##$LPBIN= 0
##$MAXI= 10000
##$MC2= 0
##$MEAN= 0
##$ME_mod= 0
##$MI= 0.1934396
##$NCOEF= 0
##$NC_proc= 2
##$NLEV= 6
##$NOISF1= 120.0001
##$NOISF2= 80.00006
##$NSP= 0
##$NTH_PI= 0
##$NZP= 0
##$OFFSET= 222.6679
##$PC= 1.4
##$PHC0= -334.2888
##$PHC1= 28.36238
##$PH_mod= 1
##$PKNL= yes
##$PPARMOD= 0
##$PSCAL= 0
##$PSIGN= 0
##$REVERSE= no
##$SF= 50.3227293897603
##$SI= 32768
##$SIGF1= 140
##$SIGF2= 120
##$SINO= 11.81781
##$SIOLD= 32768
##$SREGLST= <13C.CDCl3>
##$SSB= 0
##$STSI= 32768
##$STSR= 0
##$SW_p= 12077.2946859903
##$SYMM= 0
##$S_DEV= 0
##$TDeff= 32768
##$TDoff= 0
##$TI= <>
##$TILT= no
##$TM1= 0
##$TM2= 0
##$TOPLEV= 0
##$USERP1= <user>
##$USERP2= <user>
##$USERP3= <user>
##$USERP4= <user>
##$USERP5= <user>
##$WDW= 1
##$XDIM= 32768
##$YMAX_p= 498518868
##$YMIN_p= -2349745
$$ End of Bruker specific parameters
$$ ---------------------------------
##NTUPLES= NMR SPECTRUM
##VAR_NAME=  FREQUENCY,     SPECTRUM/REAL,   SPECTRUM/IMAG
##SYMBOL=    X,             R,               I
##VAR_TYPE=  INDEPENDENT,   DEPENDENT,       DEPENDENT
##VAR_FORM=  AFFN,          ASDF,            ASDF
##VAR_DIM=   32768,         32768,           32768
##UNITS=     HZ,            ARBITRARY UNITS, ARBITRARY UNITS
##FACTOR=    0.368581032318806, 1,           1
##FIRST=     11205.2560958543, 0,            0
##LAST=      -872.038590136011, 0,           0
##MIN=       -872.038590136011, -2349745,    0
##MAX=       11205.2560958543, 498518868,    0
$$ Real data points
##PAGE= N=1
##DATA TABLE= (X++(R..R)), XYDATA
$$ [...]
$$ plain form
15724 -346161 -168027 130049 244022 589517 714354 733883 648138 527109 38049 -128610
15714 -128610 161215 120598 222092 866114 1191823 1308553 1238094 829989 839966 803294
15704 803294 762378 877447 943815 1171753 1298984 906854 607281 274363 162009 -235295
15694 -235295 -708937 -668881 -278427 -247275 -118814 19091 -272910 -439592 -256314 -236533
15684 -236533 -835309 -1119458 -689452 -276906 -2776 246293 301874 321296 220791 -134962
15674 -134962 -181222 -275262 -557422 -596005 -607635 -822788 -615418 -414725 -399945 -203142
15664 -203142 -343301 -244320 -43345 -234155 -456431 -144748 231223 369491 475580 -238903
15654 -238903 -1118509 -1440314 -1653969 -1589282 -1293570 -848465 -339375 -194575 -233601 -236273
$$ packed form
15724c46161J78134K98076J13973L45495J24837J9529q5745j21029m89060j66659
15714a28610K89825m0617J01494O44022L25709J16730p0459m08105R977l6672
15704H03294m0916J15069O6368K27938J27231l92130k99573l32918j12354l97304
15694b35295m73642M0056L90454L1152J28461J37905k92001j66682J83278J9781
15684b36533n98776k84149M30006M12546K74130K49069N5581J9422j00505l55753
15674a34962m6260r4040k82160l8583j1630k15153K07370K00693J4780J96803
15664b03142j40159R8981K00975j90810k22276L11683L75971J38268J06089p14483
15654b38903q79606l21805k13655O4687K95712M45105N09090J44800l9026k672
$$ plain form
15644 -236273 -495112 -521192 -146384 -79276 -330736 -57365 483292 553448 436291 -27250
15634 -27250 -806421 -1087136 -1146460 -1168970 -973275 -1170226 -1341241 -926829 -125683 246183
15624 246183 102137 -153996 -197207 -337717 -352480 -351251 -156570 -57357 -163138 -275707
15614 -275707 154895 914192 1600665 2054231 2255453 2159721 1830094 1547254 1500888 1528671
15604 1528671 1329604 825418 433429 114075 171832 459157 770080 844341 455988 294751
15594 294751 455915 378523 32399 -326599 -575039 -561787 -732443 -1037189 -739722 -528225
15584 -528225 -748287 -665454 -200700 330998 471229 241262 -37888 -254988 -957599 -1494819
15574 -1494819 -1484928 -1531268 -1384409 -919188 -907853 -1493319 -1563712 -1634047 -1624616 -1405601 -1077390
$$ packed form
15644b36273k58839k6080L74808O7108k51460K73371N40657P0156j17157m63541
15634b7250p79171k80715n9324k2510J95695j96951j71015M14412Q01146L71866
15624B46183j44046k56133m3211j40510j4763J229J94681R9213j05781j12569
15614b75707M30602P59297O86473M53566K01222r5732l29627k82840m6366K7783
15604A528671j99067n04186l91989l19354N7757K87325L10923P4261l88353j61237
15594B94751J61164p7392l46124l58998k48440J3252j70656l04746K97467K11497
15584e28225k20062Q2833M64754N31698J40231k29967k79150k17100p02611n37220
15574a494819R891m6340J46859M65221J1335n85466p0393p0335R431K19015L28211
$$ plain form
15563 -1077390 -713547 -676081 -489320 -408774 -411786 -621423 -591232 -282440 -76383 318342
15553 318342 320746 -67208 -115962 -74468 126230 708655 931434 878283 885743 841510 633082
15542 633082 506504 616463 667044 595104 606670 537730 586796 667111 448879 -35917 -607192
15531 -607192 -989833 -1165712 -486562 421119 441519 33894 -254192 -428483 -430486 -547603
15521 -547603 -1102111 -1366250 -1444547 -1485031 -1146390 -975015 -706439 -337604 -674655 -1081722
15511 -1081722 -1266459 -1369312 -1050234 -1044609 -1309358 -1350641 -1179889 -361094 418579 865487
15501 865487 1014966 508701 -118532 -319933 -348593 -746555 -900542 -725200 -541144 -371746
15491 -371746 -241528 114690 150628 73021 -313281 -535914 -327053 -316229 -43798 486340
$$ packed form
15563a077390L63843L7466J86761Q0546l012k09637L0191L08792K06057L94725
15553C18342K404l87954m8754M1494K00698N82425K22779n3151P460m4233k08428
15542F33082j26578J09959N0581p1940J1566o8940M9066Q0315k18232m84796n71275
15531f07192l82641j75879O79150R07681K0400m07625k88086j74291k003j17117
15521e47603n54508k64139p8297m0484L38641J71375K68576L68835l37051m07067
15511a081722j84737j02853L19078N625k64749m1283J70752Q18795P79673M46908
15501H65487J49479n06265o27233k01401k8660l97962j53987J75342J84056J69398
15491c71746J30218L56218L5938p7607l86302k22633K08861J0824K72431N30138
$$ plain form
15481 486340 328962 -178057 -449919 -728259 -1028068 -1044049 -503748 325762 1009234 867950
15471 867950 17915 -410301 112940 807661 982411 602062 -85391 -379510 62331 119225
15461 119225 -330705 -714546 -697855 -668948 -456823 -412185 -327018 -44889 112846 -168646
15451 -168646 -651811 -922134 -772918 -569398 -387663 -286196 -257037 -392273 -702491 -990725
15441 -990725 -993386 -947687 -879703 -662952 -553404 -281110 318858 558629 288466 57496
15431 57496 -25537 50203 124712 -53947 -312907 -366671 -287640 -428610 -234656 231330 598637
15420 598637 720368 430943 233198 278941 444465 -84714 -504761 -256277 532653 798720
15410 798720 752996 952233 1259248 1487057 1143284 765362 648968 299064 -98498 -304056
$$ packed form
15481D86340j57378n07019k71862k78340k99809j5981N40301Q29510O83472j41284
15471H67950q50035m28216N23241O94721J74750l80349o87453k94119M41841N6894
15461A19225m49930l83841J6691K8907K12125M4638Q5167K82129J57735k81492
15451a68646m83165k70323J49216K03520J81735J01467K9159j35236l10218k88234
15441i90725k661M5699O7984K16751J09548K72294N99968K39771k70163k30970
15431E7496q3033P5740P4509j78659k58960n3764P9031j40970J93954M65986L67307
15420E98637J21731k89425j97745M5743J65524n29179m20047K48484P88930K66067
15410G98720m5724J99237L07015K27809l43773l77922j16394l49904l97562k05558
$$ plain form
15400 -304056 -482143 -571334 -594553 -609003 -887999 -679027 -418025 -551186 -555938 -381957
15390 -381957 50175 422995 215410 70292 387549 596563 478927 170288 -168324 -122108
15380 -122108 -324189 -549470 -378935 109864 539710 1006806 841377 256309 40829 532785
15370 532785 740700 374564 288551 135458 -181253 -390230 -884519 -1122181 -869653 -561738
15360 -561738 -401720 -544918 -665331 -621473 -752478 -1048416 -1128840 -1009403 -932402 -1072242
15350 -1072242 -1070077 -570797 190738 682825 468803 -242605 -672565 -892185 -862542 -1011258
15340 -1011258 -1007418 -943687 -931586 -541914 -326323 -140651 -55440 -285355 -524813 -396645
15330 -396645 -61080 -182306 -818930 -860442 -722214 -812867 -653478 -678214 -519982 -119863
$$ packed form
15400c04056j78087q9191k3219j4450k78996K08972K61002j33161m752J73981
15390c81957M32132L72820k07585j45118L17257K09014j17636l08639l38612M6216
15380a22108k02081k25281J70535M88799M29846M67096j65429n85068k15480M91956
15370E32785K07915l66136q6013j53093l16711k08977m94289k37662K52528L07915
15360e61738J60018j43198j20413M3858j31005k95938q0424J19437P7001j39840
15350a072242K165M99280P61535M92087k14022p11408m29960k19620K9643j48716
15340a011258L840O3731J2101L89672K15591J85672Q5211k29915k39458J28168
15330c96645L35565j21226o36624m1512J38228r0653J59389k4736J58232M00119
$$ plain form
15320 -119863 -42777 -373641 -520130 -352451 -176994 -325727 -349213 -673455 -859454 -224009
15310 -224009 390962 523085 344807 207727 217893 251302 374943 703144 732997 362427
15300 362427 262838 137088 -252401 -670576 -622329 -382382 -307189 -332740 -431049 -312597
15290 -312597 -322249 -337899 -91357 -63387 -219658 -346369 -505156 -714956 -827143 -576346
15280 -576346 -358715 -456828 -481487 -624368 -916678 -806444 -191305 239825 169600 -30161
15270 -30161 -159393 129008 -177320 -855969 -799901 -613317 -843391 -816445 -928689 -823515
15260 -823515 -483908 -552325 -229869 125654 -99281 -557310 -749502 -133538 296007 603119
15250 603119 1072394 1223538 1098141 595430 28501 -215524 -180071 63017 363218 77733
$$ packed form
15320a19863P7086l30864j46489J67679J75457j48733k3486l24242j85999O35445
15310b24009O14971J32123j78278j37080J0166L3409J23641L28201K9853l70570
15300C62427r9589j25750l89489m18175M8247K39947P5193k5551r8309J18452
15290c12597r652j5650K46542K7970j56271j26711j58787k09800j12187K50797
15280e76346K17631r8113k4659j42881k92310J10234O15139M31130p0225j99761
15270c0161j29232K88401l06328o78649N6068J86584k30074K6946j12244J05174
15260h23515L39607o8417L22456L55523k24935m58029j92192O15964M29545L07112
15250F03119M69275J51144j25397n02711n66929k44025L5453K43088L00201k85485
$$ plain form
15240 77733 -457485 -313647 -15441 -329343 -576097 -790331 -1172369 -1284259 -1227911 -1128618
15230 -1128618 -1002929 -883685 -957572 -1287055 -1206920 -728406 -349574 108417 561753 809354
15220 809354 897838 806522 773001 983903 861147 618866 824691 939538 695271 528182
15210 528182 603970 463763 349893 544042 808146 1061787 1012161 592262 380364 384917
15200 384917 336530 -52549 -293999 -251505 47659 159910 -478265 -1051445 -1268726 -1408338
15190 -1408338 -1579385 -1641911 -1683938 -1747484 -1927602 -2080188 -2103591 -1972519 -1297959 -807091
15180 -807091 -559688 -288355 236335 303065 -9281 138835 429971 592087 909632 1137362
15170 1137362 1473282 1731810 1692866 1453958 1109789 465118 -258489 -615768 -936066 -953575
$$ packed form
15240G7733n35218J43838K98206l13902k46754k14234l82038j11890N6348R9293
15230a128618J25689J19244p3887l29483Q0135M78514L78832M57991M53336K47601
15220H09354Q8484r1316l3521K10902j22756k42281K05825J14847k44267j67089
15210E28182P5788j40207j13870J94149K64104K53641m9626m19899k11898M553
15200C84917m8387l89079k41450M2494K99164J12251o38175n73180k17281j39612
15190a408338j71047o2526m2027o3546j80118j52586k3403J31072O74560M90868
15180h07091K47403K71333N24690O6730l12346J48116K91136J62116L17545K27730
15170A137362L35920K58528l8944k38908l44169o44671p23607l57279l20298j7509
$$ plain form
15160 -953575 -756393 -828457 -619617 -280432 -197321 -632468 -768434 -280456 -85828 -435
15150 -435 202897 127795 -331699 -625951 -1050917 -1203938 -383083 435487 693810 471644
15140 471644 265962 389298 337388 1480 -131397 -199342 -313323 -102467 -109087 -176438
15130 -176438 -357232 -304989 166250 360258 413520 531380 421155 224181 208309 349164
15120 349164 468547 542077 618375 523551 359078 245293 301366 105833 -284077 -391814
15110 -391814 -298537 144198 150105 -474690 -874028 -975482 -967344 -540836 -310523 -608521
15100 -608521 -764886 -949573 -993634 -795582 -612094 -550372 -397354 -228347 -183637 -624092
15090 -624092 -1271663 -1351009 -1006802 -911281 -1071510 -1358213 -1397445 -1408992 -1283201 -1141676
$$ packed form
15160i53575J97182p2064K08840L39185Q3111m35147j35966M87978J94628Q5393
15150d35K03332p5102m59494k94252m24966j53021Q20855Q18570K58323k22166
15140D71644k05682J23336n1910l35908j32877o7945j13981K10856o620o7351
15130a76438j80794N2243M71239J94008N3262J17860j10225j96974j5872J40855
15120C49164J19383P3530P6298r4824j64473j13785N6073j95533l89910j07737
15110c91814R3277M42735N907o24795l99338j01454Q138M26508K30313k97998
15100f08521j56365j84687m4061J98052J83488O1722J53018J69007M4710m40455
15090f24092o47571p9346L44207R5521j60229k86703l9232j1547J25791J41525
$$ plain form
15080 -1141676 -769203 -457775 -688583 -636756 -248581 139600 236126 170319 244156 311645
15070 311645 352877 528629 608275 597976 805471 831432 550228 379599 797246 780852
15060 780852 451461 350685 422979 235927 240962 328641 167807 -14465 -137798 -243160
15050 -243160 -80525 308936 670032 941374 960066 749797 422759 146551 -413138 -851826
15040 -851826 -843094 -750781 -651663 -464882 -358138 -118090 -167998 -58320 -84321 64227 415094
15029 415094 494853 581830 118240 -293365 -20352 234036 211332 16257 204503 470645
15019 470645 608346 576199 484190 183134 12955 -34079 -90340 -96125 -285266 -110577 433051
15008 433051 695424 486198 188058 148549 -44167 -219450 -472651 -479253 -21577 152712
$$ packed form
15080a141676L72473L11428k30808N1827L88175L88181R6526o5807P3837O7489
15070C11645M1232J75752P9646j0299K07495K5961k81204j70629M17647j6394
15060G80852l29391j00776P2294j87052N035Q7679j60834j82272j23333j05362
15050b43160J62635L89461L61096K71342J8692k10269l27038k76208n59689m38688
15040h51826Q732R2313R9118J86781J06744K40048m9908J09678k6001J48548L50867
15029D15094P9759Q6977m63590m11605K73013K54388k2704j95075J88246K66142
15019D70645J37701l2147r2009l01056j70179m7034n6261n785j89141J74689N43628
15008D33051K62373k09226k98140l9509j92716j75283k53201o602M57676J74289
$$ plain form
14998 152712 -214731 -745010 -728691 -511906 -580040 -734170 -873962 -672937 -469263 -797803
14988 -797803 -1149360 -928484 -532893 -485444 -580308 -547948 -765636 -722417 -628234 -653365 -519581
14977 -519581 -860259 -1165855 -1390188 -1637326 -1522050 -1473079 -1795205 -1817434 -1535979 -1644430
14967 -1644430 -1913667 -1551480 -893884 -295010 -88734 -416449 -808245 -958292 -1020264 -1047500
14957 -1047500 -816833 -377822 -143423 81326 286723 568192 766647 897803 999852
14948 999852 822202 326760 64577 -105341 -152251 -327296 -582740 -752320 -682418 -791624
14938 -791624 -799655 -745949 -788826 -471612 -242259 -111142 314716 943751 1217719 1095521
14928 1095521 949647 941368 1127734 1025880 637294 475544 422034 539512 393081 16380
$$ packed form
14998A52712l67443n30279J6319K16785o8134j54130j39792K01025K03674l28540
14988g97803l51557K20876L95591M7449r4864L2360k17688M3219R4183k5131J33784
14977e19581l40678l05596k24333k47138J15276M8971l22126k2229K81455j08451
14967a644430k69237L62187O57596N98874K06276l27715l91796j50047o1972k7236
14957a047500K30667M39011K34399K24749K05397K81469J98455J31156J02049
14948I99852j77650m95442k62183j69918m6910j75045k55444j69580O9902j09206
14938g91624q031N3706m2877L17214K29353J31117M25858O29035K73968j22198
14928A095521j45874q279J86366j01854l88586j61750n3510J17478j46431l76701
$$ plain form
14918 16380 -266650 -487081 -479112 -262749 -720594 -643698 -142080 -283770 -400500 -535388
14908 -535388 -797602 -988396 -1146276 -960788 -629605 -80302 240161 344747 563955 566676
14898 566676 732055 984732 712561 48924 -495347 -519264 -752051 -773970 -627607 -357338
14888 -357338 -25127 102251 -90848 257797 574048 383344 86851 91170 560282 603314
14878 603314 383282 315534 223508 212690 26176 -192050 -163546 -431823 -554048 -718919
14868 -718919 -1163154 -1453480 -1257411 -916104 -866021 -877213 -681266 -310902 51139 302155
14858 302155 267471 395367 159701 29641 192931 359025 203577 -344038 -346712 -91487
14848 -91487 -149082 -209273 -145743 -264798 -324757 214018 668017 644118 21614 -361150 -568535
$$ packed form
14918A6380k83030k20431P969K16363m57845P6896N01618j41690j16730j34888
14908e35388k62214j90794j57880J85488L31183N49303L20463J04586K19208K721
14898E66676J65379K52677k72171o63637n44271k3917k32787k1919J46363K70269
14888c57338L32211J27378j93099L48645L16251j90704k96493M319M69112M3032
14878F03314k20032o7748r2026j0818j86514k18226K8504k68277j22225j64871
14868g18919m44235k90326J96069L41307N0083j1192J95947L70364L62041K51016
14858C02155l4684J27896k35666j30060J63290J66094j55448n47615k674K55225
14848i1487n7595o0191O3530j19055n9959N38775M53999k3899o22504l82764k07385
$$ plain form
14837 -568535 -540881 -432450 -684102 -621376 -100527 372467 112405 -34069 273005 481200
14827 481200 496252 421398 169151 398661 756700 670272 517129 239033 -36405 109310
14817 109310 255339 202208 -101261 -25296 171708 358753 289621 23206 19524 -96895
14807 -96895 -344594 -353828 -172510 169800 722856 718044 481261 543205 735972 843765 758772
14796 758772 267481 -219093 -15937 97716 132034 30401 -181721 -290467 -274401 -166181
14786 -166181 -397080 -871606 -829627 -715625 -944308 -1325876 -1611079 -1835970 -1820791 -1263259
14776 -1263259 -633986 22696 258824 469208 383027 381080 402944 285457 440639 386321
14766 386321 215597 124215 130621 196615 329513 19678 -403493 -322056 -30615 -354979
$$ packed form
14837e68535K7654J08431k51652O2726N20849M72994k60062j46474L07074K08195
14827D81200J5052p4854k52247K29510L58039q6428j53143k78096k75438J45715
14817A09310J46029n3131l03469P5965J97004J87045o9132k66415l682j16419
14807i6895k47699r234J81318L42310N53056m812k36783O1944J92767J07793q4993
14796G58772m91291m86574K03156J13653L4318j01633k12122j08746J6066J08220
14786a66181k30899m74526M1979J14002k28683l81568k85203k24891J5179N57532
14776a263259O29273O56682K36128K10384q6181j947K1864j17487J55182n4318
14766C86321j70724r1382O406O5994J32898l09835m23171Q1437K91441l24364
$$ plain form
14756 -354979 -419883 -205977 -266224 -399183 -442169 -329990 -336343 -471387 -836096 -906404 -822795
14745 -822795 -990545 -969390 -1007301 -971233 -747574 -370474 161118 493169 422959 8171
14735 8171 -340664 -105924 454754 921726 863993 672412 181492 -475142 -518880 -443869
14725 -443869 -69117 189473 182012 480765 686887 861689 783944 630892 524845 510718
14715 510718 626393 495722 425924 727252 947992 681608 380128 79764 435904 1048877
14705 1048877 1023793 718763 416857 410835 469329 287022 236221 412336 519119 244006
14695 244006 -5085 -95802 55389 489625 1103659 730315 -59849 -689842 -832866 -660882
14685 -660882 -427831 -214491 -469965 -400625 -130000 -196361 124296 144840 -3298 182487
$$ packed form
14756c54979o4904K13906o0247j32959m2986J12179o353j35044l64709p0308Q3609
14745h22795j67750K1155l7911L6068K23659L77100N31592L32051p0210m14788
14735H171l48835K34740N60678M66972n7733j91581m90920o56634m3738P5011
14725d43869L74752K58590p461K98753K06122J74802p7745j53052j06047j4127
14715E10718J15675j30671o9798L01328K20740k66384l01480l00364L56140O12973
14705A048877k5084l05030l01906o022N8494j82307n0801J76115J06783k75113
14695B44006k49091r0717J51191M34236O14034l73344p90164o29993j43024J71984
14685f60882K33051K13340k55474O9340K70625o6361L20657K0544j48138J85785
$$ plain form
14675 182487 51147 -193672 -288860 -406459 -676232 -792771 -407868 -79827 -282129 -691215
14665 -691215 -1032354 -1477365 -1614032 -1098345 -561972 -86885 -177701 -107049 -122327 -438609
14655 -438609 -624207 -455971 -2879 284819 125764 -175677 46263 450696 600942 567941
14645 567941 453851 187550 -25475 -288578 -331491 325193 613687 150750 -348504 -630422
14635 -630422 -596962 -427273 -318239 -76493 520139 978721 850784 797614 641725 238376
14625 238376 45676 495204 733055 828145 731680 368921 235558 773399 1252358 1154939
14615 1154939 936872 1021304 992639 668316 764426 1250670 1368198 926657 255744 -201123
14605 -201123 -152168 198253 374462 474468 199926 -202414 -273430 -279999 -96349 78367
$$ packed form
14675A82487j31340k44819r5188j17599k69773j16539L84903L28041k02302m09086
14665f91215l41139m45011j36667N15687N36373M75087r0816P0652j5278l16282
14655d38609j85598J68236M53092K87698j59055l01441K21940M04433J50246l3001
14645E67941j14090k66301k13025k63103m2913O56684K88494m62937m99254k81918
14635f30422L3460J69689J09034K41746N96632M58582j27937n3170j55889m03349
14625B38376j92700M49528K37851R5090r6465l62759j33363N37841M78959r7419
14615A154939k18067Q4432k8665l24323R6110M86244J17528m41541o70913m56867
14605b01123M8955L50421J76209J00006k74542m02340p1016o569J83650J74716
$$ plain form
14595 78367 -170758 -128338 -61512 213 436050 479245 159668 67551 410470 661021 644710
14584 644710 621189 746756 491947 465104 520501 300258 331173 241986 97112 113140 162636
14573 162636 91826 -155409 -180682 -261143 -473138 -252397 169370 558058 673433 345563
14563 345563 -104225 89747 201111 -171766 -540399 -159626 225194 203966 215134 364955
14553 364955 573371 994756 890300 563284 719302 675508 441238 209161 225362 320623
14543 320623 241462 50680 -127859 91138 225236 287667 314753 -155549 -297640 -29015
14533 -29015 283130 267187 -121437 -513392 -686524 -878283 -999909 -819759 -453362 -345203
14523 -345203 -657520 -709760 -501648 -447234 -267022 11057 -28467 -57911 65138 234555
$$ packed form
14595G8367k49125M2420O6826O1725M35837M3195l19577r2117L42919K50551j6311
14584F44710k3521J25567k54809k6843N5397k20243L0915q9187j44874J6028M9496
14573A62636p0810k47235k5273q0461k11995K20741M21767L88688J15375l27870
14563C45563m49788J93972J11364l72877l68633L80773L84820k1228J1168J49821
14553C64955K08416M21385j04456l27016J56018m3794k34270k32077J6201R5261
14543C20623p9161j90782j78539K18997J34098O2431K7086m70302j42091K68625
14533b9015L12145j5943l88624l91955j73132j91759j21626J80150L66397J08159
14523c45203l12317n2240K08112N4414J80212K78079l9524k9444J23049J69417
$$ plain form
14513 234555 -37716 -352297 -316117 -263044 -465688 -301162 75572 344704 527146 421056
14503 421056 325142 75893 -48128 125591 254820 376459 202820 -573423 -939548 -1134301
14493 -1134301 -1240112 -1163158 -875144 -881352 -1186307 -1534327 -1479998 -1033187 -754797 -474039
14483 -474039 -343049 -390672 -160036 -128186 -148096 -157841 -380588 -783371 -1115636 -796737
14473 -796737 -280134 366976 554808 422085 461008 238011 77959 -106583 -380001 -442977
14463 -442977 -794990 -1037661 -797013 -594319 -256652 -48606 -274289 -277440 103379 283436
14453 283436 196807 65211 -180380 50637 573711 664172 734219 495150 340509 237243
14443 237243 55117 -101523 -211054 56514 292710 167263 -91946 -156648 -121043 81359
$$ packed form
14513B34555k72271l14581L6180N3073k02644J64526L76734K69132J82442j06090
14503D21056r5914k49249j24021J73719J29229J21639j73639p76243l66125j94753
14493a134301j05811P6954K88014o208l04955l48020N4329M46811K78390K80758
14483d74039J30990m7623K30636L1850j9910r745k22747m02783l32265L18899
14473g96737N16603O47110J87832j32723L8923k22997j60052j84542k73418o2976
14463d42977l52013k42671K40648K02694L37667K08046k25683l151L80819J80057
14453B83436q6629j31596k45591K31017N23074R0461P0047k39069j54641j03266
14443B37243j82126j56640j09531K67568K36196j25447k59209o4702L5605K02402
$$ plain form
14433 81359 377698 776011 1049392 1005439 843240 629726 272789 -448437 -965695 -968926
14423 -968926 -600366 -139404 -193009 -605133 -796060 -475847 -125586 35353 -68282 -826683
14413 -826683 -1392423 -1336258 -1051165 -876810 -433872 -113098 69699 159565 192982 -33236
14403 -33236 -139268 -284882 -222018 -97008 22394 83420 -36194 -321936 -692635 -533360
14393 -533360 -248915 -246649 -338938 -457812 -137198 12457 -307275 -490191 -305161 127493
14383 127493 712997 873276 357477 -240835 -728244 -947327 -746913 -487469 -586716 -826940
14373 -826940 -989703 -573118 -63487 183350 486553 975260 808323 83625 -365710 -108883
14363 -108883 207173 231498 157506 184901 642103 1009542 892433 667603 608735 464756
$$ packed form
14433H1359K96339L98313K73381m3953j62199k13514l56937p21226n17258l231
14423i68926L68560M60962n3605m12124j90927L20213L50261J60939j03635p58401
14413h26683n65740N6165K85093J74355M42938L20774J82797Q9866L3417k26218
14403c3236j06032j45614O2864J25010J19402O1026j19614k85742l70699J59275
14393e33360K84445K266r2289j18874L20614J49655l19732j82916J85030M32654
14383A27493N85504J60279n15799n98312m87409k19083K00414K59444r9247k40224
14373h26940j62763M16585N09631K46837L03203M88707j66937p24698m49335K56827
14363a08883L16056K4325p3992K7395M57202L67439j17109k24830n8868j43979
$$ plain form
14353 464756 190144 -8261 -143244 -274711 -408332 -180274 169497 529573 669723 454169
14343 454169 -33294 -385356 27697 342849 224823 97515 250074 310644 217236 203009
14333 203009 -54653 -601264 -765008 -895611 -1056059 -1307858 -1604070 -1202907 -1039829 -1176173
14323 -1176173 -1100437 -1138848 -1254400 -1023649 -689816 -870111 -895784 -700160 -347763 -121079
14313 -121079 326807 654956 428932 378524 567013 755526 809443 241599 -729162 -1023717
14303 -1023717 -974617 -710913 -323905 -12367 258582 442219 514183 407735 463282 442130
14293 442130 253755 -141180 -373027 -220518 -147581 156343 872636 821761 84603 -358627
14283 -358627 -322129 -391019 -833469 -956965 -769893 -352652 -90580 -206574 -416664 -516631
$$ packed form
14353D64756k74612j98405j34983j31467j33621K28058L49771L60076J40150k15554
14343D54169m87463l52062M13053L15152j18026j27308J52559O0570r3408j4227
14333B03009k57662n46611j63744j30603j60448k51799k96212M01163J63078j36344
14323a176173P5736l8411j15552K30751L33833j80295k5673J95624L52397K26684
14313a21079M47886L28149k26024n0408J88489J88513N3917n67844r70761k94555
14303a023717M9100K63704L87008L11538K70949J83637P1964j06448N5547k1152
14293D42130j88375l94935k31847J52509P2937L03924P16293n0875p37158m43230
14283c58627L6498o8890m42450j23496J87072M17241K62072j15994k10090r9967
$$ plain form
14273 -516631 -774741 -725215 -452750 -724703 -1052146 -716779 -84954 283153 409399 312017
14263 312017 346760 153671 -55107 -150152 -284800 -300518 -535440 -623175 -545972 -622066 -493571
14252 -493571 -400091 -85160 -11840 -435780 -989456 -1099166 -926298 -815920 -714617 -727550
14242 -727550 -557487 -606596 -894362 -1066243 -974553 -718755 -341373 44546 223302 259040
14232 259040 -242428 -739275 -1110809 -1191766 -1453570 -1544370 -1291545 -1035578 -942422 -778404
14222 -778404 -390629 -566826 -609710 -532208 -300365 -216995 -168200 -286618 -111637 34449
14212 34449 57945 -147461 -445166 -429110 -618059 -1047501 -833799 -392487 -398059 -372265 -263210
14201 -263210 -239632 34393 120509 183072 384712 161349 -49779 -171984 -275985 -248539
$$ packed form
14273e16631k58110M9526K72465k71953l27443L35367O31825L68107J26246r7382
14263C12017L4743j93089k08778r5045j34648j5718k34922q7735P7203p6094J28495
14252d93571R3480L14931P3320m23940n53676j09710J72868J10378J01303j2933
14242g27550J70063m9109k87766j71881R1690K55798L77382L85919J78756L5738
14232B59040n01468m96847l71534q0957k61804r0800K52825K55967R3156J64018
14222g78404L87775j76197m2884P7502K31843Q3370M8795j18418J74981J46086
14212C4449K3496k05406k97705J6056j88949m29442K13702M41312n572K5794J09055
14201b63210K3578K74025Q6116O2563K01640k23363k11128j22205j04001K7446
$$ plain form
14191 -248539 -248400 -180165 -216322 -444624 -408681 -287333 -402864 -634696 -710702 -368124 -270566
14180 -270566 -389808 54477 801512 904038 664917 454220 377337 457867 581137 784284
14170 784284 758138 222764 -179873 -437243 -682906 -664235 -764436 -718267 -326808 -229647
14160 -229647 -292530 17979 467556 217717 -4956 -24790 -287370 -311909 -548228 -856921
14150 -856921 -1187086 -1441806 -1286279 -1639651 -1932970 -1767775 -1078130 -624178 -274767 -67911
14140 -67911 -36940 -37077 -369289 -443279 -444640 -487459 -900721 -685017 -322023 -483442 -784264
14129 -784264 -1011830 -1175867 -1292637 -1132581 -854235 -578645 -810078 -872617 -631323 -181480
14119 -181480 140080 458468 636332 154124 168438 224534 -227677 -792427 -724654 -286182
$$ packed form
14191b48539J39O8235l6157k28302L5943J21348j15531k31832p6006L42578R7558
14180b70566j19242M44285P47035J02526k39121k10697p6883Q0530J23270K03147
14170G84284k6146n35374m02637k57370k45663J8671j00201M6169L91459R7161
14160b29647o2883L10509M49577k49839k22673j9834k62580k4539k36319l08693
14150h56921l30165k54720J55527l53372k93319J65195O89645M53952L49411K06856
14140f7911L0971j37l32212p3990j361m2819m13262K15704L62994j61419l00822
14129g84264k27566j64037j16770J60056K78346K75590k31433o2539K41294M49843
14119a81480L21560L18388J77864m82208J4314N6096m52211n64750O7773M38472
$$ plain form
14109 -286182 -229817 -348941 -492033 -446686 -728572 -753828 -455429 -71712 259703 665186
14099 665186 702361 353697 548345 1128642 1089406 1040114 618378 162073 211101 129402
14089 129402 -202400 -179959 -65049 -77193 86730 213839 288260 91769 -182550 -282963
14079 -282963 -506343 -678532 -778483 -855973 -797763 -1104794 -1509390 -1998654 -2311106 -2096422
14069 -2096422 -1642997 -1272236 -1012384 -848673 -462569 -414737 -644427 -752206 -568571 -147258
14059 -147258 6365 -166341 -254896 -241374 -152480 -163669 -447655 -591035 -692060 -931873
14049 -931873 -671068 -206757 -209660 -358086 -315225 300234 400622 -150114 -466563 -978739
14039 -978739 -1119984 -674212 -373366 -295393 175003 381526 311044 -43940 -275424 -416193
$$ packed form
14109b86182N6365j19124j43092M5347k81886k5256K98399L83717L31415M05483
14099F65186L7175l48664J94648N80297l9236m9292m21736m56305M9028q1699
14089A29402l31802K2441J14910j2144J63923J27109P4421j96491k74319j00413
14079b82963k23380j72189r9951p7490N8210l07031m04596m89264l12452K14684
14069b096422M53425L70761K59852J63711L86104M7832k29690j07779J83635M21313
14059a47258J53623j72706q8555J3522Q8894j1189k83986j43380j01025k39813
14049i31873K60805M64311k903j48426M2861O15459J00388n50736l16449n12176
14039i78739j41245M45772L00846P7973M70396K06523p0482l54984k31484j40769
$$ plain form
14029 -416193 -315510 -299002 -734745 -1352917 -1612677 -1507989 -1338525 -1360095 -1302972 -1173626
14019 -1173626 -1192416 -779085 -505078 -818428 -1090328 -878151 -314895 -32716 -271890 -709293
14009 -709293 -741062 -427677 -108067 -82767 -383792 -730608 -600881 39143 370877 224783
13999 224783 -32043 -3257 119224 30360 163796 196537 -357030 -740471 -676781 -556138
13989 -556138 -788775 -818468 -906996 -906742 -1007131 -1290944 -1404241 -1415277 -1436550 -1042757 -726973
13978 -726973 -865277 -581253 167427 660374 711265 490724 18305 -245452 -344654 -370383
13968 -370383 -559919 -901602 -886864 -712653 -714730 -686637 -613401 -579239 -790863 -1106141 -915331
13957 -915331 -548608 -212157 45361 312479 640449 650099 573488 453291 145001 -257371
$$ packed form
14029d16193J00683J6508m35743o18172k59760J04688J69464k1570N7123J29346
14019a173626j8790M13331K74007l13350k71900K12177N63256K82179k39174m37403
14009g09293l1769L13385L19610K5300l01025l46816J29727O40024L31734j46094
13999B24783k56826K8786J22481q8864J33436L2741n53567l83441O3690J20643
13989e56138k32637k9693q8528K54j00389k83813j13297j1036k1273L93793L15784
13978g26973j38304K84024P48680M92947N0891k20541m72419k63757r9202k5729
13968c70383j89536l41683J4738J74211k077K8093P3236L4162k11624l15278J90810
13957i15331L66723L36451K57518K67118L27970R650p6611j20197l08290m02372
$$ plain form
13947 -257371 -692664 -765891 -506413 -227598 -207193 -129103 388275 477303 314960 64929
13937 64929 -175467 32695 -188765 -704528 -726342 -505196 73044 246098 147341 290688
13927 290688 629122 710753 660664 626182 385179 -41537 -482697 -617822 -280038 36070
13917 36070 52223 191289 268601 116495 -413420 -821929 -806069 -780760 -855451 -1375985 -1915104
13906 -1915104 -2170476 -1859463 -1500434 -1414301 -1386763 -1156675 -945476 -1053475 -579976 259863
13896 259863 365139 -1258 -423519 -820376 -879832 -1022971 -1045318 -937788 -1009613 -840626
13886 -840626 -460007 -648340 -944008 -920042 -822597 -520104 -41811 272321 122747 -374141
13876 -374141 -309170 -242442 -370149 -295331 -663467 -835132 -654352 -449080 -492391 -647663
$$ packed form
13947b57371m35293p3227K59478K78815K0405P8090N17378Q9028j62343k50031
13937F4929k40396K08162k21460n15763k1814K21146N78240J73054r8757J43347
13927B90688L38434Q1631n0089l4482k41003m26716m41160j35125L37784L16108
13917C6070J6153J39066P7312j52106n29915m08509J5860K5309p4691n20534n39119
13906a915104k55372L11013L59029Q6133K7538K30088K11199j07999M73499Q39839
13896B59863J05276l66397m22261l96857n9456j43139k2347J07530p1825J68987
13886h40626L80619j88333k95668K3966R7445L02493M78293L14132j49574m96888
13876c74141O4971O6728j27707P4818l68136j71665J80780K05272m3311j55272
$$ plain form
13866 -647663 -573771 -194918 23096 22875 251415 314319 299592 177341 249010 305648 119297
13855 119297 -252432 -697280 -770974 -890358 -847505 -1220467 -1793349 -1841023 -1509824 -1202324
13845 -1202324 -1206694 -956399 -675759 -478985 -256593 -125365 125192 193276 -180293 -622187
13835 -622187 -1051809 -1311138 -1292357 -501973 127162 -30346 -356919 -140554 277577 419632
13825 419632 459474 349721 258463 100303 184533 216960 213022 183559 4860 -5409 -10762
13814 -10762 123707 -228601 -620864 -506862 -352493 -470113 -473926 -274947 -276784 -384060
13804 -384060 -376389 -323235 -558319 -420289 -264253 -486908 -1003683 -1395069 -1384989 -1179669
13794 -1179669 -1102030 -1448731 -1676428 -1206130 -753317 -492210 -303793 -452694 -573993 -674723
$$ packed form
13866f47663P3892L78853K18014k21K28540O2904j4727j22251P1669N6638j86351
13855A19297l71729m44848p3694j19384M2853l72962n72882m7674L31199L07500
13845a202324m370K50295K80640J96774K22392J31228K50557O8084l73569m41894
13835f22187m29622k59329J8781P90384O29135j57508l26573K16365M18131J42055
13825D19632L9842j09753r1258j58160Q4230L2427l938k9463j78699j0269n353
13814a0762J34469l52308l92263J14002J54369j17620l813J98979j837j07276
13804c84060P671N3154k35084J38030J56036k22655n16775l91386J0080K05320
13794a179669P7639l46701k27697M70298M52813K61107J88417j48901j21299j00730
$$ plain form
13784 -674723 -832124 -948461 -1002909 -1240988 -1493129 -1035267 -402295 -80690 64945 328535
13774 328535 -128958 -819493 -671113 -446726 -485419 -423446 -187909 298394 750818 1082139
13764 1082139 1102888 975147 631479 517745 747603 1108739 1267553 971428 726588 832227
13754 832227 527488 407600 554402 462069 218844 -118468 -391156 -386038 -292534 245298
13744 245298 623562 656576 429509 340750 325685 246735 283012 -18520 -549430 -932604
13734 -932604 -1224518 -1133406 -727380 -477698 -206371 -30791 10590 10567 155492 448066 736226
13723 736226 324281 149138 215259 146037 103596 349194 447436 78835 -228542 -169573
13713 -169573 -441111 -402768 102145 461438 429045 46715 -249087 -557453 -856553 -925968
$$ packed form
13784f74723j57401j16337n4448k38079k52141M57862O32972L21605J45635K63590
13774C28535m57493o90535J48380K24387l8693O1973K35537M86303M52424L31321
13764A082139K0749j27741l43668j13734K29858L61136J58814k96125k44840J05639
13754H32227l04739j19888J46802r2333k43225l37312k72688N118R3504N37832
13744B45298L78264L3014k27067q8759j5065p8950L6277l01532n30910l83174
13734i32604k91914R1112M06026K49682K71327J75580M1381k3J44925K92574K88160
13723G36226m11945j75143O6121o9222m2441K45598R8242l68601l07377N8969
13713a69573k71538L8343N04913L59293l2393l82330k95802l08366k99100o9415
$$ plain form
13703 -925968 -542769 -275258 -253366 -205010 -162806 -449116 -458196 -144320 -78874 -258006 -235176
13692 -235176 16019 22768 36180 47186 258521 507714 503125 243535 -105576 -120012 464158
13681 464158 804042 737456 128656 -712691 -505747 127895 600783 448535 -139689 -534967
13671 -534967 -563757 -200394 11105 274672 641164 1210640 1219964 768299 204382 29090
13661 29090 -365012 -603495 -454661 189392 687194 740846 795090 778627 890182 447522
13651 447522 -126210 -322367 -632108 -590309 -151160 -88885 -536602 -830091 -727857 -730008
13641 -730008 -1050261 -1075477 -501961 -10411 116207 -172380 -226437 -23079 81048 432851
13631 432851 857060 908377 889321 796359 320716 -215034 -483311 -293675 -410602 -831315
$$ packed form
13703i25968L83199K67511K1892M8356M2204k86310r080L13876O5446j79132K2830
13692b35176K51195O749J3412J1006K11335K49193m589k59590l49111j4436N84170
13681D64158L39884o6586o08800q41347K06944O33642M72888j52248n88224l95278
13671e34967k8790L63363K11499K63567L66492N69476R324m51665n63917j75292
13661B9090l94102k38483J48834O44053M97802N3652N4244j6463J11555m42660
13651D47522n73732j96157l09741M1799M39149O2275m47717k93489J02234k151
13641g30008l20253k5216N73516M91550J26618k88587n4057K03358J04127L51803
13631D32851M24209N1317j9056r2962m75643n35750k68277J89636j16927m20713
$$ plain form
13621 -831315 -1135912 -847194 -215484 196988 348537 395242 375080 602656 877951 811423
13611 811423 432495 288563 219200 385797 894024 870121 545986 531468 501691 511873
13601 511873 410450 412225 367407 116467 165119 366834 -24486 -318797 -301985 -292368 21614
13590 21614 278216 29203 -262669 -78624 -30859 68563 48931 -183445 -176176 -434913 -526091
13579 -526091 -329089 -438269 -305150 38152 -54735 -570364 -324129 183726 283796 168588
13569 168588 129045 763989 1140133 891784 458091 521193 821441 886353 827241 813888
13559 813888 663681 614553 805567 531161 329738 242409 133241 62904 -444389 -680740
13549 -680740 -781625 -1260855 -902296 -247500 -270290 -547810 -954304 -1379855 -1407336 -1069215
$$ packed form
13621h31315l04597K88718O31710M12472J51549M6705k0162K27576K75295o6528
13611H11423l78928j43932o9363J66597N08227k3903l24135j4518k9777J0182
13601E11873j01423J775m4818k50940M8652K01715l91320k94311J6812R617L13982
13590B1614K56602k49013k91872J84045M7765R9422j9632k32376P269k58737r1178
13579e26091J97002j09180J33119L43302r2887n15629K46235N07855J00070j15208
13569A68588l9543O34944L76144k48349m33693O3102L00248O4912n9112j3353
13559H13888j50207m9128J91014k74406k01423q7329j09168p0337n07293k36351
13549f80740j00885m79230L58559O54796k2790k77520m06494m25551k7481L38121
$$ plain form
13539 -1069215 -586712 -356695 -106164 -307983 -860243 -1021018 -828022 -462936 -101219
13530 -101219 -43381 -73435 -222602 -343497 53770 273764 22865 -281421 -720895 -1223354
13520 -1223354 -1424314 -1275702 -1383737 -1431368 -1548662 -1717336 -1502519 -1711957 -1791061 -1283735
13510 -1283735 -812880 -281541 293917 501580 818805 673902 95669 -201435 -211574 -328931
13500 -328931 -98691 166930 327567 624557 673367 506473 168541 218248 -7942 -395404
13490 -395404 -367895 -463390 -126968 506454 466371 -18906 -238315 -209080 -519222 -1063459
13480 -1063459 -896835 -118390 357636 200093 -30649 322660 453342 -15604 -481362
13471 -481362 -426190 -28111 161301 -24628 -177540 -270397 -134551 -118107 -333629 -722406
$$ packed form
13539a069215M82503K30017K50531k01819n52260j60775J92996L65086L61717
13530a01219N7838l0054j49167j20895L97267K19994k50899l04286m39474n02459
13520a223354k00960J48612j08035m7631j17294j68674K14817k09438p9104N07326
13510a283735M70855N31339N75458K07663L17225j44903n78233k97104j0139j17357
13500c28931K30240K65621J60637K96990M8810j66894l37932M9707k26190l87462
13490c95404K7509r5495L36422O33422m0083m85277k19409K9235l10142n44237
13480a063459J66624P78445M76026j57543k30742L53309J30682m68946m65758
13471d81362N5172L98079J89412j85929j52912r2857J35846J6444k15522l88777
$$ plain form
13461 -722406 -987232 -1013835 -799538 -569303 -441030 -724526 -863084 -347151 221287 152936
13451 152936 -368497 -637459 -403647 -118154 -146803 -516688 -639281 -558616 -43206 377773
13441 377773 454492 403989 288934 85155 -215361 -421497 -313535 -341582 -644087 -866432
13431 -866432 -750406 -699613 -814334 -957472 -1014465 -833635 -486902 -47666 -66464 -200823
13421 -200823 -553085 -913811 -850603 -585190 -634025 -544986 -182647 9473 -34418 262620
13411 262620 342122 174596 310730 454999 306395 154831 372632 560241 -58246 -896554
13401 -896554 -824133 -438823 -270339 -663732 -1282715 -1397202 -1131637 -865746 -891216 -1204674
13391 -1204674 -1359699 -1409818 -1434890 -1447366 -1433257 -1134185 -595588 -171940 -545468 -617285
$$ packed form
13461g22406k64826k6603K14297K30235J28273k83496j38558N15933N68438o8351
13451A52936n21433k68962K33812K85493k8649l69885j22593Q0665N15410M20979
13441C77773P6719n0503j15055k03779l00516k06136J07962k8047l02505k22345
13431h66432J16026N0793j14721j43138n6993J80830L46733M39236j8798j34359
13421b00823l52262l60726O3208K65413m8835Q9039L62339J92120m3891K97038
13411B62620P9502j67526J36134J44269j48604j51564K17801J87609o18487q38308
13401h96554P2421L85310J68484l93393o18983j14487K65565K65891k5470l13458
13391a204674j55025n0119k5072j2476J4109K99072N38597M23648l73528p1817
$$ plain form
13381 -617285 -437310 -675516 -1002324 -1203999 -1130922 -1145515 -1215896 -1293207 -964234 -711902
13371 -711902 -664071 -339699 332734 837739 712795 411693 40908 -276109 -34142 118032
13361 118032 -195138 -644844 -1069510 -984789 -931285 -945604 -640455 -588723 -397847 112616
13351 112616 242601 -137815 -590827 -735149 -326331 285201 543917 368181 259395 594033
13341 594033 830637 665076 395212 -29554 -655338 -675002 -273725 77990 7 -162228
13331 -162228 -107575 -118974 -33370 100018 241167 -178825 -621374 -703844 -689147 -406535
13321 -406535 -221745 -5413 623804 830422 703355 776599 923852 564513 35353 353007
13311 353007 713890 485804 770475 1063269 1138142 1068642 874448 841600 726683 28460
$$ packed form
13381f17285J79975k38206l26808k01675P3077j4593p0381p7311L28973K52332
13371g11902M7831L24372O72433N05005j24944l01102l70785l17017K41967J52174
13361A18032l13170m49706m24666Q4721N3504j4319L05149N1732J90876N10463
13351A12616J29985l80416m53012j44322M08818O11532K58716j75736j08786L34638
13341E94033K36604j65561k69864m24766o25784j9664M01277L51715p7983j62235
13331a62228N4653j1399Q5604J33388J41149m19992m42549q2470J4697K82612
13321d06535J84790K16332O29217K06618j27067P3244J47253l59339n29160L17654
13311C53007L60883k28086K84671K92794P4873o9500j94194l2848j14917o98223
$$ plain form
13301 28460 -668967 -604013 -142825 237464 458956 203820 -216731 84341 673132 626244
13291 626244 57975 -355005 -442774 -402554 -298316 -381355 -97826 179559 183912 195911 386206
13280 386206 860557 1223021 1597884 1710649 1373527 878755 375780 209753 224941 251495
13270 251495 -108134 -592020 -749675 -761163 -353707 -62081 -228835 -779282 -1118618 -825062
13260 -825062 -202587 219107 210627 235160 380002 270433 567269 1105456 1125192 504899
13250 504899 177359 680126 931943 607513 500474 675662 367441 114415 -245944 -378273
13240 -378273 -291352 -272302 -117710 115498 240634 587972 564405 116007 -224525 -86670
13230 -86670 -52623 -261361 -252959 -75227 381591 316387 273661 567726 737002 909985 817417
$$ packed form
13301B8460o97427O4954M61188L80289K21492k55136m20551L01072N88791m6888
13291F26244n68269m12980q7769M0220J04238q3039K83529K77385M353J1999J90295
13280C86206M74351L62464L74863J12765l37122m94772n02975j66027J5188K6554
13270B51495l59629m83886j57655j1488M07456K91626j66754n50447l39336K93556
13260h25062O22475M21694q480K4533J44842j09569K96836N38187J9736o20293
13250E04899l27540N02767K51817l24430j07039J75188l08221k53026l60359j32329
13240c78273Q6921J9050J54592K33208J25136L47338k3567m48398l40532J37855
13230h6670L4047k08738Q402J77732M56818o5204m2726K94065J69276J72983r2568
$$ plain form
13219 817417 397328 630487 792438 726455 726621 1020625 1107642 626639 422943 504930 87368
13208 87368 -282575 -105747 375577 489678 534248 605798 661769 896481 958813 619696
13198 619696 170829 192676 26301 -375363 -495832 -90005 616757 757280 637826 745571
13188 745571 809214 962705 1166604 899967 573177 493016 829220 987769 948887 847080
13178 847080 881377 854824 862356 466025 195702 -105517 -607007 -422107 157858 368562
13168 368562 621851 546269 207601 18171 -88358 21827 215976 -21510 -411384 -46750
13158 -46750 444501 717278 795563 585234 433019 523394 869719 1688259 2220272 2400246
13148 2400246 2142668 1500914 1165185 1361979 1657394 1457382 1284702 904157 554606
$$ packed form
13219H17417m20089K33159J61951o5983J66K94004Q7017m81003k03696Q1987m17562
13208H7368l69943J76828M81324J14101M4570P1550N5971K34712O2332l39117
13198F19696m48867K1847j66375m01664j20469M05827P06762J40523j19454J07745
13188G45571O3643J53491K03899k66637l26790q0161L36204J58549l8882j01807
13178H47080L4297k6553P532l96331k70323l01219n01490J84900N79965K10704
13168C68562K53289p5582l38668j89430j06529J10185J94149k37486l89874L64634
13158d6750M91251K72777P8285k10329j52215R0375L46325Q18540N32013J79974
13148B400246k57578o41754l35729J96794K95415k00012j72680l80545l49551
$$ plain form
13139 554606 921534 1586447 2038806 1822231 1123132 922010 941040 915527 827255 948130
13129 948130 1327019 1514883 1204893 1126213 1270984 1406723 1473558 1312428 1473418 1621022
13119 1621022 1516314 1516560 1382220 1125513 892494 805925 534353 361451 626438 705823
13109 705823 656247 866706 935653 1014425 1498915 1810362 1781333 1752143 1284940 951524
13099 951524 1131277 1161436 1130315 1271078 1236990 1258548 1476355 1842584 2011840 1875717
13089 1875717 1929672 2181960 2142172 1739808 1281363 1478603 1744734 1623518 1461914 1038789
13079 1038789 631561 678072 891750 1134455 1177729 1141415 1415548 1573454 1584159 1638333
13069 1638333 1650504 1538538 1556393 1377446 1476500 1741441 2046428 2133288 2115076 2483178
$$ packed form
13139E54606L66928O64913M52359k16575o99099k01122J9030k5513q8272J20875
13129I48130L78889J87864l09990p8680J44771J35739O6835j61130J60990J47604
13119A621022j04708K46j34340k56707k33019q6569k71572j72902K64987P9385
13109G05823m9576K10459O8947P8772M84490L11447k9029k9190m67203l33416
13099I51524J79753L0159l1121J40763l4088K1558K17807L66229J69256j36123
13089A875717N3955K52288l9788m02364m58445J97240K66131j21216j61604m23125
13079A038789m07228M6511K13678K42705M3274l6314K74133J57906J0705N4174
13069A638333J2171j11966J7855j78947R9054K64941L04987Q6860j8212L68102
$$ plain form
13059 2483178 2710630 2569790 2363619 2313347 2233242 2096061 2124279 2345127 2887157 3358717
13049 3358717 3608631 3303805 3005580 3017284 3181310 3205844 3475750 3636456 3482077 3003350
13039 3003350 2447999 2279736 2703165 3012558 2864246 3237096 3940030 4297254 4214226 3805329
13029 3805329 3800623 4114047 4230269 4575376 5102563 5383470 5505784 5832619 5719850 5189539
13019 5189539 5120723 5680651 5851618 5955701 6360895 6876337 7551025 7991938 7966916 7935116
13009 7935116 7952074 8088856 8455621 8804204 9444897 10236182 11167700 11914211 12713989 13556848
12999 13556848 14277824 14912998 15657682 17191164 18916432 20413236 21825806 24015246
12991 24015246 27254375 31010274 34612901 39034161 44766858 51574170 60346302 70689972
$$ packed form
13059B483178K27452j40840k06171n0272q0105j37181K8218K20848N42030M71560
13049C358717K49914l04826k98225J1704J64026K4534K69906J60706j54379m78727
13039C003350n55351j68263M23429L09393j48312L72850P02934L57224q3028m08897
13029C805329m706L13424J16222L45107N27187K80907J22314L26835j12769n30311
13019E189539o8816N59928J70967J04083M05194N15442O74688M40913k5022l1800
13009G935116J6958J36782L66765L48583O40693P91285R31518P46511P99778Q42859
12999A3556848P20976O35174P44684J533482J725268J496804J412570K189440
12991B4015246L239129L755899L602627M421260N732697O807312Q772132J0343670
$$ plain form
12983 70689972 83253441 99247074 118974568 144235411 176589960 218193922 272488452
12976 272488452 340441940 415869240 477876159 494842592 455220203 383374042 309515005
12969 309515005 247496727 198943227 162224400 134575650 112875741 95477082 81985888
12962 81985888 71533720 62957304 55756659 49577788 44189449 39444032 35236340 31861131
12954 31861131 28782346 26366248 24676079 23703481 22581784 21728379 20645092 19400781
12946 19400781 18656575 18416937 18241845 17675611 17066323 16903507 17070966 17211176 17386230
12937 17386230 17974663 19008439 20265118 22085481 24277198 26195880 27416747 26889627
12929 26889627 24662426 22359607 20847359 19578415 18346553 18189875 18285339 18326365 18681558
$$ packed form
12983G0689972J2563469J5993633J9727494K5260843L2354549M1603962N4294530
12976B72488452O7953488P5427300O2006919J6966433l9622389p1846161p3859037
12969C09515005o2018278m8553500l6718827k7648750k1699909j7398659j3491194
12962H1985888j0452168q576416p200645o178871n388339m745417m207692l375209
12954C1861131l078785k416098j690169r72598j121697q53405j083287j244311
12946A9400781p44206k39638j75092n66234o09288j62816J67459J40210J75054
12937A7386230N88433J033776J256679J820363K191717J918682J220867n27120
12929B6889627k227201k302819j512248j268944j231862j56678R5464M1026L55193
$$ plain form
12920 18681558 19673278 20768183 22188800 24318732 27152865 29508583 30476427 30375854
12912 30375854 30105913 30868554 33045187 36630621 40722820 43912952 43152416 40632943
12904 40632943 39756247 40453001 42833585 46771497 52187974 59033592 67581087 77859508
12896 77859508 90632008 107216444 128219340 154580839 188625581 233552467 292392564
12889 292392564 364910810 441934758 497410802 498518868 444070202 366384184 293355999
12882 293355999 234301260 188812817 154155475 127722432 107051629 90854260 78253322
12875 78253322 68228752 59806613 52487511 46549749 41780045 37802486 34198994 31068079
12867 31068079 28490646 26699974 24763433 23068151 21650146 20267954 18863893 17604955
$$ packed form
12920A8681558R91720J094905J420617K129932K834133K355718R67844j00573
12912C0375854k69941P62641K176633L585434M092199L190132p60536k519473
12904D0632943q76696O96754K380584L937912N416477O845618Q547495J0278421
12896G7859508J2772500J6584436K1002896K6361499L4044742M4926886N8840097
12889B92392564P2518246P7023948N5476044J108066n4448666p7686018p3028185
12882B93355999n9054739m5488443l4657342k6433043k0670803j6197369j2600938
12875G8253322j0024570q422139p319102n937762m769704l977559l603492l130915
12867C1068079k577433j790672j936541j695282j418005j382192j404061j258938
$$ plain form
12859 17604955 16826902 16297087 15584075 14988972 14489796 13993583 13732709 13369223 12817767
12850 12817767 12372760 12138133 11614010 11253113 11220502 11167815 11289502 11696210 11780364 12160885
12840 12160885 12538597 12602368 12403746 12087151 11695554 11539907 11547879 11627534 11958279 12428801
12830 12428801 12624873 12601844 12697248 13281605 14040714 15204474 16993107 18776008 20297739
12821 20297739 21777177 23650837 25373449 27253716 30039157 33502911 37930604 43428486
12813 43428486 49959519 58311115 67911503 79392524 93720874 111654301 134101793
12806 134101793 162416051 198688931 246267340 307389602 380158818 451836646 492867652
12799 492867652 477222583 415314868 339710566 271911925 217508923 175677782 143424862
$$ packed form
12859A7604955p78053n29815p13012n95103m99176m96213k60874l63486n51456
12850A2817767m45007k34627n24123l60897l2611n2687J21687M06708Q4154L80521
12840A2160885L77712O3771j98622l16595l91597j55647P972P9655L30745M70522
12830A2428801J96072k3029R5404N84357P59109J163760J788633J782901J521731
12821B0297739J479438J873660J722612J880267K785441L463754M427693N497882
12813D3428486O531033Q351596R600388J1481021J4328350J7933427K2447492
12806A34101793K8314258L6272880M7578409O1122262P2769216P1677828M1031006
12799D92867652j5645069o1907715p5604302o7798641n4403002m1831141l2252920
$$ plain form
12792 143424862 118559820 99371244 84400627 72551168 62832209 54774656 48255340
12785 48255340 43070771 38191182 33468116 29782060 26888873 24486575 22490784 20055601
12777 20055601 17890198 16353799 15288033 14297165 13690545 13355461 12645490 11507892 9946167
12768 9946167 8737294 7935575 7227007 7075326 6997335 6775630 6795584 6736944 6425082 6259308
12758 6259308 5767521 5478755 5277542 5077791 5000662 4797684 4686919 5004368 5133839 4752469
12748 4752469 4543861 4003579 3319462 2937870 2848925 2854757 2486151 2352017 2433266 2373801
12738 2373801 2424817 2437115 2266755 2044703 2177518 2512825 3050521 3208624 3295992 3247581
12728 3247581 3102704 2815583 2894565 3156741 3516586 3741545 3644423 3156864 2596318 2108361
$$ packed form
12792A43424862k4865042j9188576j4970617j1849459r718959q057553o519316
12785D8255340n184569m879589m723066l686056k893187k402298j995791k435183
12777B0055601k165403j536399j065766r90868o06620l35084p09971j137598j561725
12768I946167j208873q01719p08568j51681p7991k21705J9954n8640l11862j65774
12758F259308m91787k88766k01213j99751p7129k02978j10765L17449J29471l81370
12748D752469k08608n40282o84117l81592q8945N832l68606j34134Q1249n9465
12738B373801N1016J2298j70360k22052J32815L35307N37696J58103Q7368m8411
12728C247581j44877k87121P8982K62176L59845K24959r7122m87559n60546m87957
$$ plain form
12718 2108361 1628153 1731126 2050140 1883496 1846311 2000674 2018552 1805644 1974745 2435734
12708 2435734 2581467 2494904 2260449 1440772 803349 961805 1253991 1256524 1304959 1765084
12698 1765084 1708268 1260788 1302308 1481697 1543589 1678205 1415310 968291 814642 1097345
12688 1097345 1453862 1200261 470580 -69493 46908 620161 835602 982382 1229096
12679 1229096 1103721 796189 762103 1016070 1511118 1712571 1822237 1625913 1486180 1447549
12669 1447549 1490606 1351672 862810 574092 523244 398208 401754 127788 -110572 -201353
12659 -201353 93951 403779 506171 548536 433579 176798 -279574 -590078 -538094 -130678
12649 -130678 263355 79534 -421599 -638020 -489915 -381404 -465815 -236015 -229600 -557827
$$ packed form
12718B108361m80208J02973L19014j66644l7185J54363J7878k12908J69101M60989
12708B435734J45733q6563k34455q19677o37423J58456K92186K533M8435M60125
12698A765084n6816m47480M1520J79389O1892J34616k62895m47019j53649K82703
12688A097345L56517k53601p29681n40073J16401N73253K15441J46780K46714
12679A229096j25375l07532l4086K53967M95048K01453J09666j96324j39733l8631
12669A447549M3057j38934m88862k88718n0848j25036L546k73966k38360r0781
12659b01353K95304L09828J02392M2365j14957k56781m56372l10504N1984M07416
12649a30678L94033j83821n01133k16421J48105J08511q4411K29800O415l28227
$$ plain form
12639 -557827 -699915 -540628 -169743 322693 388221 258397 80351 -173510 88025 385838
12629 385838 776214 1164773 785113 388556 245719 274417 235396 63624 -75563 -139722
12619 -139722 -118814 103297 294833 20151 54031 142682 88465 350993 635772 571380
12609 571380 120894 173385 440659 558982 928047 1169374 893610 612265 589937 1058342
12599 1058342 1238859 627426 -23269 -271831 -580930 -645740 -630434 -374624 84987 195010
12589 195010 359975 1089086 1769002 1459182 975501 926449 832769 846023 1195331 1280976
12579 1280976 982784 283748 -427595 -394584 -397202 -484637 -144230 -24684 107463 407227
12569 407227 378489 -75272 -418789 -419093 -312229 7367 168219 -29272 -101322 335351
$$ packed form
12639e57827j42088J59287L70885M92436O5528j29824j78046k53861K61535K97813
12629C85838L90376L88559l79660l96557j42837K8698l9021j71772j39187o4159
12619a39722K0908K22111J91536k74682L3880Q8651n4217K62528K84779o4392
12609E71380m50486N2491K67274J18323L69065K41327k75764k81345k2328M68405
12599A058342J80517o11433o50695k48562l09099o4810J5306K55810M59611J10023
12589A95010J64965P29111O79916l09820m83681m9052r3680J3254L49308Q5645
12579A280976k98192o99036p11343L3011k618q7435L40407J19546J32147K99764
12569D07227k8738m53761l43517l04J06864L19596J60852j97491p2050M36673
$$ plain form
12559 335351 671540 500206 437822 180504 82052 291860 587033 700019 349960 342509
12549 342509 215189 -109610 2193 196279 360705 289397 543714 896616 663874 415723
12539 415723 537607 511190 486907 766331 1020669 1350290 1328907 1036719 580663 321571
12529 321571 347807 634666 737828 510886 645203 664841 480161 587295 824104 397386
12519 397386 -230243 -529284 -572582 -648164 -309243 101504 316913 399244 364722 284231
12509 284231 58854 -47327 133738 587789 1208379 1106056 386024 -347879 -286893 261457
12499 261457 743986 1097175 1202055 1178536 690717 -27525 -113911 160040 182108 108053
12489 108053 136768 -17068 -23769 -167121 -293346 -383865 -130701 294311 63501 -263883
$$ packed form
12559C35351L36189j71334o2384k57318r8452K09808K95173J12986l50059p451
12549C42509j27320l24799J11803J94086J64426p1308K54317L52902k32742k48151
12539D15723J21884k6417k4283K79424K54338L29621k1383k92188m56056k59092
12529C21571K6236K86859J03162k26942J34317J9638j84680J07134K36809m26718
12519C97386o27629k99041m3298p5582L38921M10747K15409Q2331l4522q0491
12509B84231k25377j06181J81065M54051O20590j02323p20032p33903O0986N48350
12499B61457M82529L53189J04880k3519m87819p18242q6386K73951K2068p4055
12489A08053K8715j53836o701j43352j26225r0519K53164M25012k30810l27384
$$ plain form
12479 -263883 -429550 -694720 -864935 -937410 -795149 -334836 338153 1182879 1361840 869498
12469 869498 375994 67179 34249 280810 85782 -166001 -548018 -712102 -483265 -281443
12459 -281443 -593268 -425858 71762 361473 259369 3320 -285041 -555241 -692859 -707985
12449 -707985 3804 771639 878979 1186926 1596417 1442850 1219489 1237840 1570931 1925627
12439 1925627 1628831 969047 96408 -132526 211480 431428 196369 -353474 -593941
12430 -593941 -498177 71440 746464 952719 850781 741208 351343 -191607 -560991 -98448
12420 -98448 315205 276174 142987 66558 142298 -1686 -199924 -73456 42403 194293
12410 194293 633628 854578 302749 -389726 -367357 156913 518918 575750 453415 736385
$$ packed form
12479b63883j65667k65170j70215p2475J42261M60313O72989Q44726J78961m92342
12469H69498m93504l08815l2930K46561j95028k51783l82017j64084K28837K01822
12459b81443l11825J67410M97620K89711j02104k56049k88361k70200j37618j5126
12449g07985P11789P67835J07340L07947M09491j53567k23361J8351L33091L54696
12439A925627k96796o59784q72639k28934L44006K19948k35059n49843k40467
12430e93941R5764N69617O75024K06255j01938j09573l89865n42950l69384M62543
12420i8448M13653l9031j33187p6429P5740j43984j98238J26468J15859J51890
12410A94293M39335K20950n51829o92475K2369N24270L62005N6832j22335K82970
$$ plain form
12400 736385 731990 -24858 -506875 -538560 -330381 -130361 -245066 -488860 -377323 85345
12390 85345 409408 486174 180216 -165364 -41467 175891 102571 78900 216530 285399
12380 285399 440984 681340 790005 704142 484359 428495 553909 829355 789444 551249
12370 551249 609204 642929 339120 61517 -128588 -151205 -384661 -710741 -607033 -399680
12360 -399680 -462650 -433581 -322823 -271770 97841 355443 425938 405870 520444 304020
12350 304020 437820 443384 -42866 -573326 -937812 -1161857 -668794 69673 165448 63739
12340 63739 81837 335117 833990 1110952 974473 640181 343829 258774 -109671 -308081
12330 -308081 -147691 131503 256510 386953 240325 -78841 -180513 -174467 161808 206005
$$ packed form
12400G36385m395p56848m82017l1685K08179K00020j14705k43794J11537M62668
12390H5345L24063P6766l05958l45580J23897K17358p3320k3671J37630O8869
12380B85399J55585K40356J08665q5863k19783n5864J25414K75446l9911k38195
12370E51249N7955L3725l03809k77603j90105k2617k33456l26080J03708K07353
12360c99680o2970K9069J10758N1053L69611K57602P0495k0068J14574k16424
12350C04020J33800N564m86250n30460l64486k24045M93063P38467R5775j01709
12340F3739J8098K53280M98873K76962j36479l34292k96352q5055l68445j98410
12330c08081J60390K79194J25007J30443j46628l19166j01672O046L36275M4197
$$ plain form
12320 206005 -247265 -326516 -221655 -225426 -348907 -526170 -754049 -1072279 -883651 -449982
12310 -449982 -306362 -77309 15896 153382 378717 377092 331826 311252 366625 322344 -72604
12299 -72604 -140748 11464 294965 782183 996716 868527 1031536 1307766 698750 -44542
12289 -44542 -210639 -315254 -524831 -652754 -192820 149058 13202 -232820 -403914 -361359
12279 -361359 -209782 -216476 -39230 -19209 70675 539092 537790 -150740 -693256 -903062 -956222
12268 -956222 -1185999 -1543380 -1440687 -1031611 -853955 -974622 -735499 -657701 -664761 -650252
12258 -650252 -439597 -135132 -112235 -477188 -600066 -386248 -554966 -823906 -1017967 -1223373
12248 -1223373 -1039370 -320189 412979 945879 1010711 936488 899824 812750 739211 804934
$$ packed form
12320B06005m53270p9251J04861l771j23481j77263k27879l18230J88628M33669
12310d49982J43620K29053R3205J37486K25335j625m5266k0574N5373m4281l94948
12299g2604o8144J52212K83501M87218K14533j28189J63009K76230o09016p43292
12289d4542j66097j04615k09577j27923M59934L41878j35856k46022j71094M2555
12279c61359J51577o694J77246K0021Q9884M68417j302o88530n42516k09806n3160
12268i56222k29777l57381J02693M09076J77656j20667K39123P7798p060J4509
12258f50252K10655L04465K2897l64953j22878K13818j68718k68940j94061k05406
12248a223373J84003P19181P33168N32900O4832p4223l6664q7074p3539O5723
$$ plain form
12238 804934 807889 685532 981413 1261644 1109714 790562 137348 -219528 -32981 195105
12228 195105 304679 519419 898395 1188705 1126549 1158295 1049240 691340 574671 397659
12218 397659 206517 250025 498060 829493 940094 464118 107645 297895 419601 208199
12208 208199 96754 50021 -146605 -306436 -165359 62743 231787 304383 342182 384117
12198 384117 574330 529610 354352 330878 473789 408196 317041 381516 374637 -144954 -93995
12187 -93995 368143 757277 888757 504216 360235 105169 -755313 -1240397 -1137913 -671477
12177 -671477 -424375 -440210 -162315 -82113 -258477 143624 378937 -123939 -422291 -638356
12167 -638356 -654224 108493 749170 674670 759634 846966 688392 314921 95975 -210941
$$ packed form
12238H04934K955j22357K95881K80231j51930l19152o53214l56876J86547K28086
12228A95105J09574K14740L78976K90310o2156L1746j09055l57900j16669j77012
12218C97659j91142M3508K48035L31433J10601m75976l56473J90250J21706k11402
12208B08199j11445m6733j96626j59831J41077K28102J69044P2596L7799M1935
12198C84117J90213m4720j75258k3474J42911o5593r1155O4475o879n19591N0959
12187i3995M62138L89134J31480l84541j43981k55066q60482m85084J02484M66436
12177f71477K47102j5835K77895Q0202j76364M02101K35313n02876k98352k16065
12167f38356j5868P62717O40677p4500Q4964Q7332j58574l73471k18946l06916
$$ plain form
12157 -210941 -149388 304970 493090 193411 -48877 -10121 257369 498320 776772 1025789
12147 1025789 1025158 830238 1113158 1369432 478471 -476140 -678784 -702584 -1008943 -1412911
12137 -1412911 -1710026 -1957882 -2131246 -1567234 -944461 -969855 -748934 -273107 268982 491417
12127 491417 574035 455367 127930 236294 528887 688465 377398 -142375 -78202 334391
12117 334391 56072 -602618 -972140 -668895 -54855 410026 328735 214612 143103 -331156
12107 -331156 -685444 -764106 -804788 -582682 -231344 -113689 -186555 -17752 221448 411835
12097 411835 634030 989921 1114871 1132759 1023762 711967 152109 -169255 -142489 -100419
12087 -100419 -68545 -73900 -263854 -275545 -25326 212860 422912 361631 99958 420106
$$ packed form
12157b10941O1553M54358J88120k99679k42288L8756K67490K40951K78452K49017
12147A025789o31j94920K82920K56274q90961r54611k02644k3800l06359m03968
12137a412911k97115k47856j73364N64012O22773k5394K20921M75827N42089K22435
12127D91417Q2618j18668l27437J08364K92593J59578l11067n19773O4173M12593
12117C34391k78319o58690l69522L03245O14040M64881q1291j14123p1509m74259
12107c31156l54288p8662m0682K22106L51338J17655p2866J68803K39200J90387
12097D11835K22195L55891J24950J7888j08997l11795n59858l21364K6766M2070
12087a00419L1874n355j89954j1691K50219K38186K10052o1281k61673L20148
$$ plain form
12077 420106 759533 926245 736408 528820 345577 222349 309809 530695 599507 545218
12067 545218 482419 522181 578582 440803 318118 59011 -18886 40316 -24622 -175444 -367346
12056 -367346 -260403 101200 19929 -330406 -618139 -670801 -574911 -328342 -233185 -223037
12046 -223037 -254208 -321630 -186415 -74450 119002 85337 209651 310297 430929 455932
12036 455932 600562 608482 475459 490982 362347 489586 568453 292857 -294357 -306052
12026 -306052 72435 -159936 -670897 -622466 -608797 -587900 -469697 -143528 547173 1230485
12016 1230485 1186818 834071 655821 705004 711964 742044 742870 654785 794153 777057 416560
12005 416560 411897 557216 619637 234467 -133259 -258453 32479 393446 196315 243061
$$ packed form
12077D20106L39427J66712j89837k07588j83243j23228Q7460K20886O8812n4289
12067E45218o2799L9762N6401j37779j22685k59107p7897N9202o4938j50822j91902
12056c67346J06943L61603q1271l50335k87733n2662R5890K46569R5157J0148
12046b23037l1171o7422J35215J11965J93452l3665J24314J00646J20632K5003
12036D55932J44630P920j33023J5523j28635J27239P8867k75596n87214j1695
12026c06052L78487k32371n10961M8431J3669K0897J18203L26169O90701O83312
12016A230485m3667l52747j78250M9183O960L0080Q26q8085J39368j7096l60497
12005D16560m663J45319O2421l85170l67726j25194K90932L60967j97131M6746
$$ plain form
11995 243061 432018 481188 827058 1041386 924790 673807 332820 -187770 -275921 -66216
11985 -66216 -20063 53236 415496 260135 -285981 -564322 -511797 -123026 190095 236696
11975 236696 222481 -16794 16007 578262 768877 536853 640483 738888 795176 827914
11965 827914 767878 733775 825851 685229 347978 286146 528781 768859 799119 565488
11955 565488 725244 1071995 1233270 1195473 1086062 1267591 1131309 934163 781819 479147
11945 479147 -12271 -267893 -43944 183474 219047 326773 606983 370130 111862 361307
11935 361307 629717 697729 658711 706966 723858 646862 685963 831991 553579 423012 536651
11924 536651 371384 658816 1048699 859548 710760 1069495 1400577 1639053 1918200 2211145
$$ packed form
11995B43061J88957M9170L45870K14328j16596k50983l40987n20590q8151K09705
11985f6216M6153P3299L62260j55361n46116k78341N2525L88771L13121M6601
11975B36696j4215k39275L2801N62255J90615k32024J03630R8405N6288L2738
11965H27914o0036l4103R2076j40622l37251o1832K42635K40078L0260k33631
11955E65488J59756L46751J61275l7797j09411J81529j36282j97146j52344l02672
11945D79147m91418k55622K23949K27418L5573J07726K80210k36853k58268K49445
11935C61307K68410O8012l9018M8255J6892p6996L9101J46028k78412j30567J13639
11924E36651j65267K87432L89883j89151j48788L58735L31082K38476K79147K92945
$$ plain form
11914 2211145 2819127 3525432 3738847 3592843 3675479 4160083 4947774 5666831 6260767 7107098
11904 7107098 8457992 9829909 10769782 11069499 10713800 9621077 8600399 7635219 6350035
11895 6350035 5404115 4750107 4126514 3671201 3383733 3181575 2683227 2209845 2064081
11886 2064081 1854327 1687574 1339933 1187636 1186495 1034048 923336 1022682 1192461 1224708
11876 1224708 1016669 447557 288328 924255 1452087 1210054 964242 599128 206238
11867 206238 772975 1417838 1647057 1806892 1720441 1702941 1606318 1525793 1321809 1413999
11857 1413999 1681057 1632054 1473327 1310776 1245770 790249 452378 303220 54612 -29409
11847 -29409 -303598 48102 634770 1002758 1148224 1073156 965325 933097 1034675 1105238
$$ packed form
11914B211145O07982P06305K13415j46004Q2636M84604P87691P19057N93936Q46331
11904G107098J350894J371917R39873K99717l55699j092723j020678r65180j285184
11895F350035r45920o54008o23593m55313k87468k02158m98348m73382j45764
11886B064081k09754j66753l47641j52297j141j52447j10712R9346J69779L2247
11876A224708k08039n69112j59229O35927N27832k42033k45812l65114l92890
11867B06238N66737O44863K29219J59835q6451j7500r6623q0525k03984R2190
11857A413999K67058m9003j58727j62551o5006m55521l37871j49158k48608q4021
11847b9409k74189L51700N86668L67988J45466p5068j07831l2228J01578P0563
$$ plain form
11837 1105238 1214085 1420941 1856098 2023253 1959548 1804718 1392067 687498 675532 1147081
11827 1147081 1404372 1401870 882713 373512 537876 724330 933241 830225 693770 756023
11817 756023 685025 331684 380316 432543 23125 -432779 -462243 -365085 -526870 -643313
11807 -643313 -679113 -360949 206342 523455 323741 521104 810888 728227 718118 626963
11797 626963 473003 442280 87999 -426475 -834918 -1140904 -852095 -633926 -1125079 -1391841
11787 -1391841 -1407004 -809027 -62553 223059 27735 -455632 -750338 -991796 -1246290 -1310449
11777 -1310449 -1290702 -1100982 -955791 -851985 -816031 -981411 -906586 -545794 -384633 -236797
11767 -236797 -188658 -230158 -412309 -396062 -210798 -152635 44310 216580 -65495 -338710
$$ packed form
11837A105238J08847K06856M35157J67155o3705j54830m12651p04569j1966M71549
11827A147081K57291k502n19157n09201J64364J86454K08911j03016j36455O2253
11817G56023p0998l53341M8632N2227m09418m55904k9464R7158j61785j16443
11807f43313l5800L18164N67291L17113j99714J97363K89784q2661j0109r1155
11797F26963j53960l0723l54281n14474m08443l05986K88809K18169m91153k66762
11787a391841j5163N97977P46474K85612j95324m83367k94706k41458k54494o4159
11777a310449J9747J89720J45191J03806L5954j65380P4825L60792J61161J47836
11767b36797M8139m1500j82151J6247J85264N8163J96945J72270k82075k73215
$$ plain form
11757 -338710 -334800 493080 1143838 819308 571968 690388 760312 379597 176046 227739
11747 227739 88852 58479 381755 499478 539048 992704 1433339 1410905 1259857 1454881
11737 1454881 1662284 1469071 1413033 1595753 1823363 1516703 729364 525308 358827 57253
11727 57253 -252405 -112618 172488 303896 718103 1188055 1140070 952347 1213720 1119634
11717 1119634 690561 692573 623399 388830 348168 580866 1006249 1281214 1336610 1080035
11707 1080035 904149 515347 185532 30313 135107 622297 1244807 1263109 773447 788120
11697 788120 1075322 1276249 920581 342879 -315955 -799665 -799333 -432242 -263444 -331970
11687 -331970 -62666 124249 -248355 -601851 -416257 -277758 -151741 -29778 29908 -338119
$$ packed form
11757c38710L910Q27880O50758l24530k47340J18420O9924l80715k03551N1693
11747B27739j38887l0373L23276J17723L9570M53656M40635k2434j51048J95024
11737A454881K07403j93213n6038J82720K27610l06660p87339k04056j66481l01574
11727E7253l09658J39787K85106J31408M14207M69952m7985j87723K61373r4086
11717A119634m29073K012o9174k34569m0662K32698M25383K74965N5396k56575
11707A080035j75886l88802l29815j55219J04794M87190O22510J8302m89662J4673
11697G88120K87202K00927l55668n77702o58834m83710L32L67091J68798o8526
11687c31970K69304J86915l72604l53496J85594J38499J26017J21963N9686l68027
$$ plain form
11677 -338119 -354615 34034 53891 38421 -405181 -543025 -243036 117147 570227 558780
11667 558780 244775 -63433 -30315 147159 154791 368594 460082 83375 -157613 -118644
11657 -118644 -29097 197440 131236 -185607 -575259 -415586 160187 283932 280456 327811
11647 327811 422188 617231 931239 1221931 1109727 567632 -59891 -398083 -286392 73019
11637 73019 217469 -14443 -161957 -100974 425087 523971 -19088 -336955 -894129 -1277104
11627 -1277104 -818888 -424354 -347682 -485530 -661070 -358237 -277510 -337649 -367848 -321007
11617 -321007 43369 102153 -40622 319601 313432 203516 341167 299851 155162 484496
11607 484496 438862 674968 896572 741524 291414 -361317 -532491 -414928 -227886 -275243
$$ packed form
11677c38119j6496L88649J9857j5470m43602j37844K99989L60183M53080j1447
11667E58780l14005l08208L3118J77474P632K13803R1488l76707k40988L8969
11657a18644Q9547K26537o6204l16843l89652J59673N75773J23745l476M7355
11647C27811R4377J95043L14008K90692j12204n42095o27523l38192J11691L59411
11637G3019J44450k31912j47514O0983N26061R8884n43059l17867n57174l82975
11627a277104M58216L94534P6672j37848j75540L02833Q0727o0139l0199M6841
11617c21007L64376N8784j42775L60223o169j09916J37651m1316j44689L29334
11607D84496m5634K36106K21604j55048m50110o52731j71174J17563J87042m7357
$$ plain form
11597 -275243 -215235 -204688 116850 342819 475543 484645 698936 893474 619942 -82727
11587 -82727 -49856 487485 718751 342175 66874 286614 34479 -471088 -686845 -550956
11577 -550956 -391398 -272800 -166115 -183013 -88524 30701 307794 686066 673481 593083
11567 593083 849585 1476192 1783470 1408015 1637059 2233444 2613361 3024760 3373767 3466331
11557 3466331 3773092 4519790 5305417 6180132 7642686 9357698 10880338 11773496 12311491
11548 12311491 12500119 12177419 11472056 9938261 8381730 7072346 5866508 4747893
11540 4747893 3791888 3117237 2773650 2429072 2198294 2197574 2633052 2861410 2734062 2704084
11530 2704084 2686196 2165629 1747145 1901860 2268087 2276084 2082388 2239597 2108485 1420744
$$ packed form
11597b75243O0008J0547L21538K25969J32724R102K14291J94538k73532p02669
11587h2727L2871N37341K31266l76576k75301K19740k52135n05567k15757J35889
11577e50956J59558J18598J06685j6898R4489J19225K77093L78272j2585q0398
11567E93083K56502O26607L07278l75455K29044N96385L79917M11399L49007R2564
11557C466331L06761P46698P85627Q74715J462554J715012J522640Q93158N37995
11548A2311491J88628l22700p05363j533795j556531j309384j205838j118615
11540D747893r56005o74651l43587l44578k30778p20M35478K28358j27348k9978
11530B704084j7888n20567m18484J54715L66227P997j93696J57209j31112o87741
$$ plain form
11520 1420744 1076732 810132 515564 729329 834766 848533 910821 1246020 1795359 1848129
11510 1848129 1505409 1366777 1448222 1310775 910109 680037 622646 676595 844200 1167016
11500 1167016 1319204 1302163 1477391 1848480 2111145 2017274 2240999 3077699 3707512 4227583
11490 4227583 4791621 5761732 7101766 8447018 9827739 11192448 12201420 12797364 12278734
11481 12278734 10602567 8743444 6661415 4537829 3191634 2813179 2576597 2269055
11473 2269055 2122961 2192502 2251319 1976127 1544692 1159651 518134 371363 425663 449497
11463 449497 307841 200500 18088 151623 1364563 2451230 2814360 2432855 2328000
11454 2328000 2321461 2257125 2506975 2626335 2655952 2689191 2411641 2215079 2144555 2220495 2109107
$$ packed form
11520A420744l44012k66600k94568K13765J05437J3767O2288L35199N49339N2770
11510A848129l42720j38632Q1445j37447m00666k30072n7391N3949J67605L22816
11500A167016J52188j7041J75228L71089K62665r3871K23725Q36700O29813N20071
11490D227583N64038R70111J340034J345252J380721J364709J008972N95944n18630
11481A2278734j676167j859123k082029k123586j346195l78455k36582l07542
11473B269055j46094O9541N8817k75192m31435l85041o41517j46771N4300K3834
11463D49497j41656j07341j82412J33535J212940J086667L63130l81505j04855
11454B328000o539o4336K49850J19360K9617L3239k77550j96562p0524P5940j11388
$$ plain form
11443 2109107 1794008 1720161 1711667 1653389 1633772 1175590 861326 934841 1041649 1045090 956602
11432 956602 871664 967443 852632 627684 471331 -83641 -540236 -563002 -552978 -288893
11422 -288893 24249 369762 1203781 1468500 753333 107254 -57132 202909 453876 584017
11412 584017 540320 430783 684331 1110506 1305974 1114858 1077636 1289636 1228830 1314398
11402 1314398 876699 615520 650533 282903 -100772 -213384 -411654 -410862 -218084 -201139
11392 -201139 -339220 -241580 -139291 -121222 -232123 -637193 -922607 -1305376 -1583746 -1758548
11382 -1758548 -1794130 -1748602 -1380323 -453411 194296 427570 -154426 -438329 -378307 -366924
11372 -366924 120931 619775 861616 759978 740834 949305 1061907 1059819 862894 1115396
$$ packed form
11443B109107l15099p3847q494n8278j9617m58182l14264P3515J06808L441q8488
11432I56602q4938R5779j14811k24948j56353n54972m56595k2766J0024K64085
11422b88893L13142L45513Q34019K64719p15167o46079j64386K60041K50967J30141
11412E84017m3697j09537K53548M26175J95468j91116l7222K12000o0806Q5568
11402A314398m37699k61179L5013l67630l83675j12612j98270P92J92778J6945
11392b01139j38081R7640J02289J8069j10901m05070k85414l82769k78370j74802
11382a758548l5582M5528L68279R26912O47707K33274n81996k83903O0022J1383
11372c66924M87855M98844K41841j01638j9144K08471J12602k088j96925K52502
$$ plain form
11362 1115396 1537790 1206978 764787 121856 -512733 -773961 -707962 -826198 -687127 -430073
11352 -430073 86820 668193 515993 156036 64396 -670770 -1372182 -1246379 -602706 28316
11342 28316 357490 286132 310840 453043 462942 265880 187199 322150 24873 -558655 -1103375
11331 -1103375 -1131859 -806097 -472430 -371686 -803434 -1260497 -1347206 -1211600 -731179 -234600
11321 -234600 227616 748363 758059 514789 -13083 -652696 -690187 -432958 -600686 -1007887
11311 -1007887 -1330237 -1263816 -1005616 -684906 -410920 -1464 225917 371990 275264 148991
11301 148991 102423 -14405 -61273 150397 -176964 -406538 -60882 213301 293209 288064
11291 288064 229473 -38256 -204419 -511888 -307541 145452 87180 -144746 15633 347196
$$ packed form
11362A115396M22394l30812m42191o42931o34589k61228O5999j18236J39071K57054
11352d30073N16893N81373j52200l59957r1640p35166p01412J25803O43673O31022
11342B8316L29174p1358K4708J42203R899j97062p8681J34951k97277n83528n44720
11331a103375k8484L25762L33667J00744m31748m57063q6709J35606M80421M96579
11321b34600M62216N20747R696k43270n27872o39613l7491K57229j67728m07201
11311a007887l22350O6421K58200L20710K73986M09456K27381J46073r6726j26273
11301A48991m6568j16828m6868K11670l27361k29574L45656K74183P9908n145
11291B88064n8591k67729j66163l07469K04347M52993n8272k31926J60379L31563
$$ plain form
11281 347196 250059 -216400 -291322 -462900 -755061 -819484 -653338 -131998 318126 261872
11271 261872 -123674 -284827 -567412 -838624 -950692 -944303 -680607 -385592 -170236 -28336
11261 -28336 -26184 68686 207911 -303800 -1209167 -1303060 -1027921 -931198 -627449 -92512 389523
11250 389523 459028 218585 68841 290175 544989 178391 -328932 -381233 -181495 360879
11240 360879 669726 366540 -277103 -487490 -248098 -121138 84774 146821 11025 -316363
11230 -316363 -656427 -735136 -438580 -252418 -283550 -264907 -15043 320965 219211 -214359
11220 -214359 -363731 -391960 -338398 -285751 117641 454979 507125 426890 482020 486353 459176
11209 459176 460931 619262 540354 501998 299524 -39046 36458 350750 251396 -98682 -265812
$$ packed form
11281C47196r7137m66459p4922j71578k92161o4423J66146N21340M50124n6254
11271B61872l85546j61153k82585k71212j12068O389K63696K95015K15356J41900
11261b8336K152R4870J39225n11711r05367r3893K75139R6723L03749N34937M82035
11250C89523O9505k40443j49744K21334K54814l66598n07323n2301J99738N42374
11240C60879L08847l03186o43643k10387K39392J26960K05912O2047j35796l27388
11230c16363l40064p8709K96556J86162l1132J8643K49864L36008j01754m33570
11220b14359j49372k8229N3562N2647M03392L37338N2146q0235N5130M333k7177
11209D59176J755J58331p8908l8356k02474l38570P5504L14292r9354l50078j67130
$$ plain form
11198 -265812 -380315 -596881 -873341 -269009 483240 550920 93064 -291489 -412162 -325188
11188 -325188 -547208 -960368 -1186741 -1056987 -231192 184674 -243763 -648421 -522666 -394340
11178 -394340 -243116 -128198 -50745 -45857 88991 541345 557745 446701 120351 16035
11168 16035 522866 753770 246884 -3145 101999 -21870 -374904 -437460 -276203 -64650
11158 -64650 282037 406485 341651 465652 459803 143919 -174954 -206028 -254829 -543829 -743567
11147 -743567 -934929 -893747 -845003 -969218 -983887 -519416 -435264 -478794 -474495 -600109 -463420
11136 -463420 -358227 -246755 -123726 -458470 -722050 -418931 -381338 -494715 -743317 -364742
11126 -364742 204876 168897 -347155 -337076 -187732 -222762 -115668 80744 334509 92951
$$ packed form
11198b65812j14503k16566k76460O04332P52249O7680m57856l84553j20673Q6974
11188c25188k22020m13160k26373J29754Q25795M15866m28437m04658J25755J28326
11178c94340J51224J14918P7453M888J34848M52354J6400j11044l26350j04316
11168A6035N06831K30904n06886k50029J05144j23869l53034o2556J61257K11553
11158f4650L46687J24448o4834J24001n849l15884l18873l1074m8801k89000j99738
11147g43567j91362M1182M8744j24215j4669M64471Q4152m3530M299j25614J36689
11136d63420J05193J11472J23029l34744k63580L03119L7593j13377k48602L78575
11126c64742N69618l5979n16052J0079J49344l5030J07094J96412K53765k41558
$$ plain form
11116 92951 -198963 -578458 -493757 19976 -140288 -207864 93262 -64625 -173008 -218963
11106 -218963 -502204 -1015847 -1291275 -1121946 -864873 -1054925 -1348981 -1417210 -1308263 -1502402
11096 -1502402 -1603871 -1348885 -1001496 -698066 -444930 -310982 -32433 336864 176033
11087 176033 -262800 -431477 -766499 -966159 -518948 -348435 -94382 255127 76103 -501202
11077 -501202 -596675 -387400 -230696 -113549 131380 241042 439181 723594 1202134 1523312
11067 1523312 1408428 1431903 1322025 896740 677060 656583 871056 721470 794622 1050138
11057 1050138 895536 194595 -233450 -224281 -70424 -119536 -109955 -162024 -800870 -1241004
11047 -1241004 -1135246 -910992 -653741 -715025 -933981 -1046713 -1102982 -821283 -491351 -592408
$$ packed form
11116I2951k91914l79495Q4701N13733j60264o7576L01126j57887j08383m5955
11106b18963k83241n13643k75428J69329K57073j90052k94056o8229J08947j94139
11096a502402j01469K54986L47389L03430K53136J33948K78549L69297j60831
11087A76033m38833j68677l35022j99660M47211J70513K54053L49509j79024n77305
11077e01202r5473K09275J56704J17147K44929J09662J98139K84413M78540L21178
11067A523312j14884K3475j09878m25285k19680k0477K14473j49586P3152K55516
11057A050138j54602p00941m28045R169J53857m9112R581n2069o38846m40134
11047a241004J05758K24254K57251o1284k18956j12732n6269K81699L29932j01057
$$ plain form
11037 -592408 -975659 -1051163 -469342 314566 907684 756630 209455 -340859 -503909 -112598
11027 -112598 169737 7369 -208963 -196772 -439703 -606648 -531891 -614295 -723186 -645399
11017 -645399 -523580 -477780 -488785 -416709 -565526 -828190 -764465 -534387 -435004 -217986
11007 -217986 242187 741698 948566 764922 720357 861037 1087908 1304160 1350443 913382
10997 913382 516098 234164 242698 -53102 -421422 -722974 -836529 -463135 -90673 157190
10987 157190 249067 -79165 9449 175836 -51392 -98753 216800 178647 199724 388223
10977 388223 155192 83780 -255096 -907961 -914571 -891426 -1131070 -864073 -375900 -432075
10967 -432075 -635125 -449954 -145297 -29040 -24222 -280536 -362797 4588 135143 -63877
$$ packed form
11037e92408l83251p5504N81821P83908N93118j51054n47175n50314j63050L91311
11027a12598K82335j62368k16332J2191k42931j66945P4757q2404j08891P7787
11017f45399J21819M5800j1005P2076j48817k62664O3725K30078R9383K17018
11007b17986M60173M99511K06868j83644m4565J40680K26871K16252M6283m37061
10997I13382l97284k81934Q534k95800l68320l01552j13555L73394L72462K47863
10987A57190R1877l28232Q8614J66387k27228m7361L15553l8153K1077J88499
10977C88223k33031p1412l38876o52865o610K3145k39644K66997M88173n6175
10967d32075k03050J85171L04657J16257M818k56314q2261L67385J30555j99020
$$ plain form
10957 -63877 -91288 -42585 -158796 153632 344478 317516 512603 736139 653516 194994
10947 194994 -415851 -582739 -865266 -598878 250757 575611 421069 188370 238088 711413
10937 711413 993883 994304 740063 197756 -253470 -270216 -320885 -400872 -750422 -1118022 -925779
10926 -925779 -215227 152784 293079 340938 426659 637886 990093 1176236 940015 777842
10916 777842 603350 352809 69811 -187243 -208196 -65081 -233989 -368005 -79635 119268
10906 119268 126407 385949 693776 969176 830329 484923 174932 -313950 -349114 -55429
10896 -55429 151213 192003 281826 464727 400366 30273 -423566 -608267 -207247 24621
10886 24621 202937 612530 900735 865469 602568 284991 171975 293762 269018 143221
$$ packed form
10957f3877k7411M8703j16211L12428J90846k6962J95087K23536q2623m58522
10947A94994o10845j66888k82527K66388Q49635L24854j54542k32699M9718M73325
10937G11413K82470M21k54241n42307m51226j6746n0669p9987l49550l67600J92243
10926i25779P10552L68011J40295M7859Q5721K11227L52207J86143k36221j62173
10916G77842j74492k50541k82998k57054k0953J43115j68908j34016K88370J98903
10906A19268P139K59542L07827K75400j38847l45406l09991m88882l5164K93685
10896e5429K06642M0790Q9823J82901o4361l70093m53839j84701M01020K31868
10886B4621J78316M09593K88205l5266k62901l17577j13016J21787k4744j25797
$$ plain form
10876 143221 5566 -169390 -146616 65591 -287779 -924224 -922683 -713947 -257481 62571
10866 62571 -101634 -446235 -850921 -1391843 -1284092 -742347 -407822 -389355 -364074 -147481
10856 -147481 75884 383814 386954 12494 -300126 -256926 266793 676868 845697 674979
10846 674979 411069 208978 109599 -76828 -347182 -735976 -963309 -811676 -511371 -213970
10836 -213970 -13353 106239 109568 35021 49351 -138143 -54743 397110 480347 187733 127019
10825 127019 390211 405691 -135265 -571831 -450982 -120384 284821 494279 494216 363054
10815 363054 -70180 -312197 -68948 153630 156073 15150 -454448 -516336 -162184 268417
10805 268417 516788 231643 283641 356264 -88754 -745887 -1277716 -1618748 -1214779 -883835
$$ packed form
10876A43221j37655j74956K2774K12207l53370o36445J541K08736M56466L20052
10866F2571j64205l44601m04686n40922J07751N41745L34525J8467K5281K16593
10856a47481K23365L07930L140l74460l12620M3200N23719M10075J68829j70718
10846F74979k63910k02091r9379j86427k70354l88794k27333J51633L00305K97401
10836b13970K00617J19592L329p4547J4330j87494Q3400M51853Q3237k92614o0714
10825A27019K63192J5480n40956m36566J20849L30598M05205K09458o3j31162
10815C63054m33234k42017K43249K22578K443j40923m69598o1888L54152M30601
10805B68417K48371k85145N1998P2623m45018o57133n31829l41032M03969L30944
$$ plain form
10795 -883835 -577651 -382787 -355212 -227080 -58818 164081 367626 352533 498806 446561
10785 446561 660292 763612 636747 563707 118772 -365169 -518870 -186729 292722 458110
10775 458110 470038 650072 470230 49246 16930 226107 178239 144385 -96289 -55178
10765 -55178 381322 1019767 1439324 1147106 423341 -232614 -526307 -569751 -315654 -154984
10755 -154984 100986 465328 519759 639873 1010275 1168335 1047639 1007309 744942 428219
10745 428219 330807 540350 587995 433631 106757 66232 -278616 -739508 -719978 -252218
10735 -252218 -105576 -113665 274639 696849 786576 833049 755427 587766 293718 50821
10725 50821 170416 529209 921026 844226 606524 156696 191468 217416 -101280 -213025
$$ packed form
10795h83835L06184J94864K7575J28132J68262K22899K03545j5093J46273n2245
10785D46561K13731J03320j26865p3040m44935m83941j53701L32141M79451J65388
10775D58110J1928J80034j79842m20984l2316K09177m7868l3854k40674M1111
10765e5178M36500O38445M19557k92218p23765o55955k93693m3444K54097J60670
10755a54984K55970L64342N4431J20114L70402J58060j20696m0330k62367l16723
10745D28219r7412K09543M7645j54364l26874m0525l44848m60892J9530M67760
10735b52218J46642q089L88304M22210Q9727M6473p7622j67661k94048k42897
10725E0821J19595L58793L91817p6800k37702m49828L4772K5948l18696j11745
$$ plain form
10715 -213025 -456999 -510934 -272776 209405 499348 698286 694403 192095 60874 527765
10705 527765 646676 460911 381934 190118 243214 527269 584742 229735 -4444 -270535
10695 -270535 -631579 -776698 -325623 148316 431977 475799 275524 5320 -65036 -166385
10685 -166385 -15794 107359 205439 67723 -222454 -331061 -139401 194948 373736 619341
10675 619341 421770 -11357 -388749 -401168 -419277 -688120 -613023 -644004 -558351 -560896 -733719
10664 -733719 -616511 -217865 -158719 -200897 -3504 33327 -90075 -124891 258133 528941
10654 528941 197731 -512155 -704821 -358314 36372 -58062 -259052 -318528 -135225 134343
10644 134343 -62190 -342300 -514883 -267866 119896 -160241 -344331 337658 850433 851315
$$ packed form
10715b13025k43974n3935K38158M82181K89943J98938l883n02308j31221M66891
10705E27765J18911j85765p8977j91816N3096K84055N7473l55007k34179k66091
10695b70535l61044j45119M51075M73939K83661M3822k00275k70204p0356j01349
10685a66385J50591J23153R8080j37716k90177j08607J91660L34349J78788K45605
10675F19341j97571m33127l77392j2419j8109k68843P5097l0981Q5653k545j72823
10664g33719J17208L98646N9146m2178J97393L6831j23402l4816L83024K70808
10654E28941l31210p09886j92666L46507L94686r4434k00990n9476J83303K69568
10644A34343j96533k80110j72583K47017L87762k80137j84090O81989N12775Q82
$$ plain form
10634 851315 359546 -298342 -655312 -489397 -164702 -189071 151544 429026 307666 32513
10624 32513 -297663 -230196 -98913 -73880 -246376 -106419 227796 136811 -245737 -488677
10614 -488677 -395391 -506499 -573723 -569555 -449776 -346280 -56069 -42501 -419952 -1002436
10604 -1002436 -1539341 -1449777 -1055861 -566744 -358768 -452909 -604698 -715737 -706115 -616541
10594 -616541 -96892 562041 738188 755086 491454 -124894 -739779 -932932 -776067 -488865
10584 -488865 -374353 -331672 -92642 600348 884899 498828 175841 133830 262028 176690
10574 176690 -287545 -445534 -347661 -264591 -286085 -361872 31786 580770 756360 877135
10564 877135 915068 855020 423708 2801 -126012 -306868 49287 365462 305597 304579
$$ packed form
10634H51315m91769o57888l56970J65915L24695k4369L40615K77482j21360k75153
10624C2513l30176O7467J31283K5033j72496J39957L34215r0985l82548k42940
10614d88677R3286j11108o7224M168J19779J03496K90211J3568l77451n82484
10604a002436n36905Q9564L93916M89117K07976r4141j51789j11039R622Q9574
10594f16541N19649O58933J76147J6898k63632o16348o14885j93153J56865K87202
10584d88865J14512M2681K39030O92990K84551l86071l22987m2011J28198q5338
10574A76690m64235j57989R7873Q3070k1494p5787L93658N48984J75590J20775
10564H77135L7933o0048m31312m20907j28813j80856L56155L16175n9865j018
$$ plain form
10554 304579 118300 -57164 133973 272194 258959 -106760 -626817 -749230 -589963 -368001
10544 -368001 -78035 258780 563907 418057 97531 255626 520551 719524 390512 -55361
10534 -55361 -43638 347688 714209 1016864 865617 379569 89092 -75714 -399430 -615985
10524 -615985 -424542 -237550 -577073 -584712 -350141 -19361 29435 -103718 -301411 -621684
10514 -621684 -923541 -1102981 -1093043 -963913 -765736 -788533 -935275 -1104283 -853672 -363884
10504 -363884 -261779 -372891 -414054 -600321 -588038 -558118 -374420 -570696 -692116 -718883
10494 -718883 -728220 -630207 -561196 -324646 -193840 17477 311946 431452 463110 80635
10484 80635 -217138 -124890 -125144 -647538 -980991 -1022430 -1292646 -1596973 -1461316 -1145085 -881994
$$ packed form
10554C04579j86279j75464J91137J38221j3235l65719n20057j22413J59267K21962
10544c68001K89966L36815L05127j45850l20526J58095K64925J98973l29012m45873
10534e5361J1723L91326L66521L02655j51247m86048k90477j64806l23716k16555
10524f15985J91443J86992l39523p639K34571L30780M8796j33153j97693l20273
10514f21684l01857j79440R938J29130J98177k2797j46742j69008K50611M89788
10504c63884J02105j11112m1163j86267J2283K9920J83698j96276j21420k6767
10494g18883r337R8013O9011K36550J30806K11317K94469J19506L1658l82475
10484H0635k97773R2248k54n22394l33453m1439k70216l04327J35657L16231K63091
$$ plain form
10473 -881994 -389622 -117333 -224786 -393897 -301176 -253905 -175068 57340 100481 25356
10463 25356 -16099 -376660 -759483 -673053 -747582 -312605 -63095 -342601 -399746 -247179
10453 -247179 -171534 -174774 -138973 2522 239438 149764 64137 -100604 -135236 -332616 -497581
10442 -497581 -500497 -657380 -637550 -8154 466944 917718 957880 940668 957687 732819 722535
10431 722535 607656 387597 163427 144143 286307 635835 704084 695050 864935 862314 814059
10420 814059 522052 375859 60097 -14248 458661 556784 343933 54203 -56633 -346264
10410 -346264 -729371 -1112807 -1070926 -1039309 -878903 -873978 -1165548 -1037728 -507787 -186215
10400 -186215 85808 317461 20348 -494230 -592099 -629732 -648332 -115870 162262 133986
$$ packed form
10473h81994M92372K72289j07453j69111R2721M7271P8837K32408M3141p5125
10463B5356m1455l60561l82823Q6430p4529M34977K49510k79506n7145J52567
10453b47179P5645l240L5801J41495K36916q9674q5627j64741l4632j97380j64965
10442d97581k916j56883J9830O29396M75098M50774M0162j7212J7019k24868j0284
10431G22535j14879k20059k24170j9284J42164L49528O8249r034J69885k621m8255
10420H14059k92007j46193l15762p4345M72909R8123k12851k89730j10836k89631
10410c46264l83107l83436M1881L1617J60406M925k91570J27820N29941L21572
10400a86215K72023K31653k97113n14578r7869l7633j8600N32462K78132k8276
$$ plain form
10390 133986 -77147 -497329 -928243 -760263 -658499 -790129 -950494 -1199504 -815310 -41228
10380 -41228 364997 335352 -14628 -601527 -733839 -508333 -100124 130877 -149341 -687501
10370 -687501 -1087047 -1278976 -1063019 -762072 -562238 33877 358716 67493 -461197 -878132
10360 -878132 -834292 -1030998 -1457673 -1445938 -924170 -805020 -983866 -713448 -291222 18781
10350 18781 -47901 -268723 -332027 -276026 -168814 29534 120897 -47406 -284555 -524077
10340 -524077 -490436 -261658 -228740 -399927 -777607 -1130995 -890888 -141806 477498 489548
10330 489548 132638 -231018 -669412 -899189 -783462 -741290 -756592 -659803 -472038 -153823
10320 -153823 61973 -224686 -699187 -1026782 -1221331 -539434 -194465 -256157 -184564 94498
$$ packed form
10390A33986k11133m20182m30914J67980J01764j31630j60365k49010L84194P74082
10380d1228M06225k9645l49980n86899j32312K25506M08209K31001k80218n38160
10370f87501l99546j91929K15957L00947J99834N96115L24839k91223n28690m16935
10360h78132M3840j96706m26675J1735N21768J19150j78846K70418M22226L10003
10350A8781o6682k20822o3304N6001J07212J98348R1363j68303k37149k39522
10340e24077L3641K28778L2918j71187l77680l53388K40107P49082O19304J2050
10330D89548l56910l63656m38394k29777J15727M2172j5302R6789J87765L18215
10320a53823K15796k86659m74501l27595j94549O81897L44969o1692P1593K79062
$$ plain form
10310 94498 531207 299773 -224489 -601285 -638899 -632614 -700724 -774326 -662762 4527 430182
10299 430182 449028 602505 634447 281044 -93060 -280871 -533518 -759781 -858943 -916213
10289 -916213 -973314 -1069099 -859192 -517934 -547008 -645653 -1009064 -852801 -722497 -1006842
10279 -1006842 -1248649 -999525 -582463 -305521 -333047 -330205 -169095 -152831 -135583 -345064
10269 -345064 -520511 -292322 -176392 -218367 -13843 -152993 -541428 -673588 -839622 -1083517
10259 -1083517 -976223 -533258 -92082 536904 885432 850040 930786 698926 249847 -395247
10249 -395247 -871503 -1037651 -1243321 -938172 -645862 -581480 -490666 -469907 -370835 -297866
10239 -297866 -130065 167694 226112 -55769 -111002 -262996 -872117 -1159940 -1160356 -937323
$$ packed form
10310I4498M36709k31434n24262l76796l7614O285o8110p3602J11564O67289M25655
10299D30182J8846J53477L1942l53403l74104j87811k52647k26263r9162n7270
10289i16213n7101r5785K09907L41258k9074r8645l63411J56263J30304k84345
10279a006842k41807K49124M17062K76942k7526K842J61110J6264J7248k09481
10269c45064j75447K28189J15930m1975K04524j39150l88435j32160j66034k43895
10259a083517J07294M42965M41176O28986L48528l5392Q0746k31860m49079o45094
10249c95247m76256j66148k05670L05149K92310O4382R0814K0759R9072P2969
10239b97866J67801K97759N8418k81881n5233j51994o09121k87823m16K23033
$$ plain form
10229 -937323 -812472 -415441 194648 574628 647730 370173 287441 809673 1136529 789860
10219 789860 117002 -458110 -502784 -132956 25562 174639 -174133 -697383 -964357 -1070764
10209 -1070764 -907379 -862091 -593229 -181258 -148886 -318853 -393486 -467618 -606694 -762687
10199 -762687 -571738 -354887 -360149 -573043 -724775 -357590 38513 -427053 -1137650 -1464507
10189 -1464507 -1398028 -1318272 -1499717 -1434093 -614044 -1352 191285 -48228 -497508 -755406
10179 -755406 -679802 -304007 -93031 127115 498818 744291 242018 -446215 -849923 -583153
10169 -583153 177306 236999 -115094 8336 275240 733178 1313501 1227299 621525 359132
10159 359132 294622 115062 86303 -160637 32151 452662 644669 662503 345315 43095
$$ packed form
10229i37323J24851L97031O10089L79980P3102k77557q2732N22232L26856l46669
10219G89860o72858n75112m4674L69828J58518J49077l48772n23250k66974j06407
10209a070764J63385M5288K68862M11971L2372j69967p4633p4132j39076j55993
10199g62687J90949K16851n262k12894j51732L67185L96103m65566p10597l26857
10189a464507O6479P9756j81445O5624Q20049O12692J92637k39513m49280k57898
10179g55406P5604L75795K10976K20146L71703K45473n02273o88233m03708K66770
10169e83153P60459N9693l52093J23430K66904M57938N80323q6202o05774k62393
10159C59132o4510j79560k8759k46940J92788M20511J92007J7834l17188l02220
$$ plain form
10149 43095 -149540 84645 581068 871091 1068275 1239921 1429123 1225490 804972 404950
10139 404950 17757 313013 438354 447761 752076 1022944 1596641 2059591 2377337 2584451
10129 2584451 2785011 3281667 4546274 5673771 7255956 10050383 13080426 15659797
10121 15659797 16877853 16028030 13675580 11386624 9631547 8140645 6902153 5589846
10113 5589846 4532644 3782620 2812262 2220230 2263930 2356888 2456464 2201685 1955410 2033729
10103 2033729 2155372 2378504 2415249 2175905 1770824 1350790 1230542 1139098 1382349 1513809
10093 1513809 1178993 811586 629803 849359 1191492 1338418 1192253 1018187 1415116
10084 1415116 1971553 1937493 1627034 1407476 1056122 783001 973521 1600439 2008449 1546828
$$ packed form
10149D3095j92635K34185M96423K90023J97184J71646J89202k03633m20518m00022
10139D04950l87193K95256J25341R407L04315K70868N73697M62950L17746K07114
10129B584451K00560M96656J264607J127497J582185K794427L030043K579371
10121A5659797J218056q49823k352450k288956j755077j490902j238492j312307
10113E589846j057202p50024r70358n92032M3700R2958R9576k54779k46275P8319
10103B033729J21643K23132L6745k39344m05081m20034j20248r1444K43251J31460
10093A513809l34816l67407j81783K19556L42133J46926j46165j74066L96929
10084A415116N56437l4060l10459k19558l51354k73121J90520O26918M08010m61621
$$ plain form
10074 1546828 792547 405214 53896 206 -117284 -484692 -464987 -157016 -28572 51328
10064 51328 124158 154341 -14640 242602 596420 647477 831587 1278967 1128238 900200
10054 900200 469741 -168598 -327068 -293306 -465408 -814231 -921274 -592131 -181195 -15283
10044 -15283 268701 277873 28727 -149096 -452176 -365386 -136222 -198649 -340511 -215964
10034 -215964 82232 225342 208310 66876 -5854 -42090 8212 -119690 20521 -76550
10024 -76550 -157879 -12659 -54640 -88847 -64356 257718 500756 648877 738612 918170 786130
10013 786130 492939 245945 177239 262035 29322 93994 129840 244728 127514 -21153
10003 -21153 105082 325077 681038 1008564 1146282 938849 1035947 1365706 1359403 1066332
$$ packed form
10074A546828p54281l87333l51318n3690j17490l67408J9705L07971J28444P9900
10064E1328P2830L0183j68981K57242L53818N1057J84110M47380j50729k28038
10054I00200m30459o38339j58470L3762j72102l48823j07043L29143M10936J65912
10044a5283K83984R172k49146j77823l03080Q6790K29164o2427j41862J24547
10034b15964K98196J43110j7032j41434p2730l6236N0302j27902J40211r7071
10024g6550q1329J45220m1981l4207K4491L22074K43038J48121Q9735J79558j32040
10013G86130k93191k46994o8706Q4796k32713O4672L5846J14888j17214j48667
10003b1153J26235K19995L55961L27526J37718k07433R7098L29759o303k93071
$$ plain form
9993 1066332 720054 818549 709106 329916 -32604 -171879 189901 356558 256185 536946
9983 536946 373323 445311 1092446 1388346 1290460 973397 682588 677331 667570 468125 453042
9972 453042 557597 339026 -188239 -596640 -958884 -768182 -431159 -57168 228382 230057
9962 230057 187065 191719 232711 285254 90095 -161832 -130387 -104531 -552290 -933502 -1198418
9951 -1198418 -991414 -524941 -128160 336411 485548 360609 476582 661023 231960 -134376
9941 -134376 160176 607681 459243 368474 145027 47579 274896 161983 -109761 -143991
9931 -143991 -277048 -433827 -413410 -474135 -821597 -690218 -347101 -15443 -7648 41778 -123899
9920 -123899 -483143 -674562 -639571 -323564 -48700 -295952 -328032 154642 367854 -70048
$$ packed form
9993A066332l46278R8495j09443l79190l62520j39275L61780J66657j00373K80761
9983E36946j63623P1988O47135K95900r7886l17063k90809n257r761j99445j5083
9972D53042J04555k18571n27265m08401l62244J90702L37023L73991K85550J675
9962B30057m2992M654M0992N2543j95159k51927L1445K5856m47759l81212k64916
9951a198418K07004M66473L96781M64571J49137j24939J15973J84441m29063l66336
9941a34376K94552M47505j48438r0769k23447r7448K27317j12913k71744l4230
9931a43991j33057j56779K0417o0725l47462J31379L43117L31658P795M9426j65677
9920a23899l59244j91419L4991L16007K74864k47252l2080M82674K13212m37902
$$ plain form
9910 -70048 -497817 -327277 105932 241503 160936 165693 306403 -56303 -595477 -1154126
9900 -1154126 -1471777 -1421074 -1302342 -1031104 -393299 -96569 -387901 -494497 -373170 -481784
9890 -481784 -900677 -673577 -359976 -424737 -566996 -477439 -360652 -544331 -905690 -1021261
9880 -1021261 -990983 -1062171 -1102426 -1313836 -1140205 -929485 -1003031 -934416 -769362 -518638
9870 -518638 -212686 -216129 -490349 -311071 -234974 -160262 -60869 302187 872358 822026 287065
9859 287065 154659 188609 160823 182542 251810 192851 -125153 -199732 39161 -377968 -938163
9848 -938163 -1074165 -911237 -589127 -266048 -114376 -61340 -22756 37759 218884 319527
$$ packed form
9910g0048m27769J70540M33209J35571q0567M757J40710l62706n39174n58649
9900a154126l17651N0703J18732K71238O37805K96730k91332j06596J21327j08614
9890d81784m18893K27100L13601o4761j42259Q9557J16787j83679l61359j15571
9880a021261L0278p1188m0255k11410J73631K10720p3546O8615J65054K50724
9870e18638L05952l443k74220J79278P6097P4712R9393L63056N70171n0332n34961
9859B87065j32406L3950k7786K1719O9268n8959l18004p4579K38893m17129n60195
9848i38163j36002J62928L22110L23079J51672N3036L8584O0515J81125J00643
$$ [...]
##END NTUPLES=NMR SPECTRUM
##END=
