##TITLE=C13_SL2-5ID-A
 CDCl3,  20400 sc

 27.09.2021
##JCAMPDX= 6.0         $$ Bruker NMR JCAMP-DX V2.0
##DATA TYPE= NMR SPECTRUM
##DATA CLASS= NTUPLES
##ORIGIN= UXNMR, Bruker Analytische Messtechnik GmbH
##OWNER= root
$$ XWIN-NMR		Version 3.5
$$ Tue Sep 28 09:06:00 2021 Russian Standard Time (UT+4h)  she@DPX200
##.OBSERVE FREQUENCY= 50.327896
##.OBSERVE NUCLEUS= ^13C
##.ACQUISITION MODE= SIMULTANEOUS
##.ACQUISITION SCHEME= undefined
##.AVERAGES= 20402
##.DIGITISER RES= 17
##SPECTROMETER/DATA SYSTEM= spect
##.PULSE SEQUENCE= zgpg30
##.SOLVENT NAME= DMF
##.SHIFT REFERENCE= (INTERNAL, DMF, 0, 222.668)
##AUDIT TRAIL= $$ (NUMBER, WHEN, WHO, WHERE, WHAT)
$$ ##TITLE= Audit trail, XWIN-NMR		Version 3.5
$$ ##JCAMPDX= 5.01
$$ ##ORIGIN= Bruker BioSpin GmbH
$$ ##OWNER= she
$$ F:/spectra/data/she/nmr/c13/1/pdata/1/auditp.txt
$$ ##AUDIT TRAIL=  $$ (NUMBER, WHEN, WHO, WHERE, WHAT)
(   1,<2021-09-28 09:04:46.59 +0400>,<she>,<DPX200>,
      <created by zg, POWCHK disabled, PULCHK disabled
       terminated by command 'halt'
       configuration hash MD5:
       00 E9 B6 7A A2 85 ED C7 34 08 36 98 17 FE 4E 26
       data hash MD5: 32K
       5D 64 87 A5 D0 27 86 50 B4 9A 06 FC 88 08 5B 43>)
(   2,<2021-09-28 09:04:49.51 +0400>,<she>,<DPX200>,
      <Start of raw data processing
       efp BC_mod = 2 LB = 1 FT_mod = 6 PKNL = 1 PHC0 = -334.2888 PHC1 = 28.36238 SI = 32K 
       data hash MD5: 32K
       9F E8 41 9A 7C 52 AC 42 0A 93 09 2C 77 9D A6 1F>)
(   3,<2021-09-28 09:04:51.98 +0400>,<she>,<DPX200>,
      <abs ABSG = 5 
       data hash MD5: 32K
       0A 9F 05 89 F1 D0 50 4C D8 B0 84 42 C2 B6 63 49>)
(   4,<2021-09-28 09:05:27.00 +0400>,<she>,<DPX200>,
      <pk PHC0 = 0.2185646 PHC1 = 0 
       data hash MD5: 32K
       5F BF 3E 9E AF A5 91 54 1D 44 F6 C8 D4 B7 E4 2C>)
(   5,<2021-09-28 09:05:30.57 +0400>,<she>,<DPX200>,
      <abs ABSG = 5 
       data hash MD5: 32K
       26 FE 07 AA 92 FD 68 FB 77 69 03 24 AE D9 54 44>)
$$ ##END=
$$ 
$$ hash MD5
$$ 22 FD 6D 37 F4 C9 14 BF 51 27 BE E1 A5 7C BE FD
##$RELAX= 
##$RELAX= 
##$RELAX= 
##$RELAX= 
##$RELAX= 
##$RELAX= 
##$RELAX= 
##$RELAX= 
$$ Bruker specific parameters
$$ --------------------------
##$DU= <F:/spectra>
##$EXPNO= 1
##$NAME= <c13>
##$PROCNO= 1
##$TYPE= <nmr>
##$USER= <she>
##$AMP= (0..31)
100 100 100 100 100 100 100 100 100 100 100 100 100 100 100 100 100 100 
100 100 100 100 100 100 100 100 100 100 100 100 100 100 
##$AQSEQ= 0
##$AQ_mod= 1
##$AUNM= <au_zg>
##$AUTOPOS= <>
##$BF1= 50.322709
##$BF2= 200.13
##$BF3= 50.322709
##$BF4= 500.13
##$BF5= 500.13
##$BF6= 500.13
##$BF7= 500.13
##$BF8= 500.13
##$BYTORDA= 1
##$CFDGTYP= 0
##$CFRGTYP= 5
##$CHEMSTR= <none>
##$CNST= (0..31)
1 1 145 1 1 1 1 1 1 1 1 1 1 1 1 1 1 1 1 1 1 1 1 1 1 1 1 1 1 1 1 1 
##$CPDPRG= <waltz16>
##$CPDPRG1= <>
##$CPDPRG2= <waltz16>
##$CPDPRG3= <>
##$CPDPRG4= <mlev>
##$CPDPRG5= <mlev>
##$CPDPRG6= <mlev>
##$CPDPRG7= <mlev>
##$CPDPRG8= <mlev>
##$CPDPRGB= <>
##$CPDPRGT= <>
##$D= (0..31)
$$ [...]
##$SUBNAM4= <"">
##$SUBNAM5= <"">
##$SUBNAM6= <"">
##$SUBNAM7= <"">
##$SUBNAM8= <"">
##$SUBNAM9= <"">
##$SW= 239.972175391363
##$SWIBOX= (0..15)
0 1 3 0 0 0 0 0 0 0 0 0 0 0 0 0 
##$SW_h= 12077.2946859903
##$TD= 32768
##$TD0= 1
##$TE= 0
##$TE2= 300
##$TE3= 300
##$TEG= 300
##$TL= (0..7)
120 120 120 120 120 120 120 120 
##$TP= (0..7)
150 150 150 150 150 150 150 150 
##$TP07= 0
##$TPNAME0= <>
##$TPNAME1= <>
##$TPNAME2= <>
##$TPNAME3= <>
##$TPNAME4= <>
##$TPNAME5= <>
##$TPNAME6= <>
##$TPNAME7= <>
##$TPOAL= (0..7)
0.5 0.5 0.5 0.5 0.5 0.5 0.5 0.5 
##$TPOFFS= (0..7)
0 0 0 0 0 0 0 0 
##$TUNHIN= 0
##$TUNHOUT= 0
##$TUNXOUT= 0
##$USERA1= <user>
##$USERA2= <user>
##$USERA3= <user>
##$USERA4= <user>
##$USERA5= <user>
##$V9= 5
##$VALIST= <valist>
##$VCLIST= <CCCCCCCCCCCCCCC>
##$VD= 0
##$VDLIST= <DDDDDDDDDDDDDDD>
##$VPLIST= <PPPPPPPPPPPPPPP>
##$VTLIST= <TTTTTTTTTTTTTTT>
##$WBST= 1024
##$WBSW= 4
##$XGAIN= (0..3)
0 0 0 0 
##$XL= 0
##$YL= 0
##$YMAX_a= 118500348
##$YMIN_a= -28639042
##$ZGOPTNS= <>
##$ZL1= 120
##$ZL2= 120
##$ZL3= 120
##$ZL4= 120
##$ABSF1= 222.6679
##$ABSF2= -17.32892
##$ABSG= 5
##$ABSL= 3
##$ALPHA= 0
##$AQORDER= 0
##$ASSFAC= 0
##$ASSFACI= 0
##$ASSFACX= 0
##$ASSWID= 0
##$AUNMP= <proc_1d>
##$AZFE= 0.1
##$AZFW= 0.5
##$BCFW= 0
##$BC_mod= 2
##$BYTORDP= 0
##$COROFFS= 0
##$CY= -3
##$DATMOD= 1
##$DC= 0
##$DFILT= <>
##$DTYPP= 0
##$F1P= 0
##$F2P= 0
##$FCOR= 0.5
##$FTSIZE= 32768
##$FT_mod= 6
##$GAMMA= 0
##$GB= 0
##$INTBC= 1
##$INTSCL= 4.134877e-10
##$ISEN= 128
##$LB= 1
##$LEV0= 0
##$LPBIN= 0
##$MAXI= 10000
##$MC2= 0
##$MEAN= 0
##$ME_mod= 0
##$MI= 0.1934396
##$NCOEF= 0
##$NC_proc= 2
##$NLEV= 6
##$NOISF1= 120.0001
##$NOISF2= 80.00006
##$NSP= 0
##$NTH_PI= 0
##$NZP= 0
##$OFFSET= 222.6679
##$PC= 1.4
##$PHC0= -334.0702
##$PHC1= 28.36238
##$PH_mod= 1
##$PKNL= yes
##$PPARMOD= 0
##$PSCAL= 0
##$PSIGN= 0
##$REVERSE= no
##$SF= 50.3227293897603
##$SI= 32768
##$SIGF1= 140
##$SIGF2= 120
##$SINO= 11.81781
##$SIOLD= 32768
##$SREGLST= <13C.CDCl3>
##$SSB= 0
##$STSI= 32768
##$STSR= 0
##$SW_p= 12077.2946859903
##$SYMM= 0
##$S_DEV= 0
##$TDeff= 32768
##$TDoff= 0
##$TI= <>
##$TILT= no
##$TM1= 0
##$TM2= 0
##$TOPLEV= 0
##$USERP1= <user>
##$USERP2= <user>
##$USERP3= <user>
##$USERP4= <user>
##$USERP5= <user>
##$WDW= 1
##$XDIM= 32768
##$YMAX_p= 436959096
##$YMIN_p= -2478709
$$ End of Bruker specific parameters
$$ ---------------------------------
##NTUPLES= NMR SPECTRUM
##VAR_NAME=  FREQUENCY,     SPECTRUM/REAL,   SPECTRUM/IMAG
##SYMBOL=    X,             R,               I
##VAR_TYPE=  INDEPENDENT,   DEPENDENT,       DEPENDENT
##VAR_FORM=  AFFN,          ASDF,            ASDF
##VAR_DIM=   32768,         32768,           32768
##UNITS=     HZ,            ARBITRARY UNITS, ARBITRARY UNITS
##FACTOR=    0.368581032318806, 1,           1
##FIRST=     11205.2560958543, 0,            0
##LAST=      -872.038590136011, 0,           0
##MIN=       -872.038590136011, -2478709,    0
##MAX=       11205.2560958543, 436959096,    0
$$ Real data points
##PAGE= N=1
##DATA TABLE= (X++(R..R)), XYDATA
$$ [...]
15845A319836J4437k49077j38577l36125k65593r2646K82665L84140j1593l43126
15835E64341n10333o9550k11890l29345l40588N0349M68184M51519n6926o5512
15825d9751K0287n4413P6238O1397M2028K0835j6612K68549k2483m58402k36369
15814c48696J75687K77466K09284r9141l58004k48196r3177k35481N16777O95457
15804D91976J25508p6591j46933J21040l968R8882k70738m64193j12328O4463
15794a72882J39442k18021j9669M5756J7060p475J23088k55004k11700j18852
15784f78257p4333K7172J08020M23331q7771k51703L13061M53301M38915r3916
15774E77820l68339Q0478l19710k3352q3354r5078K94329J58035k93766k82588
$$ y = [1319836, 1334273, 1085196, 946619, 610494, 344901, 252255, 534920, 919060, 907467, 564341, 54008, -15542, -227432, -556777, -897365, -847016, -378832, 72687, 15761, -49751, -29464, -83877, -7639, 53758, 95786, 116621, 100009, 368558, 346075, -112327, -348696, -173009, 104457, 313741, 214600, -143404, -391600, -484777, -720258, -203481, 491976, 617484, 540893, 393960, 515000, 511032, 609914, 339176, -125017, -237345, -172882, -33440, -251461, -271130, -225374, -208314, -215789, -92701, -347705, -559405, -678257, -752590, -725418, -617398, -194067, -281838, -533541, -220480, 232821, 671736, 577820, 209481, 289959, -29751, -53103, -136457, -231535, 62794, 220829, -72937, -355525]
15764c55525O3355J80018J90061j26784k93721l40828K6730N44019K68847l23295
15754a67123m08341m23438m8052q1210J03092L70224J84137r5176k42054K47437
15744e60504N08695L56532l77294n46565m41541J07396N83097N48235K66138o3916
15734C80273l33578J02109R2638m50080l98183r2857J91699L53501N84533N24333
15724I54388K73954k34071n69582l13651L51367O98315N9172k71477K20407K57978
15714A426800m1481k00458j20901k39449M812j23232n05612J50445M11334j0137
15704G52121j65200k7913j61118l9968K07972j17457n52936M0424P06572q7067
15694E55430j72658r0247m08240l27088J99497O9432l79335k53074j35985J90499
$$ y = [-355525, -292170, -112152, 77909, -48875, -342596, -683424, -656694, -112675, 156172, -167123, -575464, -998902, -1046954, -1128164, -1025072, -654848, -470711, -565887, -807941, -560504, -51809, 304723, -72571, -619136, -1060677, -953281, -370184, 178051, 444189, 380273, 46695, 148804, 241442, -208638, -606821, -699678, -507979, -154478, 430055, 954388, 1228342, 994271, 424689, 111038, 462405, 1160720, 1219892, 948415, 1168822, 1426800, 1385319, 1184861, 1063960, 824511, 829323, 706091, 200479, 350924, 762258, 752121, 586921, 559008, 397890, 357922, 565894, 448437, -104499, -64075, 642497, 555430, 382772, 292525, -115715, -442803, -243306, -173874, -553209, -806283, -942268, -751769]
15684g51769M86002K03749j35331k0883L51248M6744k80238J70853J58137l478
15674B25034q3165Q4991J39885j27006k46587m04408m01293k26334M06720K84137
15664c48026J59396L7055k25576m54712m0126J13475j66857j47873K98502Q09876
15654C5134Q39267J15223k59364l80603k8749j9707m22245l80230l42605j51032
15644i94911K37003M68935J27958J90942M72071j24676n71389k91765l68853J09366
15634g45319J30368l448J10134R4976k94493l5785K83698J96975K20481K07753
15624A65340J98962r5463K49476M5949n18444n55513l89374k51156K00534L58997
15614e90692J67222J80480J71325R7244K62868N6140k70674l97599j2624K46805
$$ y = [-751769, -265767, -62018, -197349, -218232, 133016, 179760, -100478, 70375, 228512, 225034, 141869, 226860, 366745, 239739, -6848, -411256, -812549, -1038883, -632163, -348026, -188630, -151575, -377151, -831863, -871989, -758514, -925371, -1073244, -774742, 35134, 874401, 989624, 730260, 349657, 320908, 301201, -121044, -501274, -843879, -994911, -757908, -288973, -161015, 29927, 501998, 377322, -194067, -485832, -854685, -745319, -614951, -618399, -508265, -413289, -707782, -743567, -459869, -262894, -42413, 165340, 364302, 268839, 518315, 564264, 45820, -509693, -899067, -1150223, -949689, -590692, -423470, -242990, -71665, 25579, 288447, 344587, 73913, -323686, -336310, -89505]
15604h9505J03612J42852l1954p5647O3225K54486J98287j16849n54585n59142
15594f65220j48846l7534J33617M45029K51005K91475L82985K68106m845l32985
15584E82787l31565l02755M2850n0168k41568j95085l13139l43388k8246O15017
15574e65260P01964M90997L34472K543m39605m20803k92912k44p835N7383R613
15563a29687O9929K83975J87061l13098l56992K66320J32625l17395p3245P8097
15553a72410k29828l96164k84741K55097M64591K93748j90695l52692o1215R1162
15543e83147J92493j23708k6550K1887J26076J76372K35836j62788j10239L8336
15533b15432j56493k2310K76907N7457j64945M331j2118k91675m09468o8058J98406
$$ y = [-89505, 14107, 156959, 125005, 49358, 112583, 367069, 565356, 448507, -106078, -665220, -814066, -851600, -717983, -272954, -21949, 269526, 652511, 920617, 915772, 582787, 251222, -51533, -8683, -58851, -300419, -495504, -808643, -1152031, -1180277, -565260, 136704, 627701, 962173, 964716, 525111, 104308, -188604, -188848, -196683, -139300, -129687, -59758, 224217, 411278, 98180, -258812, 7508, 140133, -177262, -250507, -172410, -402238, -798402, -1083143, -828046, -363455, -69707, -260402, -613094, -674309, -583147, -390654, -514362, -540912, -519025, -392949, -216577, 19259, -143529, -253768, -215432, -371925, -394235, -117328, -59871, -224816, -220485, -232603, -524278, -933746, -1001804, -803398]
15522h03398k25429j05896M53729M18855j51988n7654m2090k62723j45277Q4041
15512h37830K22043J28055K51092N08543P86696J51429o78840p04952k32007Q7539
15502c18232K77889K40753k55506k39957M96614P68508j81815n20150J89929K2013
15492D80046k69187k44402j42999j41054k51551j01239r3529k74412j16409K66551
15482h88185K95354J5566J82740L01514J39846k1799J65657L47291M11651L07695
15472A257330l02789q8518k0971p2782J45094M3247k4621j57369l44359l44267
15462H9995k25259k20581j65587R3639N3778l99422k15964j02978j52615P2971
15452a172023N28166R29661N22795j24397k61455l68732l66409k68888r8130n45857
$$ y = [-803398, -1028827, -1134723, -680994, -262139, -414127, -471781, -513871, -776594, -921871, -837830, -615787, -487732, -236640, 271903, 1058599, 1210028, 531188, -173764, -405771, -318232, -40343, 200410, -55096, -295053, 201561, 970069, 788254, 268104, 458033, 480046, 210859, -33543, -176542, -317596, -569147, -670386, -763915, -1038327, -1154736, -888185, -592831, -577265, -394525, -93011, 46835, 25036, 190693, 537984, 949635, 1257330, 954541, 866023, 845052, 772270, 917364, 960611, 935990, 778621, 434262, 89995, -135264, -355845, -521432, -427793, -374015, -773437, -989401, -1092379, -1244994, -1172023, -643857, 285804, 808599, 684202, 422747, 54015, -312394, -581282, -679412, -1225269]
15442a225269m36710J87690L67164L78923M3083j46793q5636l4448L17459O30615
15432c922L12924k28129l61225N9413L63917N39669K10499k91340k93662m94394
15422a86250k05948N48781K85667k90226j50852L38805K00912l24459q20818m48821
15412a053209O7060L30764J75782j38882M2281K19598O80260N14786R9909L2346
15402I70695k50819k93779l24434m58229l95918r4274J09813J20455J31693J1368
15392d73429j29152M6161R9652n8099J3610L46385M36474J31727k67966k43767
15382i8404m91104j190204o98997Q15162Q04741J89517j7287l02296l13352k54082
15372a556306l60948k34643N7738M04703N35676Q0897L11129P78424M90739k30993
$$ y = [-1225269, -1661979, -1474289, -1107125, -728202, -685119, -831912, -917548, -951996, -634537, -3922, 309002, 80873, -280352, -220939, 142978, 682647, 893146, 601806, 308144, -186250, -392198, 156583, 442250, 152024, 1172, 339977, 540889, 216430, -604388, -1053209, -986149, -655385, -479603, -618485, -576204, -356606, 323654, 838440, 938349, 970695, 719876, 426097, 101663, -356566, -752484, -846758, -736945, -616490, -484797, -473429, -602581, -556420, -456768, -514867, -501257, -154872, 281602, 413329, 145363, -98404, -589508, -1779712, -2478709, -1663547, -858806, -669289, -686576, -988872, -1302224, -1556306, -1917254, -2151897, -2094159, -1689456, -1153780, -1072883, -761754, 16670, 507409, 276416]
15362B76416l81674j11065j88696m91045m1422N74739J05752m50970j39007M4960
15352h02012J35647P4048K29916N44301K67546p2321q0932J05371j92662m75600
15342b66698M623M52907J40063J9576J49569j61006J37264O3326k93350k31986
15332A4288r4065K37826L32613J7711M08233K71078J33433k19712o29657l20280
15322A51468J2690j20408j63704l24134n5200K41143j82180l27758K8136P9320
15312f60627J77097j1103j41777K2868L6974M11p1782j01449j55836j39213J68954
15301h75483M64157J23002l46414k36168R4435L08194L18036j12857p467M3621
15291b26944N9292Q6804q2222k00886j47713q5455J44265P59218L71712J51822
$$ y = [276416, -105258, -216323, -405019, -896064, -937486, -362747, -256995, -707965, -846972, -802012, -666365, -592317, -362401, 181900, 449446, 377125, 296193, 401564, 208902, -266698, -262075, 190832, 330895, 350471, 500040, 339034, 476298, 539624, 246274, 14288, -79777, 158049, 490662, 508373, 916606, 1187684, 1321117, 1101405, 471748, 151468, 164158, 43750, -119954, -444088, -499288, -258145, -440325, -768083, -739947, -660627, -483530, -494633, -636410, -613542, -576568, -576157, -647939, -749388, -905224, -1044437, -875483, -411326, -288324, -634738, -870906, -776471, -468277, -150241, -263098, -270565, -226944, -167652, -80848, -163070, -363956, -511669, -597124, -452859, 306359, 678071, 829893]
15281H29893J34873m15178m30559j90708j6241J30740O8121l740M13103K95645
15271H15949o8288k12861n13067l40335J91499k13368n2214M47690p3874m37111
15261d55980j49093K58628K65571j5779J7203L24808J42872l78418j89717o5487
15251b45392J50615O02372L48017O0403p9251m83859n59955k05160o3529M0613
15241d35126k26402j2012L27936M17866K50578l13347m82858r5225k14565n22127
15231a305282m32260L21626P16030O33842L85727m36210k20064J98597R8448M5217
15221E671J43518J8463J33278J5046j8751k40286q2150L51461K49608j55181k96913
15210A23764J068M38332J90756n30202m49021j68385j02397N5742J83087L70292
$$ y = [829893, 964766, 549588, 119029, -71679, -87920, 42820, 110941, 107201, 520304, 815949, 747661, 534800, 21733, -318602, -127103, -340471, -392685, 55005, -18869, -455980, -605073, -346445, -80874, -96653, -79450, 245358, 388230, 9812, -179905, -245392, -94777, 507595, 855612, 916015, 836764, 352905, -207050, -412210, -475739, -435126, -661528, -673540, -345604, 72262, 322840, 9493, -473365, -568590, -783155, -1305282, -1737542, -1415916, -699886, -66044, 319683, -116527, -336591, -137994, -39546, 5671, 149189, 167652, 300930, 315976, 297225, 56939, -25211, 326250, 575858, 420677, 123764, 124832, 563164, 753920, 223718, -225303, -393688, -496085, -440343, -257256, 113036]
15200A13036J68246o1976k38335K43630J08694j41395j50328l34481m55011k85205
15190a033125m2307Q2251J65407K31609K65480K96866R0842j70231K02400J17154
15180B06346k47928k35374k4385j99667m44156m16341j8732M29417K70162r1307
15170g71965J13058L35070O1971n5110l47927k99853J92060K01221p1214M3669
15160e99020K67778K25299L61999L24954Q1839j70026k85114l37024r3949k7967
15150b51231M53q629K30217K11113K10065N6514o8857n21388n67046L20690N22055
15139A33956J51252J50525K76346N1330M1471J76621j66206o59162m34666k18794
15129d97327K22215K71829K29403K3533m59269n25664j23298J37007K51222K04199
$$ y = [113036, 281282, 219306, -19029, 224601, 333295, 191900, 41572, -292909, -747920, -1033125, -1075432, -993181, -827774, -596165, -330685, -33819, 57023, -113208, 89192, 206346, -41582, -276956, -301341, -501008, -945164, -1361505, -1380237, -950820, -680658, -771965, -658907, -323837, -261866, -316976, -664903, -964756, -772696, -571475, -642689, -599020, -331242, -105943, 256056, 581010, 662849, 492823, 207709, -129315, -223264, -251231, -250778, -259407, -29190, 181923, 391988, 448502, 379645, -141743, -708789, -388099, 133956, 285208, 435733, 712079, 763409, 804880, 981501, 815295, 156133, -278533, -497327, -275112, -3283, 226120, 249653, -209616, -735280, -858578, -721571, -470349, -266150]
15119b66150J65683K07244j2942K5201k17177k70348j2545k61472j04345Q0563
15109f66288K74962N66534O6019l38971p3650K74911P6175O9604j15843l14202
15099a80749l00547k75081j28446p1379K04981M51392L03678L90956N8975j19778
15089C34002N8656k69098k60176L2441K3915k63924j23984j42639m46620k7622
15079a085049L7991j74014O802L85276J68714K410L38162J65720j43256J05949
15069a91295J12998n9937K68037K16808k91290l23722j31744j84999P5593J96784
15059c12767q2244n8210J4292J31951j8649j47875O0336j61440j92089N9400K08046
15048d99249M3701M1312j41336q3527k8371k58201Q7460L42142M32511R4864l40408
$$ y = [-266150, -100467, 106777, 93835, 119036, -98141, -368489, -381034, -642506, -746851, -666288, -391326, 175208, 241227, -97744, -171394, 103517, 179692, 249296, 133453, -180749, -481296, -756377, -884823, -956202, -751221, -299829, 3849, 394805, 453780, 334002, 392658, 123560, -136616, -104175, -80260, -344184, -468168, -610807, -1057427, -1085049, -1047058, -1221072, -1214270, -828994, -660280, -657870, -319708, -153988, -297244, -191295, -78297, -138234, 129803, 346611, 55321, -268401, -400145, -585144, -509551, -312767, -395011, -453221, -438929, -306978, -325627, -473502, -413166, -574606, -766695, -707295, -499249, -455548, -414236, -555572, -639099, -667470, -925671, -838211, -496069, -63558, 31306, -309102]
15037c09102o0895M44424L31133K02199k07454j70279J62518n9116j73604n3369
15027A06455k04331l47109r0535L04240K91114j91430l66231l60750j45962J09996
15017h94543R7874j78907l5990L54337K14145M44158L48496N8150j83323k21178
15007C219k9814j1806K9485J02179J079j98983K51876K21287q6083l4655l6692
14996B11092l81731M30819M91570k6611l5178K49786j09740o47819m48930j89185
14986d55927J40449M02851K33477j36830k43886n20364m31645j01884M94895L55349
14976b63515m8273N8328M25195N34442K23289j10379j9634j64755n02220m50459
14966c17981J56001J48638p3616k69548m21809L03632L49808k27688n14414Q700
$$ y = [-309102, -369997, 74427, 405560, 607759, 400305, 230026, 392544, 333428, 159824, 106455, -97876, -444985, -535520, -231280, 59834, -131596, -497827, -858577, -1004539, -894543, -796669, -975576, -1011566, -657229, -443084, 1074, 349570, 407720, 224397, 3219, -26595, -38401, -8916, 93263, 94342, -104641, 147235, 368522, 282439, 247784, 211092, -170639, 260180, 751750, 725139, 689961, 939747, 830007, 182188, -266742, -455927, -315478, 87373, 320850, 184020, -59866, -580230, -1011875, -1113759, -618864, -263515, -311788, -253460, 171735, 706177, 929466, 819087, 799453, 634698, 132478, -317981, -161980, -13342, -86958, -356506, -778315, -474683, -124875, -352563, -866977, -858277]
14956h58277J47103J15613O599l06065n40031n54433p4530J99748L82076K55852
14946a226345K92460K68124K36106L40970P04178N49568M10760j54645n69276
14937H51900n5489k44839k21132k21779j31286O3816J74810J75335r3203l26295
14927b8162j01897L41119J96502k51428k87773j328L16957j70269o91903k06538
14917h84720L64169M40217J85062J87310l0719j59124O1947L10807J06014j37965
14907D42998L21614O5622n0331k1745j68686k51423J168N460p1929n8574L59851
14896E74025J65303l63344l48972m27649M7162K07080J48050k04497J08665J52914
14886E8737O9865J02667O1346k6546j5773J7376J27663K78265M38451r3146n77218
$$ y = [-858277, -711174, -595561, -588962, -895027, -1435058, -1989491, -2064021, -1864273, -1482197, -1226345, -933885, -665761, -429655, -88685, 615493, 1165061, 1575821, 1421176, 851900, 796411, 551572, 330440, 108661, -22625, 41191, 216001, 391336, 298133, -28162, -130059, 211060, 407562, 156134, -131639, -132967, 183990, 13721, -678182, -884720, -520551, -80334, 104728, 292038, 261319, 102195, 164142, 474949, 580963, 442998, 764612, 830234, 779903, 758158, 589472, 338049, 339217, 344677, 272748, 214174, 574025, 739328, 375984, 27012, -400637, -353475, -146395, 1655, -202842, -94177, 58737, 128602, 231269, 292615, 266069, 250296, 267672, 395335, 673600, 1112051, 1018905, 441687]
14875D41687o01423l57041m54773k24229M49574N45757O54996K65441r7765j12497
14865E09727K67839K80786J48601l28003m41221k31873k33580L0188L29311L03190
14855F34965L15670l06626p73842m62020J37989L97800J61404q4625K1458J23915
14845A66088k56727j83146j32241l56142J54547M67089J31435l95153m04140J59222
14835f49168L5223l1734L26036K91743J9848L7226j53714j85360j46648P048K94073
14824a55427M01985r5040o9161r9422j84664J53477K92992P5052K6116j22577
14814B23331K89393M38683R5033j87936k64775j59388l08018k83706k11861J89152
14804a80092K30673M1592q6961J76842L38771r2548k26269P0258J44897r9883
$$ y = [441687, -159736, -516777, -971550, -1195779, -746205, -200448, 454548, 719989, 622224, 509727, 777566, 1058352, 1206953, 878950, 437729, 205856, -27724, 2464, 331775, 634965, 950635, 644009, -129833, -591853, -453864, -56064, 105340, 20715, 42173, 166088, -90639, -273785, -406026, -762168, -607621, -140532, -9097, -404250, -808390, -649168, -613945, -645679, -319643, -27900, -8052, 29174, -124540, -309900, -456548, -449500, -155427, 246558, 151518, 82357, -17065, -201729, -48252, 244740, 319792, 345908, 223331, 512724, 951407, 1046440, 858504, 593729, 434341, 126323, -157383, -369244, -180092, 50581, 92173, 5212, 182054, 520825, 428277, 202008, 272266, 417163, 317280]
14794C17280j82937K02774L6365j24063j45744j1344K12912K08485k88406m62632
14784b37310r9643k54895l81186k21960N6126K81639K34297K71656K49858J67414
14774F5996j50329o5983M6501j24976m74802l44126J42737J10105L55459M03101
14764c6317P7758j65976J31881L29255m63668l78707J6997J79135L25883K50759
14754B67000M02036M907q13529r39486k24051L69104L51254L68467K80005k87606
14744b21899o25178k48004K02684M21739j18150M87J68853R107K83825L48417
14734B21881O809m35751l36054k42337J31117M93155P7133K27350K66665k13337
14724A96631m36603n86146m9990J03723Q8635L16629K79426K04977m11555k28423
$$ y = [317280, 134343, 337117, 373482, 249419, 103675, 92331, 305243, 513728, 225322, -237310, -336953, -591848, -973034, -1194994, -1138868, -857229, -622932, -351276, -101418, 65996, -84333, -150316, -103815, -228791, -703593, -1047719, -904982, -794877, -439418, -36317, 41441, -124535, 7346, 336601, -127067, -505774, -488777, -309642, 16241, 267000, 669036, 673943, -139586, -1079072, -1303123, -934019, -582765, -214298, 65707, -221899, -847077, -1095081, -892397, -470658, -588808, -588321, -419468, -410361, -126536, 221881, 228690, -207061, -543115, -785452, -654335, -161180, -84047, 143303, 409968, 196631, -239972, -826118, -876108, -772385, -683750, -367121, -87695, 117282, -294273, -522696]
14714e22696P9274M5277M14369M93291K10723K22384K41341P153o0978l55488
14704G74650o98565m24450N12298N19049q0621j66509n8233L06787n3724m44921
14694A85761j97157l11036l65460j8982k8068J68577K76393K27305M9587j31993
14684a45073J0963r7224j18634o4291j52715l25748J52687K25702L66416L07778
14674A59861N8623N5414j02174j31752M99097L09943k76476r0719j02596j32329
14664B46892k63465l64786l00594j18357J31053J04467l44871N2695J46246J4682
14654f96038K64955K36539N07138n4173k30817l17067l97120K66337L28257K33658
14644A41669L18913Q013k49423n50961m53417J04817L17886j2538k93637q3687
$$ y = [-522696, -443422, -398145, 16224, 509515, 720238, 942622, 1183963, 1191116, 1130138, 774650, 76085, -348365, 163933, 682982, 602361, 435852, 377619, 684406, 630682, 185761, -11396, -322432, -687892, -706874, -734942, -566365, -289972, -62667, -13080, -145073, -134110, -231334, -349968, -414259, -566974, -892722, -740035, -514333, -147917, 159861, 218484, 273898, 171724, 39972, 539069, 849012, 572536, 481817, 379221, 246892, -16573, -381359, -681953, -800310, -669257, -564790, -909661, -856966, -710720, -696038, -431083, -194544, 312594, 258421, 27604, -289463, -686583, -420246, -91989, 141669, 460582, 468595, 219172, -331789, -785206, -680389, -362503, -375041, -668678, -752365]
14634g52365j58227r0646K54943Q4770l49093l0541J46498L1354N21534M09662
14624F7889o3297l36310o7865j02856k2363K16141J17288K62641J9179l26567
14614b36120P6058j31048r1907J49364r6178o7105N8397O3687J46076K43900j28612
14603a3488l18065l08801n54724l9677P49924M56566J19267O44280O73133k9182
14593A379233j38106p776j22847l25535l41594k71178k97593k52330M8464J44419
14583a84843q0892l16319j20455J20002N09176L96086K68968J2354n1476j89284
14573C63317n66091q58058k37457N24179M75200J55418m8961K39307l20235m91621
14563g65002l29099j96563J75260N58648O59911P6282l90332n56782k90035K32132
$$ y = [-752365, -910592, -1001238, -746295, -661525, -1010618, -1041159, -894661, -863307, -341773, 67889, 4592, -331718, -399583, -502439, -524802, -308661, -191373, 71268, 90447, -236120, -160062, -291110, -383017, -233653, -329831, -396936, -338539, -274852, -128776, 115124, -13488, -331553, -640354, -1195078, -1234755, -484831, -28265, 91002, 735282, 1408415, 1379233, 1241127, 1233351, 1110504, 784969, 443375, 172197, -125396, -377726, -329262, -184843, -265735, -582054, -702509, -582507, -73331, 322755, 591723, 604077, 552601, 363317, -202774, -1060832, -1298289, -774110, -298910, -143492, -192453, 46854, -273381, -765002, -1094101, -1290664, -1115404, -556756, 103155, 179437, -210895, -767677, -1057712, -825580]
14553h25580K2016k34899K68356M93815L12598j74468J8331J91659M3748R5028
14543B10604K213J76609j26054l36234n29014o3102K41016N83813M37966l60202
14533B37615o12451j69445K26879L12598j70245m43101j11402J1448j86247j73019
14523a077370K57497O26680L72920J90975j14240n08075j71861J02114j32106
14514d53466k57581j29007K50681J52808o3988J05635j75506N8963j8912q7968
14504f18341R2081K7675L60482K24531J43856J68334p1573L0722o6167l8395Q1531
14493C34736J44661j7108l39570q3974J8415k15453L08072J71744r5987j01805
14483A23731J31482K84027l1907M4669n5667o42304j51512J64007K57845J08225
$$ y = [-825580, -803564, -1038463, -770107, -276292, 36306, -138162, -119831, 71828, 115576, 210604, 212817, 389426, 263372, -72862, -601876, -664978, -423962, 159851, 597817, 237615, -374836, -544281, -317402, -4804, -175049, -618150, -729552, -718104, -904351, -1077370, -819873, -193193, 179727, 370702, 256462, -251613, -423474, -321360, -453466, -711047, -840054, -589373, -436565, -500553, -394918, -570424, -511461, -530373, -618341, -526260, -498585, -138103, 86428, 230284, 398618, 327045, 357767, 291600, 253205, 334736, 479397, 462289, 122719, 38745, 57160, -158293, 149779, 321523, 225536, 123731, 255213, 539240, 507333, 552002, 496335, -145969, -297481, -133474, 124371, 232596]
14473B32596p4934R8674Q4801J97117N83319K21761K9550k42728n71512o6649
14463D91995M7576k24231n41300k0990N91918M83055j3604j64269j14204k19835
14453C16111l26576l80209l54952L07598J71018k45300k14004q1826J60566P6768
14443e70806J16598l2990Q6084J28115k15374j58691K46179L69028L94865l1138
14433C31870J99053K52986r520K02956J80070k68804l40131j46055n1235k2178
14423C29012k75845k01352L41004K30337K6077K08317k36633n49319l00427j40966
14413e69795R9612K94515K24468j02731n03574p846N90810J99358k65814l00085
14403c41082k95709Q5172P0945R3905M86773K82666J15358j82949p06543j18240
$$ y = [232596, 157662, 256336, 341137, 538254, 1121573, 1343334, 1372884, 1130156, 558644, 491995, 539571, 315340, -225960, -246950, 344968, 828023, 814419, 650150, 535946, 316111, -10465, -390674, -745626, -438028, -267010, -512310, -726314, -808140, -647574, -570806, -454208, -487198, -401114, -272999, -488373, -647064, -400885, -31857, 363008, 331870, 530923, 783909, 774389, 977345, 1157415, 888611, 548480, 402425, 351190, 329012, 53167, -148185, 192819, 423156, 449233, 657550, 420917, -128402, -428829, -569795, -470183, -175668, 48800, -53931, -557505, -565351, 25459, 224817, -40997, -341082, -636791, -551619, -480674, -386769, 100004, 382670, 498028, 315079, -391464, -509704]
14393e09704K45028j39359l77112M5539P0145K73259J48720l61253m09481K86905
14383g27313M78454K15847N3054K53606J34496R0668Q1517K98349m3605n97327
14373B37746l49950l764n709Q6136j1470k02041j76001N0570N3361K42265K24173
14362A45316q0619J3955m20053k75128J48310L50618J18315j45855J94601J77804
14352B27264r9522J6284J87468q5190j93631l8365L6048L724j94542j81035Q4175
14341b37322P0305J80458K92579n22080j5512N55460K14249j91087l42373K64066
14331B68743L26141K91330L48569q0014l65153k7256K15843N0536J41550r2114
14321A078175k38024l03855l10588Q8892L82040K67017l3392m20360m46517l85820
$$ y = [-509704, -264676, -404035, -781147, -735608, -665463, -392204, -243484, -604737, -1014218, -727313, -248859, -33012, 20042, 273648, 408144, 498812, 580329, 878678, 835073, 237746, -112204, -115968, -121677, -35541, -47011, -249052, -425053, -374483, -321122, -78857, 145316, 64697, 78652, -341401, -616529, -468219, -117601, 714, -145141, 49460, 227264, 127742, 144026, 331494, 246304, 52673, 14308, 50356, 54080, -140462, -321497, -237322, -167017, 13441, 306020, -216060, -231572, 323888, 538137, 347050, 4677, 268743, 594884, 886214, 1234783, 1154769, 789616, 762360, 978203, 1028739, 1170289, 1078175, 840151, 536296, 225708, 314600, 696640, 963657, 930265, 509905, 63388, -322432]
14311c22432M9923M3172R8002K08605P9131l32766k77613J26105L91190R0674
14301A53991R4439K92172j772J0442k94482n79789r5491M33314J60981m47072
14291b73267r1998j48212k55033K26827K76927J63074k26029k85057K37845j55565
14281e30488m14430Q7835L55422K82391M15612N02357M27940j27592l25709j75187
14271D98151l14465j72256K8018j02608j78849l28009l73096k3602P1379p1845
14261i67182P6679O4005n627n7132J12108K08184L6477L09167J13322k58718k16253
14250e84970r8353o2714p3850M4774J14150J81631J61303J85566p374m955Q297
14239a36495k38093k94331j62912Q5946L71885M61047J49435j24851l23292k35018
$$ y = [-322432, -272509, -229337, -131335, 77270, 156401, -176365, -453978, -327873, 63317, 153991, 248430, 540602, 538830, 549272, 254790, -324999, -420490, 12824, 173805, -273267, -365265, -513477, -768510, -541683, -264756, -101682, -327711, -612768, -374923, -530488, -944918, -857083, -501661, -219270, 196342, 698699, 1126639, 999047, 673338, 498151, 183686, 11430, 39448, -63160, -242009, -570018, -943114, -966716, -895337, -967182, -890503, -826498, -832125, -889257, -777149, -568965, -532488, -223321, -109999, -368717, -584970, -683323, -746037, -819887, -775113, -660963, -479332, -318029, -132463, -139837, -144792, -136495, -374588, -668919, -831831, -745885, -374000, 87047, 236482, 111631, -211661, -446679]
14229d46679j10874l49357L3781J85215k54158O5385K46248m38959m20528L8487
14219a451439K76086L09480M20780p6966o86435o11996m27791L57033Q69416P46817
14209b75015K92641O8789J22076J51641K3233o3100J69791k30997n62901k71656
14199e75498k27510k43481j96969K00524K23817O7483J68068K46497M6099K52284
14189c8686N91508L32540j38625m77996m60689P8352j93594k89474j82821J720
14179g77765l232M26490R85275N67367j41472n17156m00287l11715L1915L62532
14169B21952L0779m05383k02359J21486L12388M21544L53840M1351k38069k58046
14159C99483r920j67488o64928n02500l22965K48169N69331L50463l8798m00719
$$ y = [-446679, -557553, -906910, -873129, -687914, -942072, -876687, -630439, -1069398, -1489926, -1451439, -1175353, -865873, -445093, -522059, -1208494, -1820490, -2248281, -1891248, -1021832, -275015, 17626, 86415, 208491, 360132, 383365, 320265, 490056, 259059, -303842, -575498, -803008, -1046489, -1243458, -1042934, -819117, -751634, -583566, -337069, -290970, -38686, 552822, 885362, 746737, 268741, -191948, -113596, -307190, -596664, -779485, -777765, -780997, -354507, 630768, 1198135, 1056663, 539507, 139220, -172495, -140580, 221952, 252731, -152652, -355011, -233525, 78863, 500407, 854247, 895598, 657529, 399483, 389563, 222075, -442853, -945353, -1268318, -1020149, -450818, -100355, -139153, -539872]
14149e39872l04616K7052R5665K21946J86925K09382K44155N25947M89816m7013
14139A109387n95969m38643m02430o9805J48759M1873l8570k35167l61702K4793
14129h17474O01150J58298m4636N29j64493m3099L54813L65592M0288m7177p4259
14118C29532j7030k0738m64093j40113L4329p7340P2251K76114k9598J27790J52006
14107B43110J11712n8613l75570k92496j60510L31042K01808j5203p010j81426
14097b03156j74016n747L78291N22044J66371k16917k89151m8931j11229K69018
14087B86577K96722p7905j35779J83799k38557m67162j21419K04597K4508o8819
14077a13438K22538K00107J5433K7170j07024J02973J83940k30273m05138j34641
$$ y = [-539872, -844488, -817436, -721771, -499825, -312900, -103518, 140637, 666584, 1156400, 1109387, 513418, 74775, -327655, -397460, -248701, -206828, -245398, -480565, -842267, -817474, -216324, -58026, -102662, -102133, -266626, -309725, 45088, 410680, 450968, 403791, 329532, 312502, 291764, -172329, -312442, -278113, -355453, -283202, -7088, -36686, 91104, 243110, 354822, 296209, -79361, -371857, -532367, -201325, 483, -14720, -21730, -203156, -377172, -382919, -4628, 517416, 683787, 466870, 177719, 128788, 17559, 286577, 583299, 505394, 369615, 553414, 314857, -152305, -273724, -69127, -44619, -113438, 109100, 309207, 324640, 351810, 244786, 347759, 531699, 301426, -103712, -238353]
14067b38353j19966j52756k3795j25485p4962K48443n1116m50968K57804N56718
14057a74436M3060m672K51326K38520l66162o06494j37661K10620J71766L80509
14047F376J57416n69133m72512r7262K0951J58859J23524k91091l88494J74476
14037a176890N21606M89404J97169m8609l39066l93515O6917R3217P9782M64470
14027d5515N45850L16618j20883k54516k90199n21193j60764K75290K16653k30399
14017b69058l21119r8346J58956L8266J38787J58002K51556M07690L99551k70658
14007E93627l22767j29786O1162K5751r3074k4427j07862m05079j70759K69522
13997c03692L33542J06303j53626k31701N4358N0070k36195m6673K99903L05758
$$ y = [-238353, -358319, -511075, -534870, -660355, -735317, -486874, -537990, -988958, -731154, -174436, -131376, -136048, 115278, 353798, -12364, -618858, -756519, -545899, -374133, 6376, 163792, -405341, -877853, -975115, -954164, -795305, -671781, -962872, -1351366, -1176890, -655284, -165880, 31289, -17320, -356386, -749901, -682984, -589767, -509985, -45515, 500335, 816953, 696070, 441554, 151355, -369838, -530602, -255312, -38659, -269058, -590177, -688523, -529567, -491301, -352514, -194512, 57044, 464734, 864285, 593627, 270860, 141074, 202236, 227987, 134913, 110486, 2624, -402455, -573214, -303692, 29850, 136153, -17473, -249174, -194816, -144746, -380941, -427614, -127711, 178047]
13987A78047K8105p6070r8218k75891M7896N58644o609n03629l45175l96975j63719
13976a053594L19345M05418J18561m0211K5050r5468J5481L3107o0976K30090
13966a03197L20804J58709j48404j50813k78886r2886J73284j49662j57866o374
13956d35291K52491L47613N5133j89964m37179k40056k29075p3804K01190O4255
13946f84687J24856L95731L68937K28888M3988l46961n19524k2099N82398J09303
13936B80830r4785N05488K91343j85123n71983o27262n25861k20987M402r5850
13926a239788R2944O60055K10041j13309k20389l51418J33474J8267m1321j08860
13916i60304K23689J77783K47068L90207O05843M07665o4441K833N40557K70114
$$ y = [178047, 206152, 130082, 31864, -244027, -196131, 362513, 355904, -147725, -492900, -889875, -1053594, -734249, -328831, -210270, -250481, -225431, -320899, -305418, -272311, -333287, -103197, 217607, 376316, 227912, 77099, -201787, -294673, -121389, -271051, -428917, -435291, -182800, 164813, 219946, 29982, -407197, -647253, -876328, -950132, -748942, -684687, -559831, -164100, 204837, 433725, 477713, 130752, -388772, -410871, 171527, 280830, 186045, 691533, 982876, 797753, 225770, -401492, -927353, -1148340, -1143938, -1239788, -1146844, -486789, -276748, -390057, -610446, -961864, -828390, -810123, -851444, -960304, -736615, -558832, -311764, 78443, 684286, 1091951, 1027510, 1030343, 1570900, 1841014]
13906A841014j3502J40652j56526l76229m69321m88993k30213m68224j10446L40608
13896H820L87798N12161K26765J10083j73017k92534P0745J75622L7848n1756
13886A012535j90985o4884k43516m61578l86583l20100k67791m6579M29699L23016
13876b16766j3809j23607j76675J74187m8258j14804K29943L18594j89909k37093
13866c98197J29999N50662N56168J50536k09507k23001k07128m00445m1395R9290
13856F982m52509n89010j13620J37477J64668K55359M51623l1182m5847J63070
13846e2989N5287k40867L5896K90571j86150o45372k44211J79424K41472J91431
13836c75508K7386m29179p01135L68603M57026K89479L88294J52055l67604j37397
$$ y = [1841014, 1827512, 1968164, 1811638, 1435409, 966088, 477095, 246882, -221342, -331788, 8820, 396618, 908779, 1135544, 1245627, 1072610, 780076, 850821, 1026443, 1064291, 1012535, 821550, 756666, 513150, 51572, -335011, -655111, -922902, -969481, -539782, -216766, -230575, -354182, -530857, -356670, -404928, -519732, -289789, 28805, -161104, -398197, -268198, 282464, 838632, 989168, 779661, 556660, 349532, -50913, -92308, 6982, -445527, -1034537, -1148157, -1010680, -846012, -590653, -139030, -170212, -216059, -52989, 2298, -238569, -202673, 87898, -98252, -743624, -987835, -808411, -566939, -375508, -348122, -777301, -1478436, -1109833, -652807, -363328, 24966, 177021, -190583, -327980]
13826c27980P0890j15145q9381J11766P9701P0399j18541J6891M93095N92748
13816G84443J45567l00876o48877o58256n81167K54611M03121K28381N70952L70807
13806E68706r351k04907l50021k37475J1076k1220k18021m21737N5548J77572
13796f49830p0805O02k78912l90554L87048M81260M24241J20329m15203l49046
13786g40870j61237j2036N90389R8625n32378k78696K56956N6924L69187O76149
13776C23013K4758k15092m49620l60959r9073K10076K61915P6774K26352K29214
13766B27358j72702k24544j48116j36081J70491M37834m71957l56826J2425k81171
13756i43289K35992K24712o4124j67813k6286O7964M3449J77077K02499j3948
$$ y = [-327980, -257090, -372235, -461616, -349850, -270149, -199750, -318291, -301400, 191695, 784443, 930010, 629134, -19743, -677999, -1259166, -1004555, -601434, -373053, 197899, 568706, 559355, 354448, 4427, -233048, -221972, -243192, -461213, -882950, -827402, -649830, -720635, -720033, -998945, -1389499, -1002451, -521191, -96950, 23379, -391824, -740870, -902107, -914143, -323754, -225129, -757507, -1036203, -779247, -722323, -353136, 323013, 347771, 132679, -316941, -677900, -776973, -566897, -304982, -228208, -1856, 227358, 54656, -169888, -318004, -454085, -283594, 154240, -317717, -674543, -662118, -943289, -707297, -482585, -546709, -714522, -740808, -672844, -629395, -452318, -249819, -263767]
13746b63767J28934R0294J91945m11149n54758o6498M30284K2477l4139M44577
13736b1800J36008q0722K4602k35141n76572n76189j92424L92510M84232M11512
13726b33984K30913L65478l3553k45879k72665j77397m95527j13371Q2216j31471
13716a025240J8654N24218O23796K3085k29774k33425j5536j05263j83099k13890
13706h16474J65461K11758K17786K86938n8813k81638j35005J39712J14804j29595
13696b85066l66875p2388j02221m39182n5499K44726q0347p0875K81474J12381
13686h33872j55323j1330J8481J17098P7119L05535K70336J06389J00625j81342
13676a86284p7305J41808J30372l46585o61440p3302R1561j08607q7199j41323
$$ y = [-263767, -134833, -44539, 147406, -263743, -818501, -884999, -454715, -432238, -466377, -21800, 114208, 33486, 58088, -177053, -753625, -1329814, -1522238, -1129728, -645496, -233984, -3071, 362407, 328854, 82975, -189690, -367087, -862614, -975985, -893769, -1025240, -1006586, -482368, 141428, 164513, -65261, -298686, -314222, -419485, -602584, -816474, -651013, -439255, -221469, 65469, 6656, -274982, -409987, -270275, -155471, -285066, -651941, -724329, -826550, -1265732, -1321231, -1076505, -1156852, -1227727, -946253, -833872, -989195, -1000525, -982044, -864946, -787827, -482292, -211956, -105567, -4942, -186284, -263589, -121781, 8591, -337994, -999434, -1072736, -981175, -1089782, -1176981, -1318304]
13666a318304j90036j82779N39514J230771M72291m02488J2053m5267k75451l08509
13656d68205R4355K16360M4908j1792l2649j2959o4378k70350k46050L63530O54256
13645B67026K56744J2074k40552k51698j49059m176K33497K32148l09924j94155
13635a48075l6860P9426j24723l58368j25380l13545R4915O22676N46034M40019
13625F76119k31779n67328l67750j09523K55825N43896L1549k16713j1397J8865
13615B1764m23895l74950j31125l4599m9742K00451n0503J4247P7647k3950J20434
13604f54221K54056j32033K51685N83865k04178m25614j78288n5758r9856m12228
13594a072570l46894K20498M60792M74859L40375K92843N41109Q7933k06279l46162
$$ y = [-1318304, -1508340, -1691119, -1151605, 79166, 551457, 148969, 161022, 115755, -159696, -468205, -373850, -157490, -112582, -124374, -157023, -169982, -234360, -504710, -750760, -387230, 267026, 523770, 535844, 295292, 43594, -105465, -109641, 123856, 356004, 46080, -148075, -184935, -105509, -230232, -588600, -713980, -1027525, -932610, -309934, 236100, 676119, 444340, -122988, -490738, -600261, -344436, 199460, 231009, 14296, 2899, 21764, -402131, -777081, -908206, -942805, -992547, -792096, -842599, -828352, -750705, -774655, -654221, -400165, -532198, -280513, 303352, 99174, -326440, -504728, -560486, -660342, -1072570, -1419464, -1198966, -738174, -263315, 77060, 369903, 911012, 998945, 792666, 446504]
13584D46504l56099l3222j45041K05217R1645m3908J11322K60200k04866m79907
13574a48155l59778N3954J8923L45998M68556l69443n49080j6033n8789k38879
13564h52726k1143J38608K37067J10810N0258J99571r8170l2101N7986j14880
13554c24720j91224n8364q6212k48179J39701J37821K86879R8234k46476j37737
13544f30277o9335K0003o534L62798O5480l31045M9808K71278j55079J9503K37175
13533a66225J39184r0152L01012J52162j78141j22506K3329K55316N36386L09397
13523A159762L9444l31957o36072m25360q8758K37145q3662R5251j26032n93609
13513g53848K11215K36980k59822r4217Q7398j55740m70295m2081L77362J78698
$$ y = [446504, 90405, 57183, -87858, 117359, 209004, 165096, 276418, 536618, 331752, -148155, -507933, -453979, -435056, -89058, 379498, 10055, -539025, -555058, -613847, -852726, -873869, -735261, -498194, -387384, -337126, -137555, -235725, -267826, -209840, -324720, -515944, -574308, -660520, -908699, -768998, -631177, -344298, -246064, -492540, -630277, -699612, -679609, -686143, -323345, -257865, -588910, -539102, -267824, -422903, -403400, -166225, -27041, -117193, 183819, 335981, 157840, 35334, 58663, 313979, 850365, 1159762, 1199206, 867249, 231177, -194183, -282941, -45796, -129458, -34207, -160239, -753848, -542633, -305653, -565475, -659692, -572294, -728034, -1198329, -1240410, -863048, -684350]
13503f84350K30463N87607L47336r8913l19133Q9873l3431j86007k54381l48443
13493f69379j25344J6333K77110m9743n0098k56218j2563N11717J98403q6853
13483b46635K29592K08825n14482n08427k19524m700L21990K54340L20720J46761
13473a1540m7625Q0294J31900j17707M9809L44072j97301k73900L6893J23231
13463A18126K14290j52017J84970Q4967k90733j65461J6633k25860p3111p6174
13453c64370r512p9997J69655K72523m2819j23523J01942J49301J53238L2221
13443B58659n5019K55200N2914J17177K12937J14092l91377p36820n59485J9162
13433g12560K01754p7967M4962j40084m03345J02916L49868O5736k70727m61034
$$ y = [-684350, -453887, 133720, 481056, 382143, 63010, 152883, 119452, -66555, -320936, -669379, -794723, -778390, -501280, -551023, -601121, -857339, -869902, -358185, -159782, -246635, -17043, 191782, -322700, -831127, -1050651, -1055351, -733361, -479021, -158301, -11540, -59165, 21129, 153029, 35322, 85131, 429203, 231902, -41998, -5105, 118126, 332416, 180399, 365369, 450336, 159603, -5858, 10775, -215085, -288196, -364370, -373882, -453879, -284224, -11701, -54520, -178043, -76101, 73200, 226438, 258659, 203640, 458840, 511754, 628931, 841868, 955960, 564583, -172237, -731722, -712560, -510806, -588773, -543811, -683895, -1087240, -984324, -634456, -568720, -839447, -1300481]
13423a300481m3984L96756K70964M19038L0977m90835l79186J11805L90431M23862
13413a70653j287k36033M2512J39087K85596j46359l14424j41646K6450J2282
13403e04475j87889n28983j78090K63450L97457M04423J18253k22697o8178K84784
13393b21945L0870m9297L16378K50194p8370n5888K66670M05828p0131o69394
13383A24915p18225k83858N8371k41109l83679K05100J87360M4021J73415K13365
13373f20324K2178K07474J32834J92604L8819k77525j16351M4568N1356R9288
13363b25079N5307J04988K07250P6167N9644K32382j97979n24439j10092J17605
13353b04246N0839K57664M18302J38672j60503j25028J46200J88934J51289O9139
$$ y = [-1300481, -1344465, -947709, -676745, -257707, -226730, -717565, -1096751, -984946, -594515, -170653, -171940, -407973, -365461, -226374, 59222, -87137, -401561, -543207, -516757, -504475, -692364, -1221347, -1399437, -1135987, -738530, -334107, -215854, -438551, -506729, -221945, -191075, -240372, 76006, 326200, 247830, 191942, 458612, 864440, 794309, 124915, -593310, -877168, -818797, -1059906, -1443585, -1238485, -1051125, -1007104, -833689, -620324, -598146, -390672, -257838, -65234, -26415, -303940, -420291, -375723, -324367, -225079, -169772, -64784, 142466, 218633, 278277, 510659, 312680, -211759, -321851, -204246, -153407, 104257, 522559, 661231, 500728, 375700, 521900, 710834, 862123, 931262]
13343I31262k84163k70991L5280k80380n39530L026L03187K22775K64474j73661
13333B11279J75122M86210J08324l39097o47884m55355j3824K52572L02314N3608
13323A33269j10799m2029L41640M5801k57784K798N8863j47001l67438k38385
13313e81065j4408J90937K42796J95278o6549K9933r9591R5842j86217m8584k8877
13302b70505k10944L67K5890K38170J35059J12438L76126Q5202j49955k96992
13292D4856m14596P6123K32739J27636k31752j35694K69305K30764j84193l74100
13282c58912j67982M9473L8497J40920L17676K02830K09630J27646o3815j07565
13272C88398r7783l38916l43284q3130L96552L58316M5526l10191m44035k46759
$$ y = [931262, 647099, 376108, 411388, 131008, -408522, -405496, -102309, 120466, 384940, 211279, 386401, 872611, 980935, 641838, -6046, -461401, -475225, -222653, 79661, 133269, 22470, -19559, 322081, 367882, 110098, 112896, 171759, 24758, -342680, -581065, -595473, -404536, -161740, 33538, -33011, -3078, -102669, -6827, -193044, -241628, -270505, -481449, -481082, -455192, -217022, -81963, 30475, 406601, 491803, 341848, 44856, -369740, -293617, -60878, 66758, -164994, -300688, -31383, 199381, 15188, -358912, -526894, -477421, -438924, -298004, 19672, 222502, 432132, 559778, 495963, 388398, 290615, -48301, -391585, -474715, -78163, 280153, 325679, 15488, -428547, -675306]
13262f75306k54664n55990n2721L30641O48898Q67819N53389k60493l67402K70176
13252E04347N0974j90264j27459q5136l25737n54256k70453L79135N42359M45298
13242C68808m1688k44905N1528N8466J35553k25207m16173j86083K34379O15827
13232C50505R03047J43354k81783k62320J22797J6525n85331m33671K0209m5484
13222e2152j75178M81373M19190O2467J08764L77193O2609l25168m33170J14374
13212F40302N14879L2050l18912j19291k39579r3506L80354K7042P856k02275
13202F28920k23593M4562q5296k11989q9491K96437L30421l7819L1544J83864
13192H67560K92388P7233k73766l40102j09301J47340J84581M6100j85408k11031
$$ y = [-675306, -929970, -1485960, -1538681, -1208040, -559142, 308677, 862066, 601573, 234171, 504347, 555321, 365057, 237598, 152462, -173275, -727531, -997984, -618849, -76490, 368808, 327120, 82215, 133743, 192209, 327762, 102555, -313618, -499701, -265322, 350505, 1253552, 1396906, 1115123, 852803, 975600, 992125, 406794, -26877, -6668, -52152, -227330, 254043, 673233, 735700, 844464, 1221657, 1284266, 959098, 525928, 640302, 1155181, 1187231, 868319, 749028, 509449, 415943, 796297, 823339, 831195, 628920, 405327, 449889, 364593, 152604, 63113, 359550, 689971, 652152, 683696, 867560, 1159948, 1237181, 963415, 623313, 514012, 661352, 845933, 892033, 706625, 495594]
13182D95594J56007L73024m9900l30080l46200m682k14899o2678N83210L89046
13172I88442n8079M5506J88544n1015j08230k55076k61783k16793k00572j93548
13162a22604N724N44684O43193Q5360k44686m65808j29750M20936L31776j86256
13152H82569n2424J95779J28033M37752J74583m14432n32707r3203M49697K34890
13142A410537J19655l65192l20197r4932p9656m2861j80606J07066O524j54265
13132D06073j86615j67233r3898k19672l3723O8147J77695J72956J36403K07159
13122D67292J19595J06682q2063l42826l32847P7321q0962L46055O08744M28924
13112A315915K19142J72380j5961j616q9684n8384N6119J3300N7283P3854K3458
$$ y = [495594, 651601, 1024625, 974725, 644645, 298445, 293763, 78864, 16186, 599396, 988442, 930363, 975869, 1164413, 1113398, 1005168, 750092, 488309, 271516, 70944, -122604, -116880, 427804, 1070997, 1156357, 911671, 445863, 316113, 737049, 1068825, 882569, 830145, 1025924, 1153957, 1591709, 1766292, 1351860, 819153, 725950, 1175647, 1410537, 1530192, 1165000, 844803, 749871, 670215, 627354, 446748, 553814, 560338, 406073, 219458, 52225, -41673, -261345, -295068, -226921, -49226, 123730, 260133, 467292, 586887, 693569, 611506, 268680, -64167, 13154, -67808, 278247, 886991, 1315915, 1535057, 1707437, 1691476, 1689860, 1600176, 1541792, 1597911, 1611211, 1668494, 1742348, 1765806]
13101A765806m58572k73128L03742K64279j68061j59249p3026k78281l37266l38862
13091B47382R4947N6519J1927J22089k0888l57256r7622J97687L28408M31399
13081A014592K22717J39570L747M0140J89288R237k18276l07348L29286L50680
13071A773633o7598p5855L33608n6395k6882M02286j09491m12512n12924l45005
13061I02865K36569L52078J39850j54807J60715M12638K56900n7001O9668J99088
13051B518563J72760K2314J06594J65631n0305n19624o88986Q7291O69147O95550
13041C178935O19346J32300l52899j75714r3088j40428j61974J38436Q167j26267
13031C026814L71558L41429m18349l12127L7071L52068M69272M51845J19596j94339
$$ y = [1765806, 1307234, 1034106, 1337848, 1602127, 1434066, 1274817, 1201791, 923510, 586244, 247382, 342329, 398848, 410775, 532864, 511976, 154720, 57098, 254785, 583193, 1014592, 1237309, 1376879, 1380626, 1420766, 1610054, 1619291, 1401015, 1093667, 1422953, 1773633, 1706035, 1630180, 1963788, 1907393, 1880511, 2282797, 2173306, 1760794, 1247870, 902865, 1139434, 1491512, 1631362, 1476555, 1637270, 2049908, 2306808, 2249807, 2319475, 2518563, 2691323, 2713637, 2820231, 2985862, 2935557, 2415933, 1726947, 1814238, 2483385, 3178935, 3798281, 3930581, 3577682, 3401968, 3308880, 3168452, 3006478, 3144914, 3153081, 3026814, 3398372, 3739801, 3321452, 3009325, 3046396, 3398464, 3867736, 4319581, 4439177, 4244838]
13021D244838l36001j61891L17630K24030O1904O8988L76213N84304M56603N57098
13011F393716M96969J85466l46598j72694L59570M47875O2726N39011P47951K90477
13001I004469p6427l6761M95997R45706Q18911R35304J186356J008456J242853
12992A5524864J786030J262697P73470J505273K222722L104205L707876M589551
12984C4476688N878215P148011Q448509J0211837J2984949J6844167K1047099
12977A17039475K7636102L6947270M8997674O2492895O9848414N5499738J0820772
12970D29282340l9773224o4686212o3634070n1671866l9639015l0538157k3773851
12963A15565945j8827096j4997824j1654377q871721p499333o413816n479782
$$ y = [4244838, 3908837, 3746946, 4064576, 4288606, 4350510, 4419498, 4795711, 5380015, 5836618, 6393716, 6890685, 7076151, 6729553, 6556859, 6916429, 7364304, 7427030, 7966041, 8713992, 9004469, 8928042, 8891281, 9387278, 10332984, 11151895, 12087199, 13273555, 14282011, 15524864, 17310894, 18573591, 19347061, 20852334, 23075056, 26179261, 29887137, 34476688, 40354903, 47502914, 55951423, 66163260, 79148209, 95992376, 117039475, 144675577, 181622847, 230620521, 293113416, 362961830, 418461568, 429282340, 389509116, 324822904, 261188834, 209516968, 169877953, 139339796, 115565945, 96738849, 81741025, 70086648, 61214927, 53715594, 47301778, 41821996]
12956D1821996m161997l462805l379754l020989k509409j873314j708571j734405
12948A9970752j049185j040031j304121j097721o94859j22019m79606o86743o81795
12939A2814672l91133p9461J39666k1135l23990J7538K84017J76897M37759P29274
12929A3784104Q34769J104447J763213K561193K461575J307743n82582j943909
12921B1290553j841567q24612J06225L42184J009846K185269K517871K783471
12913B7569240K481836K206747K617225K864957l31764m488920m397541k441864
12905B6079916r05551j83792N55637J262686K118993L046343L658770M607099
12897D0240101N555317O728182Q393296J0531028J4061118J7941329K2661783
$$ y = [41821996, 37659999, 34197194, 30817440, 27796451, 25287042, 23413728, 21705157, 19970752, 18921567, 17881536, 16577415, 15479694, 14784835, 14662816, 14183210, 13496467, 12814672, 12423539, 12344078, 12483744, 12462609, 12138619, 12156157, 12440174, 12617071, 13054830, 13784104, 14618873, 15723320, 17486533, 20047726, 22509301, 23817044, 23234462, 21290553, 19448986, 18624374, 18730599, 19072783, 20082629, 22267898, 24785769, 27569240, 30051076, 32257823, 34875048, 37740005, 37408241, 32919321, 28521780, 26079916, 25174365, 24990573, 25546210, 26808896, 28927889, 31974232, 35633002, 40240101, 45795418, 52523600, 60916896, 71447924, 85509042, 103450371, 126112154]
12890A26112154K9587962M0256111N3630132O7902141P2159340M7311256n923136
12883D31035960n3283504o9086866o2455560m9492836l7289814k7971561k1906324
12876A09549495j7332258j4013245j1187097q954220p118103n572199m682639
12869D0689734l684222l113061k812969k355775k517365k337112j756163j137745
12861B0975322j264583j782892j800176j413078r23007o51348n39360n53062o68921
12852A1378895l94611j36411l27991m07348o1128J93113R3642l9746l06684n86758
12842I404973j86004l79048q6122L03669L66167M68883K54486l627m09581m63774
12832I270022J08570L22892K38465J05625K05642P34691J214345R95209M94889
$$ y = [126112154, 155700116, 195956227, 249586359, 317488500, 389647840, 436959096, 431035960, 377752456, 308665590, 246210030, 196717194, 159427380, 131455819, 109549495, 92217237, 78203992, 67016895, 58062675, 50944572, 45372373, 40689734, 37005512, 33892451, 31079482, 28723707, 26206342, 23869230, 22113067, 20975322, 19710739, 17927847, 16127671, 14714593, 13791586, 13140238, 12600878, 12047816, 11378895, 10984284, 10847873, 10519882, 10112534, 10051406, 10244519, 10338161, 10298415, 9991731, 9404973, 9218969, 8839921, 8753799, 9057468, 9423635, 9892518, 10147004, 10143377, 9733796, 9270022, 9378592, 9701484, 9939949, 10045574, 10251216, 10985907, 12200252, 13195461, 13690350]
12823A3690350K34187n0563J93467J155864J546993J501795J306176K018919K653560
12814B4250748K952873L450516M151061N081451O326907P607978R277205J1596473
12806G4695212J4346382J8837120K4782090L3118366M4078503N7337818O8484850
12799C35680341O5050814L1660721k1389024n8744778o6892421n7703284m4761949
12792A82900420l4193070k6508881k0370715j5726366j2773743j0366254q320622
12785E4640769o509054n042445m494360m263046l684345k997605k781334k935289
12777B1933291k318125j678490j251898p50169j088844j094302o05416p51358
12769A2394689r02374q79654r28287n95624m60111n10483n27121p84866o96889
$$ y = [13690350, 13924537, 13873974, 14067441, 15223305, 16770298, 18272093, 19578269, 21597188, 24250748, 27203621, 30654137, 34805198, 39886649, 46213556, 53821534, 63098739, 74695212, 89041594, 107878714, 132660804, 165779170, 209857673, 267195491, 335680341, 400731155, 432391876, 411002852, 352258074, 285365653, 227662369, 182900420, 148707350, 122198469, 101827754, 86101388, 73327645, 62961391, 54640769, 48131715, 43089270, 38594910, 34331864, 30647519, 27649914, 24868580, 21933291, 19615166, 17936676, 16684778, 15934609, 14845765, 13751463, 13146047, 12394689, 11492315, 10612661, 9684374, 9088750, 8628639, 8118156, 7591035, 6806169, 6109280]
12760F109280k82320R3441j31380J3705n9691k02251k75162n76861l51294l56375
12750C981092k11021K49326O3552l13828l92777m86792k49672M19111K75544k87032
12740C047503n70233m35766j74413J84889K64896J68590J96521j92745l13480
12731B175762j98041j39346K4000Q471J74675J84649K2784l43484n97108O2858
12721A375220O86953N63871o8039n16709n07670R5938j8818k78057j71505k85047
12711H76137k04213k72094k35615J65925M37853N77752O38087M50181k33104o20031
12701A580878o42519j70258L54174j02971k94223J0860k78401O6986L22329k16423
12691F30432j509r035k82424o2466M32163J86508m37246k11410j74133l58255
$$ y = [6109280, 5826960, 5920401, 5789021, 5802726, 5743035, 5540784, 5265622, 4688761, 4337467, 3981092, 3770071, 4019397, 4082949, 3769121, 3376344, 2889552, 2639880, 3058991, 3334535, 3047503, 2477270, 2041504, 1867091, 2051980, 2316876, 2485466, 2681987, 2489242, 2175762, 1977721, 1838375, 1862375, 1870846, 2045521, 2230170, 2252954, 1909470, 1312362, 1375220, 2062173, 2626044, 2558005, 2041296, 1533626, 1629564, 1610746, 1332689, 1161184, 876137, 671924, 399830, 164215, 330140, 767993, 1345745, 1983832, 2434013, 2200909, 1580878, 938359, 768101, 1122275, 1019304, 725081, 735941, 457540, 524526, 846855, 630432, 628923, 619888, 337464, 274998, 707161, 893669, 456423, 245013, 70880, -287375]
12681b87375N7490K31124M13087L77135K35339K41109Q5134k20133r4809k65523
12671G72578p2479k06813m87814k18364O2710K69077j6126k70438l16408j35432
12661f19509K32980J00389q3630k34381m9653J97974M69231O00830O51525j7164
12651A248592o65351m40970n6719L53026R2620j78765Q9115m5579j15317J91328
12641D71980p8429n1627J09795r083j5115K2143J55809K87454J71711k26405K3152
12630H61385j91720j35050J96140r2830l63601p4104J3458L53605N36098L3746
12620A137127l47301m57617j45933j44512Q2699q9381n0923K43059L62117J32271
12610G21606l406l274P6558J64429j56064k48916N0275J6918n02928l14452P4571
$$ y = [-287375, -229885, 1239, 414326, 791461, 1026800, 1267909, 1353043, 1132910, 1038101, 772578, 700099, 493286, 5472, -212892, -150182, 118895, 102769, -167669, -484077, -619509, -386529, -286140, -369770, -604151, -653804, -455830, 13401, 614231, 1265756, 1248592, 583241, 142271, 85552, 438578, 531198, 352433, 441548, 395969, 280652, 471980, 393551, 341924, 451719, 442636, 427521, 449664, 605473, 892927, 1064638, 838233, 861385, 669665, 534615, 730755, 637925, 274324, 200220, 213678, 567283, 1103381, 1137127, 789826, 332209, 186276, 41764, 124463, 35082, -15841, 227218, 589335, 721606, 718200, 714926, 791484, 955913, 799849, 550933, 601208, 618126, 115198, -199254, -124683]
12599a24683M39280J02820k69440M450M6930K38776o0169l21329j3649J67919
12589B10905j49214O2910J53465j30901J35851K29585o4206K9677K14852J19397
12579H12321l38329m53927m13022k09407K64787L78509p1523M05932L06434J25744
12569H07519k2215n768J87788N8687j09207J4760j65544j25813K35366K32056
12559A107629k05180l11566l89521n67041k7582K88001N69028J42741j04327j00581
12549D01601R2015J20566J03340K64129r0046m41992K0097q2056m34074j20257
12539a66677N39791N79120J77611O1205k40549m78143l43058J36157K19084K06764
12529F91305n77l15949k39042j44890j45363k48152l23025K18660J46766J07711
$$ y = [-124683, 314597, 417417, 147977, 152427, 199357, 438133, 377964, 56635, 42986, 210905, 61691, 124601, 278066, 147165, 283016, 512601, 448395, 478072, 692924, 812321, 473992, 20065, -392957, -602364, -337577, 40932, -30591, 375341, 681775, 807519, 785304, 779536, 967324, 1026011, 916804, 931564, 766020, 640207, 875573, 1107629, 902449, 590883, 201362, -365679, -393261, -105260, 463768, 606509, 502182, 401601, 493616, 614182, 717522, 981651, 891605, 449613, 469710, 387654, -46420, -166677, 373114, 952234, 1129845, 1191050, 950501, 472358, 129300, 265457, 484541, 691305, 690728, 374779, 135737, -9153, -154516, -402668, -725693, -507033, -360267, -252556]
12519b52556L27260K08957j47792k41128j64020m62472l33239J22011O27385M20599
12509A05005R9677n9393o1162L92504J23114l08539o7341J01844K1035j96416
12499A50328K04753J96776r1014K9277K04950o3467m10899r1668M7174j09690
12489F6520J24071K47121L07109J09262K8570j24056m32262m01253Q2975k27128
12479b19071k61970L57892N13741J80105l31193k44992J38566L82781J75287l7194
12469F53952j89492o14052n38308Q0428K56514M41528M66892Q6452R009K34492
12459H87415K48393K01312Q740m10382j89663k08303n91483m07680j71476L45939
12449b87188N91175M75926o1889k89608k50571j80844L15458R9998J46000K12025
$$ y = [-252556, 74704, 283661, 135869, -105259, -269279, -731751, -1064990, -942979, -315594, 105005, 204682, 145289, 84127, 476631, 599745, 291206, 223865, 325709, 346744, 150328, 355081, 551857, 460843, 490120, 695070, 631603, 220704, 129036, 176210, 66520, 190591, 437712, 744821, 854083, 882653, 758597, 326335, -74918, 8057, -219071, -481041, -123149, 390592, 570697, 239504, -5488, 133078, 515859, 691146, 653952, 464460, -149592, -687900, -607472, -350958, 90570, 557462, 643914, 652923, 887415, 1135808, 1337120, 1345860, 935478, 745815, 537512, -53971, -461651, -633127, -287188, 303987, 779913, 718024, 428416, 177845, -2999, 312459, 412457, 558457, 770482]
12439G70482P5841j60822k35052J09941L59371N3757k34239j43994l00191q4480
12429B10614p5602K30303q8985l07496R3479M90359L69723l78829m83813J1557
12419G1310P2847n8997J49774j2220k92194n69648l18980L89548J18008k65560
12409g16112l7801L69702L0626k59210j2163K76591L23026j83131n06287l36709
12399a051468M97959R36651L63828J18540J43584Q47L7235j13210J50326j67473
12389I16819l84806l28783J0511O01551K43350j96488m62257m91132j1520K26045
12379A23290J35740L3599k27360m32144J74574M22068L26344L12641l51513n18238
12369i99r0469K6023l46686l004N89389J97190j31954q5148J04523K16823j07569
$$ y = [770482, 846323, 685501, 450449, 560390, 919761, 973518, 739279, 595285, 295094, 210614, 135012, 365315, 276330, -31166, 62313, 552672, 922395, 543566, 59753, 71310, 144157, 85160, 234934, 222714, -69480, -639128, -958108, -568560, -450552, -716112, -753913, -384211, -353585, -612795, -624958, -348367, -25341, -208472, -714759, -1051468, -553509, 383142, 746970, 865510, 1009094, 1009941, 1047176, 933966, 1084292, 916819, 532013, 203230, 213741, 815292, 1058642, 862154, 399897, -91235, -102755, 123290, 259030, 292629, 65269, -366875, -192301, 229767, 556111, 868752, 517239, -999, -91468, -65445, -412131, -415135, 174254, 371444, 239490, 154342, 258865, 475688, 368119]
12358C68119k45078l80527J59800M32712j50705K37524J88918j83599m3989K0257
12348D03432K22260J2281m96822m52737K99430O59985M35629K62203j7518J56
12338A328299p88442q56097N06K46646Q0415k58096o2856J40700L2886K87347
12328A51308J62045k59065p0630J8823j6541J34327O76433J92043n03761o75047
12318a90065m50705K15891N0160J69819J20085j91301k16962M76793K31402k15412
12308b95k7836J1774L48494R388p48807n87290k8749L96797P32889M23199N3028
12297E82592j12718k54955m149J05755L1613j29166j79773k61634J10124J60515
12287D8204l1694N1115J0645J06818K39770O0113r5274K95755J25400J03855n4432
$$ y = [368119, 123041, -257486, -97686, 335026, 184321, 421845, 610763, 427164, 383175, 403432, 625692, 637973, 141151, -311586, -12156, 647829, 1083458, 1345661, 1328143, 1328299, 539857, -316240, -315734, -69088, 11327, -246769, -309625, -168925, -136039, 151308, 313353, 54288, -16342, 2481, -14060, 120267, 796700, 988743, 484982, -190065, -640770, -424879, -374719, -204900, -84815, -276116, -493078, -16285, 215117, -295, -28131, -16357, 332137, 341525, -407282, -994572, -1023321, -626524, 106365, 529564, 582592, 469874, 214919, 210770, 316525, 348138, 218972, 39199, -222435, -112311, 48204, 16510, 67625, 78270, 185088, 424858, 484971, 389697, 685452, 810852, 914707, 860275]
12276H60275l62377o52427n54827l38485K70852M11999J72026J0585j27302k01579
12266e11260j7661O5629l0928K58703L28636k8040j10078j2645O8K68351N53613
12255G64388L42884k28726m14795J3142J45957j79937l1636n5908Q8626L28696
12245G72691j56904k79971K05558K82898R1979J52438J931k17261m46202r7564
12235C09593J16578j99802L5555j53291j73523L2469k59066j40464M166j13898
12225e41683j22819k3743K80724O09745L61774o75142q26236L08886Q38606K72446
12215D82558O2737J83184K33282k50220k35390K48768L73221J00843k37472p6877
12205H84634J50984n1580l74178n04369o16438k41935L89921O79667M02305L05120
$$ y = [860275, 497898, -154529, -709356, -1047841, -776989, -364990, -192964, -182379, -309681, -511260, -528921, -463292, -494220, -235517, 93119, 65079, -44999, -57644, -57576, 210775, 764388, 1107272, 878546, 463751, 476893, 622850, 442913, 411277, 355369, 443995, 772691, 615787, 335816, 541374, 824272, 916251, 1068689, 1070620, 853359, 407157, 309593, 426171, 226369, 261924, 108633, -64890, -32421, -291487, -431951, -427785, -541683, -664502, -688245, -407521, 202224, 563998, -111144, -937380, -628494, 210112, 482558, 545295, 728479, 961761, 711541, 476151, 724919, 1098140, 1198983, 961511, 884634, 1035618, 984038, 609860, 105491, -510947, -752882, -362961, 316706, 719011, 1024131]
12195A024131L93228n7928k61771o2337j21481m82233l65829j85542j75471O8871
12185b26362j29971j12366J48773M1538j21575K13588J17656l09091j79363k7368
12175e84541j40386p2388L23031J95692P0937L32382J1618k61353k4179k37506
12165c86693k16462K15288K78483J30344j21554l69500j4056J15320l7965K01205
12155b05590K71004M30029Q4310o7551J24918j7721m20931j67820r3250Q58N22751
12144D61007K74853J00216J64344L22065M95727J85693j34933m03102m23734k57388
12134G84748j27738j16930k76788n84523j92670L50827K66240O5927j36599k86928
12124b54434m26946j78148L09721j6929l6934j71767J28332M25291N15502L42325
$$ y = [1024131, 1417359, 1359431, 1097660, 1035323, 913842, 431609, 65780, -119762, -295233, -226362, -356333, -468699, -319926, -278388, -399963, -186375, -68719, -377810, -557173, -584541, -724927, -797315, -474284, -278592, -207655, 124727, 136345, -125008, -149187, -386693, -603155, -387867, -109384, 20960, -100594, -470094, -484150, -368830, -406795, -205590, 65414, 495443, 579753, 512202, 637120, 619399, 198468, 30648, -62602, -61744, 461007, 735860, 836076, 1000420, 1322485, 1818212, 2003905, 1868972, 1465870, 1042136, 784748, 657010, 540080, 263292, -321231, -513901, -163074, 103166, 169093, 32494, -254434, -681380, -859528, -549807, -566736, -603670, -775437, -647105, -221814, 293688, 636013]
12114F36013K27034J90787p067O2705J11887n6541j06805k45045J36209K67825
12104A217002j9809j8226m37077m47121l98710l63441P9967r3404n38031K1535
12094i97315J97719l80146l64460Q4942L25819Q30066O81073K7635o48404n61991
12084h05062j16694K37538J70046Q1953L67533M40546J04931n2382q8470k78740
12074F1199m3896M95471M52841L0946p17282m14313k6902k15546n3108j627P4246
12063c57971k37675l91594k61574J0484L81636O05619K98680j583l1513j14163
12053i9654K64929Q6697k63038k14593J98968K82030k3181k68184l16881j8926
12043c71833M7229K65795K43600n9664j8438K7878J63935K80861M84755N40984
$$ y = [636013, 863047, 1053834, 1046767, 1109472, 1221359, 1164818, 1058013, 812968, 949177, 1217002, 1197193, 1178967, 741890, 294769, -103941, -467382, -387415, -480819, -1018850, -997315, -799596, -1179742, -1544202, -1459260, -1133441, -303375, 377698, 405333, -243071, -805062, -921756, -684218, -514172, -432219, -64686, 375860, 480791, 428409, 339939, 61199, 17303, 512774, 965615, 996561, 279279, -135034, -161936, -377482, -430590, -432217, -357971, -595646, -987240, -1248814, -1238330, -856694, -251075, 47605, 46022, 14509, -99654, 165275, 251972, -11066, -225659, -26691, 255339, 232158, -36026, -352907, -371833, -324604, -58809, 184791, 125127, 106689, 134567, 298502, 579363, 1064118, 1605102]
12033A605102q7146n03588l59838m73068k07760R5309J65010M14961o8092k35672
12023C45218J17411J31213j80780m49513P9086K15809r4305K09110M59092L37765
12013A170106J23348m90614p69242k51642j79475O6657J82750L43324M88741L8513
12003G22466j12540l23515M0278K72065k62933k61427J66635j02345o28961m56200
11993i46477K07068K50776k9034R8711L61222K37416J30966J93980R6063m77138
11983A23553n23059j97925k66724r7202k0622j4249J09528L00927K99607j07294
11973c93460j14777J70212o3412l23743r9074J00883K51050K21204j37670J54570
11963b34217N39924M42974j45492m45264n40615k33992O797Q4926K54309o7550
$$ y = [1605102, 1517956, 1014368, 654530, 181462, -26298, 69011, 234021, 648982, 580890, 345218, 462629, 593842, 413062, -36451, 42635, 258444, 164139, 373249, 832341, 1170106, 1293454, 802840, 33598, -218044, -397519, -330862, -148112, 195212, 683953, 722466, 609926, 286411, 326689, 598754, 335821, 74394, 241029, 138684, -490277, -946477, -739409, -488633, -517667, -418956, -57734, 179682, 310648, 504628, 600691, 123553, -399506, -597431, -864155, -961357, -981979, -996228, -886700, -585773, -286166, -393460, -508237, -338025, -401437, -725180, -824254, -723371, -472321, -251117, -388787, -234217, 305707, 748681, 603189, 157925, -382690, -616682, -609885, -524959, -270650, -338200]
11953c38200o1668K32151n1392J09079L18655L04266J18124P220j14759j68466
11943C55010N5659K49040m9349r0502l19249p09555j68346L22467K52523J41925
11933C9623J80161L23874o4657l86401l20888j74532K19275M63434P05363K25101
11923A210353l13419p0128K52047K8697m53884j57605L63198M93799J12208l11694
11913A153572m74538l30439M36384P03959n9420K75351O99758P36666J063875
11904D205168O73799M29802Q01856R62478J062450J038786L98643k81710j153616
11895H137656j109067p02658p32711j180735j171721m91918J5492M8481m86347
11886B326472n00799m87238p05277p1894L81531K86834O9972k55625k17952k12332
$$ y = [-338200, -399868, -167717, -219109, -110030, 208625, 512891, 631015, 638235, 523476, 355010, 410669, 659709, 610360, 519858, 200609, -508946, -677292, -354825, -102302, 39623, 219784, 543658, 479001, 92600, -228288, -402820, -183545, 279889, 985252, 1210353, 896934, 826806, 1078853, 1107550, 653666, 496061, 859259, 1353058, 1465266, 1153572, 679034, 348595, 784979, 1488938, 1429518, 1704869, 2404627, 3141293, 4205168, 4878967, 5308769, 6110625, 7073103, 8135553, 9174339, 9572982, 9291272, 8137656, 7028589, 6325931, 5593220, 4412485, 3240764, 2748846, 2764338, 2812819, 2326472, 1825673, 1338435, 633158, 561264, 942795, 1229629, 1299601, 1043976, 826024, 613692]
11876F13692j93072k47917j31791L79337M08701k23552p02809o47358p2045K98513
11866e18301J30335O2770O7325p4344j26600P9983K92315Q2025k54290J5558J74350
11855f8874r403l04713j99162j50198R5255K56577M0970J41167j10653l90103
11845f99137k69591k39618M11601O14691O77973M31334k4885m69674l08111l55617
11835b31034n41638j00246M32384M4076k95732L965K41721L74582N78579J13669
11825F20326l11082J26492L19185j37438k98597l30202J72960p9627p21283n09714
11815a148980M85754M94976M27439L09286j79004n3338k23658k82339k52906j04201
11805e26971j65883n4529N1375m0594l03433J87188O43877O0256l4986L6677M1440
$$ y = [613692, 420620, 172703, 40912, 420249, 828950, 605398, -97411, -744769, -816814, -518301, -387966, -325196, -257871, -332215, -458815, -378832, -86517, -4492, -258782, -243224, -68874, -78277, -382990, -582152, -732350, -637095, -380518, -339548, -198381, -309034, -699137, -968728, -1208346, -796745, -182054, 495919, 927253, 902368, 432694, 124583, -231034, -772672, -872918, -440534, -396458, -692190, -688225, -446504, -71922, 506657, 620326, 309244, 435736, 754921, 617483, 318886, -11316, 161644, 82017, -639266, -1148980, -663226, -168250, 259189, 568475, 389471, 336133, 112475, -169864, -422770, -526971, -692854, -747383, -696008, -736602, -1040035, -852847, -208970, -148714, -183700, -147023, -105583]
11794a05583M8207m746K44315K13173Q2549J37897R8858m6438l59193m45632j00200
11783b36793j71915r2427J59073K80658K49872J29663n1913P9914l8736k67993
11773C9403k33436j38695J67031K39576J16178J26427J41201Q6688l23018l93843
11763a72488j73349L2885k26311k81833k01475m1140j71618J69363O10867O28302
11753A73203K75802K7242j1395k10019l56037j62621K95329r47j54872J93353
11743F9038J74524N1458O5857R2758L78717L73009j12350j53670m59992p45489
11733b66140j70332k13815k3545J87221J99303J55168K84871L45428J18137j79418
11723D36878m25478j71662J43592M1707N7889K16459k0487L8769O0850O1282M0914
$$ y = [-105583, -57376, -62122, 182193, 395366, 477915, 615812, 714670, 668232, 309039, -136593, -236793, -408708, -501135, -342062, -61404, 188468, 318131, 266218, 346132, 307396, 39403, -194033, -332728, -165697, 73879, 190057, 316484, 457685, 544373, 221355, -172488, -345837, -312952, -539263, -821096, -1022571, -1063711, -1235329, -1065966, -455099, 173203, 449005, 476247, 464852, 254833, -101204, -263825, 31504, 30557, -124315, 69038, 243562, 295020, 360877, 453635, 832352, 1205361, 1093011, 939341, 479349, -266140, -436472, -650287, -673832, -486611, -287308, -132140, 152731, 498159, 616296, 436878, 11400, -160262, -16670, 25037, 82926, 299385, 278898, 317667, 378517, 439799, 480713]
11712D80713K19733R8814m01895n44382J4985M68697M82164p9733l56332k52729
11702A30035j20175J83095K73037J30240K12094j93231l79457k66927j85349n6967
11692b73605M01578N56261K92185m2011l98377j15020n378j06273j30130j52999
11682B6231l91542n29928O9736k67120j44159O39918O40937K23491J89236R8149
11672E54949J4321k21486r0674K78614L17479J16693k76112m96500m80166m42385
11662g25267P8638N41691J87304L75054M87877K65744N4839l02053l63702j07469
11652D92656J85112M2889j81694j17593q5612r2665k49868k69045l90049L28316
11642c37553P38251M5805k60758m5757j53858k74862k0634L3714k97430k6093
$$ y = [480713, 700446, 799260, 397365, -147017, -132032, 336665, 818829, 739096, 382764, 130035, 9860, 192955, 465992, 596232, 808326, 615095, 235638, -31289, -216638, -273605, 127973, 684234, 976419, 934408, 536031, 421011, 415633, 309360, 179230, 26231, -365311, -895239, -825503, -1092623, -1236782, -596864, 44073, 267564, 456800, 554949, 569270, 347784, 257110, 535724, 853203, 969896, 693784, 197284, -282882, -725267, -646629, -104938, 82366, 457420, 945297, 1211041, 1265880, 963827, 600125, 492656, 677768, 720657, 538963, 421370, 335758, 243093, -6775, -275820, -665869, -337553, 400698, 446503, 185745, 139988, -13870, -288732, -309366, -275652, -573082, -599175]
11632e99175K71630P9765J30185J57189K05742K38252J63935J7459J47654K24411
11622A037047L5334j05843n58296q47734l50926K10581K81246L24022k45774n79896
11612h00239J11384K61909K33092N82880O8733k63101l32529j41586J48171K63418
11602A32132J62027K52212n9974k77200j55723J62832p225K136J15206l15428
11592A0995p8020K75527K82987m14010o46648n52942l64929j41490M45331P48609
11582d34590M29363K51481K27139m4552j52027k63898k54122J032M7266r9653
11572b92561J11439k57303j27059L53228L55839N21464K27519n6465R8012J28462
11562A062575Q9948l2706J44835J94178K87041J80450J58480L78603P20490R18830
$$ y = [-599175, -327545, -247780, -117595, 39594, 245336, 483588, 647523, 664982, 812636, 1037047, 1072381, 966538, 408242, -439492, -790418, -579837, -298591, 25431, -220343, -800239, -688855, -426946, -193854, 389026, 457759, 194658, -137871, -279457, -131286, 132132, 294159, 546371, 486397, 209197, 53474, 216306, 209081, 211217, 326423, 10995, -67025, 208502, 491489, 77479, -569169, -1122111, -1487040, -1628530, -1183199, -434590, -5227, 246254, 473393, 428841, 276814, 12916, -241206, -240174, -192908, -292561, -181122, -438425, -565484, -212256, 143583, 665047, 892566, 836101, 934113, 1062575, 1152523, 1119817, 1264652, 1458830, 1745871, 1926321, 2084801, 2463404, 3183894, 4102724]
11552D102724J226714J943436K111150J409098J3661j080080j597418j832793
11544F296492j582035p96004m72504m82459n71040o52571n44360m51669m91200
11535B52650l8874P4724k7314K3109K60220J1994K5614L05152j24371j99014R7869
11524F61759L20423J35640q9784l24257r0617J93190j44696j93428M9427P3121
11514E90778N5420O9762r7390j06311n6350r1476r4053K281J28760K11161L04251
11503I16833j70666m04965j63855K44725M24485K66132j40951j89529j17646j02275
11493E62288J2692J40742P3431L14206N44544L14855N07084J36698j98813J81455
11483B589182M75596J053997J857712J670262J704994J389550j10495j252718
$$ y = [4102724, 5329438, 7272874, 9384024, 10793122, 10806783, 9726703, 8129285, 6296492, 4714457, 3918453, 3445949, 2963490, 2392450, 1739879, 1195519, 743850, 252650, 213776, 288500, 261186, 284295, 544515, 556509, 582123, 887275, 762904, 563890, 661759, 982182, 1117822, 1028038, 703781, 613164, 806354, 661658, 468230, 517657, 590778, 646198, 715960, 618570, 512259, 455909, 364433, 270380, 272661, 401421, 612582, 916833, 746167, 341202, 177347, 422072, 846557, 1112689, 971738, 782209, 664563, 562288, 574980, 715722, 789153, 1103359, 1647903, 1962758, 2469842, 2606540, 2407727, 2589182, 3064778, 4118775, 5976487, 7646749, 9351743, 10741293, 10630798, 9378080]
11475I378080j658881j524889j322271q12858o58655o95827l40272n44300n88791
11466A231336k46611l09226m99473J12038N47912L70604l98771l88635q6705j82780
11456A49689n37303J69906L80602j12012L3789L55709J18968n4813m8262Q3578
11446E39851M02985l6084k45591j23714J14266m68942m60841O9119M05868O01225
11436G98142J88703m72529m07238r6621L2164l0556N41J64199j98204k57012k024
11425b80435K21240O09315L0442l11634J31676o2682o39880n50763L7608l37225
11415a152338k2210O47701O65685L68401o4394j05219K06801j01851o17962o27382
11405h02768m03301l5140L03254L52474K57389K66500Q5688l70077k31583p503
$$ y = [9378080, 7719199, 6194310, 4872039, 4059181, 3400526, 2704699, 2364427, 1820127, 1231336, 984725, 675499, 176026, 288064, 835976, 1206580, 807809, 419174, 332469, 149689, -387614, -217708, 162894, 50882, 84671, 440380, 559348, 504535, 456273, 539851, 942836, 906752, 661161, 537447, 651713, 182771, -278070, -208951, 196917, 798142, 986845, 514316, 107078, 10457, 42621, 12065, 12606, 176805, -21399, -278411, -280435, -59195, 550120, 580562, 268928, 400604, 337922, -301958, -852721, -815113, -1152338, -1174548, -526847, 138838, 507239, 442845, 337626, 544427, 442576, -175386, -802768, -1206069, -1241209, -937955, -585481, -328092, -61592, 24096, -345981, -577564, -585067]
11395e85067L05741L45286K34853J69025k28290k64255j46545J01878J23691j46521
11385i0204j55827L7330J85014J38463N2709M52967O87622O15255J79146p43940
11375A358535m86882J37867n4705k38823O8058p7901J17616L18572j47552p42268
11365B52517k8361M06247J31983m20921J9246L87852P8376k97137m48546L6769
11355A18025J73412j64903k44011l55115l0808K29205k64669Q2786K83090J03603
11345f9385k0998p2324K2728n5988j78495n6123j98809k56314k39789m0114M60238
11334g05373P95251L22218K0118J12604k154q4020M4709L92078P5590r2882N5377
11323I33516k23300l04433k33843J54681J00451P7277J59949K28158j0600n6613
$$ y = [-585067, -279326, 65960, 300813, 469838, 241548, -22707, -169252, -67374, 56317, -90204, -246031, -208701, -23687, 114776, 167485, 620452, 1308074, 1923329, 2102475, 1358535, 871653, 1009520, 954815, 715992, 784050, 706149, 823765, 1142337, 994785, 252517, 224156, 630403, 762386, 341465, 360711, 748563, 826939, 529802, 81256, 118025, 291437, 126534, -117477, -472592, -503400, -274195, -538864, -456078, -172988, -69385, -90383, -162707, -139979, -195967, -374462, -430585, -629394, -885708, -1125497, -1165611, -705373, 89878, 412096, 432214, 544818, 542664, 458644, 503353, 895431, 971021, 878139, 933516, 710216, 405783, 171940, 326621, 427072, 504349, 664298, 892456, 881856, 825243]
11313H25243n8782j24926J14956j15683j98913K04718M98216N86656j7971m73255
11303A240259k84131k0373k63531q3970o098j55480m0989K96345P57024j096o35056
11292H02904l98084l02539Q2690o8089j994J60898k61126M9093M53684K59546
11282G76983l57446n37865r3678k21219n44591n7892K48957L42949Q8624R3255
11272b61923L52631K07658j45094j91966M9058p1191n903M49878K38109o8535
11262E52722j78724L5523o1375k52244L6216l1235Q6630P5553m3978N3621l24305
11251e1596k53528N23098P06531j2490m94830n25539k53506k90723m09558m32260
11241a494401l8616J063832Q47904M99018J15453k73790m67920j86051L79077
$$ y = [825243, 766461, 641535, 756491, 640808, 441895, 646613, 1144829, 1731485, 1713514, 1240259, 956128, 935755, 672224, 588254, 582156, 426676, 385687, 682032, 1439056, 1437960, 802904, 404820, 102281, 184971, 116882, 114888, 275786, 14660, 63753, 517437, 776983, 419537, -118328, -212006, -433225, -977816, -1035708, -786751, -443802, -355178, -261923, 90708, 298366, 153272, -38694, 10364, -60827, -66730, 383148, 621257, 552722, 373998, 409521, 348146, 95902, 132118, 100883, 187513, 263066, 219088, 272709, -51596, -305124, 217974, 924505, 912015, 417185, -108354, -361860, -652583, -1062141, -1494401, -1533017, -469185, 378719, 877737, 993190, 719400, 251480, 65429, 444506]
11232D44506J51329m73989k8249K70513k10056L8189n1121k42552J12467J64831
11222A75868n06485j54835P6269k9223j59213k54005j05674j59293J72421M31924
11212e12246L13082o0689m4663K85661K60221J21704K28704k20080k96218j34800
11202e9324P7375M0574J89558k94029q5560K46800P01618O30007k68188n80885
11192E97946l09166k77378m72629j98868L59803J95878O9427p5580j95480M51857
11182A45810M78006R7243j51397j00810o2602p83267p65404m01409r895J98803
11172a354922l6524M6896K70086K88733M95369N36835J63974r6747l08070l47658
11162c42028m900L81365J50627K6765o2007o57118n02750j54615J39681L84558
$$ y = [444506, 595835, 121846, 93597, 364110, 154054, 192243, 141122, -101430, 11037, 175868, -330617, -485452, -409183, -438406, -597619, -851624, -957298, -1116591, -944170, -512246, -199164, -259853, -304516, -18855, 241366, 363070, 591774, 371694, 75476, -59324, 18051, 58625, 248183, -45846, -131406, 115394, 817012, 1447019, 1178831, 597946, 288780, 11402, -461227, -660095, -300292, -104414, -34987, -110567, -306047, 145810, 623816, 721059, 569662, 468852, 406250, -377017, -1142421, -1543830, -1553725, -1354922, -1391446, -1344550, -1074464, -785731, -290362, 246473, 410447, 313700, 5630, -342028, -346928, 34437, 185064, 211829, 149822, -507296, -1010046, -1164661, -1024980, -640422]
11152f40422K56460j00340j79954l7713Q5199J99776K0560j57529L0616J33163
11142c90184K43158J46351K32421L9987N3843L60969K79229j41728j62520j08322
11132E53204k31977j58617j37650j90037l35786j81024j06263k15349k15271M92329
11122g26441K24455l1145M61319O06702j84054m66494l1770M2308j42408l30691
11112e78219m04635J96464L67360J24569j29004L2845P0110q9093r8840P501p4459
11101e75401Q483L45631J60570K37920M50156k7652j20786K4146L12142L14940
11091A130149k1209m33222k43348o25782o20149J24467M44568K51093M73392o140
11081D73819k50431L4285q6686j11470r8937k33927j11295Q9032K5714L16151
$$ y = [-640422, -383962, -484302, -664256, -701969, -616770, -416994, -396434, -553963, -523347, -390184, -147026, -675, 231746, 271733, 325576, 686545, 965774, 824046, 661526, 553204, 321227, 162610, 24960, -165077, -500863, -681887, -788150, -1003499, -1218770, -726441, -501986, -533131, -71812, 534890, 350836, -115658, -147428, -105120, -247528, -578219, -982854, -786390, -419030, -294461, -423465, -390620, -320510, -409603, -508443, -500942, -575401, -566918, -221287, -60717, 177203, 627359, 599707, 478921, 503067, 815209, 1130149, 1108940, 675718, 432370, -193412, -813561, -689094, -244526, 6567, 479959, 473819, 223388, 257673, 170987, 59517, -39420, -273347, -384642, -295610, -269896, 46255]
11071D6255R6739m66743n01357n7014M58895O79097M08883K36596K34978j15193
11061A021136k29671j13400j91461j90842k12566R1620J25548k19031l26731m05158
11051f50556l64605J83512L26843M28199M76178K38412K4098k95693m8740P7232
11041C94880O1584O83679L38946j49317k11982m67933k23605O7421K34263m863
11031G23073n52252k73961K37120L29946N6493j55191l28582j01822j11973J5740
11021a61409M22578L31518k3137N0412K0669j61062j00313j5853K03673N3528
11011F20604J22240p4195k73682P3534L65726M76532l1812p20044n52449j4407
11001g953n734l83478m20988j68531K91028L07467K19925K69493M1732n68119
$$ y = [46255, 142994, -323749, -825106, -882120, -423225, 255872, 664755, 901351, 1136329, 1021136, 791465, 678065, 486604, 295762, 83196, 174816, 300364, 81333, -245398, -650556, -1015161, -831649, -504806, -76607, 399571, 637983, 662081, 366388, 317648, 394880, 456464, 1140143, 1479089, 1329772, 1117790, 649857, 426252, 493673, 727936, 723073, 170821, -103140, 133980, 463926, 520419, 365228, 36646, -65176, -177149, -161409, 261169, 592687, 569550, 619962, 640631, 479569, 379256, 363403, 567076, 620604, 742844, 668649, 394967, 468501, 834227, 1310759, 1278947, 558903, 6454, -7953, -13687, -397165, -818153, -986684, -695656, -388189, -168264, 101229, 142961, -425158]
10991d25158m72895n3056J9198J75444J25341k5478k04014k06367l4272J73167
10981i28090k92762j52912L91639K47261j19049O3175J45595K21932P664P1711
10971c43836O80978R33715K21361m64276m17340j68776j06490j33605l4882r6476
10961G0373O8368R4833l3549j64704m1827n4879Q0655K95047J06259k83887o98594
10950e61905m13107j93715K25793M157l47412K58891Q8382K74196L46548L873
10940c14299M78700L86916m22151o33383K4249K82773L87021Q082k75165k96123
10930c73380p8048R2179K33411j81910k70504k2422o5407j0554K60053K12730
10920b03852m5539l32197k32329R9269J62737N05689J4750m34006m79810R2981
$$ y = [-425158, -898053, -951109, -931911, -756467, -631126, -656604, -860618, -1066985, -1101257, -928090, -1220852, -1373764, -982125, -734864, -853913, -790738, -645143, -423211, -415547, -343836, 337142, 1270857, 1492218, 1027942, 610602, 441826, 335336, 201731, 166849, 70373, 138741, 233574, 200025, 35321, -6506, -61385, 19270, 314317, 420576, 136689, -561905, -975012, -1168727, -942934, -938777, -1286189, -1027298, -938916, -664720, -318172, -314299, 164401, 551317, 129166, -504217, -479968, -197195, 189826, 197908, -77257, -373380, -451428, -359249, -125838, -307748, -578252, -600674, -666081, -676635, -416582, -203852, -249391, -581588, -813917, -714648, -551911, -46222, -31472, -465478, -945288, -852307]
10910h52307K76299k6356R8577N99560O63587J3417l51656k27348o2249j25251
10900F273n42107l31241L54631M00056M103k8897M03431K98661M28692L63788
10890A357390m07046j01912J32034P8245j95516n82928m90058l34873p36982m19459
10880a701105L47753Q13987M72697j12675m09847J1677J47270J24992K12972J02614
10870A0335k58101J11362O3612j63904J31796M27461J97802r8195J90404K62639
10860H75211J84872M6324l57638P516M87699k07170o68736k32990M82942J56483
10850G74513p0613j53847n47137o02411m26054J06617K63694J86961o3727j63865
10840f95869K36097P16589L71297M4497q2237j72824o9945J45236n3534k71986
$$ y = [-852307, -576008, -602364, -503787, 95773, 759360, 772777, 421121, 193773, 131524, 6273, -535834, -867075, -512444, -112388, -108285, -137182, 266249, 564910, 993602, 1357390, 950344, 848432, 980466, 1058711, 863195, 280267, -209791, -544664, -1281646, -1701105, -1353352, -539365, -66668, -179343, -589190, -577513, -430243, -305251, -92279, 10335, -247766, -136404, -72792, -236696, -104900, 322561, 520363, 422168, 612572, 875211, 1060083, 1106407, 748769, 756285, 1243984, 1036814, 368078, 135088, 618030, 774513, 703900, 550053, 2916, -599495, -1025549, -918932, -655238, -468277, -532004, -695869, -459772, 256817, 628114, 672611, 590374, 417550, 347605, 492841, 439307, 167321]
10830A67321j16789L76182K15595k1739m5396l51344l26251l30585j04812N99819
10820F2001L24514L2918M47031K94569j51929M8837K45272J24693o57703n02367
10810B67836k88874k06694K43423J4186q1741j44786O5775j41883j77053l62640
10800h12451M430n0413P1436K77405j98529j04730M81773J60773O7180K45854
10790A42728p3255m31644m48504k82105j84405J11432L00209L48221O64772L69589
10780E17038J05693k00891k48619k86167m791K29981j82798l69482m5419J95804
10770b89651j03043l21936j59063M41295L88543J65622L46298K87373m7704K36521
10760I44255j56218l05835o718l63984m34126k35123l0529j69054p652P60M34940
$$ y = [167321, 50532, 426714, 642309, 620570, 575174, 223830, -102421, -433006, -537818, 62001, 386515, 419433, 866464, 1161033, 1009104, 1057941, 1303213, 1427906, 770203, 267836, -21038, -227732, 15691, 29877, -51864, -196650, -130875, -272758, -449811, -812451, -808021, -858434, -786998, -509593, -708122, -812852, -331079, -170306, -103126, 142728, 69473, -362171, -810675, -1092780, -1277185, -1165753, -865544, -517323, 147449, 517038, 622731, 421840, 173221, -112946, -117737, 112244, -70554, -440036, -485455, -289651, -392694, -714630, -873693, -432398, -43855, 121767, 468065, 755438, 707734, 944255, 788037, 482202, 475484, 111500, -322626, -557749, -588278, -757332, -764984, -764224, -329284]
10749c29284L07665K9964q9877j9550j55532k98944o8615L46675J41026k24559
10739c61031o5089m02788j15403M23576K83543N631k52307k93903k86076p8904
10729a142751K63922J14507l7896l7286K55459M26341L84823n0870p63676m16868
10719a004295J95947L19615k87830k12846r9819N3548M64879L66257o6083k31085
10709e01712k1442K30247R4834j34780K11697J79120J34316j77770n50076k04186
10699g39752j67918J84937M34573M06079J37022j05831k10900k14223k1035J55871
10689a41177J12942o000K55434j66584k42596R4585P373o5708K34683J26566L31691
10678E41209M9571l80643o0300j4940K0213K19433L39307J58980o4537m60747
$$ y = [-329284, -21619, 8345, -81532, -101082, -256614, -555558, -624173, -277498, -136472, -361031, -426120, -828908, -944311, -520735, -237192, -231561, -483868, -777771, -1063847, -1142751, -878829, -764322, -802218, -839504, -584045, -157704, 227119, 176249, -587427, -1004295, -808348, -488733, -776563, -989409, -1089228, -1035680, -570801, -204544, -270627, -501712, -523154, -292907, -198073, -332853, -121156, 57964, 192280, 14510, -535566, -739752, -907670, -722733, -288160, 117919, 254941, 149110, -61790, -276013, -297048, -141177, -28235, -34235, 221199, 54615, -187981, -93396, -86023, -151731, 82952, 209518, 541209, 590780, 210137, 149837, 134897, 155110, 374543, 713850, 872830, 808293, 347546]
10668C47546n59276m18052L00816O05153M91541J07913O9192k08430n24359j67521
10658D4523l46504k94856K65445L86747J10750p7901j65150k57964J4939J76758
10648a43213P9749J04099J24523K15207L07361O0117p81582m32001j75049n299
10638f46088J13762N25890N06265j48718n01074l85495o420L80322K61674j06466
10628f348j05301j00249k6116N08951O09063M3251k45700m52709k09164R7964
10618A13642n687k1560P87J36967j68943j8245M20611K99329l43972o13885j1166
10607b12122j70735j3328K94415K06658J55756J81524N3515k45795l78602k82761
10597d11475K71921O71660M05626n3595j97600L4141J23692J3326q2631j71183
$$ y = [347546, -211730, -629782, -328966, 276187, 767728, 875641, 944833, 736403, 212044, 44523, -301981, -596837, -331392, 55355, 166105, 88204, -76946, -334910, -319971, -143213, -63464, 40635, 165158, 380365, 687726, 747843, -33739, -465740, -640789, -646088, -532326, -6436, 499829, 351111, -149963, -535458, -541878, -161556, 100118, -6348, -111649, -211898, -238014, 270937, 880000, 923251, 677551, 224842, 15678, 113642, 107955, 86395, 87182, 224149, 55206, 36961, 457572, 756901, 412929, -200956, -212122, -382857, -396185, -101770, 104888, 260644, 442168, 495683, 249888, -128714, -411475, -139554, 532106, 937732, 884137, 686537, 720678, 844370, 857696, 775065, 603882]
10587F03882k16754k7978j69914k91332j30293j30973M52437o1100l45650n4958
10577c72633J17014K62516M03194k8151m59424m45966j39301l00335j62839J33056
10567i92869j69378J06770K79353J01167n08131m23860O17370O16346N17511M19686
10557E63965j86709k32602J01025M7511L4599J33616j10867n7337J36525k43159
10547A86567k93882j32978k04372K6949M46748J84744k34752l93972p3175Q4120
10537d04003J80784J73173K96764L43315N2432j81622m81170l03123J10232o2270
10527b75488j09664J5799R2093L55421M07168L47985j66310l35785j6979l15001
10517g61j57717P0433K46666M2619k4979P7626n24411m24785N18966N81685m5594
$$ y = [603882, 387128, 359150, 189236, -102096, -232389, -363362, 89075, 27975, -317675, -372633, -255619, 6897, 410091, 381940, -77484, -523450, -662751, -963086, -1125925, -992869, -1162247, -1055477, -776124, -674957, -1183088, -1606948, -989578, -373232, 144279, 563965, 377256, 144654, 245679, 293190, 327789, 461405, 350538, 293201, 429726, 186567, -107315, -240293, -444665, -417716, 29032, 213776, -20976, -414948, -488123, -404003, -223219, -50046, 246718, 590033, 642465, 460843, -20327, -323450, -213218, -275488, -385152, -369353, -277260, 78161, 485329, 833314, 667004, 331219, 314240, -761, -158478, -88045, 158621, 201240, 176261, 253887, -270524, -695309, -176343, 405342, 359748]
10506C59748o5347k64753j40156q9293J06439K44883n115k44111j40244k86007
10496e23956l54031m67557L78819P48595M10302J03038J33584k37772m81750L5262
10486b55466L46748K22807N17083m35983p93190R391L02849J59327L25441L8464
10476D37471p3046l08071n03959m65594k28485J29116J29262n3098r2485m37794
10466a466683l55665l3589l3606L7627N36087K26318p8217M55747O50972J90072
10456A29063n0992N7361j28549j08684j92842j34400k4997K9991J80807K25790
10446a7452J12880j04454j99810k07833J87006K88174J60659j5327l68117l02666
10436d66940K07664K60397L25331P6797j65015K70984K87637K98303K6255l08139
$$ y = [359748, 294401, 29648, -110508, -199801, -93362, 151521, 146406, -97705, -237949, -523956, -877987, -1345544, -966725, -218130, 192172, 295210, 428794, 191022, -290728, -255466, 91282, 314089, 831172, 395189, -398001, -388610, -85761, 73566, 399007, 437471, 364425, 56354, -447605, -913199, -1141684, -1012568, -883306, -936404, -1028889, -1466683, -1822348, -1855937, -1889543, -1851916, -1315829, -1089511, -1167728, -711981, -61009, 129063, 78071, 135432, 6883, -101801, -294643, -429043, -454040, -424049, -243242, -17452, 95428, -9026, -208836, -416669, -229663, 58511, 219170, 203843, -164274, -466940, -259276, 1121, 326452, 403249, 238234, 509218, 796855, 1095158, 1121413, 813274]
10426H13274l53093j02686J07662k38788l43121K1998K64539K1562L6067J38898
10416C66312j86386j0191q2483K528q367l1103k3495m26599m22738j27854K9787
10405i20589m2962L11488M00178K64116K13284M9709m09736k67091M2511J69195
10395a89897K72101k44104m934N46568K55843l24150m83510j73336J03249M0870
10385b01300j2970l39683n03997l42556Q8210K14645Q7620J89087K55151j06865
10375f72658P5908J06999k3329N0711J45998K2789p1665M8871p8904J02612K18612
10364g4056j93700m83597l64917O17306O84406L49035R0681J71263l1559N2936
10354H17798l98570p10073n29088j66028L77174M23213K58117M44751K33582j13148
$$ y = [813274, 460181, 357495, 465157, 226369, -116752, -94754, 169785, 191347, 227414, 366312, 179926, 169735, 87252, 89780, 81413, 50310, 26815, -399784, -822522, -950376, -920589, -963551, -652063, -251885, 12231, 225515, 275224, -134512, -401603, -359092, -189897, 82204, -161900, -166834, 379734, 635577, 311427, -172083, -345419, -242170, -201300, -214270, -553953, -1057950, -1400506, -1312296, -1097651, -1010031, -820944, -565793, -672658, -596750, -489751, -513080, -462369, -316371, -293582, -365247, -316376, -395280, -292668, -74056, -267756, -751353, -1116270, -498964, 185442, 534477, 625158, 796421, 764862, 817798, 419228, -290845, -819933, -985961, -608787, -185574, 72543, 517294, 750876, 637728]
10344F37728n44570l52752L6985P511n2162L33132M63157K16769J16145K40112
10334A102055r8595m00704l46526p47570q08620R9383M80441j21861m562L81236
10324d65323J29799j66443K37051N87594J41784K06915K97680M04598m9520m52065
10314H72070l23104J13792P0549K9960l27765j18608Q3285p1404K2403l70959
10304a9781l58581j47491k54594J79623L43529J51330m26844l36418m4964N5071
10294h59120J08452J25970Q57439P26034R3372l18968K1659J14235l67817m19667
10284H1589l04897K02084Q09249L48062k03527N997j58684j44562L23579K75026
10274A233916K20348k02635l82834n953m8243k56673r2039J01120J97375j55914
$$ y = [637728, 93158, -259594, -222609, -215098, -267260, 65872, 529029, 745798, 861943, 1102055, 1003460, 602756, 256230, -491340, -1299960, -1200577, -720136, -841997, -846559, -465323, -335524, -501967, -264916, 322678, 464462, 671377, 969057, 1373655, 1324135, 872070, 548966, 662758, 733307, 763267, 435502, 316894, 400179, 328775, 351178, -19781, -378362, -525853, -780447, -600824, -257295, -105965, -532809, -869227, -914191, -859120, -750668, -624698, 232741, 958775, 1052147, 733179, 754838, 869073, 501256, 81589, -223308, -21224, 788025, 1136087, 932560, 938557, 779873, 635311, 958890, 1233916, 1454264, 1251629, 868795, 862842, 814599, 557926, 465887, 567007, 764382, 608468]
10264F08468l21819k926l98201l66099J0466P4680k0646N4322M05356l84232l49825
10253f90456k8003k1007n5476J42315K33435O6646J52659J05721l1727K00533
10243G4640m3781j87391J04571N09395O2829p39256n21696k01730L14650M33616
10233a94153K43474n2263l82632l25927j32191K24230O7088k56824K26321M42568
10223a40309Q4021j12414K56022k08329k61483M81177L02673J92381j83060m15321
10213d642k59751q9487j59397P2235K30822l46445K00081O11798K49832j35935
10203C69111l76477k92946L56277J43395k84280K28918J01880J3k03834J78485
10193B20542L16753M01766M17165j3467j30721n9759l80630l73422J2872j24255
$$ y = [608468, 286649, 283723, -114478, -480577, -470111, -395431, -416077, -361755, 43601, -340631, -690456, -718459, -739466, -794942, -652627, -419192, -352546, -199887, -94166, -125893, 74640, 30859, -156532, -51961, 457434, 520263, -218993, -740689, -942419, -627769, -194153, 49321, -2942, -385574, -711501, -843692, -619462, -552374, -809198, -582877, -140309, -56288, -168702, 87320, -121009, -382492, 98685, 401358, 593739, 410679, -4642, -264393, -353880, -513277, -441042, -210220, -556665, -356584, 255214, 505046, 369111, -7366, -300312, 55965, 199360, -84920, 143998, 245878, 245891, 42057, 220542, 537295, 939061, 1356226, 1342759, 1212038, 1152279, 771649, 398227, 411099, 286844]
10183B86844k32876j58433j74324k35059L0596N57400L13195j36219l21982o05747
10173f76605L540L26741l1846r1171k2361J18258j19386k42531J68861K64736
10163c01764J99535M24468L86168K56491l11710j70933r9463k74062k34735k28706
10153c54711k17737r3881j82172L68380N94766L53609j57336k5274J26274K57708
10143F69626j4706l20467l86982l99568k80328N6866K67728N03323K67989Q2723
10133D46204r1454K953M53146O03172K33701r9229q268N48583J223679J502608
10123D815095J466103K254947K998807K197569l81447k483280k644653k294508
10115E928633j624193p91320n6724m18389o94255q69848j000409n93734l9198
$$ y = [286844, 53968, -104465, -278789, -513848, -483252, 74148, 387343, 251124, -70858, -676605, -673065, -346324, -378170, -469341, -491702, -373444, -492830, -735361, -566500, -301764, -102229, 322239, 708407, 964898, 653188, 482255, 382792, 108730, -126005, -354711, -572448, -666329, -848501, -480121, 114645, 468254, 310918, 285644, 411918, 669626, 654920, 334453, -52529, -452097, -732425, -675559, -407831, 95492, 363481, 446204, 354750, 357703, 810849, 1414021, 1647722, 1548493, 1540225, 2088808, 3312487, 4815095, 6281198, 8536145, 11534952, 13732521, 13351074, 10867794, 8223141, 5928633, 4304440, 3513120, 3456396, 3038007, 2343752, 1473904, 473495, -120239, -159437]
10106a59437N1825M45232N38926j1090k01392l20151l46631Q4248K82196K61100
10096F24826K29357K74225M42564K99739q7541l71866p7187j39280m15282j91135
10086E88420k25308l52030j57475K25057P1684k84532r7757P8108K89763Q8396
10076B24326k24798O7658J77859K46113Q9110K12922J9211l37216k97850K35919
10066D13254J07737j78389K36283J12673L57l1709l63568l44199o7959J43631
10056B8111j6825l23542N27002N40587K26233K83011l2838k08613k86364n34326
10046B02436m06965j90174j48824J51736j86396l69467J2425L21452K80835P3520
10036b59422k05367j32960J10410j1748L84667N62148K01416J59957K95724K70381
$$ y = [-159437, -107612, 337620, 876546, 865456, 664064, 343913, -2718, 81530, 363726, 624826, 854183, 1128408, 1570972, 1870711, 1783170, 1411304, 1334117, 1194837, 779555, 588420, 363112, 11082, -146393, 78664, 150348, -134184, -231941, -153833, 135930, 224326, -472, 67186, 245045, 491158, 580268, 793190, 812401, 475185, 177335, 413254, 520991, 342602, 578885, 691558, 691915, 660206, 296638, -47561, -115520, 28111, 11286, -312256, 214746, 755333, 981566, 1264577, 1231739, 1023126, 736762, 202436, -204529, -394703, -543527, -391791, -578187, -947654, -935229, -613777, -332942, -259422, -464789, -597749, -487339, -499087, -114420, 447728, 649144, 809101, 1104825, 1375206]
10026A375206l59356m32746l03139l92310k85035m86639k50917l2259j24473n4920
10016a346588L93073M43064j28737K87712L78187L66190L95223L0501K52729N39267
10006A610621j3596p26295n59486l58614N3477j27756k54459M57819K63859j08114
9996B37456M8130O37991P13853j1480l6869m64457o23401j68485j76499k06075
9986d9836l2621K11293K88529m7040j06816k55939O3465J04355j11814j69483
9976a05907l28839q7658J49836K00126K48511J71900l92349n76444m62400Q3182
9966a100042O84506N38958K86275j17882o4317K01059M6915j38953l2568J17008
9956D20959j39195L5725j7182k0841k62847l22713l72079q8806J81401J93123
$$ y = [1375206, 1015850, 583104, 279965, -112345, -397380, -884019, -1134936, -1167195, -1291668, -1346588, -953515, -510451, -639188, -351476, 26711, 392901, 788124, 818625, 1071354, 1610621, 1597025, 870730, 311244, -47370, 6107, -121649, -376108, 81711, 345570, 237456, 285586, 923577, 1637430, 1625950, 1589081, 1124624, 501223, 332738, 156239, -49836, -82457, 128836, 417365, 370325, 263509, 7570, 71035, 175390, 63576, -105907, -434746, -522404, -372568, -172442, 76069, 247969, -144380, -720824, -1183224, -1100042, -415536, 123422, 409697, 291815, 227498, 428557, 475472, 336519, 303951, 420959, 281764, 317489, 300307, 279466, 16619, -306094, -678173, -766979, -585578, -392455]
9946c92455K07930J49609L07321r5819n59775q6999K1901o5329q387J16942K58198
9935a46863L68778K27468k31401n79130J6774L70100m7492r6506L9507Q8792O35905
9924F45932N94381m2131k12059q2645M82468M43761k72301k14043J34264r8367
$$ y = [-392455, -184525, -34916, 272405, 176586, -383189, -470188, -448287, -513616, -522003, -405061, -146863, 221915, 449383, 217982, -361148, -344374, 25726, -21766, -118272, -78765, 10027, 645932, 1240313, 1198182, 986123, 903478, 1385946, 1829707, 1557406, 1343363, 1477627, 1379260]
$$ [...]
##END NTUPLES=NMR SPECTRUM
##END=
