##TITLE=C13_SL19a-Dau
 CDCl3,  19800 sc

 31.08.2021
##JCAMPDX= 6.0         $$ Bruker NMR JCAMP-DX V2.0
##DATA TYPE= NMR SPECTRUM
##DATA CLASS= NTUPLES
##ORIGIN= UXNMR, Bruker Analytische Messtechnik GmbH
##OWNER= root
$$ XWIN-NMR		Version 3.5
$$ Wed Sep  1 08:29:58 2021 Russian Standard Time (UT+4h)  she@DPX200
##.OBSERVE FREQUENCY= 50.327896
##.OBSERVE NUCLEUS= ^13C
##.ACQUISITION MODE= SIMULTANEOUS
##.ACQUISITION SCHEME= undefined
##.AVERAGES= 19800
##.DIGITISER RES= 17
##SPECTROMETER/DATA SYSTEM= spect
##.PULSE SEQUENCE= zgpg30
##.SOLVENT NAME= DMF
##.SHIFT REFERENCE= (INTERNAL, DMF, 0, 222.683)
##AUDIT TRAIL= $$ (NUMBER, WHEN, WHO, WHERE, WHAT)
$$ ##TITLE= Audit trail, XWIN-NMR		Version 3.5
$$ ##JCAMPDX= 5.01
$$ ##ORIGIN= Bruker BioSpin GmbH
$$ ##OWNER= she
$$ F:/spectra/data/she/nmr/c13/1/pdata/1/auditp.txt
$$ ##AUDIT TRAIL=  $$ (NUMBER, WHEN, WHO, WHERE, WHAT)
(   1,<2021-09-01 08:27:53.62 +0400>,<she>,<DPX200>,
      <created by zg, POWCHK disabled, PULCHK disabled
       terminated by command 'halt'
       configuration hash MD5:
       00 E9 B6 7A A2 85 ED C7 34 08 36 98 17 FE 4E 26
       data hash MD5: 32K
       9C E8 35 CC 1E FE 95 CB 41 26 8C 1F 87 E0 0B 91>)
(   2,<2021-09-01 08:28:06.28 +0400>,<she>,<DPX200>,
      <Start of raw data processing
       efp BC_mod = 2 LB = 1 FT_mod = 6 PKNL = 1 PHC0 = -335.5414 PHC1 = 28.76238 SI = 32K 
       data hash MD5: 32K
       3B 5C 16 EB E6 CE D0 5D 78 E0 91 90 B1 B6 43 41>)
(   3,<2021-09-01 08:28:13.25 +0400>,<she>,<DPX200>,
      <abs ABSG = 5 
       data hash MD5: 32K
       B2 6C 0A DF 63 63 33 94 29 4C AB BC 2F 0E 2D BC>)
(   4,<2021-09-01 08:28:49.39 +0400>,<she>,<DPX200>,
      <pk PHC0 = -1.635381 PHC1 = 4.6 
       data hash MD5: 32K
       FD 6F E7 93 13 3E 15 A2 EE 99 E3 7A 11 76 CC 51>)
(   5,<2021-09-01 08:28:52.87 +0400>,<she>,<DPX200>,
      <abs ABSG = 5 
       data hash MD5: 32K
       B7 7F 4C F0 5F 4F 5D 17 88 0D 97 AD 50 2A 61 C1>)
$$ ##END=
$$ 
$$ hash MD5
$$ 68 3C F9 BE C0 9A BC 8B 7B 56 79 6E FB A4 BD 06
##$RELAX= 
##$RELAX= 
##$RELAX= 
##$RELAX= 
##$RELAX= 
##$RELAX= 
##$RELAX= 
##$RELAX= 
$$ Bruker specific parameters
$$ --------------------------
##$DU= <F:/spectra>
##$EXPNO= 1
##$NAME= <c13>
##$PROCNO= 1
##$TYPE= <nmr>
##$USER= <she>
##$AMP= (0..31)
100 100 100 100 100 100 100 100 100 100 100 100 100 100 100 100 100 100 
100 100 100 100 100 100 100 100 100 100 100 100 100 100 
##$AQSEQ= 0
##$AQ_mod= 1
##$AUNM= <au_zg>
##$AUTOPOS= <>
##$BF1= 50.322709
##$BF2= 200.13
##$BF3= 50.322709
##$BF4= 500.13
##$BF5= 500.13
##$BF6= 500.13
##$BF7= 500.13
##$BF8= 500.13
##$BYTORDA= 1
##$CFDGTYP= 0
##$CFRGTYP= 5
##$CHEMSTR= <none>
##$CNST= (0..31)
1 1 145 1 1 1 1 1 1 1 1 1 1 1 1 1 1 1 1 1 1 1 1 1 1 1 1 1 1 1 1 1 
##$CPDPRG= <waltz16>
##$CPDPRG1= <>
##$CPDPRG2= <waltz16>
##$CPDPRG3= <>
##$CPDPRG4= <mlev>
##$CPDPRG5= <mlev>
##$CPDPRG6= <mlev>
##$CPDPRG7= <mlev>
##$CPDPRG8= <mlev>
##$CPDPRGB= <>
##$CPDPRGT= <>
##$D= (0..31)
$$ [...]
##$SUBNAM4= <"">
##$SUBNAM5= <"">
##$SUBNAM6= <"">
##$SUBNAM7= <"">
##$SUBNAM8= <"">
##$SUBNAM9= <"">
##$SW= 239.972175391363
##$SWIBOX= (0..15)
0 1 3 0 0 0 0 0 0 0 0 0 0 0 0 0 
##$SW_h= 12077.2946859903
##$TD= 32768
##$TD0= 1
##$TE= 0
##$TE2= 300
##$TE3= 300
##$TEG= 300
##$TL= (0..7)
120 120 120 120 120 120 120 120 
##$TP= (0..7)
150 150 150 150 150 150 150 150 
##$TP07= 0
##$TPNAME0= <>
##$TPNAME1= <>
##$TPNAME2= <>
##$TPNAME3= <>
##$TPNAME4= <>
##$TPNAME5= <>
##$TPNAME6= <>
##$TPNAME7= <>
##$TPOAL= (0..7)
0.5 0.5 0.5 0.5 0.5 0.5 0.5 0.5 
##$TPOFFS= (0..7)
0 0 0 0 0 0 0 0 
##$TUNHIN= 0
##$TUNHOUT= 0
##$TUNXOUT= 0
##$USERA1= <user>
##$USERA2= <user>
##$USERA3= <user>
##$USERA4= <user>
##$USERA5= <user>
##$V9= 5
##$VALIST= <valist>
##$VCLIST= <CCCCCCCCCCCCCCC>
##$VD= 0
##$VDLIST= <DDDDDDDDDDDDDDD>
##$VPLIST= <PPPPPPPPPPPPPPP>
##$VTLIST= <TTTTTTTTTTTTTTT>
##$WBST= 1024
##$WBSW= 4
##$XGAIN= (0..3)
0 0 0 0 
##$XL= 0
##$YL= 0
##$YMAX_a= 114870817
##$YMIN_a= -27319316
##$ZGOPTNS= <>
##$ZL1= 120
##$ZL2= 120
##$ZL3= 120
##$ZL4= 120
##$ABSF1= 222.6826
##$ABSF2= -17.31421
##$ABSG= 5
##$ABSL= 3
##$ALPHA= 0
##$AQORDER= 0
##$ASSFAC= 0
##$ASSFACI= 0
##$ASSFACX= 0
##$ASSWID= 0
##$AUNMP= <proc_1d>
##$AZFE= 0.1
##$AZFW= 0.5
##$BCFW= 0
##$BC_mod= 2
##$BYTORDP= 0
##$COROFFS= 0
##$CY= -3
##$DATMOD= 1
##$DC= 0
##$DFILT= <>
##$DTYPP= 0
##$F1P= 0
##$F2P= 0
##$FCOR= 0.5
##$FTSIZE= 32768
##$FT_mod= 6
##$GAMMA= 0
##$GB= 0
##$INTBC= 1
##$INTSCL= 4.134877e-10
##$ISEN= 128
##$LB= 1
##$LEV0= 0
##$LPBIN= 0
##$MAXI= 10000
##$MC2= 0
##$MEAN= 0
##$ME_mod= 0
##$MI= 0.1934396
##$NCOEF= 0
##$NC_proc= 2
##$NLEV= 6
##$NOISF1= 120.0001
##$NOISF2= 80.00006
##$NSP= 0
##$NTH_PI= 0
##$NZP= 0
##$OFFSET= 222.6826
##$PC= 1.4
##$PHC0= -337.1768
##$PHC1= 33.36238
##$PH_mod= 1
##$PKNL= yes
##$PPARMOD= 0
##$PSCAL= 0
##$PSIGN= 0
##$REVERSE= no
##$SF= 50.3227286521846
##$SI= 32768
##$SIGF1= 140
##$SIGF2= 120
##$SINO= 11.81781
##$SIOLD= 32768
##$SREGLST= <13C.CDCl3>
##$SSB= 0
##$STSI= 32768
##$STSR= 0
##$SW_p= 12077.2946859903
##$SYMM= 0
##$S_DEV= 0
##$TDeff= 32768
##$TDoff= 0
##$TI= <>
##$TILT= no
##$TM1= 0
##$TM2= 0
##$TOPLEV= 0
##$USERP1= <user>
##$USERP2= <user>
##$USERP3= <user>
##$USERP4= <user>
##$USERP5= <user>
##$WDW= 1
##$XDIM= 32768
##$YMAX_p= 510078534
##$YMIN_p= -2317330
$$ End of Bruker specific parameters
$$ ---------------------------------
##NTUPLES= NMR SPECTRUM
##VAR_NAME=  FREQUENCY,     SPECTRUM/REAL,   SPECTRUM/IMAG
##SYMBOL=    X,             R,               I
##VAR_TYPE=  INDEPENDENT,   DEPENDENT,       DEPENDENT
##VAR_FORM=  AFFN,          ASDF,            ASDF
##VAR_DIM=   32768,         32768,           32768
##UNITS=     HZ,            ARBITRARY UNITS, ARBITRARY UNITS
##FACTOR=    0.368581032318806, 1,           1
##FIRST=     11205.996152421, 0,             0
##LAST=      -871.298533569341, 0,           0
##MIN=       -871.298533569341, -2317330,    0
##MAX=       11205.996152421, 510078534,     0
$$ Real data points
##PAGE= N=1
##DATA TABLE= (X++(R..R)), XYDATA
$$ [...]
15941a309897M69193N6474l51123k77514N2671K82858K32762j56969k34261J36909
15931a098897K63394L20729K51784J93129m8455k69554n887J36928M6494M4862
15921a65473n8809J33255O79802K55982O1248J55156k04894k73231m74810j56783
15911d8557N60492K82027j98022k89839m56770m62027J6154L36519J57713K10762
15901A08452n9504J32768J10987j56708k14945q5189j36633m20512R3204K96114
15891c31966K03667L77835M31914Q7851o97123p38160j34611J42818r3964J87538
15881e64201L13032K35144k4303j43873l04684k23450r6616m6905N9735J79834
15871f16287J00113j28731j3629L2518q6038k75377K54792M32893Q1184k38265
$$ y = [-1309897, -840704, -784230, -1135353, -1412867, -1360196, -1077338, -844576, -1001545, -1235806, -1098897, -835503, -514774, -262990, -69861, -118316, -387870, -393757, -256829, -210335, -165473, -224282, -91027, 588775, 844757, 906005, 1061161, 856267, 583036, 108226, -48557, 511935, 793962, 595940, 306101, -150669, -612696, -596542, -260023, -102310, 108452, 48948, 181716, 292703, 135995, -78950, -164139, -300772, -721284, -628080, -331966, -128299, 249536, 681450, 769301, 72178, -665982, -800593, -657775, -751739, -564201, -251169, -16025, -40328, -184201, -488885, -712335, -808951, -855856, -796121, -616287, -516174, -644905, -658534, -626016, -712054, -987431, -732639, -299746, -218562, -456827]
15861d56827k03226J18949J23959o6075M668J94619O1040j77765N0441j95499
15851e45716j75818K05603J72430K01902K73722L10620J57944k96231k54875j81801
15841a32220j15180l3909J1892K37220j68506k23521Q9453o8242K77727M27782
15831C02496K60550j04298l06897k81756J43156L12151K67947Q4900l23847k95761
15821E8641J0659K11786J97259q5005P3003J91763j95738k92898p7334J83437
15811B75573J62013k71389q34426n15937k09741J27893N90294J75470n24637k86510
15801a311397j1078N00758L83099K72208M32308K96254j69244j71234j69191l67546
15791c15063k49194m87017l74797K16692K81627N4156p7327K77404J18973p5856
$$ y = [-456827, -660053, -541104, -417145, -483220, -478552, -283933, -222893, -400658, -350217, -545716, -721534, -515931, -343501, -141599, 132123, 442743, 600687, 304456, 49581, -132220, -247400, -281309, -269417, -32197, -200703, -424224, -334771, -403013, -125286, 302496, 563046, 458748, 151851, -129905, 13251, 325402, 593349, 678249, 354402, 58641, 69300, 281086, 478345, 393340, 466343, 658106, 462368, 169470, 92136, 275573, 437586, 166197, -668229, -1184166, -1393907, -1266014, -675720, -500250, -1024887, -1311397, -1322475, -821717, -438618, -166410, 265898, 562152, 392908, 221674, 52483, -315063, -564257, -1051274, -1426071, -1209379, -927752, -873596, -950923, -673519, -554546, -630402]
15781f30402J28250L67387o8480l69013l45544k31979J90823J44120J6800J53940
15771f44098O8913r5855L16728J07834l27837j91263M571o4886k32983K48653
15761h10223M86209J58061R0887O0975j76207l02890J00728Q2799J48401O0019
15751a01241j49498j1160k48895n10035n63191P4285L32057L34046R4455k25848
15741i75025L59157M23358K82789K76696o6876j44874m43275n25493j2544L19171
15731e06916L09560m5770J11643K09909l4839O5609k66552n70231N9021N04914
15721a63652N22778r8443r363J78812j6357j86679l12177j57144K2479j07106
15711c26852q4208L11166O3649p581K51394P9629k9669j14381q1518q9878J46798
$$ y = [-630402, -502152, -134765, -203245, -572258, -917802, -1149781, -958958, -814838, -798038, -644098, -575185, -671040, -354312, -246478, -574315, -765578, -761007, -825893, -1058876, -810223, -324014, -165953, -75066, -14091, -190298, -493188, -392460, -309661, -161260, -101241, -250739, -261899, -510794, -1020829, -1584020, -1509735, -1177678, -843632, -749177, -975025, -615868, -192510, 90279, 366975, 300099, 155225, -288050, -813543, -826087, -506916, -197356, -243126, -131483, 78426, 43587, 109196, -157356, -727587, -668566, -163652, 359126, 260683, 251320, 430132, 413775, 227096, -85081, -242225, -219746, -326852, -411060, -99894, -36245, -43826, 207568, 287197, 257528, 143147, 61629, -28249, 118549]
15700A18549L87541L99102J05501m04182m64763J20626p4766k4943J25004K45428
15690E33097L06750l21318l78090j33457j77404r8741o3073o3158L45528L19459
15680B69593q7556o6227l0300J11199J48883k29904m21351p3358l2228J45357
15670b65892J30713m0908n8223L52873N88487l6304l03903o3492Q6835l62803
15660B7383k92670j01299r1954O044M74975M44322k27111j3197N32223j87946
15650E70770j88529k93812j25519N4928l18165j67655O7349J77985O8234L19837
15640A65423R4236j09885l15305o0591J28481M1488l45904r7660k84324n1531
15630h35572K92462J59125J46168o7460n49204j96336N18440P24874M27306q6270
$$ y = [118549, 506090, 905192, 1010693, 606511, 141748, 262374, 187608, 162665, 287669, 533097, 839847, 518529, 140439, 6982, -170422, -269163, -332236, -395394, -49866, 269593, 182037, 115810, 85510, 196709, 345592, 115688, -305663, -379021, -411249, -265892, -135179, -176087, -234310, 118563, 707050, 670746, 366843, 303351, 390186, 27383, -265287, -366586, -458540, -452496, 22479, 466801, 239690, 226493, 758716, 570770, 382241, 88429, -37090, 17838, -300327, -467982, -400633, -222648, -154414, 165423, 259659, 149774, -165531, -226122, -97641, -56153, -402057, -499717, -784041, -835572, -543110, -383985, -237817, -305277, -854481, -1050817, -532377, 192497, 619803, 533533]
15620E33533k40746m69581j453K06718r3131N5355O2769l5236K33730L76693K27192
15609H55843r7175n60966o93330N552L49239p6708j64650J54389M93969P6900
15599C43063p0599K49969j59060l85456k73031J84539L95143L70736J16220m84115
15589B87409q32755j95518L9888K32582J03882l65192m24489o1719L07519M41697
15579d66696o2582J33040M36613k4277l64680m43199k16741M0534K23335M99558
15569b45095M46319j8222K11722J41831j57641Q568J31060k12250k59250R2483
15559A39525L02116O28378P6344R1916L61488l49286j90178J02180K00498R1496
15549A454477l36595p09011o39542l22606j58742j15038j40654J14403K10614
$$ y = [533533, 292787, -176794, -178247, 28471, -64660, -9305, 53464, 18228, 251958, 628651, 855843, 758668, 197702, -495628, -490076, -140837, -217545, -382195, -227806, 266163, 343063, 272464, 522433, 363373, -22083, -295114, -110575, 284568, 655304, 771524, 287409, -545346, -740864, -700976, -468394, -364512, -729704, -1154193, -1215912, -908393, -466696, -529278, -396238, 40375, 16098, -348582, -791781, -1008522, -967988, -744653, -245095, 201224, 183002, 394724, 536555, 378914, 387482, 518542, 306292, 47042, 139525, 441641, 1070019, 1146363, 1238279, 1599767, 1250481, 1060303, 1162483, 1362981, 1454477, 1117882, 408871, -230671, -553277, -712019, -827057, -967711, -853308, -642694]
15540f42694k674k37926p1124J39826j70764k47983j03618M05939N17435J79931
15530b33652R7525j67595j71633K1770r0434J24879L56390K75141p5845j56441
15520a9895j9640j19293R7602N8384l17889n170J79657k2004k63035k44297k17230
15509h92810p0797K89672M28656K41892L95402K6188n92372l08589K86714L62968
15499A66924Q5101J11491K19572J29522k20679l47169k74931J32446J33305l38794
15489b03212K54602N03667K18961K35423J2015l99349j27463M3996j55119m22207
15479c8686o52086j67883J8219o3788o4181Q2247J2742P8898J5236o7484J28258
15468g18508j1249j89924k3206M9444M98435K47313l14778k58785K69595J51582
$$ y = [-642694, -645368, -883294, -954418, -814592, -985356, -1233339, -1336957, -931018, -413583, -233652, -136127, -303722, -475355, -453585, -544019, -419140, -62750, 212391, 136546, -19895, -39535, -158828, -61226, -2842, -320731, -325901, -146244, -168248, -431283, -675580, -892810, -963607, -673935, -245279, -3387, 392015, 418203, -174169, -482758, -196044, 166924, 252025, 363516, 583088, 712610, 491931, 144762, -130169, 2277, 135582, -203212, 51390, 555057, 774018, 1009441, 1021456, 622107, 494644, 538640, 383521, -38686, -690772, -858655, -840436, -904224, -968405, -886158, -873416, -794518, -779282, -846766, -718508, -729757, -919681, -942887, -893443, -395008, -147695, -462473, -721258, -451663, -300081]
15458c00081M3362Q3979J2951l37192M8649K59455K85520K24182p0821m10144
15448a60140n55388k56315M65348N79300O5373k80669K55510J84884l51191k71898
15438c25186j18649R3330J12973K33858J97268j81760k01135J79482Q6682J91594
15428B68457J15134l9958j76238j09429J83217K41907j98471k30529K30513J56283
15418D40886l10262n42914k92195j12732O3811M07147L63393R2465k80134k79583
15408d50118L5121L7624N8432J32062M97966J51733m33690k24158j260o2310m4612
15397c03210L2836Q1499r3129m39423j13479L33595J53284j8037J3177K57905
15387i4982N71727L1792k04237j10618m40600k91905K04852N2770O2741L8777
$$ y = [-300081, -256719, -172740, -159789, -496981, -448332, -188877, 96643, 320825, 250004, -160140, -715528, -971843, -506495, 72805, 138178, -142491, 113019, 297903, -53288, -325186, -443835, -350505, -237532, -3674, 193594, 11834, -189301, -9819, 76863, 268457, 383591, 343633, 167395, 57966, 241183, 483090, 284619, 54090, 284603, 440886, 130624, -412290, -704485, -817217, -753406, -346259, 17134, 109599, -170535, -450118, -414997, -377373, -318941, -186879, 311087, 462820, 29130, -195028, -196288, -258598, -303210, -270374, -188875, -282004, -721427, -834906, -501311, -348027, -366064, -352887, -94982, 476745, 508537, 304300, 193682, -246918, -538823, -333971, -281201, -218460, -179683]
15377a79683J43811m182N5492p29k78195L4254k03046l41634J53432N04307P8097
15366c8076k11908l5964r9884K9004J09316K08657j46285j23364L07951P09483
15356G08930M95788K09531k72446m61252j21044o5465l12932k99013j79049j04779
15346d01731L5737K24434Q3619l16581k54872j46324l25147j59912J96526N77507
15336d86744M04190Q8037j46235n7541Q3172o0518j49626j84186p5868O3304k80
15325e22295J79785J92648j50628l51888n2418J73786k26886j13732K97833L65630
15315b08165q4788o5266K53851k84943j04372L28060L78181J77532o6748q6136
15305B37206l11558l8150R6647J02291L33926K50409k03982J7222j28371j22995
$$ y = [-179683, -35872, -40054, 15438, 14709, -263486, -229232, -432278, -773912, -620480, -116173, -38076, -249984, -285948, -385832, -356828, -247512, -38855, -185140, -308504, -553, 708930, 1204718, 1414249, 1141803, 680551, 559507, 494042, 181110, -117903, -296952, -401731, -365994, -141560, -57941, -374522, -629394, -775718, -1100865, -1260777, -1064251, -486744, -82554, 5483, -140752, -198293, -115121, -175639, -325265, -509451, -585319, -522015, -522295, -342510, -149862, -300490, -652378, -704796, -531010, -757896, -871628, -573795, -208165, -292953, -358219, -104368, -389311, -493683, -165623, 212558, 390090, 323342, 237206, -74352, -112502, -15855, 86436, 420362, 670771, 466789, 484011, 355640, 232645]
15295B32645K53280L61923k05663l27727k60616m51425k69458K00290J17729J4424
15285c34598K09319M0615J5111j59142n67888J47688M21159j8865l0897K8864
15275b48634K18080K06040j10459j67191k19536L4862P9820m3919l74461n42384
15265a167782p4112Q4181K60310L10998J26597l11879n03510j85484J37356K45430
15255a077895j9111m7764O13593L50453O381j90976P1410J45663l5209j74784
15245c58239j86222L94692K98642l89918k53893M5776P2204n1056l22067m87415
15235a237496j36676O80546Q67688O07510K70291p1086n37846l24408K22285K44562
15225E85370p6892n02648k05055J69428m03762l97550j72247L44613M92768K02981
$$ y = [232645, 485925, 847848, 642185, 314458, 53842, -397583, -667041, -466751, -349022, -334598, -125279, -84664, -69553, -228695, -796583, -648895, -227736, -246601, -277498, -248634, -30554, 175486, 65027, -102164, -321700, -286838, -207018, -250937, -625398, -1167782, -1241894, -1157713, -897403, -586405, -459808, -771687, -1275197, -1460681, -1323325, -1077895, -1097006, -1144770, -531177, -180724, -174343, -365319, -293909, -148246, -183455, -358239, -544461, -149769, 148873, -241045, -494938, -449162, -376958, -428014, -750081, -1237496, -1374172, -693626, 174062, 781572, 1051863, 980777, 442931, 118523, 340808, 585370, 508478, 5830, -199225, -29797, -433559, -831109, -1003356, -658743, -165975, 37006]
15215C7006O3623M29094K65422k92563M8197j26100k63129J04292o379J72717
15205D32180k34876j082305p68359P0022N28839N20774J00758l98130K47174N06282
15195g7641j55697l91617j02198l1488j9191K51521l0947k5615N4555j3160K40519
15184c00959K16701L1228K4150L5503J58208L38851K29001J62973J57238m22344
15174F30550m20728p4138r0634m4916m20877k28151L80004N72309R3265r3651
15164C03033P5672N8865l83691K36225L64913k71786k31193k2809L1069o7001
15154I3297O733J47356j22821l9375J53025k66833j89391J59827L18493o5316
15144A94995m10467O1645J14960K7672j13570j97940J15167K03401J46906q5712
$$ y = [37006, 100629, 529723, 795145, 502582, 550779, 424679, 161550, 265842, 259463, 432180, 197304, -885001, -1653360, -1583338, -1054499, -533725, -432967, -831097, -583923, -77641, -233338, -624955, -727153, -758641, -777832, -526311, -557258, -582873, -528318, -541478, -300959, -84258, -53030, -28880, 6623, 164831, 503682, 732683, 895656, 1052894, 630550, 209822, 135684, 45050, 134, -420743, -648894, -268890, 303419, 396684, 303033, 378705, 437570, 53879, 290104, 655017, 383231, 152038, 129229, 160298, 93297, 100030, 247386, 124565, 85190, 238215, -28618, -218009, -58182, 260311, 194995, -215472, -153827, -38867, -11195, -124765, -322705, -207538, -4137, 142769, 57057]
15134E7057o8122P7847o4389j86403m8200j23717L3859L71978M80543K18017l50087
15123C98383j68360k69915l14295N1279k4580K17887J07220k77840j67488K06222
15113b41487J43291k96631l26921m6012L94896K82535p4204J56300K88937J78814
15103D59518K4124k66068k04655m9001j62624K07171N129m31293l04455j53216
15093h75370L62961M61270j10366j79380J06827O4963K14985K41194J13295j34297
15083B66082m88768K7498J26410P5291j3313l73215l04211j81548j54581J77193
15073h43162K37701R1726K20517L48537j7619p6205K3992r3410j98046p3108l5557
15062d14634k81982J45530M64286K28707K49452P4422k24642j84081m7204J11505
$$ y = [57057, -11065, 66782, 2393, -184010, -232210, -355927, -322068, 49910, 530453, 748470, 398383, 230023, -39892, -354187, -302908, -327488, -109601, -2381, -280221, -447709, -241487, -98196, -394827, -721748, -767760, -372864, -90329, -164533, -8233, 280704, 459518, 483642, 217574, 12919, -36082, -198706, 8465, 13594, -417699, -722154, -875370, -512409, -51139, -161505, -340885, -234058, -169095, 45890, 287084, 400379, 266082, -222686, -195188, -68778, 6513, -6800, -380015, -684226, -865774, -1020355, -843162, -605461, -513735, -293218, 55319, 37700, -38505, -14513, -107923, -305969, -379077, -414634, -696616, -551086, -86800, 141907, 391359, 465781, 241139, 57058, 9854, 121359]
15052A21359o8765Q7887J21545k88998k91440m23852l29722N1962K12185P18888
15042h8951J051813K53821k12872j38277n1876q1282l88646k54909J7872K09738
15032C16431R2312M0757K53813J0801l22399o12155j10218j5194l04932j23294
15022g74078k54448K6500J51049P6491K3467L10349K38613J58526R2489j69859
15012a20901L92987J69255j18320O0798j58920K25938M09352J70359k89983n44073
15002A96492l33842k08929Q3237q9885j37072K44209L97910J90940J03408o8949
14992C77519K9122J22390J9625j9821l35856m64263n31541L09234M58385o0265
14982i5471j51682k25802o6799L4506L06466M73477k05592m57307m59732j89590
$$ y = [121359, 52594, 140481, 262026, -26972, -318412, -742264, -1071986, -1020024, -807839, -88951, 962862, 1216683, 1003811, 865534, 813658, 732376, 343730, 88821, 106693, 316431, 408743, 449500, 703313, 714114, 391715, -220440, -330658, -345852, -650784, -774078, -1028526, -1002026, -850977, -774486, -751019, -440670, -202057, -43531, 48958, -120901, 272086, 441341, 323021, 383819, 224899, 450837, 860189, 1030548, 740565, 196492, -137350, -346279, -263042, -352927, -489999, -245790, 152120, 343060, 446468, 377519, 406641, 529031, 548656, 528835, 192979, -271284, -802825, -493591, -35206, -95471, -247153, -472955, -539754, -505248, -198782, 274695, 69103, -388204, -847936, -1037526]
14972a037526N43595P67967N5465o06185l34398j35136L3416J62381r7043N2101
14962e95363M84709Q833m21772R420K52885K44605K82776J05338j13259j30987
14952A27185J9951r6034j71505r8265J4860L65632K35481o9873n23593j80995
14942c77156l4165k5118M08815J12116q8497m89499m23488J99714M95337O58863
14932D36922L05778l39511n12349j87449R0488K45903n2832j87217K58063K02933
14922B60729k73618K712J32035k20600l98221n02202J37836L25753J93979J34146
14912b07451K36991M9290O2968K59346l18076l31332j5095N88730O31767Q5521
14902A042659p5101J1912J10411j99292m44834n41446n01231n42304k01084M3018
$$ y = [-1037526, -493931, 274036, 329501, -276684, -611082, -746218, -712802, -550421, -647464, -595363, -110654, -101821, -523593, -514173, -261288, -16683, 266093, 371431, 258172, 127185, 147136, 51102, -120403, -218668, -203808, 161824, 397305, 327432, -196161, -377156, -411321, -436439, -27624, 84492, -4005, -493504, -916992, -717278, -221941, 436922, 742700, 403189, -109160, -296609, -206121, 39782, -13050, -200267, 57796, 260729, -12889, -10177, 121858, -98742, -496963, -999165, -861329, -535576, -341597, -207451, 29540, 78830, 141798, 401144, 83068, -248264, -263359, 325371, 957138, 1042659, 967558, 979470, 1089881, 890589, 445755, -95691, -596922, -1139226, -1340310, -1297292]
14892a297292J22044L87696O22894N96249K80642J22646m8949j4310k60169n18523
14882g072k20966k97711j80869M13259L76776l5558l40248q2866o4181o1570J36408
14871c64598J94776k4009j38060J39480L51735L40067J09014k57338n2551J07507
14861D06023j51718j54025l3149J35067P4265K56310L7966j48696J38065j77691
14851C82417m12017l3551O6696J7881j62411k33168l75176J29387K86049k0953
14841c54846K46368O2904k898L29043o1519k55568K3227J39989M8510k83815k20702
14830c29307q1599o7161k54007J36428M54507J64530J52632K01081L14879J74672
14820H66655j1858j6186k5899O0635J08051m28092n98156l5276J02657k79762
$$ y = [-1297292, -1175248, -787552, -164658, 431591, 712233, 834879, 785930, 771620, 511451, -7072, -228038, -525749, -706618, -293359, 83417, 47859, -292389, -375255, -439436, -501006, -364598, -169822, -193831, -331891, -192411, 159324, 499391, 608405, 351067, 298516, 406023, 254305, 100280, 67131, 202198, 276463, 532773, 570739, 422043, 560108, 382417, -29600, -63151, 3545, 21426, -140985, -374153, -749329, -619942, -333893, -354846, -108478, -45574, -48472, 280571, 219052, -36516, -13289, 126700, 175210, -108605, -329307, -410906, -478067, -732074, -595646, -141139, 23391, 176023, 377104, 691983, 866655, 854797, 838611, 812712, 873347, 981398, 553306, -44850, -80126, 22531, -257231]
14810b57231m65755p5939J38684M73650N08746m41694m63993j53373J08249k63223
14800h91879n2253L26590J75465R8619K27915O6207p3065k3881j0687L05186M5220
14789A93437l3943p2383j44515m5211p5726l18850l62381j43848J87589P0108
14779g45723k26452L12581P39167J07870r1795k180l81984o52609n07530L2305
14769a416350L11383L59960N84943N09901l8588o9107j41056q582j43836k26048
14759b77380J10398R635K01189j44806k49402j81365j45835j56913m0890O4691
14749h10678Q5928L95340L89915p046l35019l5661Q1390j82166L63664K31892
14739A77559m3898r9723J84742J61533m74598l55703j42677j63409P7004J53797
$$ y = [-257231, -722986, -798925, -660241, -186591, 322155, -119539, -583532, -736905, -628656, -891879, -944132, -617542, -442077, -343458, -115543, -49336, -122401, -146282, -156969, 148217, 193437, 159494, 87111, -57404, -102615, -178341, -497191, -859572, -1003420, -815831, -745723, -972175, -659594, 79573, 187443, 95648, 93468, -288516, -941125, -1448655, -1416350, -1104967, -745007, -160064, 349837, 311249, 242142, 101086, 92504, -51332, -277380, -166982, -157347, 43842, -100964, -350366, -531731, -677566, -834479, -875369, -810678, -724750, -329410, 60505, 53459, -281560, -317221, -235831, -417997, -54333, 177559, 133661, 33938, 218680, 380213, -94385, -450088, -592765, -756174, -679170, -525373]
14729e25373K7375J23535M8438j6406R4702K52990J26509k2308P576M26201L22341
14718H65580l09298p16794l90140k38617j15390L51203N16439M30739k9464j76249
14708A88009m3753J69058K44507l11759m56397l07457j66580K26534J03499j00290
14698d54629K0038J21830m94079n38453k26904J75263J65931K4556J47144L52806
14688g06497K08617J54612j15868j49314M56575K21972r042j6257j37715j05966
14678a98883j02665Q8269J58755J34661K83235Q4570j27391r912k41369k29411
14668a60141m5720j30707r2652k36298j5650M7537j02866n422J46782J94940L6525
14657c63672L28176L61279J49538K1544o4481Q5897K80176k38931q01869o44888
$$ y = [-525373, -497998, -374463, -326025, -342431, -247729, 5261, 131770, 109462, 117038, 543239, 865580, 556282, -160512, -550652, -789269, -904659, -553456, -37017, 393722, 364258, 188009, 144256, 313314, 557821, 246062, -210335, -517792, -684372, -457838, -354339, -454629, -434591, -312761, -806840, -1345293, -1572197, -1396934, -1231003, -1206447, -1059303, -706497, -497880, -343268, -459136, -608450, -151875, 70097, 61055, 44798, -92917, -198883, -301548, -213279, -54524, 80137, 363372, 447942, 320551, 310639, 69270, -160141, -205861, -336568, -429220, -665518, -681168, -633631, -736497, -741919, -595137, -400197, -363672, -35496, 325783, 475321, 496865, 432384, 518281, 798457, 559526, -242343, -887231]
14647h87231K42892K85412k522n4716L95915M07085L11826N99630J53446k02704
14637A249033n84399j62001L55032J5476j86662j29054l55556j95503j04034P020
14627i0648j35336J26105K08636J63125K11133k62006m52177k22711m5199M4914
14617d54164L3065J96493M24985N5472j2414J638n24058m63839N91319Q30124
14607F78621M20050L1139j54708m07368k37625j72039k13268Q1694L53481K95401
14597F75378j37729l15360k51572J39938K80282L42127L15291j20402l90341l06792
14587B30820m8328J22281r4131J01192K22160j5548q8757r5343k57056j36290
14577e9000P8531j5129l26995M817n616j3632j16950j39018K4904n5853o1319
$$ y = [-887231, -644339, -358927, -361449, -416165, -20250, 386835, 698661, 1298291, 1451737, 1249033, 664634, 502633, 857665, 873141, 686479, 557425, 201869, 6366, -97668, -90648, -225984, -99879, 108757, 271882, 483015, 221009, -231168, -453879, -499078, -454164, -421099, -224606, 200379, 255851, 243437, 245075, -278983, -742822, -151503, 678621, 1098671, 1129810, 975102, 567734, 330109, 158070, -55198, 26496, 379977, 675378, 537649, 222289, -29283, 110655, 390937, 733064, 1048355, 927953, 537612, 230820, 182492, 304773, 210642, 311834, 533994, 518446, 429689, 334346, 77290, -59000, 19531, 4402, -322593, -317776, -323392, -337024, -453974, -592992, -568088, -623941, -685260]
14566f85260L04893M1638n622K83727L27080L5140J329L8082J08268L36585L74376
14555A160236k40215n65101m04438n9574N41952J71508n11121m1464K3J33317
14545A85123K19840j82508k44164l04421m8277N7169j81112J65735M36850O51659
14535G55894L73157P0988k97432o14145l80774k94054j40123J37500J57643L3705
14525a97641M8682J12779J74209K51965N2075Q8064n08456p63749k11053o5315
14515a018440M45763O40495J83547j09228n74725q06775p4880L65142L95881L22044
14505b31176K9568k28301L9680j20550q5569J11246P56889J024529L25633k43047
14495A378902m53790m66638l22371o10253n39062l93990R9462M55623P47734M24119
$$ y = [-685260, -380367, -338729, -344351, -60624, 266456, 301596, 302925, 341007, 449275, 785860, 1160236, 920021, 354920, -49518, -109092, 432860, 604368, 93247, 51783, 51806, 185123, 404963, 222455, -21709, -326130, -374407, -317238, -498350, -332615, 104235, 755894, 1129051, 1200039, 902607, 288462, -92312, -386366, -526489, -388989, -231346, -197641, -148959, -36180, 138029, 389994, 442069, 530133, 21677, -742072, -953125, -1018440, -572677, 67818, 251365, 142137, -432588, -1239363, -1314243, -949101, -553220, -231176, -201608, -429909, -390229, -510779, -596348, -485102, 271787, 1296316, 1621949, 1378902, 925112, 458474, 136103, -474150, -1013212, -1407202, -1307740, -852117, -104383, 319736]
14485C19736K37636J30149m13654l32726K7054o8290m86378k46187J56393r76
14475f77243K58217M26660k35264m65973k07111K27336O40305J04470k35152j44483
14465c08238l9708K32279j02051k16144j69891l26785J918o2643J52322m3097
14455h82038K034K31657Q8430j60968L4079K14647j09772K76135L81842j89115
14445a13069n62425j30928R5464J948n6337J54333J98185J41602M40616M36922
14435F06311j52834o28652k43432j16385m9767J33569K11167J04227m4817K13999
14425C3386K32855r3335k93756j18850l18742l76144j88273r641M27995K73660
14415d30845j88637l1610j0960l71043k16671J41556K03074K8778k69235j49349
$$ y = [319736, 557372, 687521, 273867, -58859, -31805, -100095, -586473, -832660, -676267, -677243, -419026, 7634, -227630, -693603, -900714, -673378, -33073, 71397, -163755, -308238, -347946, -115667, -217718, -433862, -603753, -930538, -928620, -991263, -838941, -882038, -880004, -648347, -559917, -720885, -686806, -472159, -581931, -305796, 76046, -113069, -675494, -806422, -710958, -709010, -765347, -611014, -412829, -271227, 169389, 606311, 453477, -175175, -418607, -534992, -584759, -451190, -240023, -135796, -180613, 33386, 266241, 172906, -120850, -239700, -558442, -934586, -1122859, -1132500, -704505, -430845, -619482, -651092, -662052, -1033095, -1249766, -1108210, -905136, -876358, -1145593, -1294942]
14405a294942J91681J45773M3521J98736J33862q3993J86303J06852n6393o6922
14395d95522j41666J49885L3602K29810L14202l48005l13886j29956n13474J856
14385a213154M13751M6257L33344n0939j74557l43077m24325r6488N8807J63167
14375a287214J18787M02387K56674K58033J55349L4120J00262j4334k18027p7316
14365b71279K38440q2035O0852L3741m696l75429l20100k23069j28630j4433L87759
14354f98879K66183j71676J14750N7944O63588L98648j40725O3054J52571k59519
14344D45939l37833j4771L6709Q2892m944l13766k77890o5202k72673j13561j50685
14333i85785J465J14795J86576K20791O5802M3230J75755L55138J01954K55199
$$ y = [-1294942, -1103261, -957488, -913967, -715231, -581369, -665362, -479059, -372207, -428600, -495522, -637188, -487303, -453701, -223891, 90311, -257694, -571580, -701536, -1215010, -1213154, -799403, -753146, -419802, -470741, -645298, -988375, -1412700, -1509188, -1450381, -1287214, -1168427, -766040, -509366, -251333, -95984, -61864, 38398, 24064, -193963, -271279, -32839, -114874, -54022, -20281, -24977, -400406, -720506, -943575, -1072205, -1086638, -698879, -432696, -604372, -489622, -431678, 231910, 630558, 489833, 552887, 705458, 445939, 108106, 93335, 130044, 212936, 207992, -105774, -383664, -448866, -721539, -835100, -985785, -984320, -869525, -682949, -462158, -396356, -353126, -177371, 177767, 279721, 534920]
14323E34920M62546K59974R9624l66457o61974m13727k8610K0163m89864n8942
14313f42347O12480M14543j70436j64723M82426M48843k23938n37303q86198n71832
14303a238485P5859L82456O28100M51565J32576K3835P3359Q8077J1214j80989
14293D47567k90526Q0031P4071j6390l55978l13515p4197L63274M02841K087k90713
14282B8552R3750K17514k65387j54268J74520j60168j90950j51382M5255M44259
14272H1695K28730j62655k61405J06904J06261K9663J44244L50157k66341o30831
14262b73578r0695o7449m1735q3094J17526J59611J77058j56312m85457j38072
14252h82197J49984J5017M22783P22026J23662m34838m56899o2395K40733r1140
$$ y = [534920, 997466, 1257440, 1357064, 990607, 328633, -85094, -113704, -93541, -583405, -642347, -29867, 384676, 214240, 49517, 531943, 980786, 756848, 219545, -666653, -1238485, -1162626, -780170, -152070, 299495, 432071, 455906, 529265, 617342, 628556, 447567, 157041, 237072, 311143, 294753, -61225, -374740, -448937, -85663, 317178, 319265, 28552, 122302, 339816, 74429, -79839, 94681, -65487, -256437, -407819, -362564, 81695, 310425, 147770, -113635, -6731, 99530, 129193, 273437, 623594, 357253, -273578, -364273, -431722, -473457, -556551, -439025, -279414, -102356, -258668, -744125, -882197, -732213, -717196, -294413, 427613, 551275, 116437, -340462, -402857, -162124, -253264]
14242b53264p1172J52530L24101J71863N47443L32417K62834M6142p49821m88360
14232B74713J62182L79562j16558o52502m92450r3394L9115J17183J75809L7824
14222a68516j75676L69067L60757P6261j97099j26516K9624N9893k15426j78856
14212a66487K96495J24614k77661k11792j30843R0144J26155J37550M0924P223
14202C6322L29218K25454k11377o87320m24872K20233L58686L91126K74438K01397
14192G13305k047m60870p46535m32527l16826k22936Q9653Q0911M9969K94330
14182i53573K34859P9768j26776L74553K28899k59649l5614K86128J65821K73641
14172B68057J89195j18308k93991J46013L02140M306j07555j42166k00758k07346
$$ y = [-253264, -324436, -171906, 152195, 324058, 871501, 1203918, 1466752, 1512894, 763073, 274713, 436895, 816457, 699899, 47397, -445053, -538447, -499332, -382149, -206340, -168516, -344192, 24875, 385632, 461893, 264794, 138278, 167902, 227795, 12369, -166487, 130008, 254622, -23039, -234831, -365674, -275530, -149375, -11825, 29099, 36322, 365540, 590994, 379617, -307703, -732575, -512342, -153656, 237470, 511908, 713305, 711258, 250388, -496147, -928674, -1245500, -1468436, -1378783, -1297872, -1247903, -953573, -718714, -638946, -765722, -391169, -162270, -421919, -457533, -171405, -5584, 268057, 457252, 338944, 44953, 190966, 493106, 497412, 389857, 247691, 46933, -160413]
14162a60413l03366o63462N1589M15020j13337m20220l388L13478M41399J284
14152d41416k43694j09734Q5456J88994l3488k1740K1033j87003j86920K23924
14142g04588M87284J79381k50787j12805J94714J64054n339k3133k62041j40070
14132d73330O4572K32505K65587O4885k47922m70101J9822K18522j4247J82103
14122a57604M11757J96241Q4204J17142k35270k95224j05918J40830M31605m36450
14112A51313m09682m0299K85847J43321l85104n45358j5946N41978M60789J78887
14102C65746p4125K0761l01355o78607k66102k43570r2431L93606M64084K73783
14092a38210J96677j78159j27780J78578L44456L30234q9361l45378p5330N3187
$$ y = [-160413, -463779, -1127241, -1075652, -660632, -773969, -1194189, -1197577, -884099, -442700, -441416, -685110, -794844, -709388, -520394, -553882, -575622, -554589, -741592, -928512, -704588, -217304, -37923, -288710, -401515, -206801, -42747, -48086, -71219, -333260, -473330, -408758, -176253, 89334, 154219, -93703, -563804, -543982, -325460, -339707, -157604, 254153, 450394, 534598, 651740, 416470, 121246, 15328, 156158, 587763, 151313, -258369, -298668, -12821, 130500, -254604, -799962, -815908, -273930, 186859, 365746, 291621, 312382, 11027, -667580, -933682, -1177252, -1269683, -876077, -411993, -138210, 58467, -119692, -247472, -68894, 275562, 605796, 516435, 171057, 95727, 148914]
14082A48914j05754l12095k41011k20862n2658L31204L68491K38113J02004M7709
14072C04055j80820k20494k52532M2538k18925j52644Q3130K43538J78723L29797
14062A56366L39752J24774o5117j68951k17677k56947j36349o8613J04231j61354
14052c49885l6685L42083K27665L12660K38678K3314j50915m7755K9685K89439
14042H78284K22773O9960n2541j06724m82279m98347l0002J68427j72134j98534
14032b01117l13925j02244J91930K14904J01466o7941R7547K57088L04351J15206
14022E97265l6678p0047j30054r2850j57574k6487k2992j70547J49722J86934
14012B26692J08647r8475p6859o0097k83372r6352K44006K5052j834J65915K00557
$$ y = [148914, 43160, -268935, -509946, -730808, -783466, -452262, -83771, 154342, 256346, 304055, 123235, -97259, -349791, -307253, -526178, -678822, -595692, -352154, -173431, 156366, 496118, 620892, 555775, 386824, 169147, -87800, -224149, -292762, -188531, -349885, -386570, -44487, 183178, 495838, 734516, 757830, 606915, 559160, 588845, 878284, 1101057, 1171017, 1118476, 1011752, 529473, 31126, 1124, 169551, -2583, -201117, -515042, -617286, -425356, -210452, -108986, -176927, -79380, 177708, 482059, 597265, 560587, 490540, 360486, 267636, 110062, 83575, 60583, -109964, 39758, 226692, 335339, 236864, 160005, 99908, -183464, -279816, -35810, -10758, -12592, 153323, 353880]
14001C53880K50261j86926j63963j31371n62099n86097J73490L81397J81545J99046
13991i0837O5723j64671m51651J90575R45863N51462k64896n93135j84715k02520
13981a98802j18555R145K64307J50666J2819K71649K04935k19363l36424k41621
13971b01244k87815k21395K3631K46135Q3245L16462P0482k21196k00115K08310
13961a83500L81028k4975Q9854m5496k97345j30133k1274K56379J42168J55551
13951C22257P2252l23658o44704q46657k47962M06105M57234r755m86604j21236
13941a422728K25191j91987j27618N26371L21182K30209K68883L76891Q7606l15484
13931b1484j80646J14624K80054K99804j64601k02473J50678J3546l72869n50618
$$ y = [353880, 604141, 417215, 253252, 121881, -440218, -1026315, -852825, -471428, -289883, -90837, -25114, -189785, -641436, -450861, 495002, 1046464, 781568, 188433, 3718, -198802, -317357, -308212, -43905, 106761, 119580, 391229, 596164, 376801, 40377, -201244, -489059, -710454, -686823, -440688, -357443, -40981, 29501, -191695, -391810, -183500, 197528, 172553, 262407, 216911, -80434, -210567, -231841, 24538, 166706, 322257, 394509, 70851, -573853, -1420510, -1668472, -1262367, -805133, -814888, -1301492, -1422728, -1197537, -1389524, -1517142, -990771, -669589, -439380, -170497, 206394, 294000, -21484, -202130, -87506, 192548, 492352, 327751, 125278, 275956, 289502, -83367, -633985]
13921f33985j26580M68529J79277j97678M9614J22715k64235j57295J62116K92205
13911a05317J6054k29899j51481m9172m68942j49509p384P6422L76720N02990
13901a89518q8080m36253m1244L8741K61274M5342k06094p4756m01531m11853
13891a503972J01838M60916K94815n0525l68471k18645K99663K65596K17725M64443
13881c6617K30831L19342j63899l55226M84552M99392J28667m66271q02470n13371
13871f75070q0527n1890j1071J5011J01614k72624k61816l42916J1045O33498
13861i34746N09403L59145O0396o70209o37450J83716O97935N28714O27064M44763
13851A168731J33570k16042n56255k91657p0183R3948m373j8403n8886n0946J0356
$$ y = [-633985, -760565, -292036, -112759, -310437, -260823, -138108, -402343, -559638, -397522, -105317, -89263, -319162, -470643, -519815, -988757, -1138266, -1145650, -1069228, -692508, -189518, -277598, -713851, -755095, -716354, -455080, -409738, -615832, -690588, -1092119, -1503972, -1402134, -941218, -646403, -696928, -1065399, -1284044, -984381, -718785, -501060, -36617, 194214, 513556, 349657, -5569, 478983, 978375, 1107042, 640771, -161699, -675070, -755597, -807487, -818558, -803547, -701933, -974557, -1236373, -1579289, -1568244, -934746, -425343, -66198, -5802, -676011, -1313461, -1129745, -431810, 96904, 723968, 1168731, 1302301, 1086259, 530004, 238347, 168164, 262112, 257739, 239336, 180450, 129504, 139860]
13840A39860j08805J50846n2590l99406K8274L30438J59869n0669m11417m47115
13830f60715r8972Q7601R1657K64293K58148L5148m000j85572j19919l6770l59623
13819g28724k80619K12668K18589N7932R8962N8645k23535m32629Q6216L06387
13809f26108K45458J12776m4549K58643K67068m56822n75376k3113K86953L24841
13799b30229K06189p7312k54196l7120q1918j14203K35209L74800k02389k72941
13789d54110L33383M32220J37340K15464J70355k558o2752J21123J46098k32657
13779H03906l3933j27956j17541J47123k38569j87233q544l79004q31517l5823
13769a009091K25636m0321j05187j64494J09035M29545L77997J61559J68484J05940
$$ y = [139860, 31055, 181901, 129311, -270095, -241821, 88617, 248486, 197817, -213600, -660715, -759687, -672086, -580429, -316136, -57988, -22840, -26840, -212412, -332331, -369101, -728724, -1009343, -796675, -578086, -520154, -421192, -362547, -586082, -1018711, -932495, -626108, -380650, -267874, -312423, -53780, 213288, -243534, -818910, -842023, -555070, -230229, -24040, -101352, -355548, -392668, -474586, -588789, -353580, 21220, -181169, -454110, -120727, 311493, 448833, 664297, 834652, 832094, 769342, 890465, 1036563, 803906, 769973, 642017, 524476, 671599, 433030, 245797, 237253, -141751, -973268, -1009091, -783455, -823776, -928963, -1093457, -984422, -554877, -176880, -15321, 153163, 259103]
13759B59103j74034n93746m36993j76135R9632J95614N4136j40899k91193O9107
13749a135408K47438J35793J85796L82447K21529m6660j29936l24576l37781J78205
13739f23153L41171J5262k25424k25195j58910l14504P8057k78752k54950J9923
13729a626475K81469N25268k47371k39581K53739J40137J73986M24232L27132
13720A2536P4024J92944K23260j90107j21696J64227n2100j6635Q3093K11829
13710E81375O9644J2257J73603K9698M1873q3598m85118j55434j26520r0173n1631
13699h4024k25570k32137P0691J96377k51409n98451j33168K33825O9547N13658
13689d40661L85210k79369j94822j79173P2798K97122P6269n0782K9860K38515
$$ y = [259103, 85069, -508677, -945670, -1121805, -1022173, -826559, -772423, -913322, -1204515, -1135408, -887970, -752177, -566381, -183934, 37595, -9065, -139001, -463577, -801358, -623153, -281982, -266720, -492144, -717339, -876249, -1190753, -1112696, -1391448, -1646398, -1626475, -1345006, -819738, -1067109, -1306690, -1052951, -912814, -738828, -314596, 12536, 86560, 279504, 502764, 312657, 190961, 355188, 303088, 286453, 369546, 581375, 651019, 663276, 836879, 866577, 908450, 824852, 339734, 184300, 57780, -32393, -84024, -309594, -541731, -471040, -274663, -526072, -1124523, -1257691, -1023866, -954319, -440661, -55451, -334820, -529642, -708815, -636017, -338895, -262626, -313408, -283548, -45033]
13679d5033L35297K18194j65253k24677p3863J68615n43425k97245K19422J17304
13669b90664R5500k69033k96132o1712J04462n498k4938K912q8869l0630J66164
13658f98438r6347J42269N62249L64107J57646q0388j77770L36408N84301l48268
13648G45769l55523k42752k37340M88961L05865k62219J8353K13347K67078K72625
13638A214164j18273l50312m06273L1978L0650k47083q2603k66998k05729K4249
13628c76230J25331O47083O76171J78984j82605k46239m73131l24282J34331k06086
13618d6673l03980J33958N44021L25331o4011k19331l06273k70322j76752l32747
13608g16779j15236L39469O68163M59577N9213j48920l69229l26180J19781K83092
$$ y = [-45033, 290264, 508458, 343205, 118528, 44665, 213280, -330145, -627390, -407968, -290664, -195164, -464197, -760329, -822041, -717579, -723077, -748015, -745103, -833972, -864602, -698438, -794785, -652516, -90267, 273840, 431486, 351098, 173328, 509736, 1094037, 745769, 390246, 147494, -89846, 399115, 704980, 442761, 461114, 674461, 941539, 1214164, 1095891, 745579, 339306, 371284, 401934, 154851, 72248, -194750, -400479, -376230, -250899, 396184, 1072355, 1251339, 1068734, 822495, 349364, 25082, 159413, -46673, -350653, -216695, 327326, 652657, 588646, 369315, 63042, -207280, -384032, -716779, -832015, -492546, 175617, 635194, 694407, 545487, 176258, -149922, -30141, 252951]
13598B52951N6746J20154K49805j3407j37616K0047J27968n9762l45924k71584
13588f22j15512L62169N90171L30627k48603m52261k29919K2748K75467J94978
13578G29243j84685l78423p2334q3611k56506O2247L13274J40365M865J46624
13568D21059j05930m11688l22968L10343Q36201M51832m06364n62180l13325o9546
13558a72566J82186M93376K94979k16851l24910o4274q8916K2038M86445N7103
13548F68610k05994J41720P1035j80197k75857L3644N3140k27731J07181k66961
13538h1410l59497L10008Q33306N47236m05519n38002n14640l07258L67637J15181
13528c2958m6265j8000q9109K71686K82380J73583J36064j19319K0999K32649
$$ y = [252951, 309697, 429851, 679656, 666249, 528633, 548680, 676648, 616886, 270962, -622, -116134, 246035, 836206, 1166833, 918230, 465969, 236050, 258798, 534265, 729243, 544558, 166135, 93801, 10190, -246316, -184069, 129205, 269570, 274435, 421059, 315129, -96559, -419527, -109184, 727017, 1178849, 772485, 210305, -103020, -172566, 9620, 502996, 797975, 581124, 256214, 191940, 103024, 125062, 611507, 668610, 462616, 604336, 675371, 495174, 219317, 252961, 306101, 78370, 185551, -81410, -440907, -130899, 702407, 1249643, 844124, 306122, -208518, -515776, -148139, -32958, -79223, -97223, -186332, 85354, 367734, 541317, 677381, 558062, 579061, 811710]
13518H11710J23469r5031k50677m84310o87066m39343K94173O57137L440k87653
13508c54151L345K52001K63272K41383k6178k9792j0876k03564o4744k24996l94959
13497e49259R219M80077N32562L09251Q0314n92492n72348K63181L39j15670L0085
13486a24741l4446p0619J46404J28645l04223l23132K51265N55390l593J93568
13476D14518J96143J39426j4798J15410j23884m82193m42142l41846k56138J64636
13466f30868M23519L29469K60537J60676K03579j59764l51793k46509J46596J5216
13456A50658l29408j82107j76955k74249j79877J394j9547J92437M40730K0669
13446c56255q7738k6746K34896J54527K99526L45861j2570j08473m07743l33863
$$ y = [811710, 935179, 840148, 589471, 105161, -581905, -1021248, -727075, -69938, -66498, -354151, -350806, -98805, 164467, 405850, 379672, 349880, 339004, 135440, 70696, -154300, -549259, -540040, -59963, 472599, 781850, 862164, 269672, -302676, -39495, -39156, -154826, -124741, -159187, -229806, -83402, 45243, -258980, -582112, -330847, 224543, 220950, 414518, 610661, 750087, 735289, 850699, 726815, 244622, -197520, -539366, -795504, -630868, -207349, 122120, 382657, 543333, 746912, 587148, 235355, -11154, 135442, 150658, -178750, -360857, -537812, -812061, -991938, -990544, -1010091, -817654, -376924, -356255, -443993, -470739, -235843, -81316, 218210, 564071, 551501, 443028, 35285, -298578]
13436b98578r6154M7305P5891n2061O7374J33144M7424k21731m71095k24577J92294
13425h00764j81965J8859M21317K86140J2466l24016k236R309Q1753Q9936L15189
13414g4012m5156n78444o6807L92557M75458l1321l88305o6197M34773L80465
13404D33011P9696k11927j91533M11075Q992J3927K01145j37425L1720K12841
13394H51522j32956j61276j27780p49065n76490J41528M24715L2634j16691j68330
13384e82189J60701M15423M950k45229p5428j17774r7059k84470l75032j06297
13374a302404K58132M55243K55195k93366M8273N46621J72455l18093j64270n8705
13364d00919J73507N43232K14515l65190p28431k46251N6980J98662K21317K69511
$$ y = [-298578, -394732, -347427, -271536, -323597, -256223, -123079, -75655, -297386, -768481, -993058, -800764, -982729, -963870, -542553, -256413, -243947, -567963, -570199, -560890, -479137, -389201, -74012, -119168, -697612, -764419, -371862, 103596, 72275, -316030, -382227, 52546, 433011, 512707, 300780, 109247, 520322, 529314, 543241, 744386, 606961, 638681, 851522, 718566, 557290, 429510, -319555, -896045, -754517, -329802, -297168, -413859, -582189, -421488, -6065, -1115, -246344, -321772, -439546, -536605, -821075, -1196107, -1302404, -1044272, -589029, -333834, -627200, -578927, -32306, 140149, -177944, -342214, -400919, -227412, 315820, 530335, 165145, -563286, -809537, -752557, -553895, -332578, -63067]
13354f3067L46878L20075J33301j2227k98897k12969o1491j46041J70851K05799
13344C82212o4904j91974J55744N34071M10799K07927l31733o13764l41563K44857
13334C91672N22747Q7925m81107n55998p8505R5998K71635r1225n24065k13669
13324e74592J83958J50703j68638m27024M6658N65375K07255J26331M11300J69621
13314F90947n4J10069j8595m78074n40883l65170k19942k7295K75074N13405L85172
13303C24654k77634l56171j397j62077R5526N71408M74176K17179K61906J16844
13293A264414m87603m62683r2068m55340o11614j64452M34371N72326M47838K54848
13283G00037j45987J88057K25159k29926l5457J81182j67651m45637M4550K26710
$$ y = [-63067, 283811, 603886, 737187, 724960, 426063, 213094, 151603, 5562, 176413, 382212, 317308, 125334, 281078, 815149, 1225948, 1433875, 1102142, 488378, 146815, 391672, 914419, 1002344, 521237, -34761, -113266, -17268, 254367, 163142, -360923, -574592, -390634, -239931, -408569, -835593, -788935, -223560, -16305, 110026, 521326, 690947, 690893, 800962, 782367, 304293, -236590, -601760, -821702, -848997, -573923, -60518, 324654, 47020, -309151, -310548, -472625, -377099, 194309, 668485, 885664, 1147570, 1264414, 776811, 314128, 222060, -233280, -844894, -1009346, -574975, -2649, 445189, 700037, 554050, 742107, 967266, 737340, 701883, 883065, 715414, 269777, 314327, 541037]
13273E41037j16641l89919j23425L76136N41297M26129N53704J9951l43823l16339
13263A168107l80227k15732o854J8070l7336p4723J63971J91495j39331k55971
13253D31469l18012k11188K14187K58404J21683q3489l47764J5938N97939J74553
13243H53720j91574j46937k1674M03735N78839M27689Q4123n2386k81585m93300
13233A160650m52055l190O09536M73074o069j54113n27482n18175l60648L7250
13223B58778L25735K23816j38023m03022k53026K71391L3071j01955j10142l3077
13213G3546K33667M26556M03955j17341m35072k28494k09355p44996j69547M70701
13203b96380K09435J61412L95026N22567j27010j59655O3614R5267L427K04717
$$ y = [541037, 424396, 34477, -88948, 287188, 828485, 1254614, 1808318, 1828269, 1484446, 1168107, 787880, 572148, 565294, 583364, 546028, 471305, 635276, 826771, 687440, 431469, 113457, -97731, 116456, 374860, 496543, 413054, 65290, 81228, 679167, 853720, 662146, 515209, 493535, 897270, 1476109, 1903798, 1987921, 1935535, 1653950, 1160650, 708595, 705405, 1314941, 1788015, 1781946, 1627833, 1100351, 582176, 221528, 258778, 584513, 808329, 670306, 267284, 14258, 285649, 318720, 216765, 106623, 73546, 307213, 733769, 1137724, 1020383, 585311, 356817, 147462, -597534, -767081, -296380, -86945, 74467, 469493, 992060, 865050, 705395, 769009, 864276, 867703, 1072420]
13193A072420J61880l36528m46644o67072l03891J43310M28796M56466N2964K33591
13183G95292P62048K36971l34800k44481l0478j09706l95514m23216j46721L61226
13173D70621K41443J70999L19887j8963j99231j89047J2980K83233K27027r555
13163A309394l15887j61016J48016j18403k5442L47461j36079k28823j28683j98578
13153D91960k68523l87364J73585O93123M21597J20196L20564K71181J83079J04331
13143B123729m0369J53844j197K4265L9237m66361m20099k47887j01220J1413
13133A075355J16171L27088J47323q9836r1521m64274k3548K91322L66913L49886
13123B004879K07809J06312l24976n22092k373J88876J10743K77723j26860j53864
$$ y = [1072420, 1234300, 897772, 451128, -215944, -519835, -376525, 52271, 508737, 561701, 795292, 1557340, 1794311, 1459511, 1215030, 1184552, 1074846, 679332, 256116, 109395, 470621, 712064, 883063, 1202950, 1183987, 984756, 795709, 808689, 1091922, 1318949, 1309394, 993507, 832491, 980507, 862104, 836662, 1184123, 1048044, 819221, 690538, 491960, 223437, -163927, 9658, 702781, 1124378, 1244574, 1565138, 1836319, 2019398, 2123729, 2083360, 2237204, 2236007, 2260272, 2299509, 1833148, 1413049, 1165162, 1063942, 1075355, 1191526, 1518614, 1665937, 1576101, 1484580, 1020306, 996758, 1288080, 1654993, 2004879, 2212688, 2319000, 1994024, 1471932, 1469559, 1658435, 1769178, 2046901, 1920041, 1766177]
13113A766177J78637L4117M76581O70424m0022m04103m29421n33839Q1047O675
13103A806273K24754K98368J43159r1452r8926O7079k20960j59261j61267k04879
13093A602888O8516J28571j66519Q7199L43482o5925n2914J28291L9501J04613
13083B217703J64784L72722m6133j18359m2263p5816L20262K42186P9200J63478
13073C277764J58867j50917k82807k02755J84237P5851j69302K76406L26631J54862
13063C648837j70893k1501k81963n42314K54264O43048N49755M37019M48731M8111
13053E013094r7342K68899O15900K31969l59313j583K96288K60794L75856N54732
13043G159294M04988K10877k05510l96274j29745L95838O86004O35248M55047
$$ y = [1766177, 1944814, 1978931, 2455512, 3125936, 3085914, 2681811, 2252390, 1718551, 1799598, 1806273, 2031027, 2329395, 2472554, 2381102, 2282176, 2349255, 2128295, 1969034, 1807767, 1602888, 1671404, 1799975, 1633456, 1720655, 2064137, 1998212, 1945298, 2073589, 2113090, 2217703, 2382487, 2755209, 2709076, 2590717, 2548454, 2472638, 2792900, 3035086, 3114286, 3277764, 3436631, 3285714, 3002907, 2800152, 2984389, 3060240, 2890938, 3167344, 3493975, 3648837, 3477944, 3456443, 3174480, 2632166, 2886430, 3529478, 4079233, 4516252, 4964983, 5013094, 4915752, 5184651, 5800551, 6032520, 5673207, 5671624, 5967912, 6228706, 6604562, 7159294, 7564282, 7775159, 7569649, 7173375, 7043630, 7439468, 8125472, 8760720, 9215767]
13034I215767N34008P38675R53879J396340J555361J853768K778536L608068L402270
13025B6036672J625912j328156l137321k928321k304896j930269j923913j487184
13017A2622524o18452n30248o60919j11373J67151L73479O6703k26973o6143J10012
13007A1125761N6782M27266P18139N33888K79551Q58606J037969O52051O82304
12998A6372317Q93361J031567J234174J770970J995583K224324K734204L284910
12990C1541410M380995N123292N770516P202243Q847279J0499878J2943940J6174209
12982A02483762J9797140K5082629L3016356M3904758N7450864P2010541P8728183
12975D32474233N9158633M737010n3163489p8841662p5219833o0607930m5761658
$$ y = [9215767, 9749775, 10488450, 11442329, 12838669, 14394030, 16247798, 19026334, 22634402, 26036672, 27662584, 26334428, 23197107, 20268786, 17963890, 16033621, 14109708, 12622524, 12004072, 11473824, 10812905, 10701532, 10868683, 11242162, 11308865, 11081892, 11015749, 11125761, 11182543, 11609809, 12327948, 12861836, 13141387, 13999993, 15037962, 15690013, 16372317, 17265678, 18297245, 19531419, 21302389, 23297972, 25522296, 28256500, 31541410, 35922405, 41045697, 46816213, 54018456, 62865735, 73365613, 86309553, 102483762, 122280902, 147363531, 180379887, 224284645, 281735509, 353746050, 432474233, 491632866, 496369876, 443206387, 364364725, 289144892, 228536962, 182775304]
12968A82775304l4238672k6110525k0106254j5493774j2308389j0302620q391582
12961E5823488o864278n840622m565402l478807l149852k788802k508442k478870
12953B4148413j745357j146667j456648j178159r27950p33436n72100p13013j013538
12944A4661545j104610p98692o52041m64874o14085l41187r6727m28219j55066
12935A0006044L86685J6879m4094M07130Q13706L05045L05736N38755L25825L73792
12925A3435503O06674M28801M23753N27171O57110J099185J604596K228696K761290
12916B3772779K516833J077783m54231j283306j312754l80059L00574O24586J344662
12907B6206867J926137K043812K402238K956100L643098M541156N682248P495075
$$ y = [182775304, 148536632, 122426107, 102319853, 86826079, 74517690, 64215070, 55823488, 48959210, 43118588, 38553186, 35074379, 31924527, 29135725, 26627283, 24148413, 22403056, 21256389, 19799741, 18621582, 17693632, 16960196, 16388096, 15675083, 14661545, 13556935, 12758243, 12106202, 11641328, 11027243, 10686056, 10589329, 10161110, 10006044, 10392729, 10409608, 10365514, 10772644, 11586350, 11891395, 12197131, 12735886, 13061711, 13435503, 14042177, 14470978, 14894731, 15421902, 16079012, 17178197, 18782793, 21011489, 23772779, 26289612, 27367395, 26913164, 25629858, 24317104, 23937045, 24237619, 24862205, 26206867, 28133004, 30176816, 32579054, 35535154, 39178252, 43719408, 49401656, 56896731]
12899E6896731R279925J0843915J3299413J6545133K0900548K6893913L5475638
12892A90135216M7194903O2294819P7765169Q1215524N1472903j1796850o7133311
12885D31148373q3585688p3830923n7229782m2616738l2178792k4456852j8783322
12878I8466276j4296904j1294578r523619p555349n812440m611932l467943k703213
12870C9200298j978795q52155j07589J128711K817260M775779K051817n941950
12862D1093376p683058n357976l785154k746988k127121j434385j194963j098503
12854A5665228j358148j248739p29414l27433j03889k48617l2997j76105k93373
12845A1146513k1891P4271K84838M25454J78439j0355J73333L33361L07089p9091
$$ y = [56896731, 66176656, 77020571, 90319984, 106865117, 127765665, 154659578, 190135216, 237330119, 299624938, 377390107, 458605631, 510078534, 498281684, 431148373, 347562685, 273731762, 216501980, 173885242, 141706450, 117249598, 98466276, 84169372, 72874794, 63351175, 55795826, 49983386, 45371454, 41903511, 39200298, 37221503, 36369348, 36261759, 37390470, 40207730, 44983509, 47035326, 41093376, 33410318, 28052342, 24267188, 21520200, 19393079, 17958694, 16763731, 15665228, 14307080, 13058341, 12328927, 12001494, 11897605, 11648988, 11615991, 11439886, 11146513, 11124622, 11198893, 11483731, 11909185, 12087624, 12077269, 12250602, 12583963, 12891052, 12811961]
12835A2811961R3596K26305K42660K46213P5655J46856L87037O38522L78672N12368
12825A5759845J368258J693302J598825J379078J395991K212435K876983K944539
12817C1229256L256017M077498N060310O333842P749662R594717J1728389J4128796
12809I3158487J7363172K2517346K9055589L7757954N0148254O4955373P7490371
12802C92446546P3413579L4774525k7077477p1007016p9653478o8258613n2860105
12795B01777961l9993556l0105864k3082774j8009070j4186743j1019899q913928
12788E6466127p702744o318986m764689l927115l416912l357535k705983k451702
12780B1820461k110861j735944j804468j657642j048493j080509r53016m22143
$$ y = [12811961, 12905557, 13131862, 13374522, 13620735, 13696390, 13843246, 14230283, 14868805, 15247477, 15759845, 17128103, 18821405, 20420230, 21799308, 23195299, 25407734, 28284717, 31229256, 34485273, 38562771, 43623081, 49956923, 57706585, 67301302, 79029691, 93158487, 110521659, 133039005, 162094594, 199852548, 250000802, 314956175, 392446546, 465860125, 500634650, 473557173, 402550157, 322896679, 254638066, 201777961, 161784405, 131678541, 108595767, 90586697, 76399954, 65380055, 56466127, 48763383, 42444397, 37679708, 33752593, 30335681, 26978146, 24272163, 21820461, 19709600, 17973656, 16169188, 14511546, 13463053, 12382544, 11429528, 11007385]
12772A1007385p40891j165810q74382m26745m34350l33184L629N58773K6553o88165
12762F932813p02431m98222l81384k07996n0713j19954L889J15187j83078n33183
12752D374928n44039l04622k15442J02488K92349J92305l51477l58368j84064
12743C004058k80361j13317N26649J31952o89804l17129Q8326j40402j80902q6442
12733A942628K56881K83727l28806k10276K7250n7288J14462o9402l69529l52406
12723A237241k10917j73897k44850r927L02848k8089P4102r3453n61945k24264
12713F6849J8707K68357K06879j37358K38147K69198R9403J22421L4758p5008
12703A112353k35142o5413L68628N52262k3456o29562o64315r4171K47430j63867
$$ y = [11007385, 10266494, 9100684, 8226302, 7799557, 7365207, 7032023, 7035652, 7594425, 7620978, 6932813, 6230382, 5732160, 5350776, 5142780, 5092067, 4972113, 4976002, 5091189, 4908111, 4374928, 3830889, 3526267, 3310825, 3413313, 3705662, 3897967, 3546490, 3188122, 3004058, 2723697, 2610380, 3137029, 3268981, 2579177, 2262048, 2350374, 2209972, 2029070, 1942628, 2199509, 2483236, 2154430, 1944154, 1971404, 1914116, 2028578, 1959176, 1589647, 1237241, 1026324, 852427, 607577, 597650, 900498, 872409, 946511, 853058, 291113, 66849, 85556, 353913, 560792, 423434, 661581, 930779, 1030182, 1152603, 1187361, 1112353, 877211, 811798, 1180426, 1732688, 1709232, 1079670, 415355, 321184, 568614, 404747]
12693D04747k3371L00858K05743M2628l52580l62384L1732l98l05699Q7080K27963
12682B56319P09j0645N13554L06429j5535Q4117j55816j67791m25213k70035j70632
12671e4539k61662j04829N8793M78266J73217q9807O58980Q00345m455j71163
12661A483146j90708n71164k22052N38843P42514L17413K07653L90329M04686
12652C100660K48426k64217n64520J32405N69153J46288L9771N91040R28558J023191
12642E950755J175158J392077J606503K452311K999801L349600L316300J652983
12634B3895488j629869l979809l860406l083846k703807j770736j184629o84710
12626D997676j78917l77564l72372j14472L8662m20234p89001n00419k75055k60057
$$ y = [404747, 381376, 682234, 887977, 930605, 578025, 215641, 247373, 246975, -58724, 28356, 256319, 257028, 246383, 759937, 1066366, 1050831, 1134948, 979132, 811341, 386128, 116093, -54539, -316201, -421030, -362237, 116029, 289246, 199439, 858419, 1658764, 1654309, 1483146, 1292438, 721274, 499222, 1038065, 1780579, 2097992, 2305645, 2695974, 3100660, 3349086, 3084869, 2520349, 2652754, 3221907, 3368195, 3407966, 3999006, 4927564, 5950755, 7125913, 8517990, 10124493, 12576804, 15576605, 18926205, 22242505, 23895488, 22265619, 18285810, 14425404, 11341558, 8637751, 6867015, 5682386, 4997676, 4818759, 4441195, 4068823, 3954351, 3993013, 3572779, 2783778, 2283359, 2008304, 1748247]
12616A748247k71093l60073l58500J94922M27063J00536J68598K74651J56336
12607B080687j10170l75300k98698l77942j84539o1542O1925J74272j47472j58088
12597F03133j62152J20444L6578q3010J2556L49931L60420O0694j55368k79365
12587H63861k41143k4843O149k42499l26606l15320k50766J11379K03663K16213
12577H8j32473j31640r973k00731m1223M5961J50199O1499K76957K03932p4612
12566A47984k46957l42439l52807J51784M93779R31j66035k75270P7481K28293
12556b83256l94787k66730L551K64797Q7540m1041N5590j02730R3289K41507J94686
12545a47584M6798j6365J37900j84999k98345o0375n7858P6919j3594k50939k10851
$$ y = [1748247, 1477154, 1117081, 758581, 953503, 1380566, 1481102, 1649700, 1924351, 2080687, 1970517, 1595217, 1296519, 918577, 734038, 672496, 734421, 908693, 761221, 603133, 440981, 561425, 598003, 514993, 527549, 877480, 1237900, 1298594, 1143226, 863861, 622718, 597875, 604024, 361525, 34919, -280401, -531167, -419788, -216125, 88, -132385, -264025, -273998, -474729, -515952, -469991, -319792, -258293, 18664, 222596, 147984, -98973, -441412, -794219, -642435, -148656, -147725, -313760, -589030, -511549, -283256, -678043, -944773, -941222, -676425, -588885, -629926, -574336, -677066, -583777, -342270, -147584, -100786, -117151, 20749, -164250, -462595, -522970, -580828, -503909, -517503, -768442, -979293]
12534i79293K20678J23421j43667K88822J08113J0682L56243K65901k06387l66536
12524c22023j08013J12680k28556l4279J99038K0722j13681j16745J39358J70821
12514b80678J5978l27098k28711L03562N57393L18978L38848K98612m5968n6342
12504H94574k30715m24531j78475j71543l94806m41809P3407K38950O38242M37886
12494D41180j77077j45615l89926l05630K5949m9742r7128j07658l5674J42723
12484f98598l1430P9352R7717L66126N9378j23886K38162L43246K65628o4608
12474E31087L9119K53497K8706k21653j63799k02759m8099j36655n4357M28483
12464D53570J67046n74401l08377j03303J13124K9126N4999J05398q6767L52464
$$ y = [-979293, -758615, -635194, -778861, -490039, -381926, -371244, -15001, 250900, 44513, -322023, -430036, -317356, -545912, -580191, -381153, -360431, -474112, -590857, -451499, -280678, -264700, -591798, -820509, -516947, 40446, 359424, 698272, 996884, 950916, 894574, 663859, 239328, 60853, -110690, -505496, -947305, -873898, -634948, 3294, 441180, 264103, 118488, -271438, -577068, -551119, -600861, -697989, -805647, -841321, -698598, -730028, -650676, -552959, -186833, -127455, -251341, -13179, 330067, 595695, 531087, 570206, 823703, 852409, 630756, 466957, 264198, 216099, 79444, 25087, 453570, 620616, 46215, -262162, -365465, -252341, -223215, -168216, -62818, -149585, 202879]
12454B02879L32070L09761L07829J16351k84751m76868j22239K9421j80078l90305
12444a55930k74525j11999L00221L87359j5585k07299n8602j01943j65464P5576
12434c28191J75773L23246L63422R5039o66582o80016M7017M44533J51251l3211
12424a07719j17209O6463M97720L46544J26096k73285n35846k40265l27180k03799
12414g68480l6230l27499j8596R7773K893L13391N36032J74175J65149K0156r1369
12403F7395K89555P5847k758J12597n5042Q1203R1986m20873m70998r042K13742
12392b6388J35993j15702L7135L01399K4630j80082j99095o2j4438n20514j36653
12381f93777L55605J85917K8903O0871M21666L17164J05592M43578M4371l12735
$$ y = [202879, 534949, 844710, 1152539, 1268890, 984139, 507271, 385032, 414453, 234375, -155930, -430455, -542454, -242233, 145126, 129541, -77758, -136360, -238303, -403767, -328191, -152418, 170828, 534250, 629289, -37293, -717309, -670292, -225759, -74508, -107719, -224928, -158465, 339255, 685799, 811895, 538610, 2764, -237501, -564681, -768480, -804710, -1132209, -1150805, -1053032, -1050139, -736748, -200716, -26541, 138608, 158764, 67395, 356950, 432797, 430039, 542636, 487594, 568797, 660783, 239910, -231088, -240130, -26388, 109605, -6097, 31038, 332437, 357067, 176985, -22110, -22172, -36610, -557124, -693777, -338172, -152255, -123352, -62481, 359185, 676349, 781941, 1225519, 1269890, 957155]
12371I57155k05204J16132J91191k51929o23095m30832k55848K44273K33805j54791
12361a79143O7810K280M3808k4571J29278k110l05980j41643j93914r3715j68685
12350h66585j84288M87319L45446M7808j28195L42500N32342l28m24669o4318
12340H7032K46777j23901k84479p5986J93234J86954K23915J06175M5121q4883
12330E19959j44759k73969J85436J47711K8314j1753k36410J05256M9624q9903
12320B79506k73686l05577p4576J62497K00442o0946l47791m79686L1230N99921
12310b68666N2083j43171j50990k1810L16918L3140J22696o9728m8290j79126
12300c56944N3265L75296J22877K92120J06978j90004j80607m24179l74998k48506
$$ y = [957155, 751951, 868083, 1059274, 807345, 184250, -246582, -502430, -258157, -24352, -179143, -111333, -109053, -65245, -89816, 39462, 37352, -268628, -410271, -604185, -697900, -866585, -1050873, -563554, -218108, -170300, -298495, 44005, 576347, 576019, 151350, 87032, 333809, 209908, -74571, -150557, 42677, 229631, 453546, 559721, 604842, 519959, 375200, 101231, 286667, 434378, 462692, 450939, 214529, 319785, 369409, 279506, 5820, -299757, -374333, -211836, -11394, -72340, -420131, -899817, -868587, -268666, -216583, -359754, -510744, -532554, -215636, -182496, -59800, -129528, -177818, -356944, -303679, 71617, 194494, 486614, 593592, 403588, 222981, -201198, -576196, -824702]
12290h24702o9363K85944K23122J88040L81144L70473L2212Q6260M53520K45l10762
12279H16133r0383J50020j76672l13090j56647j61888M0547J15002M65190M39059
12269A127271l48362p03145o00507J44216j44848k12538M1030J29597J97262K12858
12259a57166L63630K17646J34746j62180l01064L7601p5682N923N6954J50424
12249B70832n129m15661n90109N536j9846m09732N3446N14739K20613k76301K31107
12238d20505N43135M13006k81787m81823j56188L37507L14130K47146M98293J29550
12228A142464j64368k83037L5695K52637K44660j78568m84116l5216k0112k3881
12218D86158l59142n42854p84431j69509N30725M1643k85951N6356L34686J91777
$$ y = [-824702, -894065, -608121, -384999, -196959, 184185, 554658, 586870, 673130, 1126650, 1126895, 816133, 725750, 875770, 699098, 386008, 229361, 67473, 108020, 223022, 688212, 1127271, 778909, 75764, -524743, -380527, -525375, -737913, -696883, -567286, -370024, -157166, 206464, 424110, 558856, 396676, 95612, 133213, 57531, 63454, 120408, 270832, 265703, -149958, -740067, -734531, -754377, -1164109, -1110663, -595924, -375311, -651612, -420505, 122630, 535636, 253849, -227974, -384162, -46655, 267475, 514621, 1012914, 1142464, 978096, 695059, 730754, 983391, 1228051, 1049483, 565367, 530151, 510039, 486158, 127016, -415838, -1200269, -1369778, -839053, -797410, -1083361, -1027005, -692319, -500542]
12208e00542n5210K98222j6743m17944k23025j00272n9277K8963j15698l3783
12198a195309J23126L63243K72354J32936m4786l67442j19358L42696n5989K95311
12188b53218J86269J26682J47819J20235J52891k0198k08130k35254N2159j98715
12178a29460k18591L84617K82653j08183R84k43331j33650r6965J09160J56163
12168C397P341j49359l04180j47408R6696m663J55571L80383Q5031j32525l95331
12157d05047n0202P03772O34683o991l61537k38378j42834L24662K92907l43824
12147D07211l36451L3060R0421n1729n19376l27716j65534l2357K81253M27716
12137a93502L12452L35064J48408q7857j14941n08174o66229J5308K24895j26193
$$ y = [-500542, -555752, -257530, -274273, -692217, -915242, -1015514, -1074791, -1045828, -1161526, -1195309, -1072183, -708940, -436586, -303650, -348436, -715878, -835236, -492540, -548529, -253218, -66949, 59733, 207552, 327787, 480678, 460480, 252350, 17096, 69255, -129460, -348051, 36566, 319219, 211036, 212020, -31311, -164961, -261926, -152766, 3397, 10738, -138621, -442801, -590209, -493513, -498176, -342605, 37778, 122809, -9716, -405047, -455249, 248523, 883206, 876215, 514678, 276300, 133466, 458128, 751035, 407211, 70760, 103820, 194241, 142512, -376864, -704580, -870114, -902471, -621218, -193502, 118950, 454014, 602422, 514565, 399624, -108550, -774779, -759471, -534576, -660769]
12127f60769L56607L99046Q1850N4192J14288k42569j45808J01325J1332j10551
12117d1057q6706j73753L31702K14366K8042r5110n02862l1320L80868k06355
12107a82185n084N634j14616J38079L16342K85867J08122j11351R4199j23290
12097D11717K4884L29754l92518o06838K542K92984K58721M1019k72475k02909
12087a13119j54705J18394m0663k35784n6578J45857M25615K91483J31936o1467
12077D50969l457L67501J78478k61454r15738l56277K72965K10685L24442J85850
12067D53964l27299m63792k50358K41327N50954J49363l72179l89237m41889q8868
12057i38014M06362J8313l31038Q3509L79563K16841J27268j51618k32604N7527
$$ y = [-660769, -304162, 94884, 176734, 230926, 345214, 102645, -43163, 58162, 69494, -41057, -127763, -301516, 30186, 244552, 272594, 177484, -325378, -356698, 24170, -182185, -187269, -181635, -296251, -158172, 158170, 444037, 552159, 440808, 535007, 411717, 436601, 766355, 373837, -233001, -230459, 62525, 321246, 362265, 89790, -113119, -267824, -149430, -190093, -425877, -482455, -336598, 89017, 380500, 512436, 450969, 447512, 815013, 993491, 732037, -183701, -539978, -267013, -56328, 268114, 453964, 126665, -337127, -587485, -346158, 204796, 354159, -18020, -407257, -849146, -938014, -531652, -513339, -844377, -760868, -381305, -164464, -37196, -188814, -421418, -363891]
12047c63891k23997j37451K70250N42812N88629M3799j22739R9089o8019j91002
12037D37480Q1894J55427K30019K89821P6172l32170n69644k14011K36910M25652
12027H17550K38057P3364l05469k71132J775q4529l99904m06648n37136k62512
12017a136584l9965O10031Q49607L21072k32603k91098j46697j12092J64311J02810
12007H8792j4700L3637j35125j38677o321J64316J82450J5129K74004R9014k25138
11996C37381k81863J18358L15041O3191j81000O3920K51995O1585k23170l38110
11986A87328K20819K52400p1578K137j4342l00595n53071k05411K75871L33643
11976A27201J01659l9261K6395L39019K07673j57542J77493N7069k63342n18806
$$ y = [-363891, -587888, -725339, -455089, 87723, 676352, 720151, 597412, 696501, 628482, 437480, 519374, 674801, 904820, 1194641, 1270813, 938643, 368999, 154988, 391898, 817550, 1055607, 1128971, 823502, 552370, 554145, 469616, 69712, -336936, -874072, -1136584, -1176549, -566518, 283089, 604161, 371558, 80460, -66237, -178329, -14018, 88792, 74092, 107729, -27396, -166073, -172394, -8078, 174372, 189501, 463505, 562519, 337381, 55518, 173876, 488917, 552108, 371108, 435028, 687023, 748608, 525438, 187328, 408147, 660547, 588969, 591106, 576764, 276169, -276902, -482313, -206442, 127201, 228860, 189599, 215994, 555013, 762686, 605144, 782637, 839706, 576364, 57558]
11966E7558n69606l15174K01154N83349K29272K7024k7434M03286M98525j89901
11956H98053k30927p2853l31198n44645N1272J55031J12807J29968j353K89218
11946D55373l619n99506m7443K58431L67537Q61675O47310K85121J14794J70128
11936B509801M39185O92890O61494O34262R23437J429274J652437J547482J741048
11927A2231310K360754K477394R14656q24817j519042j763240k498391k379280
11919H999344j219702r83348j140122j269094n91859m94886r28270p69883k40043
11910A362137l73608l58037r13N4750J32900j51485l52882j00920L74572L62961
11900I49475L07970J84167n550l95582m30895k33805M13262N55322R4225l73286
$$ y = [57558, -512048, -827222, -626068, -42719, 186553, 213577, 186143, 589429, 1087954, 898053, 667126, 594273, 263075, -281570, -230298, -75267, 37540, 167508, 166155, 455373, 451754, -147752, -195195, 63236, 430773, 1292448, 1939758, 2224879, 2339673, 2509801, 2948986, 3641876, 4303370, 4937632, 5861069, 7290343, 8942780, 10490262, 12231310, 14592064, 17069458, 17984114, 17159297, 15640255, 13877015, 11378624, 8999344, 7779642, 6796294, 5656172, 4387078, 3795219, 3300333, 2372063, 1602180, 1362137, 988529, 630492, 629579, 684329, 817229, 665744, 312862, 211942, 586514, 949475, 1257445, 1441612, 1436062, 1040480, 609585, 375780, 789042, 1344364, 1438589, 1065303]
11890A065303n07114o4144J31793O5749K45688K67687N0494K20001J42808k02264
11880A416001l10815l87486j70833m113r412L20335M81728J57156j79822k10637
11870A102102r4093j98187m43722l02859r8513J73673j56606k14871J00792J77929
11860D5645l8570m4447J05314k083k42761j8002q867L738M15605K80631k04793
11849B91410K1822Q9124K27695N7442n4730K19626J57035j07570j19558J3075
11839G95371l10445n47226k88486K4317J54711R9937K6726J69220L17720L13148
11829G54993P1138O8050m0236j69632p30511n82949P4366J85297L98358L33865
11819C62739N2217K51760m7216l09557k49803O4000J21781o3274j29294l59975
$$ y = [1065303, 558189, 494045, 625838, 691587, 937275, 1204962, 1255456, 1475457, 1618265, 1416001, 1105186, 717700, 546867, 542754, 533342, 853677, 1335405, 1492561, 1312739, 1102102, 1008009, 809822, 366100, 63241, -35272, 138401, -18205, -233076, -132284, 45645, 7075, -37372, 67942, 65859, -176902, -194904, -203771, -200033, 215572, 496203, 291410, 313232, 402356, 630051, 687493, 632763, 852389, 1009424, 901854, 782296, 795371, 484926, -62300, -350786, -326469, -171758, -71821, -45095, 124125, 441845, 754993, 826131, 894181, 853945, 684313, -46198, -629147, -554781, -369484, 28874, 362739, 414956, 666716, 619500, 309943, 60140, 124140, 245921, 182647, 53353, -306622]
11809c06622j68830K24842P8539j14072j08503j34802J15641j9557K94061K37661
11799I8358J09544k21176P4448M22375K37420j09185l46693j44691l28796l53536
11789e61932k37662j45957J43359q2823J3803L78779L89353K04346J57568Q8775
11779C47609l08235O0405R4571l32706k02877K63013J69898L26662J39879K80061
11769H38280J98599m48777m9155L43562l61228m67528J82955M19975P35056J15919
11759A507658m93950Q7469j76243m64524j10700P1366k6284l68233l38076l04119
11749f15636j43469m5649J39824K51617K49456J92550k50253k04760l3574l7498
11739d97392n7289o8316K35064J85975O8840k89174n48385j81712P9603j4222
$$ y = [-306622, -475452, -250610, -172071, -286143, -394646, -529448, -413807, -433364, -139303, 98358, 207902, -13274, 61174, 483549, 720969, 611784, 265091, 120400, -208396, -561932, -799594, -945551, -802192, -885015, -871212, -492433, -103080, 101266, 258834, 347609, 39374, 99779, 194350, -138356, -341233, -78220, 91678, 418340, 558219, 838280, 1036879, 588102, 538947, 882509, 521281, 53753, 236708, 656683, 1391739, 1507658, 1013708, 1101177, 924934, 460410, 349710, 421076, 394792, 26559, -311517, -615636, -759105, -804754, -664930, -413313, -163857, 28693, -221560, -426320, -459894, -497392, -554681, -622997, -387933, -201958, -133118, -422292, -970677, -1152389, -1072786, -1087008]
11729a087008K0400K11859L44914L18829M11033K39665n88317m19531l03971r2514
11719i44641J76628j37574k63532J49233M03744o3004J20194J89011j1397L21803
11709e9535K58286q0234K43524L72294M38916N63720o6707n58890q43568o15606
11699c47800k54282R1885R2872j16749p5391J51284L6058m2582k15936l02316
11689i82957P805O13299M36224n8594L40625K55250k99196n4349j14708j49273
11679e874K19982M41449M95352k80419n81017k58071o9246j18738l0998O2972
11669a24608Q9813j18340j41053K95539L76644K12106q3619l9853K98724K88654
11659A054007Q7797k21583j5050J65300l9937m51508k43279J26254L68617M09933
$$ y = [-1087008, -1066608, -854749, -509835, -191006, 220027, 459692, -128625, -548156, -852127, -944641, -768013, -905587, -1169119, -1019886, -616142, -679146, -558952, -369941, -381338, -59535, 198751, 118517, 362041, 734335, 1173251, 1736971, 1670264, 1111374, 267806, -347800, -602082, -510197, -417325, -534074, -609465, -458181, -422123, -464705, -680641, -982957, -975152, -361853, 74371, 15777, 356402, 611652, 312456, 258107, 143399, -5874, 214108, 655557, 1150909, 870490, 289473, 31402, -37844, -156582, -187580, -124608, -34795, -153135, -294188, 1351, 377995, 590101, 506482, 466629, 765353, 1054007, 1141804, 920221, 905171, 1070471, 1030534, 579026, 335747, 462001, 830618, 1240551]
11649A240551q0456p6203k05536n37483q48379o37397L74784Q02107M99967J07996
11639F39951j62480j18423J86390j07016K155K77309N05816M41663k99699m17750
11629I47916n5389L35502N30493M3049P3656j43238m71095p93009m54821K50374
11619B63438L7930K1528L54386L62053l73430n66357k47881j41924L74015Q8761
11609A72519r413O19266O39056j14073n62713l61248j44302L93510K57100k3033
11599H66669l78603l28603j25703K21388j17757o4164L68203j65652k78243k54724
11589b57189j3279K69974M28831L12862r6899n62048j97304J01379j7213J31992
11579A01106N6465l13518j00129J48036M41148M01085J61659P8667n1633k39992
$$ y = [1240551, 1160095, 1083892, 878356, 340873, -507506, -1144903, -770119, 31988, 531955, 639951, 477471, 359048, 545438, 438422, 440577, 717886, 1223702, 1665365, 1365666, 947916, 892527, 1228029, 1758522, 1801571, 1875227, 1731989, 1260894, 467885, 13064, 263438, 301368, 322896, 677282, 1039335, 665905, 99548, -148333, -290257, 83758, 172519, 163106, 782372, 1421428, 1307355, 744642, 383394, 239092, 632602, 889702, 866669, 488066, 159463, 33760, 255148, 137391, 73227, 441430, 275778, -2465, -257189, -270468, -494, 428337, 741199, 644300, 82252, -115052, -13673, -30886, 101106, 157571, -155947, -256076, -108040, 333108, 734193, 895852, 974519, 922886, 682894]
11569F82894L4339O58427M00365K59574p33K59818N96514K63316l579q9837L09679
11558C370777K33837l73159P6865R70332J204510J030310M65221J026389K160470
11549A0165552K585979K609170K277508O09278r79638k382544k824956k544303
11541I516046j590388j410108j418189q77015l09967N454M7013K14595k71397
11532C906044m27538n13967P6876m9365n24271k14802k83829l69838l39740l34074
11522I25496L1600K22119l1291k8251m6547j18411l21665j39622J71210J96159
11512H60797j44655R006P30779M54780o6188K84231J23129j35741j56087L0818
11502A990869K53104K03191K58291K05469J58726O83948R76339N49987M50378
$$ y = [682894, 717233, 1375660, 1776025, 2035599, 2034866, 2294684, 2891198, 3154514, 3150935, 3061098, 3370777, 3604614, 3231455, 3308320, 4278652, 5483162, 6513472, 6978693, 8005082, 10165552, 12751531, 15360701, 17638209, 18247487, 17267849, 14885305, 12060349, 9516046, 7925658, 6515550, 5097361, 4220346, 3910379, 3915833, 3962846, 4177441, 3906044, 3478506, 2964539, 3041415, 2992050, 2467779, 2252977, 1969148, 1599310, 1259570, 925496, 957096, 1179215, 1147924, 1119673, 1073126, 954715, 633050, 493428, 664638, 860797, 716142, 725148, 1455927, 1910707, 1844519, 2128750, 2251879, 2116138, 1960051, 1990869, 2243973, 2447164, 2705455, 2910924, 3069650, 3753598, 4729937, 5279924, 5730302]
11493E730302O72966J280944J476494K049095K644273K633764K254920R97040
11485A9739798r50039k290811k674560k373314k235552j804003j313998p43973
11477E353548m78586m31948n31352r33715q43666n9186K92191m02017n80496l04299
11467A080474j95283K11615O78958O25491L39906N9243l2216L6948l81848m79331
11457A943957j79843J10033k6139k21714l72483k39345k3627j4104o4446J3306
11447I25595L5430p6898j48217M84430K74533J66478p2495j98777k55869l79387
11437G54823k31985m35811l77202j14891k5044Q4131l26051k82459j41705o8906
11427a165100L73469O65055K71882K61663L18902k70860k24033j50331k39764
$$ y = [5730302, 6403268, 7684212, 9160706, 11209801, 13854074, 16487838, 18742758, 19739798, 18789759, 16498948, 13824388, 11451074, 9215522, 7411519, 6097521, 5353548, 4874962, 4443014, 3911662, 2977947, 2134281, 2075095, 2367286, 1965269, 1384773, 1080474, 885191, 1096806, 1775764, 2401255, 2741161, 2800404, 2768188, 2805136, 2423288, 1943957, 1764114, 1874147, 1848008, 1626294, 1253811, 1014466, 990839, 976735, 912289, 925595, 961025, 884127, 735910, 1220340, 1494873, 1661351, 1588856, 1390079, 1134210, 754823, 522838, 87027, -290175, -405066, -430110, -345979, -672030, -954489, -1096194, -1165100, -791631, -126576, 145306, 406969, 725871, 455011, 230978, 80647, -159117]
11418a59117j39648R7088K68446m0863j74975K16146L58103j22252Q853L80681
11408F92462K43921K82953M3961K4086K0471k7889m5220l60210j50540m2145k94388
11397C87462q4488J85594J23683K47881n6344k43689J08565m41K5381P6699p3025
11386F97278M29969K4246j74140k68135m32674j81016J50309j01671k72645q5404
11376b13883j77100j45734P6399M49246J21263L3590M91529L80416L2502k7243
11366A020985L94475J084060J474552J572695K067092L909826M231810K71902
11358A6027397l930763l850701k277433j662968r69398k13936m27750q40895p49353
11349A104200m17344m98020n00371j48273K36359k2424j69526K06303L99463K9909
$$ y = [-159117, -298765, -201677, 66769, 25906, -149069, 67077, 425180, 302928, 311781, 692462, 936383, 1219336, 1263297, 1287383, 1307854, 1279965, 1234745, 874535, 723995, 681850, 387462, 302974, 488568, 612251, 860132, 803788, 560099, 668664, 668223, 693604, 770303, 697278, 1127247, 1151493, 977353, 709218, 276544, 95528, 245837, 144166, -128479, -213883, -390983, -536717, -460318, -11072, 110191, 143781, 635310, 1015726, 1048228, 1020985, 1415460, 2499520, 3974072, 5546767, 7613859, 11523685, 15755495, 16027397, 12096634, 8245933, 5968500, 4305532, 3336134, 3122198, 2694448, 1853553, 1104200, 686856, 188836, -311535, -459808, -223449, -245873, -415399, -209096, 190367, 220276]
11339B20276J03201K07511m0683J84M2524J18674M73692J54674l33538m5061K31215
11328A132669J99403L8617r6005j6569Q7159R9091p0711o9751j62425j71728r817
11317I59933r6772k27452l25320k7303L93740j62741l28371j95033k40339m0805
11307b90463L56248P9332j3324J86913J42056L2085M3918o88071o14435j26218
11297h91959m8955J39817m1511k55277q5938N8500j55683K12386P38456M38982
11287A08818m8444J61401J99680Q4374j87024l46783p7203l4475k6533o8637j62075
11276c96901K94536L06309K98425M54903K05800k04918l29973K44370L36118k43279
11266I65390n14252l4260m62679o32508l35857L75943M71768J4147p9975p8341
$$ y = [220276, 323477, 530988, 490305, 490489, 533013, 651687, 1125379, 1280053, 946515, 901454, 1132669, 1332072, 1370689, 1274684, 1258115, 1345274, 1444365, 1373654, 1303903, 1141478, 969750, 959933, 863161, 635709, 310389, 283086, 676826, 514085, 185714, -9319, -249658, -290463, 65785, 145117, 131793, 318706, 460762, 492847, 536765, -151306, -765741, -891959, -940914, -801097, -842608, -1097885, -1183823, -1125323, -1281006, -1068620, -330164, 108818, 60374, 221775, 421455, 505829, 318805, -27978, -105181, -139656, -166189, -234826, -396901, -102365, 203944, 502369, 957272, 1163072, 958154, 628181, 872551, 1208669, 965390, 451138, 416878, -45801, -678309, -1014166, -638223, -166455, -152308, -232283, -310624]
11256c10624J60414K50320P627j35221k30539m50107l95104p2305J35304K56582
11246g83653J51136J98722L00392K30549k8758l0191J70274l89064k98022J12300
11236c66315l54260l29883J98744L39331M37534Q6814k49441k59198k12058J37252
11226e71480J75090j38996K8124M01879M86186K20156j45280l15175k28538j28076
11216b16110O9706J08657K0851Q2570J452j52469j36567J28736O39863K80375
11206H27064P2997l2155k93422k34380k41835k11906J2540J24890O4265j24509
11196c6451n15953n19151J27849K70901K42155N0268K64834K99123j17658j2443
11186E3474o5467P8673K28387L33745J96409k35040k85644k30121m73886m60041
$$ y = [-310624, -150210, 100110, 107737, -27484, -258023, -708130, -1103234, -1175539, -1040235, -783653, -632517, -433795, -133403, 97146, 68388, 38197, 208471, -180593, -478615, -366315, -720575, -1050458, -851714, -512383, -74849, 11965, -237476, -496674, -708732, -571480, -396390, -535386, -507262, -105383, 380803, 600959, 455679, 140504, -88034, -216110, -146404, -37747, -16896, 65674, 67126, -85343, -221910, -93174, 546689, 827064, 900061, 867906, 574484, 340104, 98269, -113637, -101097, 23793, 88058, -36451, -552404, -1071555, -943706, -672805, -430650, -380382, -115548, 183575, 65917, 53474, -11993, 66680, 295067, 628812, 825221, 590181, 304537, 74416, -399470, -859511]
11176h59511K22899M67733J76195k11085l7456K38895l45313l96438J7079N6380
11166f70622O6005j0970M6364K53974j02810j57024k33096k91172K42701M31744
11156d24906M41956J47990m7090j39383Q6979k94895m37256K24161J65632j27586
11146d04398j5473K920J49374L15820J25230j23748k37827L39361M85691Q0304
11136G17254N4215l18800m20996r4500q8042q9224K4289K42531k18949j86505
11126c78727J71018j45822m34154J742K94396k72812j80362N4765o808K05432
11116f91332L65572K69771j59697L2089J83994k52586l49241j97817k11431j02247
11106a112925K52808M64106J63677k75039m58680k09477N79694K71167k6416j04804
$$ y = [-859511, -636612, -168879, 7316, -203769, -241225, -2330, -347643, -744081, -727002, -670622, -604617, -615587, -569223, -315249, -418059, -575083, -808179, -1099351, -856650, -424906, 17050, 165040, 117950, -21433, 65546, -229349, -666605, -442444, -276812, -404398, -419871, -416951, -267577, 48243, 173473, 49725, -188102, 151259, 636950, 717254, 771469, 452669, 31673, -62827, -150869, -240093, -215804, 26727, -192222, -378727, -207709, -353531, -787685, -785943, -491547, -764359, -944721, -889956, -896764, -691332, -325760, -55989, -215686, -183597, 397, -252189, -601430, -799247, -1010678, -1112925, -860117, -396011, -232334, -507373, -966053, -1175530, -595836, -324669, -351085, -455889]
11096d55889l02030K66365L47688L62780M74031J88824k87094j95762k00700j90228
11086G985p4089k24928K0633k03504r37220l35219M22505N21592O15948L08996
11076A22699K48197K01619O9373k12977j73406K31615j16615m1029K05268M7j26120
11065D08671l89354k50415k26992k96478J49038L32831R1862k9632J45203K1620
11055d3646q7060J0906j1100K15004K8269o38666l68174n1942m94107K85974Q27431
11044c27111N98504O6967m95385n06805k94710m83784r7637O91462O43493P6271
11034a28735M19213N82488j88459m04088j33343k4377j51683j07922M9157N8869
11024b8880L4911j54615q1318O6690J27861j40579j7062N5850r8023n9731M5891
$$ y = [-455889, -757919, -491554, -143866, 218914, 692945, 881769, 594675, 398913, 198213, 7985, -66104, -291032, -270399, -473903, -1411123, -1746342, -1323837, -802245, -186297, 122699, 370896, 572515, 641888, 428911, 255505, 487120, 370505, 329476, 534744, 534791, 408671, 19317, -231098, -458090, -754568, -605530, -272699, -180837, -210469, -65266, -43646, -130706, -119800, -130900, 84104, 112373, -526293, -894467, -946409, -1440516, -1154542, -327111, 271393, 338360, -157025, -663830, -958540, -1442324, -1539961, -848499, -205006, -128735, 290478, 872966, 684507, 280419, 147076, 122699, -28984, -136906, -87749, -28880, 6031, -148584, -229902, -163212, -35351, -175930, -192992, -137142, -235165, -294896, -249005]
11013b49005L81997J40544J0730j17817j05577k56255k70026k80242k55841J7993
11003i83499L27641M18214K76551n1537k97995k49954j15926k7914K68662N3311
10993c82446J40577J06752N9068p3261P4170J69966j5616R9705k90671k40878
10983c52634J73254J76521J23311J85516l27755m86060l18339L87195N15565j8169
10973E8405j69941r4190p3057J3019Q4299j6470j2594L65633L50445J49769K06721
10962H62039p9056l15460k26027j10734Q6430l8244j51167k60690j22484O5745
10952b89648l442N0849R7682j92671k79436m8613j86829k39432l5116J8272J11327
10941i97057J99650l8592k7501K73204K86471Q5930Q9121n9738k52849o9629k36946
$$ y = [-249005, 132992, 273536, 284266, 166449, 60872, -195383, -465409, -745651, -1001492, -983499, -655858, -237644, 38907, -12630, -310625, -560579, -676505, -704419, -435757, -382446, -241869, -135117, -76049, -149310, -75140, 94826, 79210, 178915, -111756, -352634, -179380, -2859, 120452, 305968, -21787, -507847, -826186, -438991, 76574, 58405, -111536, -205726, -278783, -265764, -181465, -197935, -210529, 155104, 505549, 655318, 862039, 782983, 467523, 241496, 130762, 217192, 178948, 27781, -232909, -355393, -289648, -293090, -242241, -144559, -337230, -616666, -665279, -852108, -1091540, -1126656, -1108384, -997057, -797407, -835999, -863500, -590296, -303825, -217895, -128774, -188512, -441361, -510990, -747936]
10930g47936l58669k79426o7349j11927L01251O36448J89215J20333J58126K91532
10920A31598Q716k17787k93454n43822k07416l00653j49164L3089p1186P5484
10910a534595K74159L16472K74323J83225J0184r6359k36525m90936j90322K20083
10900a270291n5684k97744m5518L92822J82173p3950m9025L90626L25854K14126
10890b86611k29987m55899j50116M06907N44237M21594L80581O8781j19836m89179
10880I0472l17191q1763n1279j62074n6199j8424q6384L49477O15568K30447j32947
10869C79703k83919j5935M95778l8242m23860l22415l01278P5667J92432J53007
10859h9062M0728k7176J15367J95896M98825M7721k95691m1860l88701o41637
$$ y = [-747936, -1106605, -1386031, -1453380, -1565307, -1264056, -627608, -438393, -318060, -159934, 131598, 140314, -77473, -370927, -914749, -1122165, -1422818, -1571982, -1538893, -1610079, -1534595, -1260436, -943964, -669641, -486416, -476232, -572591, -809116, -1300052, -1490374, -1270291, -1325975, -1623719, -1669237, -1276415, -1094242, -1168192, -1217217, -826591, -500737, -286611, -516598, -972497, -1122613, -715706, -171469, 250125, 630706, 699487, 579651, 90472, -226719, -308482, -359761, -521835, -578034, -596458, -682842, -333365, 282203, 512650, 379703, 95784, 79849, 575627, 537385, 113525, -208890, -510168, -434501, -242069, -89062, -48334, -75510, 39857, 235753, 734578, 782299, 486608, 444748, 56047, -585590]
10849e85590j84666R397N5112n3226K9714M20667L13635j20547k34248n9180l4997
10838d43929K12948J34562J0089K32032M2359j41772l7862j92186j18281k84127
10828e86167o3901K47642K60119P05589O27691K28256k22483o03868j041972q75374
10818a324468M405M95345K75974k41516m1246J96285M794j93558k14336m4881
10808a083202K6074j84976m93733l16495M9480L72141N59950O33317L00621K61581
10798A24758J58111j9366n64517m78120o2663R4641M21637M52453L92151l7370
10788D81715l29901l28751k49409j9682K04984r3224O3173k37094l43466j22787
10778i74442L241L93696O77066M73641r0557n89744m79557k91131K39384N63227
$$ y = [-585590, -770256, -760859, -705747, -758973, -729259, -308592, 5043, -115504, -349752, -408932, -443929, -230981, -96419, -86330, 145702, 188061, 46289, 8427, -183759, -302040, -586167, -650068, -402426, -142307, 563282, 1190973, 1419229, 1196746, 592878, -449094, -1324468, -1320063, -824718, -548744, -790260, -831506, -635221, -630427, -823985, -1038321, -1083202, -1057128, -1242104, -1735837, -2052332, -2002852, -1630711, -1070761, -437444, -136823, 124758, 282869, 263503, -301014, -779134, -841797, -747156, -325519, 126934, 519085, 481715, 151814, -176937, -426346, -446028, -241044, -334268, -271095, -508189, -851655, -974442, -971201, -577505, 99561, 573202, 482645, -107099, -586656, -877787, -638403, -75176]
10768g5176J14901j06190o65K20851R3367J91085J86563K07284j48744Q4682j48529
10757F19429l34064j5078K30210q7441M2505J43050k92046j55345J99342J62267
10747E12829j29377k04548L25178K15687l80314k52185J42606J08956l1098k48943
10737E8791l20078j64739K75054n9446k64850K82314J01948O346L45998j48818
10727A12520j83572L06270L11891j46919l89763l60651l89288l477j08088K35404
10717f15673K76980K37042K87994M5516j43896M6563K57825j94022m19052K00615
10707b0108o9093l54146R3544J49398J48252L66525l7318K69645o687o81778o16892
10696g58658j19768J53205K04501J13070J27954J21596L15198J78483j98174k52305
$$ y = [-75176, 39725, -66465, -67130, 153721, 247088, 438173, 624736, 832020, 683276, 767958, 619429, 285365, 270287, 500497, 413056, 455561, 598611, 306565, 151220, 350562, 512829, 383452, 178904, 504082, 719769, 339455, 87270, 229876, 338832, 307734, 58791, -261287, -426026, -150972, -210418, -475268, -192954, -91006, -84660, 261338, 112520, -71052, 235218, 547109, 400190, 10427, -350224, -739512, -742989, -851077, -615673, -338693, -101651, 186343, 231859, 87963, 134526, 392351, 198329, -220723, -20108, -89201, -443347, -349803, -200405, -52153, 314372, 277054, 546699, 540012, -141766, -758658, -878426, -725221, -520720, -407650, -279696, -158100, 157098, 335581, 137407, -114898]
10686a14898o0387K52056K66814r2180j26522L0677r0153R0491K6151l62734k41219
10675d21904j36530n8372K65025K69336J53684K02878J21006l62267l32429j03137
10665d02710r170J32462N71330L75261m6489p5278J70797L00265j3502P2068n28055
10654E46979q55804n2355M98027L15366K50347n0167j45524j86157l89696j34955
10644b03939j33130j24444k83155j4046L20061J67324M5973j13162M4414K06651
10634h7453j4664L17046J87063n9724j54814j034j00481l50000j01609J85451
10624a80219J58313K94405R1703m05569j04592J75797j87396o79887l22520J67378
10614i92587M89751M83008L82445O6094l5683m8306m62900m78025J42486M20139
$$ y = [-114898, -175285, 76771, 343585, 251405, 124883, 155560, 65407, 155898, 182049, -180685, -421904, -558434, -616806, -351781, -82445, 71239, 274117, 395123, 32856, -299573, -402710, -411880, -279418, 291912, 667173, 620684, 545406, 716203, 1016468, 1002966, 1075034, 546979, -308825, -361180, 136847, 452213, 702560, 652393, 506869, 320712, -68984, -203939, -337069, -461513, -744668, -758714, -438653, -271329, -225356, -338518, -294104, -87453, -102117, 214929, 401992, 342268, 187454, 186420, 85939, -264061, -365670, -180219, -21906, 272499, 364202, -41367, -145959, 29838, -157558, -837445, -1159965, -992587, -502836, -19828, 362617, 428711, 393028, 344722, -118178, -596203, -453717, -33578]
10604c3578m5535K0315R4614O8367k58384n51032j25009J54513K56k81590m96511
10593a453574L14510J011706N98659k55276l35916j68980K3432L38518L14586
10584C87665k90298n80403k938K62376m3046j62624N73700N13152L71087M17874
10574A446545r0922l73595o2732p2283n62286l76105j43712j96211J91186N46305
10564C06190J16124j52868K34634J99052k81202n05249m01181l01474r9210J40364
10554g44820L17325K18554K75882K79121m5353j73172L12875O82849N15136l8366
10544A600031n36230j2690j08665n95426l70347M56941L79391l16482k85251j70025
10534D1247k95045L29988K72976k30966o2681O9777J2967M5190K9945k15056k80142
$$ y = [-33578, -79113, -58798, 35816, 104183, -154201, -705233, -830242, -675729, -675473, -957063, -1453574, -1139064, -127358, 471301, 216025, -119891, -288871, -265439, 73079, 387665, 97367, -483036, -485974, -223598, -266644, -429268, 144432, 657584, 1028671, 1446545, 1355623, 982028, 919296, 847013, 284727, -91378, -235090, -431301, -240115, 306190, 422314, 269446, 504080, 703132, 421930, -83319, -484500, -785974, -885184, -744820, -427495, -208941, 66941, 346062, 300709, 127537, 440412, 1123261, 1638397, 1600031, 1063801, 1051111, 942446, 347020, -23327, 433614, 813005, 496523, 211272, 41247, -253798, 76190, 349166, 118200, 55519, 125296, 138263, 183453, 213398, -1658, -281800]
10523b81800o80633o72974J6857K90416N48088O16134J03351m73315l10401J23951
10513g20326R1754N7049K97075M32515J65150q8132k08882k03728j44881j60089
10503d82495k61679j59585M65772O15380J84029M72750K20348l24648m15622k58308
10493E5942l1725q6305n05651k75757P2201L42727K01332l0851K46938K67210
10483B56061o5323j24158j32285l89550j54195J02067J62727J91817K62219K04086
10473C13466J18631j20437l64332k9072K57000J48115N2551j7318l87623j80814
10463b09833l4642N7721p9918l62549j77058O8708K66012M82595q9435l39443
10453d17842Q9746L19422K06101K50240J56013p3746o5387l18278j41785O0141
$$ y = [-281800, -962433, -1635407, -1618550, -1328134, -780046, -163912, -60561, -533876, -844277, -720326, -628572, -571523, -274448, 158067, 323217, 235085, 26203, -177525, -322406, -482495, -744174, -903759, -437987, 177393, 361422, 834172, 1054520, 729872, 314250, 55942, 24217, -62088, -567739, -843496, -771295, -428568, -227236, -258087, -11149, 256061, 190738, 66580, -65705, -455255, -609450, -507383, -344656, -152839, 109380, 313466, 432097, 311660, -52672, -81744, 175256, 323371, 375922, 358604, -29019, -209833, -244475, -186754, -266672, -629221, -806279, -737571, -471559, 11036, -78399, -417842, -328096, -8674, 197427, 447667, 603680, 529934, 464547, 146269, 4484, 64625]
10443F4625k7091K42596M4597j8045m17567o05860k39766J12761N68559K49431
10433b5760l22167j55258J91019k5812o1680k90432l31968J89305K21515J49223
10423d62015k3516K17808P5121M0650P4902l5191k1495j07441l09846m09583J10357
10412h50249J08049M6495j7618J60647M29495O18856K63162j05399j68325p6274
10402D08839o6308L26432L25955k24691p18037k92644K79661L19262J90865k85226
10392B64108k36822j68621l98241j93297K93908M71651L33205L7079K6337J31459
10382E60766j56416o82059k52911o3213j19857J31252K64738K70928M40237j3051
10372C80414n3431L4569l77486j45924j13657k14529J96126L77323J73726l0833
$$ y = [64625, 37534, 280130, 324727, 306682, -110885, -716745, -956511, -843750, -275191, -25760, -347927, -503185, -312166, -337978, -399658, -690090, -1022058, -832753, -611238, -462015, -485531, -267723, -192602, -151952, -77050, -112241, -133736, -241177, -551023, -960606, -850249, -742200, -695705, -713323, -552676, -123181, 495675, 758837, 653438, 485113, 408839, 342531, 668963, 994918, 770227, 52190, -240454, 39207, 358469, 549334, 264108, 27286, -141335, -539576, -732873, -438965, 32686, 365891, 402970, 429307, 560766, 404350, -277709, -530620, -593833, -713690, -582438, -317700, -46772, 393465, 380414, 326983, 361552, -15934, -161858, -275515, -490044, -293918, 83405, 257131, 226298]
10362B26298k51454n26941n47833N4835K42040o8112k22967R8283L11339J72007
10352e12505J77680N0552m0194K8759L01889M80282L15745j12108m57581j09810
10342A22709M6874M97296M80522k20387m63120L998J01761M58872K10173l16328
10332I22370n48242l35086o6395o1321L16153M92508j9353m0520j21515n55107
10322a6508j63490p967q5555j62637L2254m4552k35537l00261Q2201n5652j93206
10311a150910l2952J27616M40056M56026J14137k76868j37272l7829K12321o8619
10301c54294n11355l7767K16900P2828M1204K79041N7551l97107l02379K16463
10291g18915K62485O8593K32394K23716K6650R217j54322m58300o6467J40084
$$ y = [226298, -25156, -552097, -1099930, -1045095, -803055, -871167, -1094134, -995851, -684512, -512505, -334825, -284273, -324467, -295708, 6181, 486463, 802208, 690100, 232519, 122709, 169583, 666879, 1147401, 927014, 463894, 467892, 569653, 1028525, 1238698, 922370, 374128, 39042, -27353, -88674, 227479, 719987, 700634, 660114, 538599, -16508, -179998, -187965, -273520, -436157, -403903, -448455, -683992, -984253, -902052, -957704, -1150910, -1183862, -1056246, -616190, -160164, -46027, -322895, -460167, -497996, -285675, -354294, -865649, -903416, -686516, -613688, -572484, -293443, -235892, -632999, -935378, -718915, -456430, -387837, -155443, 68273, 94923, 104140, -50182, -508482, -574949, -434865]
10281d34865J53361k15559o8369O7627k06249j42179k40597L42626N81800K02609
10271D0205l9407j24079j81408n17414k83383M23018K12602j07223M84382J07526
10261A4819j44174K05170K3379k64835m3548n1227r7466j05381k686L22275L91178
10250B47504K97618M9184j45309j31043j01065n26034n09758m2222j66469k11322
10240a238916n2719p4829J50546K49122k0560J51938M23698L52236K31671K80406
10230D52593Q7223j69609l22807K73249L46289j85895k17909l94056l19933l22741
10220g73596n38317q8993J76019K64576M15900J42112p6798k89298m8110M90728
10210c25777L51677o1612k54304j05905J00824K0986k11133j8960L47035K93132
$$ y = [-434865, -281504, -497063, -565432, -497805, -704054, -846233, -1086830, -744204, -162404, 40205, 798, -123281, -304689, -822103, -1105486, -682468, -469866, -577089, -92707, 14819, -129355, 75815, 99194, -165641, -209189, -260416, -357882, -463263, -465949, -143674, 247504, 545122, 594306, 448997, 317954, 216889, -309145, -818903, -861125, -1027594, -1238916, -1291635, -1366464, -1215918, -966796, -987356, -835418, -411720, -59484, 172187, 452593, 539816, 370207, 47400, 320649, 666938, 481043, 263134, -130922, -450855, -773596, -1311913, -1400906, -1224887, -960311, -544411, -402299, -479097, -768395, -816505, -325777, 25900, -35712, -290016, -395921, -295097, -274111, -485244, -504204, -157169, 135963]
10200A35963k91072l90007r5440L31819J52688l42644k23551K67459N12684J25187
10190A83086q4982p060j43074k78941n48978l74187K09724M74239K18250o248
10180c58171K54269J49245j54095L4393N58633R08755M55669k05819l52613m89329
10170H00937k55145K3571k6517J12111J88060K59276R290J07168L848J4132j43562
10159A093169o22631J34938k7749k15493L71315K66559j43911l17966l71587O9879
10149B36523J5703j63621L21168K03610j46060j40644k65061k32392k92830j481
10139d65085K25107j74629j85765O1191M82868R08682L89664j36476k6528j24675
10129I54354m25643n50021j01787M29103M53303K17909j00808J7317J19389J36725
$$ y = [135963, -155109, -545116, -640556, -308737, -156049, -498693, -722244, -454785, 57899, 183086, 98104, 91044, -52030, -330971, -879949, -1254136, -1044412, -570173, -351923, -358171, -103902, 45343, -108752, -74359, 484274, 1393029, 1848698, 1642879, 1290266, 800937, 545792, 569363, 542846, 654957, 843017, 1102293, 1111583, 1218751, 1222599, 1236731, 1093169, 470538, 605476, 577727, 362234, 733549, 1000108, 856197, 538231, 166644, 236523, 252226, 88605, 409773, 613383, 467323, 326679, 61618, -170774, -463604, -465085, -239978, -414607, -600372, -539181, -56313, 852369, 1242033, 1105557, 1079029, 954354, 528711, -21310, -123097, 306006, 759309, 977218, 876410, 893727, 1013116, 1149841]
10119A149841j82615l23292j98109K21698N37692M20013Q70880J299043J226576
10110E021727J377513J464765J875262K335746L182999M623876N679541M567194
10102C0128623j06647n021780n868531m678054k959387j807638j587431j111404
10094F987751q98640p81460p91260p88382n15402n50398k27069l16062l44683
10085A774395p6596q6291k07118m28037l41362m7677L23466N42903L87639j8658
10075A822664k91103j64240l65446m06090j11678J2479J09840j97861J87526K55310
10065H51401J09813m56167p14616j18792o7001J2206j23860K4206j16833J10598
10055d89045m0070j37344n2461J44185J55389L47934J99662k7506J88156l09744
$$ y = [1149841, 967226, 643934, 445825, 667523, 1205215, 1625228, 2496108, 3795151, 5021727, 6399240, 7864005, 9739267, 12075013, 15258012, 19881888, 25561429, 30128623, 30021976, 25000196, 19131665, 14453611, 11494224, 9686586, 8099155, 6987751, 6089111, 5307651, 4516391, 3728009, 3212607, 2662209, 2435140, 2119078, 1774395, 1697799, 1611508, 1404390, 976353, 634991, 587314, 910780, 1453683, 1841322, 1822664, 1531561, 1367321, 1001875, 595785, 484107, 496586, 606426, 408565, 596091, 851401, 961214, 505047, -209569, -328361, -395362, -383156, -507016, -482810, -599643, -489045, -529115, -666459, -718920, -574735, -419346, -71412, 128250, 100744, 288900, -20844]
$$ [...]
##END NTUPLES=NMR SPECTRUM
##END=
