##TITLE=C13_SL18-DNR(f6)
 CDCl3,  19900 sc

 26.08.2021
##JCAMPDX= 6.0         $$ Bruker NMR JCAMP-DX V2.0
##DATA TYPE= NMR SPECTRUM
##DATA CLASS= NTUPLES
##ORIGIN= UXNMR, Bruker Analytische Messtechnik GmbH
##OWNER= root
$$ XWIN-NMR		Version 3.5
$$ Fri Aug 27 08:35:27 2021 Russian Standard Time (UT+4h)  she@DPX200
##.OBSERVE FREQUENCY= 50.327896
##.OBSERVE NUCLEUS= ^13C
##.ACQUISITION MODE= SIMULTANEOUS
##.ACQUISITION SCHEME= undefined
##.AVERAGES= 19900
##.DIGITISER RES= 17
##SPECTROMETER/DATA SYSTEM= spect
##.PULSE SEQUENCE= zgpg30
##.SOLVENT NAME= CDCl3
##.SHIFT REFERENCE= (INTERNAL, CDCl3, 0, 222.675)
##AUDIT TRAIL= $$ (NUMBER, WHEN, WHO, WHERE, WHAT)
$$ ##TITLE= Audit trail, XWIN-NMR		Version 3.5
$$ ##JCAMPDX= 5.01
$$ ##ORIGIN= Bruker BioSpin GmbH
$$ ##OWNER= she
$$ F:/spectra/data/she/nmr/c13/1/pdata/1/auditp.txt
$$ ##AUDIT TRAIL=  $$ (NUMBER, WHEN, WHO, WHERE, WHAT)
(   1,<2021-08-27 08:34:00.60 +0400>,<she>,<DPX200>,
      <created by zg, POWCHK disabled, PULCHK disabled
       terminated by command 'halt'
       configuration hash MD5:
       00 E9 B6 7A A2 85 ED C7 34 08 36 98 17 FE 4E 26
       data hash MD5: 32K
       9C CF 0B 66 32 FC CD 1A A0 95 49 C0 30 25 10 EE>)
(   2,<2021-08-27 08:34:02.78 +0400>,<she>,<DPX200>,
      <Start of raw data processing
       efp BC_mod = 2 LB = 1 FT_mod = 6 PKNL = 1 PHC0 = -335.8601 PHC1 = 31.96238 SI = 32K 
       data hash MD5: 32K
       91 EE E3 EA F5 EA 7F 5B E5 AA 73 CF C1 33 3D F6>)
(   3,<2021-08-27 08:34:05.42 +0400>,<she>,<DPX200>,
      <abs ABSG = 5 
       data hash MD5: 32K
       ED 68 81 DA E8 78 6E 99 22 1A AF 60 CB A1 53 34>)
(   4,<2021-08-27 08:34:38.70 +0400>,<she>,<DPX200>,
      <pk PHC0 = -5.076837 PHC1 = 6.800001 
       data hash MD5: 32K
       3E 26 F4 2D 66 67 AE E1 01 11 FE FD E7 7F B4 F1>)
(   5,<2021-08-27 08:34:42.98 +0400>,<she>,<DPX200>,
      <abs ABSG = 5 
       data hash MD5: 32K
       98 2B 92 E3 0F 6F 2A 0C DE CD 3E 40 0E 49 04 8D>)
$$ ##END=
$$ 
$$ hash MD5
$$ 36 B1 8E C2 29 28 0A 79 46 3C D4 67 7C 4C AF 49
##$RELAX= 
##$RELAX= 
##$RELAX= 
##$RELAX= 
##$RELAX= 
##$RELAX= 
##$RELAX= 
##$RELAX= 
$$ Bruker specific parameters
$$ --------------------------
##$DU= <F:/spectra>
##$EXPNO= 1
##$NAME= <c13>
##$PROCNO= 1
##$TYPE= <nmr>
##$USER= <she>
##$AMP= (0..31)
100 100 100 100 100 100 100 100 100 100 100 100 100 100 100 100 100 100 
100 100 100 100 100 100 100 100 100 100 100 100 100 100 
##$AQSEQ= 0
##$AQ_mod= 1
##$AUNM= <au_zg>
##$AUTOPOS= <>
##$BF1= 50.322709
##$BF2= 200.13
##$BF3= 50.322709
##$BF4= 500.13
##$BF5= 500.13
##$BF6= 500.13
##$BF7= 500.13
##$BF8= 500.13
##$BYTORDA= 1
##$CFDGTYP= 0
##$CFRGTYP= 5
##$CHEMSTR= <none>
##$CNST= (0..31)
1 1 145 1 1 1 1 1 1 1 1 1 1 1 1 1 1 1 1 1 1 1 1 1 1 1 1 1 1 1 1 1 
##$CPDPRG= <waltz16>
##$CPDPRG1= <>
##$CPDPRG2= <waltz16>
##$CPDPRG3= <>
##$CPDPRG4= <mlev>
##$CPDPRG5= <mlev>
##$CPDPRG6= <mlev>
##$CPDPRG7= <mlev>
##$CPDPRG8= <mlev>
##$CPDPRGB= <>
##$CPDPRGT= <>
##$D= (0..31)
$$ [...]
##$SUBNAM4= <"">
##$SUBNAM5= <"">
##$SUBNAM6= <"">
##$SUBNAM7= <"">
##$SUBNAM8= <"">
##$SUBNAM9= <"">
##$SW= 239.972175391363
##$SWIBOX= (0..15)
0 1 3 0 0 0 0 0 0 0 0 0 0 0 0 0 
##$SW_h= 12077.2946859903
##$TD= 32768
##$TD0= 1
##$TE= 0
##$TE2= 300
##$TE3= 300
##$TEG= 300
##$TL= (0..7)
120 120 120 120 120 120 120 120 
##$TP= (0..7)
150 150 150 150 150 150 150 150 
##$TP07= 0
##$TPNAME0= <>
##$TPNAME1= <>
##$TPNAME2= <>
##$TPNAME3= <>
##$TPNAME4= <>
##$TPNAME5= <>
##$TPNAME6= <>
##$TPNAME7= <>
##$TPOAL= (0..7)
0.5 0.5 0.5 0.5 0.5 0.5 0.5 0.5 
##$TPOFFS= (0..7)
0 0 0 0 0 0 0 0 
##$TUNHIN= 0
##$TUNHOUT= 0
##$TUNXOUT= 0
##$USERA1= <user>
##$USERA2= <user>
##$USERA3= <user>
##$USERA4= <user>
##$USERA5= <user>
##$V9= 5
##$VALIST= <valist>
##$VCLIST= <CCCCCCCCCCCCCCC>
##$VD= 0
##$VDLIST= <DDDDDDDDDDDDDDD>
##$VPLIST= <PPPPPPPPPPPPPPP>
##$VTLIST= <TTTTTTTTTTTTTTT>
##$WBST= 1024
##$WBSW= 4
##$XGAIN= (0..3)
0 0 0 0 
##$XL= 0
##$YL= 0
##$YMAX_a= 114978364
##$YMIN_a= -31339957
##$ZGOPTNS= <>
##$ZL1= 120
##$ZL2= 120
##$ZL3= 120
##$ZL4= 120
##$ABSF1= 222.6753
##$ABSF2= -17.32152
##$ABSG= 5
##$ABSL= 3
##$ALPHA= 0
##$AQORDER= 0
##$ASSFAC= 0
##$ASSFACI= 0
##$ASSFACX= 0
##$ASSWID= 0
##$AUNMP= <proc_1d>
##$AZFE= 0.1
##$AZFW= 0.5
##$BCFW= 0
##$BC_mod= 2
##$BYTORDP= 0
##$COROFFS= 0
##$CY= -3
##$DATMOD= 1
##$DC= 0
##$DFILT= <>
##$DTYPP= 0
##$F1P= 0
##$F2P= 0
##$FCOR= 0.5
##$FTSIZE= 32768
##$FT_mod= 6
##$GAMMA= 0
##$GB= 0
##$INTBC= 1
##$INTSCL= 4.134877e-10
##$ISEN= 128
##$LB= 1
##$LEV0= 0
##$LPBIN= 0
##$MAXI= 10000
##$MC2= 0
##$MEAN= 0
##$ME_mod= 0
##$MI= 0.1934396
##$NCOEF= 0
##$NC_proc= 3
##$NLEV= 6
##$NOISF1= 120.0001
##$NOISF2= 80.00006
##$NSP= 0
##$NTH_PI= 0
##$NZP= 0
##$OFFSET= 222.6753
##$PC= 1.4
##$PHC0= -340.937
##$PHC1= 38.76238
##$PH_mod= 1
##$PKNL= yes
##$PPARMOD= 0
##$PSCAL= 0
##$PSIGN= 0
##$REVERSE= no
##$SF= 50.3227290194735
##$SI= 32768
##$SIGF1= 140
##$SIGF2= 120
##$SINO= 11.81781
##$SIOLD= 32768
##$SREGLST= <13C.CDCl3>
##$SSB= 0
##$STSI= 32768
##$STSR= 0
##$SW_p= 12077.2946859903
##$SYMM= 0
##$S_DEV= 0
##$TDeff= 32768
##$TDoff= 0
##$TI= <>
##$TILT= no
##$TM1= 0
##$TM2= 0
##$TOPLEV= 0
##$USERP1= <user>
##$USERP2= <user>
##$USERP3= <user>
##$USERP4= <user>
##$USERP5= <user>
##$WDW= 1
##$XDIM= 32768
##$YMAX_p= 268257719
##$YMIN_p= -1104954
$$ End of Bruker specific parameters
$$ ---------------------------------
##NTUPLES= NMR SPECTRUM
##VAR_NAME=  FREQUENCY,     SPECTRUM/REAL,   SPECTRUM/IMAG
##SYMBOL=    X,             R,               I
##VAR_TYPE=  INDEPENDENT,   DEPENDENT,       DEPENDENT
##VAR_FORM=  AFFN,          ASDF,            ASDF
##VAR_DIM=   32768,         32768,           32768
##UNITS=     HZ,            ARBITRARY UNITS, ARBITRARY UNITS
##FACTOR=    0.368581032318806, 1,           1
##FIRST=     11205.6284273983, 0,            0
##LAST=      -871.666258592022, 0,           0
##MIN=       -871.666258592022, -1104954,    0
##MAX=       11205.6284273983, 268257719,    0
$$ Real data points
##PAGE= N=1
##DATA TABLE= (X++(R..R)), XYDATA
$$ [...]
15863a02400J55996J82980m6764j42242Q1452j0607j81444j56181M3877J15546
15853e9787Q9706J73657J41837M7146j59312n6924O012j45234l37607j85357j7262
15842e03125N3571n6107L42J02212N4304R4134q1132k1371J78785J62045K05765
15831A89423K65166N9207l39387k71207J1061j8141M4193J58762K56972K22483
15821E78532j18540l01402j14823M3115P3685Q0076l465k11808j30925j72625
15811b78180p5560M9117J07527J83511J00710J49055o3477l9895R2849L1869m4300
15800B13226j91445j81458p2159k9031k02349o7066J70535K13133K27394Q2472
15790A63252q1527n6745L8403L2054Q1669K21950M7168j99128k04682J2438M0170
$$ y = [-102400, 53596, 236576, 189812, 47570, 129022, 118415, -63029, -219210, -175333, -59787, 29919, 203576, 345413, 392559, 233247, 176323, 182335, 37101, -300506, -485863, -503125, -449554, -505661, -505319, -403107, -348803, -254669, -335801, -357172, -178387, -16342, 189423, 454589, 513796, 174409, -96798, -85737, -103878, -59685, 99077, 356049, 578532, 459992, 158590, 43767, 86882, 160567, 240643, 237178, 25370, -105555, -278180, -353740, -304623, -197096, -13585, 87125, 236180, 172703, 132808, 225657, 257526, 213226, 21781, -159677, -231836, -260867, -463216, -530282, -359747, -146614, 80780, 163252, 81725, 24980, 63383, 95437, 177106, 399056, 446224, 247096, 42414, 54852, 95022]
15779I5022n8490j60468j21398j29269k0775K45623J01346J12902r812j58957
15769a04276k32341j46468J68N511P7715L1328o8238M0325l831K2977j8943p351
15757d03424J05708J83706Q1696j78480j08283k264j03659j55502J41341M2687
15747c96474j91611R6405K46249J09424J60671J37414Q8219R4794J00469o9856
15737C75704k59091r3039j5565j00110J5513K16577J60924N7165j34712j9065
15727B04301Q1114j33098j54741j27586k37388r1102J23771K65534J72093K2099
15717A24997J72544K43637n6915j75314m3737j08544j03289l0222j35099j6342
15707a28284o9628j27416m670L3862J59706J84014K9939q686Q9652J98786J89507
$$ y = [95022, 36532, -123936, -245334, -374603, -395378, -149755, -48409, 64493, 54681, -104276, -336617, -483085, -482917, -477406, -399691, -368363, -436601, -396276, -400107, -377130, -396073, -403424, -297716, -114010, -32314, -210794, -319077, -321341, -425000, -580502, -439161, -396474, -588085, -491680, -245431, -136007, 24664, 162078, 250297, 345091, 445560, 375704, 116613, 23574, 8009, -92101, -76588, 139989, 300913, 358078, 223366, 204301, 285415, 152317, -2424, -130010, -367398, -458500, -334729, -69195, 102898, 124997, 297541, 541178, 484263, 308949, 265212, 156668, 53379, 23157, -111942, -128284, -197912, -325328, -329998, -296136, -136430, 47584, 77523, 68837, 158489, 357275, 546782]
15696E46782j76182q276o4248k06285p8835p5914m5967o5436L5760J09662l5443
15685f4382J53682K56886J05458o9276l4737m6119j98833o829P8750J08730Q3495
15674C66825Q7344K333j78538k12753j41993P9720J58544J03017L7498p3520o0908
15663A67569o7539k00606k9018R587N8985J08026K8436m8439m5408J9716K54344
15652B55653J39170j38528k51314j06412J15172N5218r7848j13817o7680J56208
15642e4178J64734M0878N1052J30644n4644r1274j05685k24985j11748o6428j65008
15631d86642P0124Q077j62844q4658J19576J66887J84893J95878J02926J69519
15621B83736l7650l5092m0428k397K38397K63601j71719k52597n8529j00981k08134
$$ y = [546782, 370600, 362324, 298076, 91791, 12956, -62958, -108925, -174361, -138601, -28939, -64382, 89300, 346186, 451644, 382368, 347631, 301512, 102679, 95850, 174600, 283330, 366825, 454169, 456502, 277964, 65211, -76782, 2938, 161482, 264499, 301997, 228477, 167569, 100030, -100576, -129594, -120007, -61022, 47004, 75440, 27001, -18407, 1309, 255653, 394823, 256295, 4981, -101431, 13741, 68959, -28889, -142706, -210386, -54178, 110556, 151434, 202486, 333130, 278486, 187212, 81527, -143458, -255206, -321634, -486642, -416518, -408441, -571285, -655943, -536367, -369480, -184587, 11291, 114217, 283736, 246086, 210994, 170566, 168169, 406566, 670167, 498448, 245851, 187322, 86341, -121793]
15610a21793k32452o2249M7928J15789K08453J07857k5852K8500J47129r9766
15600A13544j07460n7966q6690j13089p5832j38220J7062k6231J50607L05604
15590a8671K66788l1905p3980m8997j25169k06396j01304M7092j1528P5838L15016
15579H6784K04556k02015k83942k12316k25266m2837J80364L66889J99304j55013
15569h3492n1236K45374l9905j20911M3590o3917q2486J16050J66583J12591J70019
15558D12260j07900k29364j66642L2225P5054j25841j98003l2121J18998J33504
15548h7830N4801M0959K1246o119r128m6959j54873l7072K43723J98499k76645
15537e9398k24197j04119m6127L6306R5171p4751k28343n4091J18578J71867J65844
$$ y = [-121793, -354245, -416494, -368566, -252777, -44324, 63533, 37681, 66181, 213310, 113544, 6084, -51882, -138572, -251661, -327493, -465713, -448651, -474882, -324275, -18671, 248117, 216212, 142232, 93235, -31934, -238330, -339634, -292542, -304070, -228232, 86784, 291340, 89325, -194617, -406933, -632199, -675036, -494672, -127783, 71521, -83492, -134728, 110646, 70741, -50170, -6580, -70497, -152983, -36933, 129650, 242241, 412260, 304360, 74996, -91646, -59421, 15633, -110208, -308211, -340332, -221334, -87830, -33029, 7930, 29176, 23057, 13929, -33030, -187903, -224975, 18748, 217247, -59398, -283595, -387714, -433841, -397535, -302364, -377115, -605458, -659549, -540971, -369104, -203260]
15526b03260K03810J14443k0044J7747n4565j9056l457m8672j09924N9543K41848
15515A78413J01377r3745j25343r3822l3661O8035K03694J31818J7408j8168p9213
15504B56793p9325k36991k36658O2807K19623P0021l5900O3830J68494p2031j92915
15493a2252o6779P0785P1658J2725l476o9567m4327J11914k5298p4489o7339N3455
15481d2990j32811r127L39027K17175K091M329j8688j11325j06457m431K55121
15470C91914K58928j65010m78887j00681J4668M0833J37234n6698j52561k1132
15460a31392R1293J66486K60045N5663r0634k40852L1909J23725k38906q6534
15450e9197K6670j45986j08247o2063j03458K22185K46279J29659J45804J19785
$$ y = [-203260, 550, 114993, 94949, 112696, 58131, 39075, 35618, -13054, -122978, -63435, 178413, 279790, 186045, 60702, -33120, -66781, 1254, 204948, 336766, 354174, 336006, 256793, 177468, -59523, -296181, -233374, -13751, 56270, 20370, 84200, 252694, 180663, -12252, -79031, -8246, 63412, 76137, 72661, 3094, -41233, 70681, 45383, -29106, -96445, -42990, -175801, -184928, 154099, 371274, 373365, 377694, 359006, 247681, 141224, 136793, 391914, 650842, 485832, 6945, -93736, -79068, -38235, 98999, 42301, -110260, -131392, -40099, 126387, 386432, 442095, 351461, 110609, 142518, 266243, 27337, -59197, -32527, -178513, -286760, -348823, -452281, -230096, 16183, 145842, 291646, 411431]
15440D11431o8570j95648q1403n4810q8580o338p3142Q4641K07290K88157k4108
15429C98920l16561l06544l04233j83676o5470n029L13127K72991l523m5792M7017
15418a98773K57936K21333O2409L227j09373j60790n1098j41421q1827j67536
15408c65913q7728J89580o9464q5900K18726M51045j2458k41308P1761L02306
15398C70647J7371m38721k78251r837k2937k44925j8372J63316J10085J45892
15388b05732Q8213L5859p5207j32001R2704R0417q9665k35174j99510M8224J48135
15377d33737K17783K08296R1269n3191j61567m4802P8079J96672J06389j678j77025
15366B6488P0099J48795r0368j12886j5179Q8967N9260k7521k2470j12274j12257
$$ y = [411431, 342861, 147213, 65810, 11000, -77580, -83918, -157060, -72419, 134871, 423028, 398920, 82359, -224185, -528418, -712094, -777564, -782593, -469466, -196475, -199998, -245790, -198773, 59163, 280496, 342905, 346132, 236759, 75969, 24871, -116550, -198377, -365913, -453641, -264061, -333525, -419425, -200699, 250346, 237888, -3420, 68341, 370647, 388018, -50703, -328954, -338791, -361728, -606653, -625025, -461709, -351624, -205732, -117519, -81660, -156867, -288868, -196164, -105747, -195412, -430586, -630096, -581872, -433737, -215954, -7658, 83611, 30420, -131147, -175949, -97870, 98802, 205191, 203513, 26488, 96587, 245382, 155014, 42128, 26949, 115916, 175176, 147655, 125185, 12911, -99346]
15355i9346j74675o4457K8758n0403M5551K1916P7189J90856k5389q447J6012
15344d2435Q728L4603p218L2278p9811j38844J6380J93259J71366o0388j79811
15333e1893l05435j62275J02853J37502O1158J3983l1731j31315j43410R9236
15323d11327L69241K00644k7725q7311j41359j85660n5665N7925L1557q7874R4551
15312b43003Q7574K46852J84498K58572J13000p7373k68854l01847j80988p3994
15302b55563j0908j53880j1014K11495N1048N7970Q7550j16345j54766L7083J31933
15291a25397J28358R8811O2610L2092q3575j16081k22882j14150J01710k6162
15281b64666L108J59829L16988J74087j01328l94r5846j84264k42217k15101j5802
$$ y = [-99346, -274021, -338478, -309720, -360123, -314572, -292656, -215467, -24611, -50000, -58447, -42435, -33707, 896, -6322, 25956, -53855, -192699, -176319, 16940, 188306, 127918, -51893, -357328, -519603, -416750, -279248, -218090, -204107, -235838, -367153, -510563, -411327, -42086, 158558, 130833, 43522, -97837, -283497, -339162, -281237, -249680, -337554, -243003, -155429, 91423, 275921, 534493, 647493, 570120, 301266, -581, -181569, -255563, -266471, -420351, -431365, -219870, -168822, -110852, -23302, -139647, -294413, -257330, -125397, 2961, 101772, 164382, 196474, 112899, -3182, -226064, -340214, -238504, -264666, -261558, -101729, 215259, 389346, 288018, 287624, 191778, 7514, -234703, -449804, -465606]
15270d65606P3961O545J20862J46875K7081P1767J46857O9276K26993K40318j05729
15259E59200k41964j00839j32039n1569M9841J32847R5197Q3224k2914j51423
15249B19561k58541j02311m8405J14451J52158J28255M2605j59491j47059j05237
15239a64014j2763J79330Q1206j93410k8746J63741K05447m3751j5133r6521k06933
15228a31547k27931j29427p3604l07856j82503K54373M46610K18986Q3428L5190
15218a4281j52461k04088K8202K31090J07330J23285O1313k05868j34411j8924
15208a78813J27293K14936J61022J828k52773k90730k68363o3263o2763r2995
15198g04621K63421K52072P2741J05946M1748j51324j12381K9811P8719n7331
$$ y = [-465606, -391645, -385100, -264238, -117363, -90282, -18515, 128342, 197618, 424611, 664929, 559200, 317236, 216397, 84358, 32789, 82630, 215477, 310674, 393898, 370984, 219561, -38980, -141291, -189696, -75245, 76913, 205168, 247773, 88282, -58777, -164014, -176777, 2553, 83759, -109651, -138397, 25344, 230791, 187040, 171907, 75386, -131547, -359478, -488905, -562509, -870365, -1052868, -798495, -351885, -132899, -49471, -14281, -166742, -370830, -342628, -111538, -4208, 119077, 180390, -25478, -159889, -178813, -51520, 163416, 324438, 326266, 73493, -217237, -485600, -548863, -611626, -704621, -441200, -189128, -116387, -10441, 31307, -120017, -232398, -202587, -123868, -181199]
15188a81199j58029J05252J08232J17785L10132O8029N9948R9519p0268q8141
15178C71260l1963j31229j78575j1497r4634K2669J65653N0733L4797j62290l24162
15167b89238k73768K0282J99346J83053J9975j33176j48008N2179L469j24208
15157d90094J07079K66637J97187m9612j82464r7814Q1991J73005J89862Q8797
15147B84574k25273j67890j67563r9306K24654M25980Q5186j50163J754j37174
15137G4779j19951j03085o8406J5982j8004N8556J78994J48223J08330J37399
15127D12817O0214k16252k51447k41249r7828m9776q793O4562j9978m110o1588
15116d13428O8017l6254k3021J07699M8467J28452J70708q0587N32J34269p5852
$$ y = [-181199, -339228, -233976, -125744, -7959, 302173, 370202, 430150, 529669, 459401, 371260, 339297, 208068, 29493, 17996, -76638, -53969, 111684, 162417, 197214, 34924, -289238, -563006, -542724, -343378, -160325, -140350, -273526, -421534, -369355, -365886, -490094, -383015, -116378, 80809, 31197, -151267, -249081, -167090, 5915, 195777, 284574, 59301, -108589, -276152, -375458, -150804, 275176, 360362, 210199, 211953, 74779, -45172, -148257, -216663, -200681, -218685, -160129, 18865, 167088, 275418, 412817, 473031, 256779, 5332, -235917, -333745, -383521, -392314, -327752, -347730, -351840, -413428, -345411, -381665, -404686, -296987, -248520, -120068, 50640, -29947, -29415, 104854, 29002]
15105B9002j66503k5754n9710j29102q3732j3880J55585o0151j8899J55892J44442
15094g2810O4898o183q620J6458n0168m4132m9781j0937J44827J71891j18547
15083C6896j66218J9254L6505Q4243j7912M9749n9375Q4001K17140Q0331P3921
15072D38535j58899j30005j85595l45749k92558l6746L08692K64985R3300K29051
15062A85011R0370j05602Q0664N6553k40897j87225j46988k34219j9042N3404
15052d67971j6945j00769j66565j89755j62949O4596J78135J40915J19563K08145
15042c93600J98375Q2210r4o8845q7968n0919P8154L19736L28692Q7653j21930
15031C71464p5956j25566k06045J12993K58801m6666k95589k12121j56843J717
$$ y = [29002, -137501, -163255, -222965, -352067, -435799, -449679, -294094, -354245, -373144, -217252, -72810, -7912, -14095, -22715, -6257, -56425, -100557, -150338, -161275, -16448, 155443, 36896, -129322, -110068, -73563, 10680, -7232, 42517, -16858, 67143, 284283, 364614, 438535, 279636, 149631, -35964, -381713, -674271, -711017, -402325, -137340, -44040, 185011, 275381, 169779, 250443, 306996, 66099, -121126, -268114, -502333, -521375, -467971, -484916, -585685, -752250, -942005, -1104954, -1040358, -862223, -721308, -601745, -393600, -195225, -113015, -113109, -181954, -269922, -320841, -242687, 77049, 405741, 493394, 371464, 295508, 169942, -36103, 76890, 335691, 289025, -6564, -218685, -375528, -373811]
15021c73811J42775k2923L927j45383j34970R0844J89603O8039l4036L6473K3619
15010a55843K07801P4651j53330j49875O7844J09411l7217j88141p5513K8270
15000b71942J6524J13037K00845J72445N8053O147K4476j85135l01102j13753
14990b80405l0646n742k9418J40532K24153k3373k25462j25432Q8842J97039J19090
14979D9178K02498j7542n6124m7187j98619k67437n3032J59876P7619j43320P7077
14968b17013L05156l0028k19227k03967q0001j27753j19710K9877o9122L2520
14958f99268K16719K03826J04697O3267O6194m3913j31278o4806l756M0606r4178
14947c41890j18856K3293K0100J8655l6165k41141m854L08044K39279O0962j69305
$$ y = [-373811, -231036, -253959, -250032, -395415, -530385, -439541, -249938, -181899, -215935, -179462, -155843, 51958, 126609, -26721, -176596, -108752, 659, -36558, -224699, -300212, -271942, -255418, -142381, 58464, 230909, 288962, 295109, 319585, 134450, -166652, -280405, -311051, -316793, -346211, -205679, 18474, -4899, -230361, -355793, -266951, -69912, 49178, 251676, 234134, 178010, 130823, -67796, -335233, -388265, -228389, -150770, -294090, -217013, 88143, 58115, -161112, -365079, -445080, -572833, -692543, -662666, -731788, -699268, -482549, -278723, -174026, -110759, -44565, -88478, -219756, -284562, -288318, -247712, -341890, -460746, -437453, -417353, -398698, -434863, -676004, -680858, -372814, -133535, -72573, -241878]
14936b41878j91704J02855J66699r9649m434J48403m4273j27153N1980P0366k5432
14925a94220J33537J82590P4336K45366J08517k22302k68276l4010J0687j7936
14915A8289m9013k2582J12397Q4385q5119j08900L4612R6121p1351n6293J54223
14904A06769p4409j12299J07373J40915K3352k52J81618J80369J48601M8016j40557
14893F09496k79784k95167l8506N9153j55575k13720n0971K3856K44356K55854
14883A58992j9368j56667j22740j95296J25259L43721J62627k2601j19355j94184
14873c9612k79821l45879j57093J45770K82285J50743j02892k2896J0703R8071
14863b60621J30167R6119J5684p556J13986k386q2017O899J05367N6804n7674
$$ y = [-241878, -433582, -330727, -164028, -263677, -268111, -119708, -163981, -291134, -239154, -168788, -194220, -60683, 121907, 196243, 441609, 550126, 327824, 59548, 25538, 36225, 18289, -30724, -53306, 59091, 143476, 58357, -50543, -15931, 80190, 8839, -47454, 106769, 32360, -79939, 27434, 168349, 191701, 191449, 373067, 553436, 702037, 750053, 609496, 329712, 34545, -3961, 55192, -100383, -314103, -365074, -341218, -96862, 158992, 139624, -17043, -139783, -335079, -209820, 133901, 296528, 273927, 154572, -39612, -319433, -665312, -822405, -676635, -394350, -243607, -346499, -369395, -358692, -260621, -130454, -34335, -18651, -26207, 87779, 85393, 3376, 10275, 115642, 172446, 114772]
14852A14772j4206J31493J15120o2300k685q3127Q1197J11587j28432l06901l69118
14841d12600j47169J10829J62787m3602o5007N5348K0831r9219M5206J33875O7397
14830a71324K666N2239L3119J7833J04886R4644q697J02162J60547j3847k8136
14819C46092l4517q0461j9757j88640k25130J5196j07915k27707m7679K5227J09320
14808d35971K81124K40399J40858J68712J44151P1297j7627j84407l2320l9330
14798C36886k01823j89104j36132k6114K02579K15797m8265r5986J36682J43629
14788C38149n442k0601j9185l19242k90585j12221O6776J13604J01875j03730
14778b50602j57663N1474J60926O6798l8832O6639K45687J86336k23426l02293
$$ y = [114772, 100566, 232059, 347179, 284879, 282194, 199067, 280264, 391851, 263419, -43482, -412600, -559769, -448940, -286153, -329755, -394762, -339414, -318583, -417802, -372596, -238721, -171324, -168658, -116419, -83300, -65467, 39419, 134063, 125366, 227528, 388075, 374228, 346092, 311575, 231114, 211357, 22717, -202413, -187217, -295132, -522839, -570518, -545291, -435971, -154847, 85552, 226410, 395122, 539273, 610570, 592943, 408536, 376216, 336886, 135063, -54041, -190173, -216287, -13708, 202089, 153824, 57838, 194520, 338149, 332707, 312106, 292921, -26321, -316906, -429127, -362351, -248747, -146872, -250602, -408265, -356791, -195865, -129067, -167899, -101260, 144427, 330763, 107337, -194956]
14768a94956p1266P6953J22921R239K873J70954K31342r2915M153O7454j26068
14757B00684k16383q1032l1049n835j68719k25564j27482p2412J65079K96756
14747b65957j668l6558K02641J24361O5370r7562j47543p8299n939J18215J75598
14736E2659l5526j59124j27493j12245K9364m4258k59761r2378J7680j6038Q2764
14725f64356K20147J85776L07897Q7440j49418j46675j61282J83977K17683K447
14715H3636q9069R2706J17711k6140N2945J8348j71100k571J62847J27397j3213
14704C53497j34438J7956K30628J31112j32390r5749j88184l5481j33529l3261
14694a9839L3808j6165m8984j81839k3166J10151J96052N7249j01052m0001K4087
$$ y = [-194956, -266222, -189269, -66348, -57109, -54236, 116718, 348060, 255145, 259298, 326752, 200684, -15699, -96731, -127780, -133615, -302334, -527898, -655380, -727792, -562713, -265957, -267625, -304183, -101542, 22819, 88189, -9373, -156916, -235215, -241154, -122939, 52659, 17133, -141991, -269484, -381729, -352365, -396623, -656384, -748762, -731082, -747120, -664356, -444209, -258433, 49464, 136904, -12514, -159189, -320471, -136494, 81189, 83636, -5433, 87273, 204984, 178844, 231789, 250137, 79037, 76466, 239313, 366710, 353497, 219059, 237015, 467643, 598755, 466365, 370616, 182432, 146951, 13422, -19839, 13969, -2196, -51180, -233019, -256185, -146034, 50018, 107267, 6215, -33786, -9699]
14683i699J8414p4727q3860R5500N9572r008r1960J9954N2356r8595k9533K7654
14671a23932j7556J5320k5282N5907L0654j72539n7035J79661K01848K3055j23828
14660a3727r4651j2512J92569K01505J8936o6233R9903J59760R6143j27838j82083
14649B71772r7968o4905j24038j78510m1896O1726J52974K21751R9509j10757
14639A89658j44543p2549P4312p1881j02605M1218K02819J52134j11007k96913
14629a39357j91440j32510n9645j27644L1030J39388P9053L9566R357J55569J01449
14618i5184K8730q7673k65045M0643K63871J04127k16893k86923m2183K7488o405
14607e35447Q3022J16124J4801J80890K58241J13954j39313k98928j94937n5203
$$ y = [-9699, 8715, -66012, -149872, -54372, 5200, -3808, -95768, -75814, -23458, -122053, -151586, -123932, -141488, -126168, -151450, -95543, -64889, -237428, -294463, -114802, 87046, 110101, -13727, -108378, -120890, 71679, 273184, 292120, 225887, 325790, 485550, 581693, 453855, 271772, 173804, 108899, -15139, -193649, -235545, -173819, -20845, 200906, 300415, 189658, 45115, -27434, 46878, -25003, -127608, -86390, 116429, 268563, 157556, -139357, -330797, -463307, -522952, -650596, -619566, -480178, -401125, -361559, -352202, -196633, -95184, -66454, -154127, -419172, -378529, -114658, -10531, -227424, -514347, -556530, -529042, -535447, -452425, -336301, -321500, -140610, 117631, 231585, 92272, -206656, -401593, -456796]
14597d56796q0279j8485k649j377J62168K72592K29639Q3281l0425J5471j614
14586A71526j12743o5631k8798k5213J8042l2495K4283J11935l3161j20660j31262
14575b24177m8505K58638K51109j08935k45024j37692J07362J39479O5195J9722
14565G7172j380M3751J5784J6892n5184o8535j5731k13987k85943r1135J88989
14554c89307K30946J96826j1244k92722k39807n0423M9214J32639J58350R8887
14544a16641J58771J67734L611Q209m2521j77292m25545k84705N2451N9789J32603
14533d63536K42250J16548j13771j34859N1408K39923K55153K21868J32745j27725
14523D20004j54582l6773K8217n3785n1735k12764k43440o6110J27520J67032
$$ y = [-456796, -537075, -555560, -558209, -559586, -397418, -124826, 104813, 188094, 157669, 173140, 171526, 58783, -6848, -35646, -60859, -42817, -75312, -51029, 60906, 27745, -92915, -224177, -272682, -14044, 237065, 128130, -116894, -254586, -147224, -7745, 57450, 77172, 75792, 119543, 135327, 152219, 97035, 28500, 12769, -201218, -487161, -578296, -389307, -158361, 38465, 27221, -265501, -505308, -555731, -506517, -373878, -215528, -116641, 42130, 209864, 213475, 221684, 179163, 1871, -423674, -708379, -655928, -596139, -463536, -221286, -104738, -218509, -353368, -301960, -62037, 193116, 414984, 547729, 420004, 265422, 228649, 256866, 203081, 151346, -61418, -304858, -370968, -243448, -76416]
14513g6416J07879J31988J30031Q116j64104j67364k04369k65342j90263J31456
14503e58388K39956Q0721J24792K17324J78821J08286J36612j21703k60789k64203
14493a18571n3012J60538l7574N123N7260j69758l15965j62382J46864P5409M9539
14482c62529J40519K03470J80996N9509M3283j215M305N7921L0875N6738l3033
14471C80839j78680j38801p3200j84858j58251o4114r6133J8775J09038J72985
14461b12400K53109O8217j15086n1078r6973j19815O3412K23294K99013P6460
14451C88153j67133j89580p3356O2453R0446j60998k03152j91040j93270m0186
14441f77663J82585L23394K61631K11225j00527j41404k28q2767k18133r835M775
$$ y = [-76416, 31463, 163451, 293482, 301598, 137494, -29870, -234239, -499581, -689844, -558388, -318432, -237711, -112919, 104405, 283226, 391512, 528124, 406421, 145632, -118571, -171583, -11045, -48619, -43496, 13764, -155994, -471959, -634341, -487477, -412068, -362529, -222010, -18540, 162456, 221965, 265248, 264033, 268338, 326259, 357134, 413872, 380839, 202159, 63358, -9842, -194700, -352951, -417065, -513198, -494423, -385385, -212400, 40709, 108926, -6160, -57238, -154211, -274026, -210614, 12680, 311693, 388153, 221020, 31440, -41916, 20537, 110983, -50015, -253167, -444207, -637477, -677663, -495078, -171684, 89947, 301172, 200645, 59241, 59013, -23754, -241887, -251722, -246947]
14430b46947P5256q9453j55953Q0551J37116K6542J44879J97864q9536o5627J01296
14419A15988k5503k25299K1371J60305J19221m4462j29493L0193M3767j5068q6788
14408c5768j78945j12194M2969k7029M1360r8286r2171k3865j09735p9910J01666
14397e71908R1676K7275K78575L17863K85813K7246k54625p2071j22973p7987
14387g1116m7894O8766K86070J57262P784j22166k03116p4699N9049J49901J22489
14376C32330J21712K9680k68231j83392O0926k7238l6680N8464P4025j05479Q139
14365F4256J09180J21552R6112Q379j55118m9942R1906n8294j45255j12965k15974
14354b46163q8157L4069J33608P7830n8340K4698M7785j1354P5450m1597k17294
$$ y = [-246947, -171691, -261144, -417097, -336546, -199430, -172888, -28009, 169855, 80319, 14692, 115988, 90485, -134814, -113443, 46862, 166083, 121621, -7872, 22321, 66088, 51020, -35768, -214713, -326907, -283938, -310967, -269607, -367893, -460064, -483929, -593664, -673574, -571908, -480232, -452957, -174382, 143481, 429294, 456540, 201915, 129844, 6871, -71116, -119010, -50244, 235826, 393088, 400872, 278706, 75590, 891, 59940, 209841, 332330, 454042, 483722, 215491, 32099, 93025, 65787, 29107, 87571, 161596, 56117, 64256, 173436, 294988, 391100, 399479, 244361, 194419, 286325, 228031, 82776, -30189, -246163, -334320, -300251, -166643, -88813, -147153, -122455, -74670, -86024, -10574, -52171, -269465]
14343b69465p9378m1894o844K4742J04570J10514J08549J9345M7311M047k34514
14332b13017j68487J56219K69283j6125n6322N5477j751J7292l6880M6304L5192
14321H7185p0377j28418k38492q494J03884k4104n0724k12986L8214J54745K3441
14310c26126n2816M7181J79409J55136q9440k75911J08410K02605P9435j6884
14300A0999l5059p2826r0386n9829n6609k2031R0986J65567J48658K16827m8594
14289B47703j74775j37853L4441P2987J6432K4513N6184k03695k32005q6065J38372
14278b43761L47929Q7778p2348j2132O8946M726k8747J0718J3421R7689J64979
14267D39198m0130j99847k33136j91290q6715l5765J85456Q5077n6780k7805P0344
$$ y = [-269465, -348843, -390737, -397581, -372839, -268269, -157755, -49206, -29861, 17450, 21497, -213017, -381504, -225285, 43998, 27873, -28449, 27028, 25277, 42569, 5689, 51993, 87185, 16808, -111610, -350102, -358596, -254712, -278816, -329540, -542526, -504312, -349567, -326126, -378942, -331761, -152352, 2784, -86656, -362567, -254157, -51552, 27883, 10999, -24060, -96886, -187272, -247101, -303710, -325741, -234755, -69188, 79470, 296297, 247703, 72928, -64925, -30484, 42503, 58935, 83448, 139632, -64063, -296068, -382133, -243761, 104168, 191946, 119598, 107466, 176412, 181138, 152391, 163109, 176530, 274219, 439198, 399068, 199221, -33915, -225205, -311920, -347685, -162229, -77152, -133932, -161737, -91393]
14256i1393m7238K8067J38149K2594j126L3540J5462j56954q8383k5053R7937
14245g4398R9254L9840j2425j30045o7718k7541k5491O4952n5345j9904M977l9796
14233b43640N7648J00670J52364K9769j02608q5075P368J52855K7841o761J54245
14222B44676P3545j23339j0890j5784q4867j88983l60479O7285L32919L01228
14212B35311K32552m9480k63373j60669O7883J85339k0338j20510K9408j28849
14202G274j55209k269n4434p932J11205k2272j54092m0878J39181J00333o2608
14191a41701k3079M956j56500m2795J41769J81657m3929k27638j1577N4207Q830
14180b55800j39097r4935K95179M60584K41066r7633k39205j5805K8636M242J01838
$$ y = [-91393, -138631, -110564, 27585, 50179, 49053, 82593, 98055, -58899, -147282, -172335, -74398, 24856, 64696, 52271, -77774, -145492, -173033, -198524, -133572, -188917, -208821, -203844, -243640, -185992, -85322, 67042, 96811, -5797, -90872, -83504, 69351, 97192, 90431, 244676, 318221, 194882, 183992, 168208, 83341, -105642, -466121, -398836, -65917, 235311, 467863, 418383, 155010, -5659, 62224, 247563, 227225, 106715, 136123, 7274, -147935, -150204, -204638, -212570, -101365, -123637, -277729, -318607, -179426, -79093, -141701, -164780, -159824, -316324, -359119, -217350, -35693, -79622, -307260, -318837, -264630, -255800, -394897, -489832, -194653, 265931, 506997, 409364, 170159, 154354, 182990, 187232, 289070]
14169B89070j10668m09038l73789j24245K13623K77684O4473k79815j10216K60654
14159c02267J77225r5778k1553P9139O7132j16246o8335N8785P4101K3158J30611
14148E972J99944J42020J2436j45832l7044j15244j52050k50577r3151R4949J19388
14137b19189J83391o4692l09405r648K66121K03094j06042k64743k46482j57955
14127g25550R4955L28748J51315J7030n5877j16370j1146m3115m2576Q0819N4132
14116b67635K54602J71860r7148l1725L8018n2298r3041j88893j48216j41188
14106e55664j71466O3715J56881K19344L15776K11590l5476j31799j79165k15778
14096c22042K5236L1854J28321J15827k24L6196L119k9108R6540J71899J69254
$$ y = [289070, 178402, -230636, -604425, -728670, -515047, -237363, -172890, -452705, -562921, -302267, -125042, -220820, -242373, -163234, -96102, -212348, -280683, -221898, -147797, -124639, 5972, 205916, 347936, 360372, 214540, 177496, 62252, -89798, -340375, -433526, -338577, -219189, -35798, -100490, -409895, -419543, -153422, 49672, -56370, -321113, -567595, -725550, -630595, -301847, -150532, -133502, -189379, -305749, -316895, -360010, -402586, -321767, -267635, -13033, 158827, 61679, 29954, 67972, 15674, -77367, -266260, -414476, -555664, -727130, -663415, -506534, -287190, 28586, 240176, 204700, 72901, -106264, -322042, -296806, -264952, -136631, -20804, -21028, 15168, 18287, -10821, 85719, 257618, 426872]
14085D26872q8172j25965k44210k27039K48476J78441j24626J0258P2612j0344
14075A16303k45159k92876j93582L8569K54376N12314J63431j50774l98651j70412
14065c66461K56448J95489Q5876q0123j08343k42276o6931J19524L3917r1271
14055b64151J12601K1721j03153L2830m8426o9518K2300J10888k0552k89350q3670
14044e78480K18713r2282l7906J42546J33979O6648k4873J4322R3308Q1539j25784
14033a08270k9497k2626J6381p1729j6252j60749p4656j721R5013J54694O6261
14022a53151N8121K06102Q7733J86576O1918j11590m4068k8140j964L0124m9963
14011B41698m0102P524j29833R428J12283l6823k01646j82690N4346q0518r0757
$$ y = [426872, 338700, 212735, -31475, -258514, -10038, 168403, 43777, 54035, 126647, 116303, -128856, -421732, -615314, -576745, -322369, 189945, 353376, 202602, -196049, -366461, -110013, 85476, 171352, 91229, -17114, -259390, -326321, -206797, -172880, -264151, -151550, -129829, -232982, -200152, -248578, -318096, -295796, -184908, -205460, -494810, -578480, -359767, -452049, -489955, -347409, -213430, -146782, -171655, -157333, -64025, 17514, -108270, -137767, -160393, -144012, -215741, -231993, -392742, -467398, -469119, -374106, -219412, -153151, -95030, 111072, 198805, 385381, 447299, 335709, 291641, 263501, 261537, 291661, 241698, 201596, 209120, 79287, 88715, 200998, 164175, -37471, -220161, -165815, -246333, -337090]
14000c37090j25210o3652J53021J52250J80546J43785J46159J90688R0569N889
13990E36955j27662k97588l27372M810J74976J92136J25637K58330J67070p5526
13980F31766l31499k51967J1765k6306j36364K5143J41418o1699l3007q2522O9113
13969d4159K00778P5605J02682M9253q3375j28620j2974J07467q3180j07741P5043
13958A50779J66158k0370k18129l57504j44051J07744K9604J11608L57147K8503
13948B11489k68709j38792Q7874J29269O8051l4365r783K4976j50296l2920J19146
13937E940K9699k17507j27265L9158R1019R2866J05701O5713J63487N2751j8699
13926B82863n5299j75446j20418j35213p6549J41780Q9735q852K9824l2123L3244
$$ y = [-337090, -462300, -525952, -372931, -220681, -40135, 103650, 249809, 440497, 531066, 536955, 409293, 111705, -215667, -210857, -35881, 156255, 281892, 540222, 707292, 631766, 300267, 48300, 60065, 33759, -102605, -77462, 63956, 2257, -30750, -113272, -44159, 156619, 232224, 334906, 384159, 300784, 172164, 159190, 266657, 183477, 75736, 150779, 316937, 296567, 78438, -279066, -423117, -315373, -285769, -174161, 182986, 211489, -57220, -196012, -108138, 21131, 89182, 54817, 45034, 70010, -80286, -113206, 5940, 35639, -181868, -309133, -269975, -178956, -86090, 19611, 85324, 248811, 301562, 282863, 227564, 52118, -68300, -203513, -280062, -138282, -48547, -57399, -27575, -59698, -26454]
13915b6454K08700P2569K5373K26889M0397k34849l22129k36559r9749J10194
13905b35618J65182L81315J68858j76489j40984m5616n3638L7622J9064j05147
13895A4549j05800k2584J13961P7123o889q8658j86754j66364J57559K28099L1635
13884D5877m1191O8506J75196k1035j76395o3500O5069Q7320k8731j67180o6046
13873a22110J36162J63814O750j88929j19627q5912J04155J15694J05275K92818
13863D08090L56375K6594n4991o6191j75958n6905j818m0267J906N0969o9739
13852C78065k59171j43060N4220p7742l04549m72141r0418L54108J79099M1630
13842c39959J38635K449J33747Q2873O0128l9560P1809L8988p6949o7586M0528
$$ y = [-26454, 182246, 254815, 280188, 507077, 547474, 312625, -9504, -246063, -345812, -235618, -70436, 310879, 479737, 303248, 162264, 116648, 63010, 100632, 119696, 14549, -91251, -113835, 126, 77249, 70360, -18298, -205052, -371416, -213857, 14242, 45877, 4686, 73192, 248388, 227353, 50958, -12542, 52527, 139847, 111116, -56064, -122110, 14052, 177866, 184616, -4313, -123940, -209852, -105697, 9997, 115272, 408090, 764465, 791059, 736068, 669877, 493919, 437014, 435196, 394929, 396835, 447804, 378065, 118894, -24166, 30054, -47688, -352237, -824378, -914796, -560688, -381589, -339959, -201324, -198875, -65128, 17745, 77873, 38313, 110122, 149110, 72161, 4575, 45103]
13831D5103N5532P2735l6322r4998O334J23538J27172M4530m9912j02038J735
13820A93409P1727J4862k29716k66033j58977j6943r0177O0067J47465l0476p3962
13809c78754J27759J89421J38063J96118K6552r866j14739K4402L3351k18399
13799A3908J18311K66915o3728k78688j66175J8674j853n67J52501J26469k03271
13788a7504k6776J47125O0683j2637j89621j81425j30045q2313O6778l3812j51464
13777e51011j02282M7119J22509J09307j34622j32354j704Q1646J32153K6975
13767d02264N5219J35886N9508m4743J13786L1389n9674M9520l3387M1135J66916
13756A13291Q3488J20096K24403M2324r5753k05453l90434m18825q5368J35467
$$ y = [45103, 100635, 173370, 137048, 42050, 48384, 171922, 299094, 343624, 293712, 191674, 193409, 265136, 279998, 50282, -215751, -374728, -391671, -481848, -421781, -274316, -304792, -378754, -250995, -61574, 76489, 272607, 299159, 289293, 174554, 198956, 232307, 13908, 132219, 399134, 335406, 56718, -109457, -90783, -92636, -93203, 59298, 185767, -17504, -44280, 102845, 163528, 150891, -38730, -220155, -350200, -432513, -365735, -399547, -551011, -653293, -606174, -483665, -374358, -508980, -641334, -643038, -561392, -429239, -402264, -347045, -211159, -151651, -196394, -82608, -51219, -110893, -61373, -94760, -53625, 113291, 196779, 316875, 541278, 583602, 487849, 282396, -108038, -526863, -612231, -476764]
13746d76764J64274P8347M891m7926p7758p003N2902K4852J6591j35030k3556
13735d26180K76260K92866P37j12324O402K8947m8002j35602j65603n7620J78568
13724a61551K50808J12776m0073j90976l10740j62524K2730J81411K89960J29413
13714A21234j25570j94158q2522M5719j19487j88384p2134r53J01469K20581R8957
13703a95248m1983k37774j45742j776K2722m0046J90772K71107J57619P2185r1063
13692c9227j54010R4488O5195p9312j27571j78271N1012N2812j2057n9718n9365
13681d46024R8376M3694m8814j2243J07134J84237k2765p3476R0122N7425j25434
13670a47768l05959j11118K99220O9832j19010n4979J03641L48351K43155n432
$$ y = [-476764, -312490, -234143, -229252, -277178, -354936, -361939, -309037, -284185, -267594, -402624, -426180, -149920, 142946, 143683, 31359, 37761, 66708, 18706, -116896, -282499, -340119, -161551, 89257, 202033, 161960, -29016, -339756, -502280, -479550, -298139, -8179, 121234, -4336, -198494, -281016, -235297, -354784, -543168, -615302, -616255, -514786, -294205, -195248, -237231, -475005, -620747, -622523, -599801, -639847, -449075, -177968, -20349, 51836, -39227, -193237, -98749, -33554, -112866, -240437, -418708, -367696, -314884, -326941, -386659, -446024, -347648, -303954, -352768, -365011, -257877, -73640, -96405, -169881, -79759, -22334, -147768, -453727, -564845, -265625, -195793, -314803, -369782, -266141, 82210, 325365, 319933]
13660C19933q4089j67652j60175p294R1768j11182k13582J46927L21181q651j08105
13649A9079n0286J07232J42780k8531p3649k9105k8414K0986n554k64241k50020
13638d39723o991K48741J94562M6575m8854j1100l724L5908R2438J56314K0648
13627B84794k22286r3457J59289M0363J6302n1850j10480k79276m6182N713J7644
13616b79426J406j52840J35585N8655j26355k51125k92682L4553M09853L27914
13606a34462P5661j71868q8126o5662r3782j22926M782R1664J92184J60836K00174
13595D8475J38136m8883j22262q4209r5463k06106o1787P141R5749K29887J58485
13584E9163J04660K08941M7053j76784k68172j22274l5444q9282k89619j70201
$$ y = [319933, 235844, 68192, -91983, -99277, -7509, -118691, -332273, -185346, 135835, 127184, 19079, -31207, 76025, 218805, 190274, 116625, 87520, 59106, 80092, 74538, -189703, -439723, -446714, -197973, -3411, 43164, -5690, -16790, -20514, 15394, 107832, 264146, 284794, 62508, -30949, 128340, 168703, 185005, 133155, 22675, -256601, -302783, -297070, -279426, -278020, -430860, -295275, -236620, -362975, -614100, -906782, -872229, -462376, -134462, -58801, -230669, -318795, -384457, -478239, -601165, -596383, -504719, -312535, -151699, 48475, 186611, 137728, 15466, -68743, -164206, -370312, -432099, -424958, -329209, -99322, 59163, 163823, 372764, 419817, 243033, -25139, -147413, -182857, -272139, -561758, -731959]
13574g31959j6276J1969J25368J6403p0314J34030K56383J85979q3567k993J0710
13563a64267o7884K2550K00032K31359o982k47726j80544j08064J8297L1258O2560
13552b09411K22427Q8029p3387j02077l4007q9478J9498L79n2604M757O8924N2087
13540a04863J17156J05107R8849l3788k23765J19066J92291m2562p301M6022j95159
13529G1053Q049K52407m9411L6407K61357K69438j08387j18052l03630j60626
13519A58605n359k2249J1692q7888l3743m5578j00033J3587J63537P2341o1601
13508F3311L9589J09799m4060q6128o0567m8702r4359R6592R4828O2585o7165
13497F5723r9861Q5572j3702j66461l9323R5158m019J02154O2242N3078J03060
$$ y = [-731959, -748235, -736266, -610898, -594495, -664809, -530779, -274396, -88417, -171984, -174977, -164267, -232151, -209601, -9569, 221790, 214808, -32918, -213462, -321526, -303229, -271971, -209411, 13016, 101045, 27658, -74419, -108426, -197904, -178406, -178027, -230631, -225874, -156950, -104863, 12293, 117400, 216249, 182461, -41304, 77762, 270053, 227491, 220190, 266212, 71053, 79102, 331509, 282098, 318505, 579862, 849300, 740913, 622861, 319231, 158605, 153246, 130997, 142689, 54801, 21058, -24520, -124553, -110966, 52571, 124912, 63311, 102900, 212699, 168639, 82511, 21944, -26758, -121117, -24525, 70303, 132888, 65723, -34138, 51434, 37732, -128729, -168052, -72894, -76913, 25241, 87483, 140561, 243621]
13486B43621p5759j01893k45848k07120O8168J34450J70202J19845l6263J14293
13476A83696M4652k6883j05143j73395M1015o4631k67464k3138J68816J35044
13466h7431l069k96793j27612J01769J18879K09037O8018r1684r2274L0576J56233
13455a4351K04452L2789j52874j29327N663o2424k67641j36938J79631J60909
13445a80111o7676q2119J44540J52354j54353j67952O1687l1284o9056Q9524J97612
13434a06834K9966K9248K37892J96942j82301k09327j86474l6798j94552k31201
13424f53439J61454J98369K0176o1948l9078N8890J25823M50524L11704j05210
13414D67265j37715j44553j30726n6809L1826p0634j45014m6379K13304K15572
$$ y = [243621, 167862, 65969, -179879, -386999, -318831, -184381, -14179, 105666, 69403, 183696, 228348, 201465, 96322, -77073, -36058, -100689, -368153, -391291, -222475, -87431, -90500, -387293, -514905, -413136, -294257, -85220, -17202, -108886, -201160, -170584, -14351, 190101, 222890, 70016, -59311, -53648, -116072, -383713, -520651, -341020, -180111, -247787, -329906, -185366, -33012, -187365, -355317, -293630, -324914, -393970, -304446, -106834, -76868, -47620, 190272, 387214, 204913, -4414, -190888, -227686, -422238, -653439, -491985, -293616, -273440, -335388, -374466, -315576, -189753, 260771, 572475, 467265, 329550, 184997, 54271, -2538, 29288, -41346, -186360, -232739, -19435, 196137]
13404A96137K5853k5893j23060j92589n9852J8587K04435K16480P3152j43562
13394A89688o2237m6890j44274j16452j92758o1580K08133O9765R3369Q8908k3191
13383B481j24217j21956p370n9558l3745n9492p4086P8118K00261P5274Q3819
13372d0471J85019P7171n7779j95726k20932K2074J30210J37935P8919o2517p5509
13361b1606M9849J03335P0721o0051k07880r8352L8586J43019K8854Q1015m7344
13350H0146l9239M0167J07008L1962l0104j05217j88724q16L1206j15186N5670
13339a33127K98717M2538L8554J34332M7028k1245q8023r2398j4302j47803j14978
13328e0707o1560n3935j3306j52522r7989L12278J83213k4958L2232k0942J17741
$$ y = [196137, 221990, 196097, 73037, -119552, -179404, -160817, 43618, 260098, 333250, 189688, 127451, 80561, -63713, -180165, -372923, -434503, -226370, -156605, -63236, 25672, 2481, -121736, -243692, -251062, -310620, -344365, -403857, -477943, -399825, -199564, -124290, -40471, 144548, 221719, 163940, -31786, -252718, -230644, -100434, 37501, 116420, 53903, -21606, 28243, 131578, 202299, 142248, -65632, -163984, -125398, 17621, 46475, 127490, 80146, 40907, 81074, 188082, 220044, 189940, 84723, -104001, -104817, -73611, -188797, -133127, 165590, 208128, 246682, 381014, 428042, 406797, 318774, 226376, 212074, 64271, -50707, -112267, -166202, -179508, -332030, -430019, -117741, 65472, 40514, 72746, 51804, 169545]
13317A69545j5185n4501L4866j3024p682Q1299j221j04818k4746j31195r5532
13306a62194j28307j17692P9906J87043K59316O8290k06692k80024p9211N1957
13296c27608K20421K14114O76k56969j49373L1121M9493m6266k7586R6500K30239
13285C4762L47947K01990j34556k08676j07544j5035J1062K04260J3192q0168
13275B67234k0634j21021k46559j36325J38843O6727j4214p3518j40233l7942
13265c17642M2538R1599K45911J74830n7148k04210L5811K21003N1995k1851P0383
13254C33219R9384j30840l0287K2331j09846M0270L0069L1143K42197k1185k15922
13243B90533m466j40222j27192J5764R593p2003m8764J65753K81704J58260J21545
$$ y = [169545, 154360, 99859, 134725, 121701, 114019, 195318, 194097, 89279, 64533, -66662, -162194, -290501, -408193, -328287, -141244, 118072, 186362, -20330, -300354, -379565, -327608, -107187, 106927, 107603, -149366, -298739, -267618, -218125, -264391, -291977, -195477, 34762, 382709, 584699, 450143, 241467, 133923, 118888, 129950, 334210, 347402, 267234, 246600, 125579, -120980, -257305, -118462, -51735, -65949, -139467, -279700, -317642, -275104, -183505, 62406, 237236, 180088, -24122, 11689, 232692, 284687, 262836, 333219, 432603, 301763, 271476, 293807, 183961, 224231, 254300, 285443, 527640, 506455, 290533, 286067, 145845, 18653, 34417, 44010, -27993, -76757, 88996, 370700, 528960, 650505]
13232F50505J13867Q4346L0386J05993M8906j38055l10372j40425K25648O8344
13222G39143l9168J3925m2927q8556n257l7403j3824J76836J61837L5847l3568
13211H66885m1724k49546k97230o8384J40759K14979R3859J0995j53492J49313
13201F66414M1973j63958P7771j2468L2987J67278j6190j71698k13337j27229
13191B81543J56166L3551l67120m8171L70806J63879p4040k30611k24708q4880
13181b3585L9326L2028N8006J80216J81852p5566j42942j28988k09051j02497
13171a91201J40556O1569O333N7548J89077J19962J15409J15836m4795k20160
13161C50134k28504N1429K46906K65385m4397j24548M3777K3760J4114n3840p6704
$$ y = [650505, 764372, 848718, 879104, 985097, 1034003, 895948, 585576, 445151, 670799, 739143, 699975, 713900, 670973, 582417, 577160, 539757, 525933, 702769, 864606, 900453, 866885, 825161, 575615, 278385, 210001, 350760, 565739, 659598, 670593, 517101, 666414, 708387, 544429, 622200, 609732, 642719, 809997, 793807, 622109, 408772, 281543, 437709, 471260, 104140, 55969, 426775, 590654, 516614, 286003, 61295, -23585, 15741, 47769, 105775, 285991, 467843, 392277, 249335, 120347, -88704, -191201, -50645, 10924, 17257, 74805, 263882, 383844, 499253, 615089, 570294, 350134, 121630, 173059, 419965, 685350, 640953, 516405, 560182, 583942, 598056, 544216, 467512]
13150D67512m9203R1625q4780k26225m3849L06506K67417O8991J82177n4027k64282
13139F61862k41839k98646j28747J15263K72410J75472L8421j39525q8790O9744
13129D35625J4420j78999j93548o7789R6427L20191L85268l1763l50336j66507
13119B62989q8439K01930Q3291j37154k970J19120J60398J30282j0908j34826
13109E83713j20000r2361L0746k0786M7521p3646k12545J43957J31015J41527
13099E59141J22037J33641Q1163k16393k70001o1718L0616J32939L42304L72788
13089A226517J24154k29870q3172J13019l7803j95975j34477q6288k8155R6105
13079G64055l6166p8354j9173j2070K22716N0997j16464j09093J35564R3903r9412
$$ y = [467512, 418309, 509934, 425154, 198929, 155080, 461586, 729003, 797994, 980171, 926144, 661862, 420023, 121377, -7370, 107893, 380303, 555775, 594196, 454671, 365881, 435625, 450045, 271046, 77498, 9709, 106136, 426327, 811595, 779832, 429496, 262989, 174550, 376480, 459771, 322617, 319647, 438767, 599165, 729447, 718539, 583713, 463713, 371352, 402098, 381312, 428833, 355187, 142642, 286599, 417614, 559141, 681178, 814819, 895982, 679589, 409588, 347870, 378486, 511425, 853729, 1226517, 1350671, 1120801, 1037629, 1150648, 1112845, 916870, 782393, 696105, 667950, 764055, 727889, 649535, 630362, 618292, 841008, 892005, 775541, 666448, 802012, 895915, 796503]
13068G96503q6300J2768J29022l3162o4841K2774J64695R1092j4209j09585j92811
13057G15946N3203K70914J42933J12968K73024K70109J32673J02082k5613j42327
13047A905912P2934J77672L5244J7626j21478o3795J77352M4713j63363m4050
13037B038767J10785J09938K6207o5172K2713O1208j3594K22156L18749j6395
13027B815362n8509K48352K55805K83981M73786M76046N45086Q65088R64628Q37401
13017G707026L13387j40500m45060n69795n48164n36821n31456l93883j70634
13008D684100N9411J63947N5134l1323K1846K23928M21358N05440M23324M08822
12998F935987L96550L47755K84129M94090Q43621J155416J133546J397639J679685
$$ y = [796503, 710203, 722971, 851993, 818831, 753990, 776764, 941459, 1032551, 1018342, 908757, 715946, 769149, 1040063, 1182996, 1295964, 1568988, 1839097, 1971770, 2073852, 2048239, 1905912, 1978846, 2156518, 2191762, 2209388, 2087910, 2024115, 2201467, 2246180, 2082817, 2038767, 2149552, 2259490, 2285697, 2220525, 2243238, 2304446, 2290852, 2513008, 2831757, 2815362, 2756853, 3005205, 3261010, 3544991, 4018777, 4494823, 5039909, 5904997, 6869625, 7707026, 8020413, 7879913, 7434853, 6865058, 6316894, 5780073, 5248617, 4854734, 4684100, 4743511, 4907458, 4962592, 4931269, 4953115, 5177043, 5598401, 6103841, 6527165, 6935987, 7332537, 7680292, 7964421, 8458511, 9302132, 10457548, 11591094, 12988733, 14668418]
12989A4668418J541327J823126K304442L037524L857521M833123N903264P186961
12981D5155706Q768213J1061784J4406775J8958139K5024793L2754953M0145718
12974A96276081M0688390K4565285o845258l3017744m0912860l6690934k9025456
12967A15037504k2097443j6687035j2856250j0181317p915032o212783n316987
12960C3770657m652086l728206k802660k268012j942679j707313j573945j375447
12952A3720309j187283p09366n77052o06565q54972r09828n71844l62303k68259
12943G672837l25509n85033k43441l4366j67548j68123k19769j15122Q0877J9038
12933E913841j17704n5278k92904l8862K74714j8757K1812K31309K54086J774
$$ y = [14668418, 16209745, 18032871, 20337313, 23374837, 27232358, 32065481, 37968745, 45155706, 53923919, 64985703, 79392478, 98350617, 123375410, 156130363, 196276081, 236964471, 261529756, 254684498, 221666754, 180753894, 144062960, 115037504, 92940061, 76253026, 63396776, 53215459, 45300427, 39087644, 33770657, 29118571, 25390365, 22587705, 20319693, 18377014, 16669701, 15095756, 13720309, 12533026, 11823660, 11246608, 10640043, 9785071, 8875243, 8303399, 7941096, 7672837, 7347328, 6762295, 6518854, 6484488, 6316940, 6148817, 5929048, 5813926, 5894803, 5913841, 5796137, 5740859, 5447955, 5409093, 5683807, 5665050, 5686862, 5918171, 6172257, 6174031]
12923F174031M8924O4549K03949M21814N80098R88019J116374J139346J187977
12914A1925081P12884p3110l71833k74945k84611r3796J36990N10792Q04644R11165
12904A3903261R68625J132030J688194K116456K468715L017454M130303N182394
12896C4607432N973227P298648R185887J1730435J5507145K0572076K7453761
12889A32328611L5625976M2642470L9944662J7716000j6300320l8793672m2053329
12882A71110398l5371573k7326777k0647361j5378675j1942911r304385p257680
12875D3881036n866808m865756m011029l197531k312102j621622j164308o08418
12867B0233462n8979K3287j281546k399547k053765j499209j395854j210868q33858
$$ y = [6174031, 6222955, 6287504, 6491453, 6913267, 7493365, 8481384, 9597758, 10737104, 11925081, 12637965, 12564855, 12193022, 11918077, 11633466, 11539670, 11676660, 12187452, 12992096, 13903261, 14871886, 16003916, 17692110, 19808566, 22277281, 25294735, 29425038, 34607432, 40580659, 47879307, 57065194, 68795629, 84302774, 104874850, 132328611, 167954587, 210597057, 250541719, 268257719, 251957399, 213163727, 171110398, 135738825, 108412048, 87764687, 72386012, 60443101, 51138716, 43881036, 38014228, 33148472, 29137443, 25939912, 23627810, 22006188, 20841880, 20233462, 20174483, 20197770, 18916224, 16516677, 14462912, 12963703, 11567849, 10356981, 9523123]
12858I523123n92899n17056l76147k65514k51366l58115k16921k35572k51208
12849F458325q2057j05948n6016J20900J2786j24507j80312J31331K48173m2424
12839F380251p0736k17676q8964p5151m7854P5102J87100O7770Q4789n8912N7471
12828F293190K87644J97351K68275M42335N72734Q13954Q23004O54481N33181
12819A0886149P06722J094707J395595J601233J811871K116324K670221L323708
12811B5606530M335689N517019O617314Q212885J0139013J2682321J6551745K1808287
12803A11470803K9122472L7298336M1837948L3973101P636419k3643835l9799373
12796A97895871l9574486l2447901k4991002j8945633j4747429j1581126q804637
$$ y = [9523123, 8930224, 8413168, 8037021, 7771507, 7520141, 7162026, 6945105, 6709533, 6458325, 6376268, 6270320, 6214304, 6335204, 6347990, 6223483, 6043171, 6174502, 6422675, 6380251, 6309515, 6091839, 6002875, 5927724, 5879870, 5954972, 6142072, 6209842, 6294631, 6235719, 6293190, 6580834, 6778185, 7046460, 7488795, 8061529, 8875483, 9698487, 10352968, 10886149, 11592871, 12687578, 14083173, 15684406, 17496277, 19612601, 22282822, 25606530, 29942219, 35459238, 42076552, 50289437, 60428450, 73110771, 89662516, 111470803, 140593275, 177891611, 219729559, 253702660, 261339079, 237695244, 197895871, 158321385, 125873484, 100882482, 81936849, 67189420, 55608294, 46803657]
12789D6803657p013610n568289m344708l684276l330298k794885k269223j830185
12781A5968183j665837j519730j079293j004007r34518o71913o85008p83270o76894
12772F947713m34281k56756k79939n74275o68987m61288k44169n1071j44684l01497
12762C530766k08208p7380m1118o4940j03159j23248j96576m07667m71604k44556
12752A592310j4032J37253J36088J41131j6967j54741n3239r3827J00586K05012
12742A979574n4378j70242j16626k93078r8375J43165L2124j7369j58437p9934
12732A166424o6067j54955l5464O4487j2696j02971O1131Q0797o0391k07455p1320
12721F61520j43779j48722M7875J73399J43291L4422J04535m9690k80492K4561
$$ y = [46803657, 39790047, 34221758, 29877050, 26192774, 22862476, 20067591, 17798368, 15968183, 14302346, 12782616, 11703323, 10699316, 9764798, 9092885, 8407877, 7624607, 6947713, 6513432, 6256676, 5976737, 5402462, 4733475, 4272187, 4028018, 3976947, 3832263, 3530766, 3322558, 3245178, 3204060, 3139120, 3035961, 2912713, 2716137, 2308470, 1836866, 1592310, 1578278, 1715531, 1851619, 1992750, 1975783, 1821042, 1767803, 1673976, 1774562, 1979574, 1925196, 1754954, 1638328, 1345250, 1246875, 1390040, 1422164, 1404795, 1246358, 1166424, 1100357, 945402, 909938, 974425, 961729, 858758, 919889, 1000686, 940295, 732840, 661520, 517741, 369019, 416894, 590293, 733584, 768006, 872541, 822851, 542359, 566920]
12711E66920K23699K29410l793p3783k35934l46213K1943J87727J9666K870j2590
12700E79922l1736J33198J55527j90316k29804K7675K88579K03191k23183l7452
12690F75601J04175J03075r27j31159l4906J18713L01219o454k29625j12344k6711
12679G60657J2352Q2245k8451K4439k3111m45803k12230K60347J38565r3470p9745
12668C95795j02503J31129K03958m5328n2427Q3426J32587o4931k6221o0486l0078
12657E64921J9987p8501j55578j69057J21702L7110o5232n0616M7269m9462M7095
12646B69638K48133L2895o459j83967j97874m5630L4681r0036j8821M982o9404
12635b1862P5161M7123j49888j6827J23332o6130k512k2260O3240O2726m9239
$$ y = [566920, 790619, 1020029, 1016236, 942453, 706519, 360306, 382249, 569976, 589642, 592512, 579922, 548186, 681384, 836911, 646595, 416791, 444466, 733045, 936236, 713053, 675601, 779776, 882851, 881924, 750765, 715859, 834572, 1135791, 1129337, 899712, 787368, 760657, 773009, 855254, 826803, 851242, 828131, 382328, 170098, 430445, 569010, 475540, 395795, 293292, 424421, 628379, 583051, 530624, 614050, 746637, 681706, 655485, 594999, 564921, 584908, 506407, 350829, 181772, 303474, 340584, 275352, 224736, 272005, 222543, 269638, 517771, 550666, 544207, 360240, 162366, 116736, 151417, 61381, 42560, 47542, -21862, 53299, 100422, -49466, -66293, 57039, -9091, -11603, -33863, 29377, 92103, 42864]
12624D2864o292K956l6918j6380N5342m612p1042j31584m5835k3082r903N4842
12612a89644O0751o3013K7149J71169K11933k3720j55131j74984q5427J02648
12602a18269J13490N8042P8584L2674l3259J23078M8141k06556l26336q8432M2421
12591b76422M0575M8968J79829O2670j14191o2917k03238p5749J39748R6113j18020
12580b82634j2742M5629N4648J32282O2823Q2267j01028j26226k5493Q0254l9031
12569a29251r6659O2678J86563O7733p4491k76339l33467J11004K81445J44373
12559e6411J38505J20912K580k67248r7309N0348n4245p2826K27857L60606Q6518
12548D39287j09744k49919k85450j3393M0457m6435m1244J51511K04592J59430
$$ y = [42864, 36572, 39528, 2610, -13770, 41572, 36960, -34082, -165666, -211501, -234583, -244486, -189644, -128893, -191906, -164757, 6412, 218345, 194625, 39494, -135490, -220917, -118269, -4779, 53263, 131847, 164521, 131262, 254340, 302481, 95925, -230411, -318843, -276422, -235847, -186879, -7050, 55620, -58571, -121488, -324726, -400475, -260727, -164614, -282634, -295376, -249747, -195099, -62817, 6, 82273, -18755, -144981, -170474, -90220, -129251, -225910, -163232, 23331, 91064, 16573, -259766, -593233, -482229, -200784, -56411, 82094, 203006, 205586, -61662, -158971, -108623, -162868, -235694, -7837, 352769, 439287, 329543, 79624, -205826, -219219, -178762, -225197, -266441, -114930, 89662, 249092]
12538B49092J16581R0135j93500l51371k5848J10045J02618J69143J74290J2715
12528D53900k32940l00583o8779K43839J48736Q566K4080m9381k24221p7213K49155
12517A75159K06133P1127j24376j49457n6472j975J70585R8675j48179K2481J93172
12506D56873N6955j71098o0119J78218J09243m2808q4842J13272n155j08372N9960
12495E02127O3452K7439k35394m23766k26985p3274k06543R2805J50765n2937
12485c82311n70j13853j12976J9528J37683K98758n7970k19207J9271L4625N6979
12474c20043J16649K25616J03433J0502k6205j22297j5467J14683R0821q5040
12464I2652j06993J28120P6047k40078k48186k34487n5652J61893J67936K06532
$$ y = [249092, 365673, 455808, 262308, -89063, -114911, -4866, 97752, 266895, 441185, 453900, 220960, -79623, -148402, 95437, 244173, 252739, 276819, 227438, 3217, -73996, 175159, 381292, 452419, 328043, 178586, 122114, 120139, 290724, 389399, 241220, 263701, 456873, 513828, 342730, 282611, 460829, 570072, 527264, 442422, 555694, 550539, 442167, 502127, 565579, 593018, 357624, -66142, -293127, -366401, -572944, -480139, -329374, -382311, -382881, -496734, -609710, -590182, -452499, -153741, -211711, -430918, -411647, -377022, -320043, -203394, 22222, 125655, 136157, 109952, -12345, -27812, 86871, 177692, 92652, -14341, 113779, 189826, -50252, -298438, -532925, -588577, -426684, -258748, -52216]
12454e2216k4831k13516j61793j21646J58181K24358k6020O6255K30453J19901
12444A99126j32650j42887P4109m9648M0760Q2261k34992n443L89249J91086l4843
12433C76128J5867p3571l79301k07530J75075J61312J33041j2137o0009j74553
12423d5678l31689k67548m5142J74820K75187Q7475J01966R1579L0116n2704j43651
12412a25269M3494k8889j06899j3541J33865J68363O7658J0516K3621J80658L9341
12401C92918j90887l20631k0964J21457K09333M4023p5966J20716K0192k11632
12391H8559m4861J01491J5507O533J49076J22494p5674j05491n6549j14348j36977
12380e0240R0156J51929N9182J53609L13092J97232j02709l81799l34713j94701
$$ y = [-52216, -77047, -290563, -452356, -574002, -415821, -191463, -217483, -151228, 79225, 199126, 66476, -76411, -2302, -51950, -11190, 71071, -163921, -169364, 219885, 410971, 376128, 391995, 318424, -60877, -268407, -93332, 67980, 201021, 188884, 128875, -45678, -377367, -644915, -690057, -515237, -240050, -152575, -50609, 40970, 71086, 18382, -125269, -81775, -110664, -217563, -231104, -97239, 71124, 138782, 149298, 172919, 353577, 392918, 202031, -118600, -139564, -18107, 191226, 235249, 159283, 279999, 300191, 88559, 43698, 145189, 160696, 167229, 316305, 438799, 363125, 257634, 201085, 86737, -50240, 39916, 191845, 251027, 404636, 717728, 914960, 812251, 430452, 95739, -98962]
12370i8962j41275L4549K11982K42376K70210J43378k58768l74668k21822j54907
12360c47907J44904K22211L58744K61455o9189p2490j73410j64824K1333J9917
12350B00744q1745r2041K1272N0179J77952r7831j91787j4349P6225l7837k5554
12339a4772j9691Q6494J16055j00982Q3025J97264K37974m9721j95248j02895
12329B37503j70855o8986K03287K93336J54908K1358o3853j62266j80000j90425
12319G4007j32527L6177J98201P0125J80883L43448O2627p4456R6593J98113J71860
12308A225051L08882K80944O8426J03306J95606K98340N33299Q68590J054209
12299D936653N12871j38708n20926o08583p61267p89715n71600m23406k49231
$$ y = [-98962, -240237, -205688, 6294, 248670, 518880, 662258, 403490, 28822, -193000, -347907, -203003, 19208, 377952, 639407, 570218, 497728, 324318, 159494, 180827, 200744, 118999, 26958, 48230, 98409, 276361, 178530, -13257, -27606, 48619, 10782, -14772, -34463, 52031, 168086, 67104, 150129, 347393, 585367, 535646, 340398, 237503, 66648, -2338, 200949, 494285, 649193, 670551, 606698, 444432, 264432, 74007, -58520, -22343, 175858, 245983, 426866, 770314, 832941, 758485, 855078, 1053191, 1225051, 1533933, 1814877, 1883303, 1986609, 2182215, 2480555, 3013854, 3882444, 4936653, 5449524, 5310816, 4789890, 4181307, 3420040, 2630325, 2058725, 1635319, 1386088]
12290A386088j14690p9549k48973m54004j96420j44790o675R3643J47597J87438
12280E69665j52007j90764j09723M2744K4585p6180N773J77838K41773n2159j06263
12269C75282l6081q4108r9894K04222K51104J23106p7516l64001k13676J7800
12259I6238p6656j77334j1299J35239J37396J25490K96390j1344l28228k16757
12249c0865N8998K14956J27123N4178M4364k09445j66980J43193J02626j16970
12239B21178j18524q4023J20158J90059n0316L1498K6901k68256k03734J45749
12229A0690J38109M5667M3218o6547j07831k74751j66116o0061J7714J12461J79990
12218a27457J24828p4118r8127M1266p7688r1572J9541L2012J17198J43902O0697
$$ y = [1386088, 1271398, 1191849, 942876, 488872, 292452, 147662, 140987, 234630, 382227, 569665, 417658, 226894, 117171, 159915, 184500, 108320, 114093, 291931, 533704, 481545, 375282, 339201, 255093, 155199, 359421, 610525, 733631, 656115, 292114, 78438, 96238, 19582, -157752, -169051, -33812, 103584, 229074, 525464, 514120, 185892, -30865, 28133, 243089, 370212, 424390, 468754, 259309, 92329, 235522, 338148, 221178, 102654, 18631, 138789, 328848, 278532, 310030, 336931, 68675, -135059, 10690, 148799, 194466, 237684, 171137, 63306, -211445, -377561, -437622, -419908, -307447, -127457, -2629, -76747, -174874, -133608, -211296, -302868, -283327, -251315, -134117, 9785, 70482]
12207G0482l1353L3880J55033n116k2789J21403J5164j4072j03278j85902m8293
12196a4841j05259r0267k8231M0551L7273M8061K70823K18382K5917L7658J29213
12185E69280o4953n0147Q0048q1476j48367R9463K62856J26674j66591o9391l03435
12174B53961m17500j69761j3752N4873J24069R2280p9006K659J98516J24054R944
12163A80337P3848O3192j83019k00068m5016J15178R7458j6137l3486o7731J75576
12152A60132L98941J78673r5933k14586q2660m8308q9336L474m7577j48656j28588
12141a14424j0535J10378R0114q4556n8104p3665m0998J6385M8281N4597j21736
12130a84263n7215M8146P6320l9502P5851j30178j58383K1223J01891P7417k17314
$$ y = [70482, 39129, 73009, 228042, 222926, 200137, 321540, 336704, 322632, 219354, 33452, -14841, -120100, -210367, -238598, -198047, -160774, -112713, 158110, 376492, 402409, 440067, 569280, 504327, 454180, 534228, 452752, 304385, 403848, 666704, 793378, 626787, 557396, 253961, -163539, -333300, -347052, -292179, -168110, -75830, -154836, -152177, 46339, 170393, 180337, 254185, 317377, 134358, -65710, -110726, 4452, 101910, 85773, 52287, -15444, 160132, 559073, 737746, 641813, 427227, 344567, 296259, 206923, 210397, 162820, 14164, -114424, -124959, -14581, 75533, -9023, -67127, -140792, -181790, -165405, -117124, -62527, -184263, -241478, -193332, -117012, -156514, -80663, -210841, -369224, -348001, -246110, -168693, -386007]
12119c86007k30292J04885K07213M3404K20234K62457r3441k50612n8826k5988
12109b06973R9025Q7712k2196n293M8969M7861N6291Q131j7961J8003P0437J26928
12097C10934j1404k29768p4905J57008m3538j32674m2354P7316K31260Q1634l1556
12086B91953J69519P0900k78094j85845r2566n7159J21997J42040m119q5221j91500
12075i8095k09461j00421l4904j8118J4201K63238J48760j62213p7632K6322J34031
12064a14292K7060O979N0830J33686O2329N751L8401k4054j0471L0187K4456L7758
12052B68620J563j37391n6782o8909j12674j21637j05572M3p206J21029M26479
12041B07563J02157j25416J88377K47440J03963j49023l55632p0198K52268K66952
$$ y = [-386007, -616299, -511414, -304201, -260797, -40563, 221894, 128453, -122159, -180985, -206973, -107948, -20236, -42432, -47725, 1244, 49105, 105396, 113527, 95566, 113569, 184006, 310934, 299530, 69762, -5143, 151865, 108327, -24347, -66701, 10615, 241875, 323509, 291953, 461472, 532372, 254278, 68433, -24133, -81292, 40705, 182745, 178626, 93405, -98095, -307556, -407977, -442881, -460999, -446798, -183560, -34800, -197013, -274645, -248323, -114292, -87232, -80253, -29423, 104263, 166592, 172343, 210744, 186690, 176219, 206406, 230862, 268620, 270183, 132792, 76010, 7101, -105573, -227210, -332782, -332739, -339945, -218916, 207563, 309720, 184304, 372681, 620121, 724084, 575061, 219429, 149231, 401499, 668451]
12031F68451q5931l15619k50288p5678m8852q8750j25429R980J13228P264O3730
12020a27894M2736Q3943N4313Q9548J61217J78237P4822J586j41992k91595k15759
12009i0838m3323j9056K258M1874K3474n8710p6786n4381j09163j00126q9183
11998e73960J44152L23829K72869P607j68225l4224L9688k3385p193K34116J57329
11987C72603J9291J75294L7151r108J987K4501j63149j77032j07974p9917M6459
11976A40106L3104J07349J26263O3520o9987n2530k90120k29127j516j15259J17407
11965a70790K54789n3058j92550j03474J59912K6071j45447j07771m0226J4312
11955c58232J64728J68002n476p9541J7542J18379J31878K24228o799k03883j53961
$$ y = [668451, 582520, 266901, 16613, -59065, -107917, -196667, -322096, -312116, -198888, -191624, -127894, -85158, -1215, 53098, 142646, 303863, 482100, 556922, 558508, 416516, 124921, -90838, -134161, -153217, -150959, -109085, -85611, -144321, -221107, -275488, -384651, -484777, -573960, -429808, -105979, 166890, 174497, 6272, -27952, 11736, -11649, -18842, 215274, 372603, 391894, 567188, 604339, 595231, 597218, 621719, 458570, 281538, 173564, 93647, 140106, 173210, 280559, 406822, 470342, 400355, 347825, 57705, -171422, -172938, -288197, -170790, 83999, 30941, -161609, -265083, -105171, -79100, -224547, -332318, -372544, -358232, -193504, -25502, -30978, -110519, -92977, 25402, 157280, 381508, 374709, 170826, 16865]
11944A6865O0142Q2388O6594j259K18021K54248J19623j10500k28668O1182L9817
11933E78453o3873l3098Q1519J1501p3940p1295l3486o8326j18065R5531n7195
11922B47726p7184R4817J37587K60904J32436L53699L49133J89260R0322l7480
11912A741220q8554K49423O02826N27108N61070N57924L84382K57908p6876o76672
11902D039759q42788o97927n45136m78636l70041l07600k39496n4893j70254j43636
11892A89352L2400J13998K0626k30241k04744p1295J52816K90450J27732J5386
11882D36480l8458q5752q3221K8101q4k1815j04283J8223J78400J38659K01917
11871F68167j40314k22476n3399o3658J86400K22581J30780o9459j39688L0993
$$ y = [16865, 77007, 159395, 225989, 224730, 442751, 696999, 816622, 706122, 477454, 538636, 578453, 514580, 481482, 563001, 574502, 500562, 429267, 395781, 327455, 209390, 304921, 247726, 170542, 265359, 402946, 663850, 796286, 1149985, 1499118, 1688378, 1778700, 1741220, 1652666, 1902089, 2504915, 3032023, 3593093, 4151017, 4535399, 4793307, 4716431, 4039759, 3196971, 2499044, 1953908, 1475272, 1105231, 797631, 558135, 503242, 332988, 189352, 221752, 335750, 356376, 126135, -78609, -149904, 2912, 293362, 421094, 436480, 398022, 312270, 229049, 257150, 257066, 235251, 130968, 149191, 327591, 466250, 668167, 527853, 305377, 251978, 188320, 374720, 597301, 728081, 658622, 518934, 549927]
11861E49927q357m3341O8749R0624o2991p673k2229N2761J81054m8017r5522r3425
11849E61560k94105j77299K833k1202R3818J87186M6976j5872j87067m1885J86717
11838C41660j45670j83539N1819K18717J16785p6701k91716n9853L8664J7388
11828B7554K0275J27835P261j14990j62217k84744Q92J57420K5568M5840J41661
11817g645M5115J03771M5570M0765J50081O2080k3137k89746k57106J5781K06173
11806I1702M3564p0866O9281q0938j91256l1581J34551L9053k351o465m5647j62155
11794b13108l6244P1107K16153K88436L60248Q738l98640j3019R0402J199M5107
11783D20379p5253o623R4693L8469j05706j52650j35645j11394m2125P79n2080
$$ y = [549927, 541570, 498229, 566978, 657602, 594611, 586938, 564709, 617470, 798524, 750507, 654985, 561560, 267455, 90156, 92989, 71787, 165605, 352791, 399767, 383895, 196828, 154943, 341660, 195990, 12451, 64270, 282987, 399772, 323071, 31355, -28498, 10166, 27554, 47829, 175664, 182925, 67935, -94282, -379026, -378134, -220714, -195146, -149306, -7645, 37470, 141241, 186811, 227576, 377657, 439737, 416600, 126854, -130252, -114471, 91702, 135266, 64400, 133681, 52743, -138513, -170094, -35543, 3510, 1159, -5306, -50953, -213108, -249352, -178245, 37908, 326344, 686592, 695330, 296690, 283671, 374073, 375272, 420379, 345126, 338503, 433196, 471665, 365959, 213309, 77664, -33730, -75855, -75076, -127156]
11772a27156j1371j0171R3669K32165K21342K16777Q0096o0032k24261j98147
11762B12911j22109k2469k366L7623k8365l8847l9247m13758m77538M5990M71288
11751c76887L13125J38799P0520j96957k79883m3411J98499K20007R2120r2220
11741D3712r1891o0810q5411p1224Q7867J11199n4245q4588k344j7600j22452
11730c47787k4167J06125L6903m8585J69911J00175p777j9457k2282n8583K8457
11719h7067L1116J0350K0769m0944l443p5853j84486L959R9969q4610n1836K07879
11707a54197L42633L02835j77910l52091M507J49798P2620O2565J71678K3287
11697D45725j48620k64607R2504K77483O8226l4717p3462l5684J63398O8152j98668
$$ y = [-127156, -138527, -148698, -55029, 177136, 398478, 615255, 695351, 635319, 411058, 212911, 90802, 68333, 65967, 103590, 75225, 36378, -2869, -416627, -894165, -848175, -376887, -63762, 75037, 145557, -51400, -331283, -374694, -176195, 43812, 135932, 43712, -48179, -108989, -194400, -265624, -177757, -66558, -120803, -205391, -207735, -225335, -347787, -371954, -265829, -228926, -277511, -107600, -7425, -15202, -34659, -56941, -115524, -87067, -55951, -45601, -24832, -65776, -69219, -145072, -329558, -325599, -225630, -310240, -362076, -154197, 188436, 491271, 313361, -38730, -34223, 115575, 188195, 250760, 422438, 445725, 297105, 32498, 125002, 402485, 470711, 435994, 362532, 326848, 490246, 558398, 359730]
11686C59730j93566j33254j1924M0684n0388j49304j94508j67920O6641J77766
11676b56043j7340n3377M0829p1029J83366L02065J03785r742P1542J89580r167
11665D74469k461l0556j44654q3159K7304J19054m7342j44658o5282k3935j22536
11654d3756o7171N0786J17974J71826J18592j67623j64159o8962N2738J99527
11644A99772L0570j66998K8516N3881k73940q5912J93073J62448P1140J2094n7643
11633A67001p2831k7159k62778j7532J77o5245l205j6704R7252N4892J8195R4338
11621c3599J73545J18494M5553R482p1108p634j14144k38834j40572r3664P0823
11610b81658J80385k2039k13320o9800J99127m3455j77886N4735K8203N5190K15551
$$ y = [359730, 166164, 32910, 20986, 61670, 11282, -138022, -332530, -500450, -433809, -256043, -273383, -326760, -285931, -356960, -173594, 128471, 232256, 222514, 294056, 483636, 474469, 472008, 441452, 296798, 213639, 240943, 359997, 312655, 167997, 102715, 78780, -43756, -110927, -60141, 57833, 229659, 348251, 180628, 16469, -52493, 245, 199772, 230342, 63344, 91860, 145741, -128199, -214111, -21038, 141410, 212550, 224644, 167001, 94170, 67011, -195767, -213299, -213122, -278367, -281572, -298276, -201024, -146132, -127937, -33599, 139946, 258440, 303993, 313475, 242367, 234733, 120589, -118245, -258817, -352481, -281658, -101273, -123312, -336632, -406432, -207305, -250760, -428646, -373911, -345708, -290518, -74967]
11599g4967K38987K89179R040j35295J6172j26806k13640j72846N5650J97183
11589H2657N8490j45429l4396L746r8757o8968k6252p0753J15105J98332Q4268
11578I8043j15105j79520K4513J56843Q5654J17831L87554J68520k28486l44438
11568A71409j08995J29617M5110R2743J43761J44156K8508j33469j81599j97971
11558A33270P1774J67587r3426M5078O6026j09466J10062J80073P2045O643P5937
11547G25603R4708K22640K12811L5411k1035J42743J63573j41553m5131J2371
11537A402141J29951L62740K59774K03587L50711L98911P62745Q02700M03668
11528E076928j67317o38476o83917o47702n70170k19293o1096j51969k64664k55004
$$ y = [-74967, 164020, 453199, 462239, 326944, 343116, 216310, 2670, -170176, -114526, 82657, 141147, -4282, -38678, -34932, -133689, -202657, -228909, -299662, -184557, 13775, 98043, -17062, -196582, -172069, -15226, 70428, 188259, 575813, 744333, 515847, 171409, 62414, 192031, 237141, 329884, 473645, 617801, 646309, 512840, 331241, 133270, 205044, 372631, 279205, 324283, 390309, 280843, 390905, 570978, 643023, 649666, 725603, 820311, 1042951, 1255762, 1291173, 1270138, 1412881, 1576454, 1434901, 1389770, 1402141, 1532092, 1894832, 2154606, 2358193, 2708904, 3107815, 3870560, 4673260, 5076928, 4909611, 4271135, 3587218, 2939516, 2369346, 2150053, 2088957, 1936988, 1672324, 1417320]
11518A417320j05483n9930j03354j73270j48509Q183q2475k4611J65055j02851
11508G90075l17792j23843p7562J32957K40210J67356J19343R1162J14134K28983
11498A365023L25404K60337L62144L42690L13062K91394N38701P95609M22571
11489E016935k07542o45289p67639o45941l89699j40937l51096n28075m27726
11480I12991J8943o1602j06331q760j19870k47954j75598R9899J01577J53476
11470E66771j54822j60365J87648R9256k21079k96539k7566K10039k2572j68017
11460A2754K2453J27536K524R2231J48646J39159l1258j95169J7381J55644k26
11449D91675q5645m3587r0978O081l2494L399j72070k46144K107j003M0382J65961
$$ y = [1417320, 1311837, 1251907, 1148553, 975283, 826774, 834957, 752482, 727871, 892926, 790075, 472283, 348440, 270878, 403835, 644045, 811401, 930744, 1021906, 1136040, 1365023, 1690427, 1950764, 2312908, 2655598, 2968660, 3260054, 3798755, 4594364, 5016935, 4809393, 4164104, 3396465, 2750524, 2360825, 2219888, 1868792, 1340717, 912991, 931934, 870332, 764001, 755241, 635371, 387417, 211819, 311718, 413295, 566771, 411949, 251584, 439232, 538488, 317409, 20870, -6696, 203343, 180771, 12754, 35207, 162743, 165267, 257498, 406144, 545303, 514045, 318876, 336257, 491901, 491675, 406030, 362443, 271465, 277546, 245052, 248451, 76381, -169763, -167656, -168659, -128277, 37684]
11437C7684J05775M828q2180j17431k2351M9595o1067Q2149L35575J50322L4557
11426E17456J28230j09865k91655m5288n208J14781J03718p9222k69040k20145
11416a56238K2171P5511j03812M9179K19830L9122R7141L2381j33589m6303P4107
11405A69500O0485J53931J32743o7997j99425N7168J55050R5673Q0835j04229
11395E33734j36953k18373o4720j9436R4414O5343J8664q535m6611P9763J74262
11384D71552j04378j37488J4445M5240j06533j31130r0048k10767j35077P4070
11374c10114J16055o1446J07480L67504K45711o1198k00555k41314j08701M45917
11364B99339N86400N50742O05271N40872m8945o75458m98613k19824j43838j49912
$$ y = [37684, 143459, 148287, 66107, -51324, -73675, -24080, -85147, -2998, 332577, 482899, 517456, 645686, 535821, 244166, 198878, 193670, 308451, 412169, 332947, 63907, -156238, -134067, -58556, -162368, -113189, 106641, 145763, 242904, 275285, 141696, 95393, 169500, 229985, 383916, 516659, 448662, 249237, 306405, 461455, 557128, 637963, 533734, 396781, 178408, 113688, 94252, 188666, 254009, 272673, 264138, 217527, 297290, 471552, 367174, 229686, 244131, 289371, 182838, 51708, -38340, -249107, -384184, -310114, -194059, -255505, -148025, 219479, 465190, 403992, 203437, -37877, -146578, 299339, 885739, 1436481, 2041752, 2582624, 2533679, 1858221, 1359608, 1139784, 995946, 846034]
11354H46034j06222k85677l78426j71505J9193K04742J67774k7436j04319Q6735
11344B50893J25366J24792m7812j41859j4795J33650Q6128j32463k26957j52060
11334D883k97788q9258k4409j11080P7648L2420J47679L50376J95434k20999l62832
11323b97926L0054Q0475J2661o9320m7449O6093r3320j3771J83138J38908Q0820
11312G0363K81347K73907J36845j08056k19842m266j2573q9850j09777o6496J33685
11301B85287J21567J19557j63765l5398M1842q3966j96242k34508j20417M8806
11291b17237J477j9675O2545J4514n3197k0189Q9267J30272j79835j23198J2620
11280c02636R9114J7141k3506o0550j29839K8518K45168K07330J19416K4859m5367
$$ y = [846034, 739812, 454135, 75709, -95796, -76603, 128139, 295913, 268477, 164158, 250893, 376259, 501051, 453239, 311380, 296585, 430235, 516363, 383900, 156943, 4883, -292905, -382163, -406572, -517652, -440004, -407584, -259905, 90471, 285905, 64906, -297926, -267872, -187397, -174736, -244056, -291505, -225412, -318732, -332503, -149365, -10457, 70363, 351710, 625617, 762462, 654406, 434564, 430298, 417725, 327875, 218098, 151602, 285287, 406854, 526411, 362646, 327248, 369090, 285124, 88882, -145626, -266043, -217237, -215760, -235435, -172890, -158376, -211573, -231762, -142495, -12223, -192058, -315256, -302636, -203522, -186381, -209887, -270437, -400276, -371758, -126590, 80740, 200156, 225015, 179648]
11269A79648j88003k29113k21955J0500J04482J36226J41276Q9643j2953n1467
11259d1716o4691k25298k80525m3693J44109K23112J94908J64687J04169m3751
11249A31311r7279m6551Q0059m8280j97100M5205K61117Q1285j6631K38824J77940
11238F09900O87o532N3087k11810m35336k32560J2061L7109J13627J05938m8842
11227b671k1882k5961k4540j29137m9854J10279J67936j7760r6697m114J67393
11216G2992P6955j97924k62861L7545J99060J30509R3852L0748m13914l24958
11206e57996J60740O9559n9382K41959J93529j45174k83324j2830K11547J92713
11196A1341j9890l9099r0725r0868L7622K3341j02191M8663K31929K35264J22768
$$ y = [179648, -8355, -237468, -459423, -448923, -344441, -208215, -66939, 22704, 9751, -41716, -106407, -331705, -612230, -655923, -511814, -288702, -93794, 70893, 175062, 131311, 34032, -12519, 67540, 19260, -177840, -132635, 128482, 209767, 193136, 431960, 609900, 610587, 604055, 657142, 445332, 9996, -222564, -210503, -173394, -59767, 46171, -2671, -24553, -50514, -75054, -204191, -254045, -143766, 24170, 6410, -90287, -94401, 72992, 149947, -47977, -310838, -273293, -74233, 56276, 150128, 180876, -233038, -557996, -397256, -327697, -387079, -145120, 48409, -96765, -380089, -392919, -181372, 11341, -8549, -47648, -138373, -229241, -191619, -168278, -270469, -221806, 10123, 245387, 368155]
11185C68155j33156k58899l08532p0423J76543R5354q263M3261M0688M9433j20292
11174a26131k24884q2613J36453J50668P4337k13179l71153j35993J18139J67440
11164e06916K8297n75l7596q259J85017J59736K43058K06933j6155p9084k28767
11153e4311j18888J900p2463r6324j43787n4789O9504J37218R2102o9242L5260
11142b73820J04462m1990K6565K6920o5561L1009J3021K1089N6088J14821O1374
11131G3978q8105j19561P443L05299K49280k4613p6812M1357O9308J23551j133
11120E59992p5017r1854J0276n8447k25556r7814k121p3905N7802K3005K4481
11109E0842J71373J10108j70378k8620J66095J82283n9666l45989k71829r2398
$$ y = [368155, 234999, -23900, -332432, -402855, -226312, -130958, -139221, -95960, -55272, -5839, -126131, -351015, -433628, -297175, -146507, -72170, -285349, -656502, -792495, -674356, -506916, -478619, -479194, -516790, -525049, -340032, -180296, 62762, 269695, 253540, 174456, -54311, -173199, -171299, -243762, -340086, -483873, -538662, -469158, -331940, -239838, -309080, -273820, -169358, -211348, -184783, -157863, -223424, -192415, -179394, -158305, -102217, 12604, 73978, -14127, -133688, -126245, 179054, 428334, 403721, 326909, 368266, 437574, 561125, 559992, 484975, 393121, 403397, 344950, 119394, 21580, 19459, -54446, 3356, 26361, 50842, 222215, 332323, 161945, 133325, 299420, 481703, 422037, 76048, -195781, -288179]
11099b88179n9469j0065k7989J00727J92575M9511l0334p1232n974J0967q9073
11088b28535j64613R0100J67677k3521j20111m7945J71235J82757n8n5702j1060
11077c9776J23827R5556K50269J45759o1976M0807o1613l60341l38168j35802
11067c41458M5796J40596P4234q5788o9636k0716J3891K0611j81454k29313j0
11056f33247L11307L59519J09966n2846r7246j10209p8695q5558P5786K37266
11046C6043K75901q3032l13865j22239R1428J82583n9254N8431N7931j58707l2781
11035f7561M093L312J49122J22294O8725R4326j22j05681j97290j45661J57849
11024H3406r756m465j5702j16307J38433R711k10116O1750J03108J41816N7813
$$ y = [-288179, -347648, -357713, -385702, -284975, -92400, -42889, -73223, -144455, -150429, -139462, -228535, -393148, -303048, -135371, -158892, -279003, -326948, -155713, 27044, 26986, -28716, -39776, 84051, 179607, 429876, 575635, 513659, 554466, 492853, 132512, -205656, -341458, -295662, -155066, -80832, -166620, -236256, -256972, -243081, -222470, -403924, -633237, -633247, -321940, 37579, 147545, 94699, -2547, -112756, -191451, -277009, -201223, 36043, 311944, 228912, -84953, -207192, -115764, 66819, 7565, 65996, 123927, -34780, -67561, -63468, -60156, 88966, 211260, 279985, 374311, 374189, 268508, 71218, -74443, 83406, 73650, 69185, 53483, -62824, 75609, 85320, -124796, -63046, 40062, 181878, 239691]
11013B39691j57875k19725k10037j532P1471J09794J09153K46283J24192l1763
11003B79652j21100j36570l0307l6928o1741j70700p5951m0652m8303R0523M2498
10992c09579n447M0837J4815r5748k83048r5454L7601j2802N9662L26767J70863
10981a51533R7524R6901q0915j21443o2208J01034J54203L2558K683n8688k43382
10970b33266j43879J60516K99876L35928L06663Q2232j61332k58409j98248j69747
10960B0334n1176J11901K1183q4427q0365l8759j225j0294m0552M9502l8115j72049
10948c14042l8763N1505K96723K75202N1815J64112J66197j09577l43967k95923
10938i6718J9884J87283N3361j66721k99115j43342K84385J98839k33902k83545
$$ y = [239691, 81816, -137909, -347946, -349478, -278007, -168213, -59060, 187223, 311415, 279652, 158552, 21982, -8325, -45253, -106994, -277694, -353645, -394297, -442600, -352077, -309579, -315026, -274189, -259374, -355122, -638170, -733624, -696023, -708825, -649163, -322396, -151533, -54009, 42892, -38023, -159466, -221674, -120640, 33563, 66121, 68804, 10116, -233266, -377145, -216629, 83247, 419175, 725838, 808070, 646738, 388329, 190081, 20334, -30842, 81059, 102242, 17815, -62550, -101309, -102534, -112828, -153380, -103878, -141993, -314042, -352805, -301300, -4577, 270625, 322440, 486552, 652749, 543172, 199205, -96718, -76834, 110449, 163810, -2911, -302026, -445368, -160983, 37856, -196046, -479591]
10928d79591q5104O0291L03593K83965L7136p2542K270j14867r1091m3871l7211
10917b37022N6940o9209j89477j5388J87535J37912k49437l09155q0602K07791
10907e60112K25166J25649L74183M19035K11967j05058j45198k05403k69331l40383
10897b69485j85052P4366J75933k4033j84671R0197K16012Q7840L2054o6422n5740
10886a09001J83463K26849J27480o0543j70141k31820k09873n869j05583K1227
10876c33811Q0903j48110m0181J47077J02731k5025M022K50360J1842L1124J53885
10865B34817j1333j17803r3063k2231j59922j04795J09989L00289J78026R7758
10855D11732J3696j64833j57341o6877j2684J57813J51527k9354j88526k80263
$$ y = [-479591, -564695, -504404, -200811, 83154, 120290, 47748, 50018, -64849, -155940, -199811, -237022, -180082, -249291, -438768, -454156, -266621, -128709, -378146, -687301, -767903, -560112, -334946, -209297, 164886, 583921, 795888, 690830, 545632, 340229, 70898, -269485, -454537, -380171, -204238, -228271, -412942, -322745, -106733, -18893, 13161, -53261, -109001, 74462, 301311, 428791, 368248, 198107, -33713, -243586, -249455, -355038, -333811, -252908, -401018, -441199, -294122, -191391, -216416, -212394, 37966, 49808, 80932, 234817, 223484, 105681, 12618, -9613, -169535, -274330, -164341, 135948, 313974, 411732, 425428, 260595, 103254, 36377, 23693, 181506, 333033, 303679, 115153, -165110]
10845a65110r7575n2731j16459j64976L9663K84892R8331q9800j04270j67004
10835e35039l3557J60069K80402J69962k0574P0524J82515n8530k89559l422J58779
10824H1570N2620j22248k43737N4858J21940q1632j66714j77410r4678L3410P6685
10813d65336J40033P7049P1539Q4199q268L2981K45743J16256k87000p3354J89412
10802A23254J26614L6521J14507P4719j28125j79377q9162q5018j10442Q5539
10792c0970K80445J36764j946o2419l78504l24661Q5960K18346K20833Q823n6848
10781I5823K3560j45655j34827O0851J57435l0108p3537P4422J58327O9502K9254
10770B85047J54871O5036N1929L21437L43153J73769k1014J9737K08499N31183
$$ y = [-165110, -262685, -315416, -431875, -596851, -557188, -272296, -173965, -263765, -368035, -535039, -568596, -408527, -128125, 41837, 21263, 91787, 274302, 215772, -73787, -77209, 81570, 134190, 11942, -231795, -176937, -54997, -136629, -303343, -480753, -575431, -542021, -465336, -325303, -248254, -176715, -92516, -100784, -67803, 177940, 294196, 7196, -66158, 123254, 249868, 286389, 400896, 475615, 347490, 168113, 78951, -6067, -116509, -30970, 249475, 386239, 384293, 321874, -56630, -381291, -295331, -76985, 143848, 152671, 95823, 119383, -26272, -161099, -100248, 57187, 27079, -46458, 27964, 186291, 255793, 285047, 439918, 504954, 556883, 878320, 1221473, 1395242, 1374228, 1393965, 1602464, 2133647]
10760B133647O30365M98162R82144J834058Q18401j238073j626522r69541n54274
10751B508367l49271r2811k55424n26775n06013k65609j55237k540J2828j04626
10741B62889j19914J6809m0975N5889q1515j29179J0320q1729q1708k8603O2989
10730a54727J2159j1039q5561o1375K01488J57072J47288K36860k0788k86175
10720A35202j1923Q8711K5586L771o1308j60367j93619p7016J11228L7649O3654
10709c8432Q3107M7757j66251l7816J04220Q3452J39867K7906q9845p0469k7991
10698E5505j5409J4392L0159J73306J07041j45044q3424N9354j79263j32379Q0715
10687c5047M7551j91928j94219q454P9136P3424q2220j72322J2999J29930M3075
$$ y = [2133647, 2764012, 3262174, 4244318, 6078376, 6896777, 5658704, 4032182, 3062641, 2508367, 2159096, 2066285, 1810861, 1284086, 778073, 512464, 357227, 354687, 367515, 262889, 142975, 159784, 118809, 174698, 93183, -35996, -25676, -107405, -189113, -217716, -154727, -142568, -153607, -239168, -300543, -99055, 58017, 205305, 442165, 421377, 135202, 123279, 211990, 237576, 241347, 180039, 19672, -173947, -250963, -139735, -102086, -38432, 44675, 92432, -73819, -111635, -7415, 76037, 215904, 243810, 153965, 83496, 55505, 40096, 54488, 84647, 257953, 364994, 219950, 136526, 195880, 16617, -115762, -35047, 12504, -179424, -373643, -382097, -302961, -229537, -311757, -484079, -471080, -341150, -298075]
10676b98075J78731K59228K36908q2566q658J46459O5759j14477o7178k7932j49747
10665A38452j93543j26542N0072J37982r2855k68129j83449K7527K28326M1491
10655b40668m1436K3496l6273k13002q1366K07549J59906N2388p1136j5162R7120
10644a58584J04638k6571K0101M0449j56828r3306M7992J93717n8454r509J27512
10633C1157J63579K2384N4054K0200k60160k87055L0531L7388j2828M9507j3389
10622a64632J2535r8643r8973J19255J42853p941K6773K8679M7598j39761N343
10611a26914J55375l8587N770J83510K03005k1995p4709j21271q0146j5159J1230
10600H0109l8683o9511j3811P1511o1705j21696N2504O2718m8429L7622J31520
$$ y = [-298075, -119344, 139884, 376792, 294226, 285568, 432027, 497786, 383309, 316131, 288199, 138452, -55091, -181633, -131561, 6421, -86434, -354563, -538012, -510485, -282159, -240668, -282104, -258608, -294881, -507883, -589249, -381700, -221794, -169406, -240542, -255704, -158584, -53946, -80517, -60416, -19967, -176795, -270101, -222109, -28392, -86846, -96355, 31157, 194736, 217120, 271174, 291374, 31214, -255841, -225310, -187922, -200750, -151243, -164632, -152097, -250740, -349713, -230458, -87605, -95546, -68773, -40094, 7504, -132257, -126914, 28461, -10126, -4356, 179154, 382159, 360164, 285455, 164184, 84038, 68879, 80109, 41426, -28085, -41896, 29615, -32090, -153786, -101282, -38564, -86993, -49371, 82149]
10589H2149J9947k1553K8275N2560L4851m7906j34151k22761j16060J58433R7891
10578f8325p0009J23113J49276l2009k55764l08058p3959J7855J47294K35135
10568a35451P5678k7800l7414j65935j73404o4412K23079L30486K25067o9276
10558A80618j54525Q3966J05561l2933N987K5396L4956n2367j15628J58288J40963
10547C80282m3895o4806j7858k3768k74004k46632K46092K08275o7128J38513
10537B35071L03820R0576k75283k45205Q6753N8423m1816j2774R2947k6967j04477
10526A61068P3463J2502P4517N5409n4965l3034k6035j5155j25891k70607k86149
10515d34877o3914K12458L33467Q1437m5919J14743Q798j80314m2523J47408J61179
$$ y = [82149, 102096, 80543, 108818, 161378, 196229, 148323, 14172, -208589, -324649, -166216, -68325, -138334, -15221, 134055, 102046, -153718, -461776, -535735, -517880, -370586, -135451, -59773, -87573, -124987, -290922, -464326, -528738, -305659, 24827, 249894, 180618, 26093, 110059, 215620, 182687, 188674, 214070, 249026, 196659, 81031, 239319, 380282, 336387, 271581, 253723, 229955, -44049, -290681, -44589, 163686, 96558, 235071, 538891, 629467, 354184, 108979, 195732, 254155, 212339, 199565, 292512, 265545, 161068, 234531, 247033, 321550, 376959, 321994, 288960, 262925, 247770, 121879, -148728, -434877, -498791, -286333, 47134, 128571, 82652, 197395, 206193, 25879, -16644, 130764, 291943]
10504B91943k15787j04711O094p1682j37921R4786J1508j14253m63J79632K08092
10493A47238N5179n4551j07277L4157R1465l1338M8723P0275j59647j40919j06746
10482a53441j22710l8657q9327p1886K8415J81099K90050M438k40996l36261k22750
10471g72026N0017K02587K32792J82598K02912J78811J20117j2188q1744K782
10461C06658n3171q0825R4000R4786Q8130N3114l3109k36289k33054q1804k4937
10450a06501J86484R6633l7214k3288J12219K59487J09815k81384l94713j42649
10440b21111p3324j84380l064N5131K76993M09519n2471k10820j06150j69437
10430b79114p9484L6113j5388m1498O9221J05811J51846J3449n5847Q7623k9815
$$ y = [291943, 76156, -28555, -22461, -94143, -232064, -137278, -125770, -240023, -240486, -60854, 147238, 202417, 147866, 40589, 74746, 166211, 134873, 183596, 253871, 94224, -46695, -153441, -276151, -314808, -404135, -476021, -447606, -266507, 23543, 27981, -213015, -549276, -772026, -722009, -519422, -286630, -104032, 98880, 277691, 397808, 385620, 303876, 306658, 253487, 172662, 266662, 361448, 449578, 502692, 469583, 233294, 240, -81564, -106501, 79983, 176616, 139402, 116114, 228333, 487820, 597635, 316251, -78462, -221111, -294435, -478815, -481879, -426748, -149755, 259764, 207293, -3527, -109677, -279114, -358598, -322485, -337873, -379371, -310150, -204339, -52493, -39044, -94891, -7268, -37083]
10419c7083j47724j21161j32980p5773o1708N9046J63101K04297k4207p3063N0407
10408a96848N183n4398K4670P9482M7718J78753K26153M9652k18748j75015o9214
10397a02612l202p4034j21748o2046J9169J04317K19344Q446l7551j4900m6676
10386a11493R4172N7304Q0894J76104O1616r0703m3368k68298m34669j19263J11795
10375d85909J93614J76725J43150K4268k09995j11256Q3178J06811P72J37627
10365E8985o8648k93966L7018K00635K1382j5263r5364k01785q293J50147J08302
10354a06850N7897r3467j05266k9512o6120k9120J05930J18555J61039P9649L996
10343I6731R2267j22147j11200k1156q7672q5852j3674R5461L8707N7607K5706
$$ y = [-37083, -184807, -305968, -438948, -514721, -576429, -517383, -354282, -149985, -174192, -247255, -196848, -191665, -246063, -221393, -141911, -94193, 84560, 310713, 360365, 141617, -33398, -102612, -105814, -179848, -301596, -363642, -344473, -240156, -20812, -12366, -49917, -64817, -111493, -17321, 39983, 120877, 296981, 358597, 267894, 224526, -43772, -478441, -597704, -485909, -292295, -115570, 27580, 51848, -158147, -269403, -186225, -79414, -78642, 58985, -9663, -303629, -266611, -65976, -44594, -59857, -155221, -357006, -365299, -215152, -106850, -48953, -142420, -247686, -277198, -343318, -372438, -266508, -147953, 13086, 92735, 96731, 188998, 66851, -44349, -65505, -153177, -239029, -252703, -157242, -118535, -60928, -35222]
10332c5222m6178j06854j66137k81065q7117Q3192P750J01458J90504P2761N2548
10321b14360R0351K9360J2971q8305k39075m9009J44125K71004Q7266p7776P6008
10310D2560m4120o0728K6049n848Q9668J45076o2947j98570J6587j4645l7337
10299a04255n3545j80288l0644J26188J66586J38870O1827L7831j87692k75044
10289c00166K0615P1960O9988J49977K45789o6667l04367j24385K9420j30959
10279c38795j46699q3014k8310L47200J88133L7872m4167l1381J06527p404l8324
10268c8362K9416q9865j65932N933Q222r2022p8078j22650j08330M7058R0998
10257e13612L6398j49621j02967O6478j3929j83912n3472J37562K74201J53478
$$ y = [-35222, -81400, -188254, -354391, -635456, -722573, -639381, -631631, -530173, -339669, -266908, -214360, -124009, -94649, -81678, -169983, -409058, -458067, -313942, -42938, 44328, -33448, 42560, -1560, -62288, -36239, -42087, 47581, 192657, 129710, -68860, -52273, -66918, -104255, -157800, -338088, -368732, -242544, -75958, 62912, 124739, 162570, -25122, -300166, -279551, -207591, -137603, 12374, 258163, 191496, -112871, -237256, -207836, -338795, -485494, -568508, -596818, -249618, -61485, -23613, -67780, -99161, 7366, -38, -38362, -8946, -98811, -264743, -258810, -250588, -342610, -420688, -543338, -651668, -604610, -513612, -477214, -626835, -729802, -663324, -677253, -861165, -914637, -777075, -502874, -349396]
10247c49396m826p6582j51939p0293k3255J35709J40479L9743j8752J24901K1077
10236b33134l0528O3442J7171k3315k2369Q6988J85243K36119j215j32366j36095
10225I941j16702p8145k3827k4443p0023j04082q8342P0252R2787m8469l8523
10214d19576M1107L0240M1494K79069K41494r6886k11177l1026N5039k54629k20
10203c25071L20759J76689l000o8791J3373J7153j79194l4596K5861J91231J78163
10192C12577j37718j05134j6700R1615R9473l2747P1371p8178l03112q5289J31774
10181e2068j14953j01663j11689K9058L9301k58319j04314j9493J20229K80096
10171b93815K59236R3218N9174o5100l9631J11574l1083j73614N493l7856j97343
$$ y = [-349396, -354222, -430804, -582743, -653036, -676291, -540582, -400103, -360360, -379112, -254211, -233134, -263662, -200220, -183049, -206364, -228733, -141745, 43498, 279617, 278402, 146036, 9941, -106761, -184906, -208733, -233176, -303199, -407281, -495623, -425371, -332584, -381053, -419576, -378469, -348229, -306735, -27666, 213828, 116942, -94235, -125261, -70222, -324851, -325071, -4312, 172377, 169377, 100586, 113959, 131112, -48082, -82678, -56817, 134414, 312577, 174859, 69725, 53025, 144640, 244113, 211366, 282737, 204559, -98553, -183842, -52068, -167021, -268684, -380373, -351315, -312014, -570333, -674647, -694140, -573911, -293815, -34579, 58639, 117813, 52713, 13082, 124656, 93573, -80041, -74548, -112404, -309747]
10160c09747j83764M4304q4998O6298K33348K41027J80221Q8376J0455o9492j60241
10149E5787j44815k3374M340j86201j17206R6924K0857j4355j15645k02714l3261
10138f59663l239M1083L16019M43658J91084Q7680L8078j51991j07922K07114
10128D01901K36623J82163o3243j85928n0042K4783N2049Q1438k18212l28249
10118A33283N8209J32121l845K33841L50823J84024L00962L96170M76693L17477
10108B579758M91995R96475J303282J601343J603425L91314j154932j717135j501816
10099D593709j018214o48487k95388j86901k75739l81444l94118l59919l25347
10090G08152k48601q3488n2907l5029Q8463k20726r8630J01814J59695J65086
$$ y = [-309747, -493511, -449207, -534205, -467907, -234559, 6468, 186689, 275065, 285520, 216028, 55787, -89028, -112402, -108062, -294263, -411469, -314545, -293688, -308043, -423688, -626402, -659663, -662902, -621819, -305800, 137858, 328942, 416622, 454700, 302709, 194787, 401901, 638524, 820687, 757444, 571516, 521474, 546257, 598306, 679744, 461532, 133283, 191492, 323613, 319768, 553609, 904432, 1088456, 1389418, 1785588, 2262281, 2579758, 3071753, 4068228, 5371510, 6972853, 8576278, 8967592, 7812660, 6095525, 4593709, 3575495, 2927008, 2631620, 2444719, 2168980, 1787536, 1393418, 1033499, 708152, 459551, 376063, 323156, 288127, 376590, 155864, 57234, 159048, 318743, 483829]
10080D83829P138j16134j44395p649J13399K48296O5838j60358q1633L2000M4992
10069D85323M7565J15301K54946K33003m9915l11191m00064l24539r5852N0839
10059E416J38843J80849M6738k11092l6723J94677l932J9561j31156l42260j4568
10048a53647J9666P1637O7286k1106n9995m9939J97550L8489o2068j4754r3127
10037f0008l17633k57505n6986J65871M3160J49790J98029J45279J2267l6380
10027a4116j44160k34477j33051J61395L29381J79256J06439k3727j93105j72813
10017a38978j15187Q343L64730K70322p7703P0020P8761j09791k74992k59098
10007a83573n1946p9727j56850n5199J48873J86506K49654J61542O2192j8978
$$ y = [483829, 490967, 374833, 230438, 222789, 336188, 584484, 650322, 489964, 408331, 440331, 485323, 532888, 648189, 903135, 1136138, 1086223, 775032, 374968, 50429, -45423, 5416, 144259, 325108, 371846, 160754, 124031, 318708, 314776, 334337, 203181, -139079, -153647, -133981, -62344, 4942, -16164, -76159, -126098, 71452, 109941, 47873, 33119, -60008, -377641, -635146, -692132, -526261, -483101, -333311, -135282, 9997, 22264, -14116, -158276, -392753, -525804, -364409, -35028, 144228, 250667, 226940, 33835, -138978, -254165, -245822, 118908, 389230, 311527, 381547, 460308, 350517, 75525, -183573, -235519, -315246, -472096, -527295, -378422, -191916, 57738, 219280, 281472, 262494]
9997B62494j78231k97419p0308J48519R3278j02696j64938m5464J91165P4351
9987h9249j1049K8006P3254L7487Q3045J77842l654j00479k10695j72229J01323
9976h6398J87646K42913J41103M787n7521l01441l00129k62449R3759L46622K43466
9965B52358J02105o3914j69604j05283N7121J93019R8439k24728r0476K14686
9955B63723J59397j4060q0584m6230N547j15444l1470P3381J5534k93074k57575
9944c20855N8178K25879P3612N3712J70522l5735N4921Q5424j89227j82113q7461
9933i3143j43885P0805J08846n5117j06522p1573k0602l6475k10402j01084P382
9922f51770P0016R1253R1206J07830L2348k23621n5688L02850J56427m6638n1732
$$ y = [262494, 84263, -213156, -283464, -134945, -41667, -144363, -309301, -354765, -163600, -89249, -100298, -72292, 962, 38449, 121494, 299336, 295682, 195203, -15492, -187721, -86398, 101248, 344161, 485264, 490051, 432530, 131089, -169040, -431489, -337730, 8892, 252358, 354463, 290549, 120945, 15662, 72783, 265802, 364241, 139513, 49037, 263723, 423120, 409060, 328476, 282246, 287793, 172349, 140879, 214260, 229794, -63280, -320855, -262677, -36798, 36814, 90526, 261048, 225313, 280234, 365658, 176431, -5682, -93143, -237028, -166223, -57377, -112494, -219016, -290589, -311191, -347666, -558068, -659152, -651770, -581754, -490501, -399295, -291465, -259117, -482738, -538426, -235576, -79149, -125787, -177519]
9911a77519l7446J27435L73413Q8659k63913j66790L8251k04616j54906p6700
9901d54132o4925J45988O1838n6648p598J1664L1779j10965m7277M7453R7583
9890c45240R5404J93920K98594Q8699r2034j67819k57645j87397o2233R8554R4833
9879b42364j8829J81955J22708q7077j01733l9298J38246J7417K3913M6714k6892
9868A4760j89663k33919m3003P0978P4353J5106Q674P6411J97336M8759K5178
9857F4970N7746q8396j57451j12836m0103J50790J48304k800j08545l9579j41525
9846b69425j77091j09497k03651j35871q5275l7411J31772j5350n589K49181K02266
9835d55941K5429J4831m1070r6417M7028J76425J10492j17114k3197J64303Q1982
$$ y = [-177519, -214965, -87530, 285883, 374542, 110629, -56161, -17910, -222526, -377432, -454132, -519057, -373069, -311231, -367879, -375477, -363813, -332034, -442999, -490276, -442823, -345240, -249836, -55916, 242678, 331377, 239343, 71524, -186121, -373518, -435751, -337197, -242364, -261193, -79238, 43470, -43607, -145340, -184638, -46392, -28975, -5062, 41652, 14760, -174903, -408822, -451825, -380847, -306494, -291388, -282714, -206303, -8967, 39792, 64970, 122716, 34320, -123131, -235967, -276070, -125280, 23024, 20224, -88321, -127900, -269425, -446516, -556013, -759664, -895535, -980810, -1018221, -886449, -901799, -907388, -658207, -455941, -430512, -415681, -456751, -553168, -506140, -329715, -219223, -336337, -359534, -195231, -113249]
9824a13249O38k0637J09284j2987j37892k7864P1930r5035k65377Q9707K60260
9813a41222M1413J61350L00986J34667j25558j11724n5402j60490j9082R4663
9803A19601L4867P3022l43j62265l6575j828j54279J06680L30997l8686l06031
9792c4840l12406k82997J8262J05672J86520K10197J42250j83431k2499N4688
9782a18584L044j10965k60644K4560J76577J33924K04717J14563n4813J15075
9772B27454m5858j76862k1412R1842j17j40815j41089R9325L01741K1938k81863
9761f5716l4798J62925l675k0140J38826J21605M1070M1413L43966K46416j74137
9750G97755k61260k73377k79066j37727j598J11143J00158K5268p45l3328J4745
$$ y = [-113249, -112611, -133248, -23964, -36951, -174843, -202707, -130777, -225812, -491189, -401482, -141222, -99809, 61541, 362527, 497194, 371636, 259912, 204510, 44020, 24938, 119601, 154468, 227490, 227147, 64882, 28307, 26479, -127800, -21120, 309877, 271191, -34840, -347246, -630243, -611981, -506309, -319789, -109592, 32658, -150773, -173272, -118584, -115540, -226505, -487149, -462589, -286012, -152088, 52629, 167192, 112379, 227454, 181596, 4734, -16678, 75164, 75047, -65768, -206857, -107532, 194209, 216147, -65716, -100514, 62411, 58736, 38596, 177422, 299027, 340097, 381510, 725476, 971892, 797755, 536495, 263118, -15948, -153675, -155273, -44130, 56028, 81296, 80551, 47223, 61968]
9739F1968j03719j44146j64889q0057N9139J70479J27365j70995l22811j0021
9729e77687K44629J5497K1072Q6960L26017K49523Q9165K3500j82769o9140K26922
9718D53689j5918j29220n6094j77183j44689p1381p49J99742J65803L5384p4281
9707A85103j9348k939j49016k58166l6714P1729q9350P2585o8438k3340O8965
9696b48929K33361J71850K32958K27258j36044k29908j28507p748k4833J5232
9686A04690n9925k48240L9373K97915L2479j27451j17123r2457j09126j45793
9676d25658r7326J22121J37875K83974K02036j29902m8194Q9985J63024M13559
$$ y = [61968, -41751, -185897, -350786, -430843, -371704, -201225, -73860, -244855, -567666, -577687, -333058, -317561, -296489, -209529, 116488, 366011, 455176, 478676, 295907, 226767, 453689, 437771, 308551, 252457, 75274, -69415, -140796, -141545, 58197, 224000, 259384, 185103, 165755, 162816, 13800, -244366, -281080, -209351, -298701, -226116, -294554, -317894, -248929, -15568, 156282, 389240, 616498, 480454, 250546, 122039, 114291, 89458, 104690, 44765, -203475, -164102, 133813, 166292, 38841, -78282, -170739, -279865, -425658, -522984, -400863, -262988, 20986, 223022, 93120, 44926, 134911, 297935, 711494]
$$ [...]
##END NTUPLES=NMR SPECTRUM
##END=
