##TITLE=C13_SL17-SPh(old)
 CDCl3, 23000 sc

 5.3.2020
##JCAMPDX= 6.0         $$ Bruker NMR JCAMP-DX V2.0
##DATA TYPE= NMR SPECTRUM
##DATA CLASS= NTUPLES
##ORIGIN= UXNMR, Bruker Analytische Messtechnik GmbH
##OWNER= root
$$ XWIN-NMR		Version 3.5
$$ Fri Mar  6 13:42:56 2020 Russian Standard Time (UT+4h)  she@DPX200
##.OBSERVE FREQUENCY= 50.327896
##.OBSERVE NUCLEUS= ^13C
##.ACQUISITION MODE= SIMULTANEOUS
##.ACQUISITION SCHEME= undefined
##.AVERAGES= 19710
##.DIGITISER RES= 17
##SPECTROMETER/DATA SYSTEM= spect
##.PULSE SEQUENCE= zgpg30
##.SOLVENT NAME= CDCl3
##.SHIFT REFERENCE= (INTERNAL, CDCl3, 0, 222.624)
##AUDIT TRAIL= $$ (NUMBER, WHEN, WHO, WHERE, WHAT)
$$ ##TITLE= Audit trail, XWIN-NMR		Version 3.5
$$ ##JCAMPDX= 5.01
$$ ##ORIGIN= Bruker BioSpin GmbH
$$ ##OWNER= she
$$ F:/spectra/data/she/nmr/c13/1/pdata/1/auditp.txt
$$ ##AUDIT TRAIL=  $$ (NUMBER, WHEN, WHO, WHERE, WHAT)
(   1,<2020-03-06 11:21:07.26 +0400>,<she>,<DPX200>,
      <created by zg, POWCHK disabled, PULCHK disabled
       terminated by command 'halt'
       configuration hash MD5:
       00 E9 B6 7A A2 85 ED C7 34 08 36 98 17 FE 4E 26
       data hash MD5: 32K
       78 54 D8 48 F1 3B B2 1A 64 DF 1B BD 0E B7 76 80>)
(   2,<2020-03-06 13:40:28.84 +0400>,<she>,<DPX200>,
      <Start of raw data processing
       efp BC_mod = 2 LB = 1 FT_mod = 6 PKNL = 1 PHC0 = -231.2269 PHC1 = 40.20638 SI = 32K 
       data hash MD5: 32K
       D8 20 09 D8 47 71 CE AE 6F 89 06 2E 45 D3 34 2F>)
(   3,<2020-03-06 13:40:32.09 +0400>,<she>,<DPX200>,
      <abs ABSG = 5 
       data hash MD5: 32K
       BD 7E E1 BE 68 0F 38 D8 5A 5E B3 E7 A7 28 8F 11>)
(   4,<2020-03-06 13:41:01.62 +0400>,<she>,<DPX200>,
      <pk PHC0 = 4.672271 PHC1 = -5 
       data hash MD5: 32K
       F4 4B 27 4D D0 BA BF 64 F5 4A 3A A6 45 3D 65 FF>)
(   5,<2020-03-06 13:41:04.92 +0400>,<she>,<DPX200>,
      <abs ABSG = 5 
       data hash MD5: 32K
       C5 93 D2 51 D7 DD BD 60 68 8E 3B 9F EF 94 67 BD>)
$$ ##END=
$$ 
$$ hash MD5
$$ ED 75 B4 75 51 50 CC E1 21 95 EC 5C 3F 36 3A BA
##$RELAX= 
##$RELAX= 
##$RELAX= 
##$RELAX= 
##$RELAX= 
##$RELAX= 
##$RELAX= 
##$RELAX= 
$$ Bruker specific parameters
$$ --------------------------
##$DU= <F:/spectra>
##$EXPNO= 1
##$NAME= <c13>
##$PROCNO= 1
##$TYPE= <nmr>
##$USER= <she>
##$AMP= (0..31)
100 100 100 100 100 100 100 100 100 100 100 100 100 100 100 100 100 100 
100 100 100 100 100 100 100 100 100 100 100 100 100 100 
##$AQSEQ= 0
##$AQ_mod= 1
##$AUNM= <au_zg>
##$AUTOPOS= <>
##$BF1= 50.322709
##$BF2= 200.13
##$BF3= 50.322709
##$BF4= 500.13
##$BF5= 500.13
##$BF6= 500.13
##$BF7= 500.13
##$BF8= 500.13
##$BYTORDA= 1
##$CFDGTYP= 0
##$CFRGTYP= 5
##$CHEMSTR= <none>
##$CNST= (0..31)
1 1 145 1 1 1 1 1 1 1 1 1 1 1 1 1 1 1 1 1 1 1 1 1 1 1 1 1 1 1 1 1 
##$CPDPRG= <waltz16>
##$CPDPRG1= <>
##$CPDPRG2= <waltz16>
##$CPDPRG3= <>
##$CPDPRG4= <mlev>
##$CPDPRG5= <mlev>
##$CPDPRG6= <mlev>
##$CPDPRG7= <mlev>
##$CPDPRG8= <mlev>
##$CPDPRGB= <>
##$CPDPRGT= <>
##$D= (0..31)
$$ [...]
##$SUBNAM4= <"">
##$SUBNAM5= <"">
##$SUBNAM6= <"">
##$SUBNAM7= <"">
##$SUBNAM8= <"">
##$SUBNAM9= <"">
##$SW= 239.972175391363
##$SWIBOX= (0..15)
0 1 3 0 0 0 0 0 0 0 0 0 0 0 0 0 
##$SW_h= 12077.2946859903
##$TD= 32768
##$TD0= 1
##$TE= 0
##$TE2= 300
##$TE3= 300
##$TEG= 300
##$TL= (0..7)
120 120 120 120 120 120 120 120 
##$TP= (0..7)
150 150 150 150 150 150 150 150 
##$TP07= 0
##$TPNAME0= <>
##$TPNAME1= <>
##$TPNAME2= <>
##$TPNAME3= <>
##$TPNAME4= <>
##$TPNAME5= <>
##$TPNAME6= <>
##$TPNAME7= <>
##$TPOAL= (0..7)
0.5 0.5 0.5 0.5 0.5 0.5 0.5 0.5 
##$TPOFFS= (0..7)
0 0 0 0 0 0 0 0 
##$TUNHIN= 0
##$TUNHOUT= 0
##$TUNXOUT= 0
##$USERA1= <user>
##$USERA2= <user>
##$USERA3= <user>
##$USERA4= <user>
##$USERA5= <user>
##$V9= 5
##$VALIST= <valist>
##$VCLIST= <CCCCCCCCCCCCCCC>
##$VD= 0
##$VDLIST= <DDDDDDDDDDDDDDD>
##$VPLIST= <PPPPPPPPPPPPPPP>
##$VTLIST= <TTTTTTTTTTTTTTT>
##$WBST= 1024
##$WBSW= 4
##$XGAIN= (0..3)
0 0 0 0 
##$XL= 0
##$YL= 0
##$YMAX_a= 32855081
##$YMIN_a= -130876907
##$ZGOPTNS= <>
##$ZL1= 120
##$ZL2= 120
##$ZL3= 120
##$ZL4= 120
##$ABSF1= 222.624
##$ABSF2= -17.3728
##$ABSG= 5
##$ABSL= 3
##$ALPHA= 0
##$AQORDER= 0
##$ASSFAC= 0
##$ASSFACI= 0
##$ASSFACX= 0
##$ASSWID= 0
##$AUNMP= <proc_1d>
##$AZFE= 0.1
##$AZFW= 0.5
##$BCFW= 0
##$BC_mod= 2
##$BYTORDP= 0
##$COROFFS= 0
##$CY= -3
##$DATMOD= 1
##$DC= 0
##$DFILT= <>
##$DTYPP= 0
##$F1P= 0
##$F2P= 0
##$FCOR= 0.5
##$FTSIZE= 32768
##$FT_mod= 6
##$GAMMA= 0
##$GB= 0
##$INTBC= 1
##$INTSCL= 4.134877e-10
##$ISEN= 128
##$LB= 1
##$LEV0= 0
##$LPBIN= 0
##$MAXI= 10000
##$MC2= 0
##$MEAN= 0
##$ME_mod= 0
##$MI= 0.1934396
##$NCOEF= 0
##$NC_proc= 2
##$NLEV= 6
##$NOISF1= 120.0001
##$NOISF2= 80.00006
##$NSP= 0
##$NTH_PI= 0
##$NZP= 0
##$OFFSET= 222.624
##$PC= 1.4
##$PHC0= -226.5546
##$PHC1= 35.20638
##$PH_mod= 1
##$PKNL= yes
##$PPARMOD= 0
##$PSCAL= 0
##$PSIGN= 0
##$REVERSE= no
##$SF= 50.3227315989248
##$SI= 32768
##$SIGF1= 140
##$SIGF2= 120
##$SINO= 11.81781
##$SIOLD= 32768
##$SREGLST= <13C.CDCl3>
##$SSB= 0
##$STSI= 32768
##$STSR= 0
##$SW_p= 12077.2946859903
##$SYMM= 0
##$S_DEV= 0
##$TDeff= 32768
##$TDoff= 0
##$TI= <>
##$TILT= no
##$TM1= 0
##$TM2= 0
##$TOPLEV= 0
##$USERP1= <user>
##$USERP2= <user>
##$USERP3= <user>
##$USERP4= <user>
##$USERP5= <user>
##$WDW= 1
##$XDIM= 32768
##$YMAX_p= 431963808
##$YMIN_p= -2613850
$$ End of Bruker specific parameters
$$ ---------------------------------
##NTUPLES= NMR SPECTRUM
##VAR_NAME=  FREQUENCY,     SPECTRUM/REAL,   SPECTRUM/IMAG
##SYMBOL=    X,             R,               I
##VAR_TYPE=  INDEPENDENT,   DEPENDENT,       DEPENDENT
##VAR_FORM=  AFFN,          ASDF,            ASDF
##VAR_DIM=   32768,         32768,           32768
##UNITS=     HZ,            ARBITRARY UNITS, ARBITRARY UNITS
##FACTOR=    0.368581032318806, 1,           1
##FIRST=     11203.0474431902, 0,            0
##LAST=      -874.247242800138, 0,           0
##MIN=       -874.247242800138, -2613850,    0
##MAX=       11203.0474431902, 431963808,    0
$$ Real data points
##PAGE= N=1
##DATA TABLE= (X++(R..R)), XYDATA
$$ [...]
15957e77668n38879J44084M03740K51531M4296O7503J92708J71723j36000j8744
15947D294l95228l68453L70138M28367P1017K166J85200J46488K02078K18654
15937H64721j07841l53160k11097J43679K26330Q8599O3823m17319m07766p1402
15927a81433q4432N5063K88500K38345l88227q2400K65415O24376j11551m78970
15917A44686l18579J00679J31020j82296L4037k99875K9908K12187R5472k8462
15907h1223k2034J08925L8831K08373J67137j25729m09251k62303Q3843M0310
15897b53121m8350k5880p1180L9913k05480L2950K72152R5165k43132j36067j88984
15886g32014l44428J40902L5286k24967j07670M87422K74516r5476M0509j79367
$$ y = [-577668, -1116547, -972463, -568723, -317192, -272896, -205393, -12685, 159038, 23038, 4294, -390934, -759387, -389249, 39118, 110135, 112301, 297501, 443989, 646067, 864721, 756880, 403720, 192623, 336302, 562632, 651231, 715054, 297735, -110031, -181433, -265865, -210802, 77698, 316043, -72184, -154584, 110831, 735207, 623656, 144686, -173893, -73214, 57806, -124490, -90453, -390328, -360420, -148233, -52761, -81223, -103257, 5668, 44499, 252872, 420009, 294280, -114971, -377274, -293431, -253121, -301471, -327351, -398531, -358618, -564098, -531148, -258996, -163831, -406963, -543030, -732014, -1076442, -935540, -900254, -1125221, -1232891, -745469, -470953, -566429, -525920, -705287]
15876g05287m81436m5248L74711J91659l7806j3296L03898K14791q7756N8615
15866b27155J95161j22840j4686P3692R1329k7301j18314q7948j46204k34038
15856f18304j72956k26518k05909K85357L22693L37505L20438J38215K01721J23998
15846E06240n5310m14920l50972l00107O55L59194n8366j81497j31694O7432q153
15835e67498m5158j65347N61720O75043k07718j46772p1339j46826J65223J72689
15825B24017J33047K14917J30503k96476k24796J84456M43091L20978J24862k3203
15815A231396l91202l70152Q8682k97229n89221m49301l53061R6276M18190j25808
15805g41430m2119M61232L12895K76597L71587K57187k437n31467p29046m42613
$$ y = [-705287, -1186723, -1231971, -857260, -665601, -703407, -716703, -412805, -198014, -285770, -227155, -31994, -154834, -169520, -95828, -4499, -31800, -150114, -238062, -384266, -618304, -791260, -1017778, -1223687, -938330, -615637, -278132, 42306, 180521, 382242, 506240, 450930, 36010, -314962, -615069, -614414, -255220, -313586, -495083, -626777, -559345, -567498, -612656, -778003, -216283, 458760, 251042, 104270, 32931, -113895, 51328, 224017, 357064, 571981, 702484, 406008, 181212, 365668, 808759, 1129737, 1254599, 1231396, 840194, 470042, 558724, 261495, -327726, -777027, -1130088, -1033812, -615622, -741430, -783549, -322317, -9422, 267175, 638762, 895949, 893512, 362045, -367001, -809614]
15795h09614L32422M77896J66494J11029J91756J96923K24954r3722l63980m44137
15785i979k77092J54868J04484K44511J24823O5389M01703J23707n03868j45206
15775B83340L4871Q3353j61316k25719N7658j97358j99195K01089M0076m83107
15765e66308l64820J28915J99891j13102l89824L1862K27814P738K99225M19001
15755a19608J53033J98973L90907j16549p33305l88885M04418J59417k86892o66483
15745a004974m83628K58162L63227P622K42662M65720L01146K53626K74390K18001
15735H95954P1353j02232J7926K17095m40097n64504K9086Q6732P2405K33603
15725E17321R0074j94323k77304q7838q8696K81882L54673K12453l5681k35474
$$ y = [-809614, -477192, 704, 167198, 278227, 469983, 666906, 891860, 798138, 434158, -9979, -287071, -132203, -27719, 216792, 341615, 407004, 808707, 932414, 428546, 283340, 318211, 401564, 240248, 14529, 72187, -125171, -324366, -123277, -83201, -566308, -931128, -802213, -602322, -715424, -1105248, -1073386, -845572, -837834, -538609, -119608, 33425, 232398, 623305, 506756, -226549, -615434, -211016, -51599, -338491, -1004974, -1488602, -1230440, -867213, -859591, -616929, -151209, 149937, 403563, 677953, 895954, 967307, 865075, 883001, 1100096, 659999, 95495, 124581, 211313, 283718, 517321, 607395, 413072, 135768, 47930, -40766, 241116, 595789, 808242, 772561, 537087]
15715E37087m47589k25922q5521R537l68503n61595k50124J38148K01732J13286
15705i39464K29815L05796O05818K52008l6538j20531p1708j11256l14706l67241
15695e68007k30218l23604j35388M24107M91080J05098q4179j0207J41464O2454
15685a27400k80747n29359j74804K9993L88477L31605J61676p1833K9180L04739
15675F1527k22888l36947j06704N13640N98427K58793k07241n56174m46665n19650
15665i63882q763M78589L56589K2410j14180J06841j51050m97064j43437L26130
15655e87817L06285k98757k58976K92305K46407K39084K43984M46616K24794j58171
15645F95754p56456r81947j89619Q7185q5656k22817J92245O90723K73434k07595
$$ y = [537087, 89498, -136424, -221945, -212408, -580911, -1142506, -1392630, -1254482, -1052750, -939464, -709649, -403853, 201965, 453973, 417435, 296904, 225196, 113940, -200766, -568007, -798225, -1121829, -1257217, -833110, -342030, -236932, -321111, -331318, -189854, -127400, -408147, -937506, -1112310, -1082317, -693840, -362235, -200559, -272392, -243212, 61527, -161361, -498308, -605012, -91372, 507055, 765848, 558607, 2433, -444232, -963882, -972645, -494056, -137467, -115057, -229237, -122396, -273446, -770510, -913947, -587817, -281532, -580289, -839265, -546960, -300553, -61469, 182515, 629131, 853925, 695754, -60702, -1042649, -1232268, -1145083, -1230739, -1453556, -1261311, -570588, -297154, -504749]
15635e04749L8806J00195R6619J56896r8549l26652m96318o0926m128k05944M00767
15624i03983P39078n4201l56581j54447K53845L26340O74043L45652l78859m24275
15614F6612l48571r2495L26786P0166p1968L097n72315m27388R6657M15949K91041
15603b42429m2648j64524K19336N85634Q3678k81881M2936P515J35385N0055P8238
15592D71295R2134p1458j43602j21096M6303M6014j07877q7288j18068j77839
15582a71482p0634j69786K76070O60484K68214o0242m36418l27396O9671Q3082
15572A21563j10900p5954L04602K07112k59216k44306O2175J8468n363p4115j0615
15561f6549k29451k17153J03264N9825J54095j424K9995J66172j11060k67824
$$ y = [-504749, -465943, -365748, -269129, -112233, -210782, -537434, -1033752, -1094678, -1098806, -1304750, -903983, -164905, -219106, -575687, -730134, -476289, -149949, 524094, 869746, 490887, 66612, -281959, -374454, -47668, 22498, -49470, -46373, -618688, -1046076, -949419, -533470, -242429, -285077, -449601, -230265, 355369, 439047, 157166, 200102, 207617, 343002, 393057, 471295, 563429, 491971, 348369, 227273, 273576, 319590, 211713, 124425, 6357, -171482, -242116, -411902, -135832, 524652, 792866, 732624, 296206, -31190, 38481, 121563, 10663, -65291, 239311, 446423, 187207, -57099, 5076, 23544, 18181, -55934, -66549, -296000, -513153, -409889, -350064, -195969, -197393, -167398, -1226, -112286, -380110]
15551c80110L6953O3336n1730M4229j614j54888k8561k51792k81212j77573j05120
15540a288082K62357L40267J11752J04108P57408O47579r7798m92193o54952j5593
15530c25147M56785N3568l52555k65307j25284l08877m96839j87210L94146N57616
15520e99104M43350j62873m97990q916L07390R7251L17857O22720M69032q6767
15510I01950m99858k17922l910K69555J72296n5257l11782m42941J3982J88151
15500A4264K45464R5722l98950m39392o184K02485O24773L23842l56145l62636
15490e6757l57166m1637K25986K34896k94585n64276L9430K25056l13067p0024
15480i72144J93141K87940M46429n0486m70056l6164n2813j14943k4416j4575
$$ y = [-380110, -343157, -279821, -331551, -287322, -288936, -443824, -472385, -724177, -1005389, -1182962, -1288082, -1025725, -685458, -573706, -469598, 287810, 935389, 837591, 345398, -309554, -325147, 131638, 185206, -167349, -432656, -557940, -866817, -1363656, -1550866, -1156720, -599104, -155754, -318627, -816617, -825533, -518143, -420892, -103035, 519685, 988717, 901950, 402092, 184170, 180260, 449815, 622111, 566854, 255072, -187869, -173887, 14264, 259728, 355450, -43500, -482892, -489076, -286591, 338182, 662024, 305879, -56757, -413923, -455560, -229574, 5322, -289263, -853539, -814109, -589053, -902120, -972144, -779003, -491063, -44634, -95120, -565176, -601340, -654153, -769096, -793512, -808087]
15470h08087O457J79625N57368L51062k12076l68712j4098N4678j23431L60997
15460a6217O47571K39424l45925k07265O0411j58701J79649K10687k61579l54365
15450f310k04568j64459k22896k2716M59160J85788m9497R1366L1127m38493l36906
15439f78404M57654K38583K93539J99775L8698j31172k12909j50322p7914M4282
15429B1810k65645m55330m4636k0260P14599Q38157J37364j30452k51688m87751
15419E6168l33350J03604J46181m33093n59550M48856M16101Q3673k38836n28184
15409h38430j73996J58242J95460j28417r1782J16095J55596K91515k17189n86789
15399a119695l37111O0919P05064P30704M27992J49893m30959k48105j9611j22408
$$ y = [-808087, -801630, -622005, -64637, 286425, 74349, -294363, -308461, -253783, -377214, -16217, 631354, 870778, 524853, 317588, 377999, 219298, 398947, 609634, 348055, -6310, -210878, -375337, -598233, -620949, -161789, 23999, -25498, 65868, 96995, -341498, -678404, -220750, 17833, 311372, 511147, 549845, 418673, 205764, 55442, -22472, 21810, -243835, -699165, -743801, -764061, -49462, 788695, 926059, 795607, 543919, 56168, -277182, -173578, -27397, -460490, -1020040, -571184, -155083, -71410, -310246, -838430, -1012426, -854184, -658724, -787141, -878923, -762828, -607232, -315717, -532906, -1119695, -1456806, -1395887, -690823, 39881, 467873, 617766, 186807, -61298, -80909, -203317]
15389b03317J84838L04699q1038l58868l82139q0028k74317q1555K62433L43440
15379c65852L09580P6264K64779J75863l30020j64451L9133J84883o8334K12597
15369C34442P01114M87749k64217l87354k94730j44949l35604n43330j56043M48612
15359a54310J79032k32755k22818m6576L98212O25487M08983K21869k40716n95929
15349C40479k30867l280L22695L04904J35785K4076m5220k06708n57508j91694
15339a07338J09109j96165k41066l47713m11380r278J68140o1509J84242N36239
15329c76719K74843j92519n04609j771K31903O2410m8249j33465l89841q100J11174
15318i74943o9705j77390K14388L12978n5217Q18J79228K91394J97264L67795
$$ y = [-203317, -18479, 286220, 205182, -153686, -535825, -615853, -890170, -971725, -709292, -365852, -56272, 19992, 284771, 460634, 130614, -33837, 5296, 190179, 121845, 334442, 1035556, 1523305, 1259088, 871734, 577004, 432055, 96451, -446879, -602922, -154310, 24722, -208033, -430851, -477427, -79215, 546272, 955255, 1177124, 936408, 340479, 109612, 106332, 429027, 733931, 869716, 893792, 848572, 641864, 84356, -107338, 1771, -194394, -435460, -783173, -1194553, -1203831, -1035691, -1097200, -912958, -376719, -101876, -294395, -799004, -800775, -568872, -506462, -554711, -688176, -1078017, -1086117, -974943, -1044648, -1222038, -1007650, -694672, -749889, -749071, -569843, -278449, -81185, 286610]
15308B86610K86520j8969r5411Q838l1331r4450l22557l72060n97067K31765P26133
15297H021J06255j32479k41725J02806j16152N1572L13749K07313O7410j80917
15287A85853j17223L06424L10198k98981n42702j82545k22658j43028k61365k37621
15277a203648P7526J11149j20343R2850K34831L49237L02325L1485j40817J42895
15267a22510N11522N0861l86265l61175k84204l03100m8997L77403M17730J12869
15257c5866j42755p6332K44341M97364K91924K63755J91013j46453k95632n32339
15247B59020m81637o5789J19657J07365J50633K11900k10315o64672m31721l60408
15237a365967k24959N93439P25607K90644K63484n9525O7569p6864m38099m03828
$$ y = [286610, 573130, 554161, 458750, 467588, 436257, 341807, 19250, -352810, -949877, -718112, 8021, 114276, -18203, -259928, -157122, -273274, -221702, 92047, 299360, 366770, 185853, 68630, 375054, 685252, 386271, -156431, -338976, -561634, -704662, -966027, -1203648, -1126122, -1014973, -1135316, -1042466, -807635, -458398, -156073, -124588, -265405, -122510, 389012, 439873, 53608, -307567, -591771, -894871, -943868, -566465, -148735, -35866, -178621, -254953, -10612, 486752, 778676, 1042431, 1233444, 1086991, 791359, 259020, -222617, -288406, -168749, -61384, 89249, 301149, 90834, -573838, -1005559, -1365967, -1590926, -997487, -271880, 18764, 282248, 222723, 290292, 213428, -224671, -628499]
15227f28499J67861M32542N39519L91497j81876m01109J37865L26584l1095l64946
15217C88343l89814k50049J13302J61115j1501k21664k11501K8050J3648j33425
15207e13496Q3082J095k09537k56187k53894K62232N21851L09170K64715k35089
15197b6058k27142J39677R2863K2011m5476J25787J20534j08298j13016k32703
15187b51821k96588m5513K6074j17335r664L69910J99986n5142J74404J93355
15177A87666J82525K22457o3332o90596o28358k32039k18774J9760L4403J82652
15167a003636J32562k2584K98528K25937N40560R6219m08965n7105N59270J22125
15157D82911l57897j91225L94014N76083j94080k44228J87817l2030k47761m07522
$$ y = [-628499, -460638, -28096, 511423, 902920, 721044, 319935, 457800, 784384, 753289, 388343, -1471, -251520, -138218, 22897, 11396, -210268, -421769, -393719, -380071, -513496, -430414, -429319, -638856, -895043, -1148937, -886705, -364854, -55684, 209031, -26058, -253200, -113523, -20660, 1351, -44125, 81662, 202196, 93898, -19118, -251821, -548409, -593922, -567848, -685183, -694847, -324937, -124951, -180093, -5689, 187666, 370191, 592648, 529316, -161280, -789638, -1021677, -1240451, -1220691, -1186288, -1003636, -871074, -893658, -595130, -369193, 171367, 267586, -141379, -198484, 360786, 482911, 125014, -66211, 327803, 903886, 709806, 465578, 653395, 621365, 373604, -33918]
15147c3918j99834l3194j70868j87834L93085L95790P0018R1523m8941k34978
15137D0849J81624o7854o4226K86750K53148K07259j89577l14081l87788j13730
15127a67626L82418K68370Q3740n9947M161k57196l37447J62007J42559l8402
15117A82637j99498n15596k57643J03682L22586K33435j99064j19411K15662L49388
15107A16178L70494R9581k65206j9404N3043j7017k69549n491J81937J30163o3764
15096C10965k48762m35237k20975J80780K61939L42955J02346m64776m8087M35175
15086B16323j4481k69622k68082o47989j99190L95878O03456K30210J65674L48831
15076E61008q6840m16108K47254M41564j45314P8155q2224l98400o01363l17642
$$ y = [-33918, -233752, -266946, -437814, -625648, -232563, 163227, 233245, 324768, 275827, 40849, 222473, 154619, 90393, 377143, 630291, 837550, 647973, 333892, -53896, -167626, 214792, 483162, 566902, 506955, 511116, 253920, -83527, 78480, 221039, 182637, -16861, -532457, -790100, -686418, -363832, -130397, -329461, -448872, -233210, 116178, 486672, 586253, 321047, 301643, 354686, 337669, 68120, 62629, 244566, 374729, 310965, 62203, -373034, -594009, -413229, -151290, 191665, 294011, -170765, -218852, 216323, 201842, -67780, -335862, -983851, -1183041, -787163, -183707, 46503, 212177, 561008, 474168, 58060, 305314, 746878, 601564, 679719, 597495, 199095, -402268, -719910]
15066g19910J87973K22519n6213j53553J10680J30635M2983j85463k06522k01123
15056h27994j92583k571N33412Q64344L76917k07189j36802k5311j54924n1200
15046A76099L22755M21198P9464k16458l67751m41412P6926K13889K96793L73744
15036I35247j42573n48387m64969j10190k02860j4184Q4369O4082J01782l9251
15026c36934j5392K03291J74038o4696k76239j31980j05492k90947P5260K37299
15016e31792K96128Q4037k702J71518K93749R091l60467K16527R8364j485J52610
15005D25578K57035J13010O8130J26906k04817n209k1016P7684N13587L04188
14995A655076k52610m17362l23307k69505n55227j84471L48499k8884j56515Q8867
$$ y = [-719910, -531937, -309418, -365631, -519184, -408504, -277869, -234886, -420349, -626871, -827994, -1020577, -1023148, -489736, 374608, 751525, 544336, 407534, 382223, 227299, 176099, 498854, 920052, 999516, 783058, 415307, -26105, 50821, 264710, 561503, 935247, 792674, 244287, -220682, -330872, -533732, -547916, -463547, -399465, -297683, -336934, -352326, -149035, 25003, -39693, -315932, -447912, -553404, -844351, -769091, -531792, -235664, -151627, -154329, 17189, 310938, 320029, -40438, 176089, 274453, 272968, 425578, 682613, 795623, 863753, 990659, 785842, 780633, 759617, 837301, 1350888, 1655076, 1402466, 985104, 661797, 392292, -162935, -347406, 1093, -27791, -184306, -95439]
14985i5439K93129k15063l96573k27849o2539L21765J94203J31513M03699L56385
14975G03231j56583l40386l40429J22654K53397M1270J8216R547P0439k98190
14965H3166k39918K44502K1206l6474j63908k49661J83086M07559O2112r4426
14955B17244k62719l09345L88382M00318k42331m81473k62241m2551j36927q2805
14945h14448J96974M62283N12923K14233k31394n46504r8403N41366M73285L53659
14935A063974j21764n36830l21063J38837J54135k57809l84404l05495q5463n5235
14925g11117j35867J34767K74196k667j47888K54284N76876J17143j6336N5168
14915C98559j49441j28218o1643l39972n95509k72452l3137j92870J3064L34514
$$ y = [-95439, 197690, -17373, -413946, -641795, -704334, -382569, -188366, -56853, 346846, 703231, 546648, 206262, -134167, -11513, 241884, 283154, 301370, 310917, 381356, 83166, -156752, 87750, 108956, 72482, -91426, -341087, -158001, 249558, 311670, 217244, -45475, -354820, 33562, 433880, 191549, -289924, -552165, -594716, -731643, -814448, -617474, -155191, 357732, 571965, 340571, -205933, -304336, 237030, 710315, 1063974, 942210, 405380, 84317, 223154, 377289, 119480, -264924, -570419, -655882, -711117, -846984, -712217, -438021, -440688, -588576, -334292, 242584, 359727, 343391, 398559, 249118, 120900, 59257, -280715, -876224, -1148676, -1181813, -1374683, -1361619, -1027105]
14905a027105N24121L35536J90128l33042o46910m29584M1703p6943j35869K61353
14895a296612K37839R0809J75071K72823L09288J5897J59827P7240n96236m09214
14885i63268Q1540L55100K55161L47985M60258K01575k93387r7754j63212j77667
14875F331k38901J2235M61963M04103j32988l75988o7976M04356J23935j06605
14865D90465j53789j02255j67126j26104j38192q2203Q7170K22238K73356J28599
14855D32159J26628j5300j91321q5862l75323n32948n1786K27846L29323J52291
14845A5707L65666K10549l17050j04188M96090L32149k04593K70370Q4119p07784
14835D41035p96139j25871N8948J898J73802L28591J35155N5520j53864k08156
$$ y = [-1027105, -502984, -167448, 22680, -310362, -957272, -1386856, -1345153, -1422096, -1557965, -1296612, -1058773, -967964, -792893, -520070, -210782, -194885, -35058, 42182, -554054, -963268, -881728, -526628, -271467, 76518, 536776, 738351, 444964, 347210, 183998, 6331, -232570, -220335, 241628, 645731, 512743, 136755, 68779, 473135, 597070, 490465, 336676, 234421, 67295, -58809, -197001, -279204, -192034, 30204, 303560, 432159, 558787, 543487, 352166, 266304, -109019, -641967, -693753, -465907, -136584, 15707, 381373, 591922, 274872, 170684, 666774, 998923, 794330, 1064700, 1148819, 441035, -355104, -480975, -422027, -420129, -246327, 82264, 217419, 272939, 119075, -89081]
14825h9081r9978J94491J61787k56873k00343L9038K22471j0006L52445M89946
14815H03897m3543l17671m02774j18933k82667q96207k51471K0514L16040k64909
14805a437724l91145k07919P0481K71392M51351L22661L82136J88360p4359Q2777
14795c41989L26384R1507m99966k09518J92372R610J50162L93244M90982L16826
14785I19614O0298l67894m05976j52185k19707J86070J44735R2953j63666m41576
14775c47334m6338M6713j54310K37679N1816M0907J32071j70064Q8386L22814
14765B02340L4071M8019J67022K6495l57722r244J18521k14943j49104j10K50116
14754A15461M15895J27403l08406n81173l62923Q1681K2603q054r2425l01629
$$ y = [-89081, -189059, 5432, 167219, -89654, -289997, -250959, -28488, -38494, 313951, 803897, 760354, 442683, 39909, -79024, -361691, -1257898, -1509369, -1488855, -1172815, -1437724, -1828869, -2036788, -1966307, -1694915, -1243564, -920903, -538767, -350407, -424766, -341989, -15605, 75902, -424064, -633582, -441210, -431600, -281438, 111806, 602788, 919614, 979912, 612018, 206042, 53857, -165850, 20220, 164955, 257908, 94242, -347334, -393672, -346959, -501269, -263590, -211774, -170867, -38796, -208860, -120474, 202340, 236411, 284430, 451452, 477947, 120225, 110981, 229502, 14559, -134545, -134655, 115461, 531356, 658759, 350353, -230820, -593743, -512062, -489459, -497513, -589938, -891567]
14744h91567L72839O57762J03787P5308q1829j31381J33747K6193k33032N6230
14734H8057K76623J76117q867k41385j85130M157J9614O0050m43590l24260L1934
14723e46680J9455j24586M30471N92853l0758l42083k96453L9430P8926j05940
14713b85365l12199k77757p0479J92704j27983L06305P65186M76576J23307J09822
14703I00117J05382l04678p03839k56652n8289l63907j96286k8601k6738J29273
14693h04218L14650M79189K77314k65089m34284m14732k29979L70144L47313O5148
14683b94544j32948j120Q5359K45468k8106k46857l29419l09288o1974J6042K6488
14672a030899j13894M50617M05717q9149j52623l28602R4343L34566j27269n6301
$$ y = [-891567, -518728, 139034, 242821, 318129, 236300, 104919, 238666, 264859, 31827, 88057, 364680, 540797, 531930, 290545, 105415, 109572, 129186, 189236, -254354, -578614, -546680, -527225, -651811, -221340, 371513, 340755, -1328, -297781, -258351, -179425, -285365, -597564, -875321, -945800, -753096, -881079, -574774, 190412, 666988, 790295, 900117, 1005499, 700821, -3018, -259670, -317959, -681866, -878152, -906753, -933491, -804218, -489568, -10379, 266935, 1846, -432438, -847170, -1077149, -707005, -359692, -294544, -427492, -428612, -343253, -97785, -125891, -372748, -702167, -1011455, -1073429, -1057387, -1030899, -1144793, -694176, -288459, -377608, -530231, -858833, -764490, -429924, -557193, -613494]
14662f13494K19185K42462P3067j40578J09905J64272q2744M01178k2115m70016
14652a18878m2316J52K04286n4835J5176J83152j44422n27580l03958j22312L16228
14641e95307O82361L53342Q4165k5880j79215j15562K62215l5255l34429k0906
14631G5529K77972L32052J17453o3903M2282J07973n8988o3365O7091l11761k07613
14620C14722j53374j76509j9710J25656J21266J4971p7010L6949J9990J29863
14610C36814K86313L00986k4198o74290m51731J25856M37110L54198J45846j58282
14600F78622m22441m04881k61491K2859K26523Q1592J56564L91414k91031j05557
14590G2173j89115k38198J3011M2385K36068J46035J78178k74915m88330j24560
$$ y = [-613494, -394309, -151847, -78780, -219358, -109453, 54819, -27925, 373253, 351138, -118878, -161194, -161042, 43244, -11591, 3585, 186737, 42315, -485265, -789223, -911535, -595307, 87054, 440396, 524561, 498681, 319466, 203904, 466119, 430864, 96435, 75529, 353501, 685553, 803006, 739103, 781385, 889358, 830370, 767005, 834096, 522335, 314722, 161348, -15161, -34871, 90785, 212051, 227022, 150012, 186961, 206951, 336814, 623127, 924113, 899915, 225625, -226106, -100250, 336860, 691058, 836904, 678622, 256181, -148700, -410191, -387332, -160809, -79217, 77347, 468761, 177730, 72173, -116942, -355140, -342129, -299744, -63676, 82359, 260537, -14378, -502708, -627268]
14580f27268O90932N87422l08380q1035J73430l6752j80732j46119k7752m01504
14570c57758l98400O0699K31090k3330k22178p9467o01617k38429K26694K47160
14560a155536L95186L39285L95247J73720j10983k48664k84274Q4622J73609K43296
14550E508K04641K6871o50122l43969R46638N75535j89500k87986j27741l71129
14540b11254L9010L27481m4852r0821R7133J48104O1146J53218O7762j37633k94111
14529A15183m68938j92802l931j54763L3725K91795J87142k00736n13210j62740
14519a069275L59765M78744L14613M00990L80396K91989l9913r9739K02157L7345
14509A257072L2645k90597n13240l48517l37057K42602P17336N29998j19376n08148
$$ y = [-627268, 63664, 651086, 342706, 261671, 435101, 398349, 217617, 71498, 43746, -357758, -756158, -695459, -464369, -487699, -709877, -789344, -1390961, -1629390, -1402696, -1155536, -760350, -421065, -25818, 147902, 36919, -211745, -496019, -411397, -237788, 5508, 210149, 237020, -413102, -757071, 189567, 765102, 575602, 287616, 159875, -211254, -172244, 155237, 110385, 19564, 116697, 264801, 325947, 479165, 546927, 409294, 115183, -353755, -546557, -550488, -705251, -671526, -379731, -192589, -393325, -906535, -1069275, -709510, -230766, 83847, 484837, 865233, 1157222, 1117309, 1017570, 1219727, 1257072, 1289717, 999120, 485880, 137363, -199694, 42908, 760244, 1290242, 1170866, 662718]
14499F62718j54972l44374m13357l24532L89627O06920L84423n2382m38244k79927
14489C5900j7424J4615p9830J06663j16493J97275K76400n87816l19906j53844
14479f44460j49838J42944r4429m95150k28032J37739L41939K62552L33100M87618
14469I3983r0491J12509Q1473j77160J54925L99821l2486l42240L3728J2218n31372
14458b85092k17655J94529K29450m77945n11707l5616M6753O4077K82797L82165
14448c28244r4957L02745P4920K2748Q2795Q7595R9588k3537m03137p09793m69418
14437a358695M15679P96151O90925K19520j86727j45363l75151j00259O4865j75885
14427a54940j82785k31664K27355M51942L53988K88316J70322m0552q5774j20221
$$ y = [662718, 507746, 163372, -249985, -574517, -184890, 422030, 806453, 754071, 315827, 35900, 18476, 33091, -46739, 59924, -56569, 140706, 417106, -170710, -490616, -644460, -794298, -651354, -745783, -1240933, -1468965, -1331226, -989287, -726735, -393635, 93983, 3492, 116001, 197474, 20314, 175239, 575060, 542574, 200334, 234062, 246280, -285092, -502747, -308218, -78768, -556713, -1068420, -1104036, -1057283, -993206, -710409, -328244, -423201, -120456, -45536, -22788, 60007, 147602, 247190, 223653, -179484, -889277, -1358695, -943016, -146865, 544060, 763580, 576853, 431490, 56339, -43920, 20945, -154940, -337725, -569389, -342034, 109908, 463896, 752212, 922534, 881982, 796208, 675987]
14417F75987k16600l24362k73497k21308k72212q0426L04676J70631j86376k93286
14407g16773k11320k91266j73054K46243K22802K98668N21849M17578J82201K52155
14397G49083J25960k04571n59186n21465k78987J00186R1133q3867r1235J0978
14387f61971k98682l8680J24047q7039J68467O82394N03716J37107J84071K12739
14377I26169k56879j02137l28977l2277P040o0930K967q1134L17794R4127m53273
14366C2490l96412k31429j32837L92398K71232o3307k46893m44318J12248K30197
14356d76631J4328K00723J84713J47396j60583m63495n8242J49098m86921m81702
14346a431316K33066L3522j45442L32692O09910K76231j25825r0746k8603K55587
$$ y = [675987, 459387, 135025, -138472, -359780, -631992, -712418, -407742, -237111, -423487, -716773, -928093, -1219359, -1392413, -1146170, -923368, -624700, -102851, 314727, 496928, 749083, 875043, 670472, 111286, -410179, -689166, -588980, -497847, -581714, -672949, -661971, -960653, -999333, -875286, -962325, -793858, -111464, 392252, 529359, 713430, 926169, 669290, 567153, 238176, 205899, 212939, 152009, 154976, 73842, 391636, 485763, 32490, -363922, -595351, -728188, -335790, -64558, -127865, -374758, -819076, -706828, -476631, -462303, -261580, -76867, 70529, -90054, -553549, -611791, -462693, -949614, -1431316, -1198250, -1164728, -1310170, -977478, -367568, -91337, -217162, -307908, -336511, -80924]
14336h0924M40797K70662l7514j58395n9132j78132j63410J53189j77533l54879
14326c45271j21979j2822N39747K58950k99613J4691Q1486L2448K69222R6866
14316E13725P7880Q7664N579k2549m5217O7182K09770j61425m90672m70064n29041
14305g57168o2978M23988K99417L93493J11794k09292M9464J75302J51203k8491
14295E46732l05703J54086O40257M88901L61333J1118l27617j96074k02310k50510
14285I20213l03842m35193l09933K44415M31027q7871n15333k05105L20976M58584
14275E17938K62012m8300n7321K47308M17429R7505l16664n28055o85620o40794
14265g34562p2087J05568K14601O34990N45737J77592j19297k49089l71760k14903
$$ y = [-80924, 359873, 630535, 593021, 434626, 375494, 197362, 33952, 187141, 9608, -345271, -467250, -480072, 59675, 318625, 19012, 33703, 115189, 147637, 416859, 513725, 591605, 679269, 684848, 662299, 617082, 684264, 894034, 732609, 241937, -228127, -757168, -820146, -396158, -96741, 296752, 408546, 199254, 248718, 424020, 575223, 546732, 241029, 395115, 1035372, 1524273, 1885606, 1896724, 1569107, 1373033, 1170723, 920213, 616371, 181178, -128755, 115660, 546687, 458816, -56517, -261622, 59354, 517938, 779950, 731650, 674329, 921637, 1339066, 1436571, 1119907, 591852, -93768, -734562, -806649, -701081, -486480, 148510, 694247, 871839, 752542, 503453, 131693, -83210]
14255h3210L83355L34522J05377l1645j39243l66466k68028k44070L5173M42221
14245A67986P8161r5834n4897L5686M05156K69589k22219K7117J50490N8588r3736
14234G26087m747k5443l20640k16961L0384j41584k41514n19677j49379J21447
14224g42027k2920q2217J61347L11370L30280J67345K11373N8646j03017j40323
14214A49857l11708q8264l22788j24497M34295M58819q802o2806m79951n36844
14204h92689j73056K79540P72462L79963j60882l19132P2810L45632K68154J13083
14194F85885j48044q1780l4983m1623l9467P7422p4007L60282K49806l12413m11567
14183B29511m43680m39636m67209J00572L53140o4258J5315K72668L25472J05904
$$ y = [-83210, 300145, 634667, 740044, 708399, 569156, 202690, -65338, -309408, -274235, 167986, 246147, 150313, 95416, 131102, 536258, 805847, 583628, 610745, 761235, 819823, 726087, 721340, 695897, 375257, 158296, 188680, 47096, -194418, -714095, -863474, -742027, -764947, -847164, -685817, -374447, -44167, 123178, 334551, 393197, 290180, 149857, -161851, -250115, -572903, -697400, -263105, 195714, 186912, 124106, -355845, -892689, -1065745, -786205, -13743, 366220, 205338, -113794, -40984, 304648, 572802, 685885, 537841, 456061, 421078, 379455, 339988, 417410, 343403, 703685, 953491, 641078, 229511, -214169, -653805, -1121014, -1020442, -667302, -731560, -716245, -443577, -118105, -12201]
14173a2201K11589K03124l10021j38531Q0511k2804K89363L0336p2810j27240
14163A31316J74678K16365P1342J718N1644J65054K8517k287p85108r96181n65315
14152a508257J27028J3829J6103K51092j05895J36186N92584N24866J07651q5724
14142F9463K33456n3885n27592m66005K62794K0836j5432K47383K50627L0655
14132E2300m80173m12745j32206J45202K57190M60163O9347K11944M18282o4183
14122E25121m01768l86975n591N57570k4229p03528m18543l98752J48633M65209
14112f42853K86516J2496J55062J65211k27360j17418m7324m6584J5262K57752
14102a89240O6437L7153J3655Q4584j22856k60318j96340L44348M91958J21125
$$ y = [-12201, 199388, 402512, 92491, -46040, 34471, 11667, 301030, 331366, 258556, 131316, 305994, 522359, 593701, 595419, 647063, 812117, 840634, 838347, 53239, -942942, -1508257, -1381229, -1367400, -1351297, -1100205, -1206100, -1069914, -477330, 47536, 155187, 69463, 302919, 249034, -278558, -744563, -481769, -460933, -476365, -228982, 21645, 52300, -427873, -840618, -972824, -827622, -570432, -110269, -40922, 171022, 589304, 525121, 123353, -263622, -269213, 288357, 264128, -439400, -857943, -1256695, -1108062, -642853, -356337, -343841, -188779, -23568, -250928, -368346, -415670, -462254, -446992, -189240, -122803, -85650, -71995, 12589, -110267, -370585, -566925, -222577, 269381, 390506]
14092C90506L94078J06904n34401l33907L01205K83444K59526K02937J39128O6757
14082A276177j63102k83696k56113J02549M1893j25560N4065O1839j56280K4105
14072E75877k94317m45390j5453L19832L03797J61409q6326k49646k21069q253
14062D0461K65156K19408r1946l5671J01966k8466j35475l69831k95201l1915
14052c61514J22559M8464r4557p2600p1709j69182l05070k76878K46119N34472
14042c99896p94o5805L04979N48611J98948j10484J62337J67450m40312j36303
14032B28731J4758r9324l79357j03962K77778L1089k08358j72831p26j43135q1441
14021f36778J54119J01618N9319m36536L03434K99859l35554j9058J55630J07306
$$ y = [390506, 784584, 891488, 357087, 23180, 324385, 607829, 867355, 1070292, 1209420, 1276177, 1113075, 829379, 573266, 675815, 717708, 592148, 646213, 708052, 551772, 575877, 281560, -163830, -179283, 140549, 444346, 605755, 519429, 269783, 48714, 40461, 305617, 525025, 433079, 397408, 499374, 470908, 335433, -34398, -329599, -361514, -238955, -190491, -285048, -357648, -429357, -598539, -903609, -1180487, -934368, -399896, -400690, -466495, -161516, 387095, 586043, 475559, 637896, 805346, 365034, 228731, 243489, 144165, -235192, -339154, -61376, -30287, -238645, -411476, -412202, -555337, -636778, -482659, -381041, -321722, -758258, -454824, -154965, -490519, -509577, -353947, -246641]
14011b46641L41971M48587k08518k58802M4662l999k42021l63684o25734j68218
14001a282397J71820L02849M91840N53932K36622j99680K2164K77725k09568k63641
13991A01666l76919k84883q8003J46717J85703n2420k41330p6072K66552L40435
13981g8554L38666j583L12345Q9105p18954n38358J4616L76220K15809J89481
13971A98793j55895j37655L67716L36895J73727k79697m90839k84516j87n6049
13961c27707M96973P49080L41378q1351j67229j48727j94341n49104n81561M1777
13951d20812O61264K68793m29596k40641j18693k25810K67370L19406L16689J52190
13941E50160m10043j65965M17164J008l1025R3560L7615J69694J62815L79688
$$ y = [-246641, 95330, 543917, 335399, 76597, 121259, 117260, -124761, -488445, -1114179, -1282397, -1110577, -807728, -315888, 238044, 474666, 274986, 297150, 574875, 365307, 101666, -275253, -560136, -648139, -501422, -315719, -368139, -609469, -685541, -418989, -78554, 260112, 258529, 570874, 659979, -58975, -597333, -582717, -206497, 9312, 198793, 42898, -94757, 272959, 609854, 783581, 503884, 13045, -271471, -271658, -327707, 169266, 918346, 1259724, 1178373, 1011144, 862417, 668076, 118972, -462589, -420812, 240452, 509245, 79649, -160992, -279685, -505495, -238125, 81281, 397970, 550160, 140117, -25848, 391316, 392324, 361299, 454859, 492474, 662168, 824983, 1204671]
13931A204671Q4606p32768o90974l9152J02998O9885j86232m5344j09288j57651
13921d99249P8577M67771M27783R4940l13450K9082L17433K03675j47746k70364
13911C88452j73470q6058j29628p3764J22543m4704k49038j73525r5087J78549
13901c35730m6829l9023J01874j27386j83203K1062J58917q6173l12397j44209
13891i93097J90272K29511K36003m1583l86801j10505L53597N81124L78896l31598
13881A05819p37503n01355K76988P34526J08930k63200L4023j05078j71650J5046
13871e03454M14184L09435j38119n1942J17422l098K19693L80624J16899J17406
13861I79050m61357m65716Q0897j28184m97253j62176j07817K30048K53370m7485
$$ y = [1204671, 1289277, 556509, -134465, -173617, -70619, -734, -186966, -232310, -341598, -499249, -420672, 47099, 474882, 569822, 256372, 285454, 602887, 806562, 658816, 388452, 214982, 128924, -704, -74468, 48075, 3371, -245667, -419192, -514279, -335730, -382559, -421582, -319708, -447094, -630297, -609235, -450318, -536491, -848888, -993097, -802825, -573314, -337311, -378894, -765695, -876200, -522603, 58521, 437417, 105819, -631684, -1133039, -856051, -121525, -12595, -275795, -241772, -346850, -518500, -503454, -89270, 220165, 82046, 30104, 147526, 144428, 364121, 744745, 861644, 979050, 517693, 51977, 132874, 4690, -492563, -654739, -762556, -532508, -279138, -326623]
13851c26623K52702L25098p5421l1987j02498m2474r7753J10258j17890j00718
13841b07306m5189j23578k36879k95713R5997P58760Q35161O1890m68357k01890
13831A72896K14763J86112l5142p7572p7708J66207N00822k3555p77008o87621
13821d37806l28395Q2716J63442j0307J2675K60236J38797j3119l19368k13042
13811f64171R99j7074P2936K39466N6007L9202K97140K56036j40022J1794K12196
13800C64509q957k18654k19264q2635K21372O9029j36715J58016K03909N9467
13790D10077k31255q1287K3712r5217k08147l07407p3545O6988n9992o2020l1858
13779f49951n0798j57184K62951K24966O8521n246l47304m91468R0122N07160
$$ y = [-326623, -73921, 251177, 175756, 143769, 41271, -1203, -98956, 11302, -106588, -207306, -252495, -376073, -612952, -908665, -812668, -53908, 781253, 843143, 374786, 172896, 387659, 573771, 538629, 461057, 383349, 549556, 1050378, 1026823, 249815, -437806, -766201, -683485, -520043, -530350, -517675, -257439, -118642, -131761, -451129, -664171, -663172, -680246, -607310, -367844, -311837, -272635, 24505, 280541, 140519, 152313, 364509, 355552, 136898, -82366, -165001, 56371, 125400, -11315, 146701, 350610, 410077, 178822, 97535, 121247, 26030, -182117, -489524, -563069, -496081, -556073, -618093, -649951, -700749, -857933, -594982, -370016, -301495, -306741, -654045, -1145513, -1055391, -548231]
13769e48231K32524k29932J0750N2819k81059n1559L63067M61463J16477l30458
13759b04139O3224K32427j79816j50675j4265o369L39123O6106k61928j53246
13749b69558O8055L2913o7505j53461J88589J77417q5285O5464l3681k06J31849
13738E4591J04220M4940R0456j55293j01699o583j87181n8790m54221q8796R696
13727g48660n8395j58646j36743J22261q7647J21877J93476p721J46295N7571
13717e56332K28845R2658m21774l35767J32477N22762L4404m32902l10719K2461
13707a023887K67859J84078J02266N4438k1588M0203K21816L77987K244k86335
13697h0919j08197n0827P8854k83989k23472J70962K35761J44651q2018Q3970
$$ y = [-548231, -315707, -545639, -534889, -482070, -763129, -814688, -451621, 9842, 126319, -204139, -140915, 91512, -88304, -238979, -253244, -259613, 79510, 145616, -116312, -269558, -201503, -168590, -236095, -389556, -200967, -23550, -108835, -43371, -77052, -77258, 54591, 158811, 203751, 294207, 138914, 37215, 30632, -156549, -215339, -669560, -758356, -748660, -807055, -965701, -1102444, -980183, -1067830, -945953, -752477, -760198, -613903, -556332, -327487, -234829, -656603, -992370, -859893, -337131, -302727, -735629, -1046348, -1023887, -756028, -571950, -469684, -415246, -436834, -396631, -174815, 203172, 205416, -80919, -189116, -239943, -161089, -445078, -668550, -497588, -261827, -117176, -199194, -115224]
13687a15224k01660n82542l61619N38642O07397K32250j11851j94165J40785O5699
13677A7712K38226J58905k12272m763j78111k35496k08921m70979n065L87757
13667e13007L92857J19430p5250j65064j05479l8070r6912J97180K50946J38680
13657A05311J07154N6795J55390j52134k74409k16745L85465N85640Q1476o30349
13647B03594r46869o18487L53197N49954L08183l02150m10362M5817o0816J01230
13637g76709j720J22950J75022J08732L9086m8617k89887m48590p2906M04541
13627g88098K33179K95147K11644J22142L10658K49221K35823p4102j40344j72578
13617D82692L6682J55348K70738r4085m51070k78750K90301J32140k03754k39524
$$ y = [-115224, -316884, -899426, -1261045, -722403, -115006, 117244, 5393, -188772, -47987, 17712, 255938, 414843, 202571, 197808, 19697, -215799, -424720, -895699, -900764, -513007, -120150, -720, -75970, -241034, -346513, -384583, -481495, -284315, -33369, 105311, 212465, 269260, 424650, 272516, -1893, -218638, 166827, 752467, 833943, 203594, -743275, -1361762, -1008565, -458611, -150428, -452578, -862940, -817123, -877939, -776709, -778429, -655479, -480457, -371725, -332639, -381256, -671143, -1119733, -1192639, -788098, -554919, -259772, -48128, 74014, 384672, 633893, 869716, 795614, 655270, 482692, 519374, 674722, 945460, 851375, 400305, 121555, 411856, 543996, 340242, 100718]
13607A00718n01414j87876J53464j23145P6576O7491L039M75989o1404j16381
13597a12943J39706Q7602P8297Q1532j56881l30375k85922K50038K41274k78848
13587b86520n32550l10606K28253O75264O85085L35344n100J39802L8755j92352
13577G75375k52754j32608J09891K9365j65268K32491P3756j27676k97396p83228
13567e38052l66605M35884L20944k7888j36797L08733J73751n8963j47033l40613
13557c76639l35479m49866j92467L34879L74937K64833O9383k67400K13346M34844
13547G0371O8689j19013j20220J9948L5301k23058J19411J34534K61137j94686
13537E2414l53931k16821p1008N2152j96949k74925K29338L31579Q8998N32727
$$ y = [100718, -400696, -588572, -435108, -558253, -481677, -414186, -411147, 64842, 3438, -112943, 26763, 114365, 192662, 274194, 117313, -213062, -498984, -248946, -7672, -286520, -819070, -1129676, -901423, -226159, 458926, 794270, 789170, 928972, 967727, 775375, 522621, 390013, 499904, 529269, 364001, 596492, 670248, 542572, 245176, -538052, -904657, -468773, -147829, -175717, -312514, -3781, 169970, 111007, -36026, -376639, -712118, -1161984, -1354451, -1019572, -644635, -379802, -310419, -577819, -364473, 70371, 139060, 20047, -100173, -80225, -44924, -267982, -148571, -14037, 247100, 52414, -301517, -518338, -589346, -537194, -734143, -1009068, -779730, -448151, -359153, 173574]
13527A73574J46549j97405l204r5883J17789j69667k91771j59355M7311J84808
13517b47254l8664j58779K5552O1063K17033L44804N334n91677m61741r7927K23876
13506g18380K63669K41865K03677M27872K39948k11005l50043k06496J84909o3466
13496A2550q8478k72735n5660R2778j85839N1191N8226K31805L43500K75092K12587
13485F75017k61890l03221n6196k49890p3105J7723J80751K69323l1234J49362
13475C16640K52531l69579k16278K82232M0523m50062m79212P6071L56999O2353
13465a27782j26863j36251m52419k26504N6750J3493k744J23126K51371M76623
13455a51200M00949J84907k63464j35187n2125k74604j54349o0615k09110j28786
$$ y = [173574, 320123, 122718, 119514, 23631, 141420, -28247, -320018, -479373, -432062, -247254, -285918, -444697, -419145, -358082, -141049, 203755, 209089, -382588, -844329, -942256, -718380, -454711, -212846, -9169, 418703, 658651, 447646, 97603, -108893, 76016, 12550, -75928, -348663, -404323, -311545, -497384, -446193, -387967, -156162, 187338, 462430, 675017, 413127, 109906, 53710, -196180, -269285, -251562, -70811, 198512, 167278, 316640, 569171, 199592, -16686, 265546, 306069, -143993, -623205, -547134, -190135, -127782, -254645, -390896, -843315, -1069819, -1013069, -999576, -1002320, -879194, -627823, -151200, 249749, 434656, 171192, 36005, -16120, -290724, -445073, -505688, -714798, -843584]
13445h43584K05281K59209L45633K52675J46976j72608j97402J21853J33315m256
13435B47092k25607J33834L04557J54275P2524K11386l87095q20893j80001N87433
13425I7505P02024L05121K13935n07838o63976j78628j48986j97305J9385J4513
13415c44250Q601N16318O08515L1916l10087p9421J37496j78252J2385L09775
13405G12996j15380J90370K99353r7698k70695j19648J13043O7471J94360Q6123
13395A060295k05068l64422m87639l8608K05766j31382k49997O2026J26825r7279
13385a19483Q0777L95202R3716p0206K71251J67375m8620j01822k58853m02136
13375G201l9498J95264Q3740j91968P7827K91775J97019J72295k62714k8709M2852
$$ y = [-843584, -638303, -379094, -33461, 219214, 366190, 193582, -3820, 118033, 251348, 247092, 21485, 155319, 459876, 614151, 686675, 898061, 510966, -309927, -489928, 97505, 799529, 1104650, 1318585, 810747, 146771, -31857, -180843, -378148, -358763, -344250, -335649, 180669, 789184, 821100, 511013, 431592, 569088, 390836, 403221, 712996, 597616, 787986, 1087339, 989641, 718946, 599298, 712341, 779812, 974172, 1060295, 855227, 490805, 3166, -35442, 170324, 38942, -211055, -149029, -22204, -119483, -38706, 356496, 450212, 380006, 651257, 818632, 770012, 668190, 409337, 7201, -32297, 162967, 246707, 54739, 132566, 424341, 621360, 793655, 530941, 502232, 545084]
13364E45084J89427k1714k8138m949j28255k59428k17462J25661L43551N83485
13354A127262J82311k4014L22668J03035l54353m39806o28186k15085L06942N12066
13344H92840N78985L44321l10452n25538l3741k35777j40989K46264J55813J07333
13334A079059m6292k05964j45007l41005J9537J41963K22088J53332O3313j69232
13324G71792O1009K60976N1848l27370K966K84303J13617N0520q9437r5213M9563
13313A134574j87990k03396O8810M8450j33138n9587K4253k40765k86879k02008
13303c7676N6817M63863O06696L53620J28852r3355m33482k43728K96285L97634
13293A495526J09571L5721J37068K04002l63398n81845j14391L6423J24456j72516
$$ y = [545084, 734511, 712797, 684659, 679710, 551455, 292027, 74565, 200226, 543777, 1127262, 1309573, 1285559, 1608227, 1711262, 1356909, 917103, 288917, 73832, 380774, 892840, 1471825, 1816146, 1505694, 980156, 946415, 710638, 569649, 815913, 971726, 1079059, 1032767, 826803, 681796, 340791, 360328, 502291, 724379, 877711, 941024, 771792, 832801, 1093777, 1145625, 818255, 821221, 1105524, 1219141, 1269661, 1180224, 1085011, 1134574, 946584, 743188, 811998, 860448, 727310, 667723, 691976, 451211, 164332, -37676, 19141, 483004, 1089700, 1443320, 1572172, 1478817, 1045335, 801607, 1097892, 1495526, 1605097, 1640818, 1777886, 1981888, 1618490, 1036645, 922254, 958677, 1083133, 910617]
13283I10617O6391j0167j48399J75184K19693l96800n16867n1209K07668K79652
13273G35763L05737k2122k46664J33362Q3896m72743k30533R4003l1022m39075
13263h9398k6593M07423J98925k29830m88403n2707M38698M28312J83675J47308
13253I17410q6921l63237J934K98360o6236N9321K28412m3097j87394P2894J56917
13242I88363N9417J7711m15655m64769O472j80559j19248K53853J13087q618k93877
13231d3823k65347M2940K56781N3122k21869j15694k40153J4412L88120J80710
13221D9199l88425q0373L62494M79936J88760J00549n2132m04675p4492J01702
13211B82543J30853L97407M91181l8824q3984J81530Q2608p9277N00791M57616
$$ y = [910617, 977008, 966841, 818442, 993626, 1213319, 816519, 299652, 248443, 456111, 735763, 1041500, 1019378, 772714, 906076, 989972, 517229, 286696, 380699, 349677, -89398, -115991, 291432, 490357, 260527, -227876, -280583, 158115, 586427, 770102, 917410, 830489, 467252, 469186, 767546, 701310, 760631, 989043, 945946, 758552, 831446, 988363, 1047780, 1065491, 649836, 185067, 191539, 10980, -108268, 145585, 258672, 250054, -43823, -309170, -266230, -9449, 43673, -178196, -293890, -534043, -519631, -131511, 49199, -339226, -419599, -57105, 422831, 611591, 712140, 660008, 255333, 180841, 282543, 413396, 810803, 1301984, 1263160, 1179176, 1360706, 1443314, 1364037, 1864828, 2322444]
13201B322444J32667p0304m37701l32372k09416l41994J60825N56635L0656k69710
13191A541730l77195k29150J4229N9759J21920j23842j11910j75558p5769J62624
13181H06838J31439M26610K78931j4348j80151j75564M0764k21507k48304j77001
13171F67707J79223N84667L67142J71005j66805l22267l17285J13316j29534l86912
13161G60257l46564k44423J87620K24018M68721M79716L61965o9339m59438j48324
13151A214209k99356j47232L3853P7015J98835m6J34885j95848o70812o58814
13141c13311j98205L13441L84205J2632K0281j23520l10588K6411L0673L19174
13131A61193Q42263K73953l01826j13962J79985J62421L01317K67402K6572l58628
$$ y = [2322444, 2455111, 2384807, 1947106, 1614734, 1405318, 1063324, 1224149, 1780784, 1811440, 1541730, 1164535, 935385, 949614, 1009373, 1131293, 1007451, 895541, 719983, 644214, 806838, 938277, 1364887, 1643818, 1629470, 1449319, 1273755, 1314519, 1093012, 844708, 667707, 846930, 1431597, 1798739, 1969744, 1802939, 1480672, 1163387, 1276703, 1147169, 760257, 413693, 169270, 356890, 580908, 1049629, 1529345, 1891310, 1821971, 1362533, 1214209, 914853, 767621, 801474, 878489, 1077324, 1077278, 1212163, 1016315, 345503, -313311, -511516, -198075, 186130, 198762, 219043, 95523, -215065, -188654, -157981, 161193, 1003456, 1277409, 975583, 861621, 1041606, 1204027, 1505344, 1772746, 1799318, 1440690]
13121A440690m39124r4577j04789K93101N92492P0942l02660m43325k79249Q918
13111G42419j06724k89616j94461J66977M13961J22637K59418K27130k96668k82438
13101G62635n4417L3902Q7962L41443N06198j72723L5829N34204J50204j57806
13091B067431k57220J64744J33515j35251R8845L7196j45061J18836P3684P7013
13081B233732K66760J75137m3249K32807r4078l90319M3773K53661j18185l47626
13071B212413j00653m39764k56727M22304N59281L47447K43k06813L79009M27521
13061C344261j13733l00067O2330P07045M92704L22258M12044L8892j80692K37313
13051E022355O27191J069368J504882J834921L365584N341365N504449m52789
$$ y = [1440690, 1001566, 906989, 802200, 1095301, 1687793, 1758735, 1456075, 1012750, 733501, 742419, 635695, 346079, 151618, 318595, 732556, 855193, 1114611, 1341741, 1045073, 762635, 708218, 742120, 830082, 1171525, 1677723, 1505000, 1540829, 2075033, 2225237, 2067431, 1810211, 1974955, 2108470, 1973219, 2072064, 2109260, 1964199, 2083035, 2156719, 2233732, 2500492, 2675629, 2632380, 2865187, 2771109, 2380790, 2424563, 2678224, 2560039, 2212413, 2111760, 1671996, 1415269, 1837573, 2396854, 2744301, 2744544, 2537731, 2916740, 3344261, 3230528, 2930461, 2992791, 3699836, 4192540, 4514798, 4926842, 4965734, 4785042, 5022355, 5649546, 6718914, 8223796, 10058717, 13424301, 18765666, 24270115, 23817326]
13043B3817326n694877m904047k860947j734495j258125j008332n31434m34967
13035E390102m13567J16532P8515O4758J77562k16671m38791j8371J40721l03233
13025D577557j38689J13742N5404K54549j75337l58468l74584k15524r7928J65851
13015C806573L48232N49826M86347Q25394M93565j28976l7086K33243J08756Q6866
13005F772740M54946P67281P24936J01726J52355q5345j65217L40239O57263J209433
12995A0930357J383958R94644J126320J148526J298683J423134J735326J965985
12987B2006933K160138L260899M488092N651178P102529R251608J2072495J5640117
12979H1633989K1081699K8071345L8184215N2781486O9024964P4974470N1911450
$$ y = [23817326, 18122449, 13218402, 10357455, 8622960, 7364835, 6356503, 5825069, 5390102, 4976535, 5093067, 5171582, 5236340, 5413902, 5197231, 4758440, 4740069, 4880790, 4577557, 4438868, 4552610, 4608014, 4862563, 4687226, 4328758, 3954174, 3738650, 3640722, 3806573, 4154805, 4704631, 5190978, 6016372, 6509937, 6380961, 6343875, 6577118, 6685874, 6772740, 7227686, 7994967, 8719903, 8821629, 8973984, 8888639, 8723422, 9063661, 9720924, 10930357, 12314315, 13308959, 14435279, 15583805, 16882488, 18305622, 20040948, 22006933, 24167071, 27427970, 31916062, 37567240, 44669769, 53921377, 65993872, 81633989, 102715688, 130787033, 168971248, 221752734, 290777698, 365752168, 417663618]
12972D17663618k587701n3217211p0599565o3314387m8651241l5873944k6435671
12965A16983898j9520593j5472440j2472142r669294p684904o155120m949926
12958D1059479m350899l381504k641506k542483k347212k077097k278846k258017
12950A9181915j332994j025565q21921r10412j306811q85930m46434l94180m53325
12941A1604343k60527l43296k54851n0640n24256n33398l13141k20537l39427
12932H764270P7604J08482j4265j16605o7154R747J78200J97072M61956P10667
12922A0309974J86506J55945P60585Q12978J260154J782429K225738K654428J744994
12913B1893731o4907j063232j489074j152167n35127k84260m08460l09955K19000
$$ y = [417663618, 415075917, 361858706, 291259141, 227944754, 179293513, 143419569, 116983898, 97463305, 81990865, 69518723, 59849429, 52164525, 46009405, 41059479, 36708580, 33327076, 30685570, 28143087, 25795875, 23718778, 21439932, 19181915, 17848921, 16823356, 16001435, 15091023, 13784212, 12898282, 12451848, 12057668, 11604343, 11343816, 11000520, 10745669, 10695029, 10170773, 9637375, 9324234, 9103697, 8764270, 8841874, 8950356, 8936091, 8819486, 8752332, 8762079, 8940279, 9137351, 9599307, 10309974, 10496480, 10652425, 11413010, 12225988, 13486142, 15268571, 17494309, 20148737, 21893731, 21828824, 20765592, 19276518, 18124351, 17589224, 17304964, 16896504, 16586549, 16805549]
12904A6805549J088825J664149J937417J940446K704711L665460M661806O239439
12896D0707802P741164R564006J2554662J6996558K3023589L1530550M3007584
12889A85125915N8691976P3981298P4838793L9325826k2177841o5027339p2185949
12882B72572679o0208673m5038518l2766464k4414168j8422911j4080015j1016475
12875F6625455q936455p711343o396291n100582m192841l752922l405380k656469
12867B4473172k073648j475273j375119j455699j059939r52545j263622j117786
12859A3699541l13653N2975m89160o67991l62275p14195r35246l91427j72197
12850I706372o13658q62141n46541l03078j516K10379k9076m05346l26473P723
$$ y = [16805549, 17894374, 19558523, 21495940, 23436386, 26141097, 29806557, 34468363, 40707802, 48448966, 58012972, 70567634, 87564192, 110587781, 142118331, 185125915, 243817891, 317799189, 392637982, 431963808, 409785967, 344758628, 272572679, 212364006, 167325488, 134559024, 110144856, 91721945, 77641930, 66625455, 57689000, 49977657, 43581366, 38480784, 34287943, 30535021, 27129641, 24473172, 22399524, 20924251, 19549132, 18093433, 17033494, 16080949, 14817327, 13699541, 13385888, 13438863, 12949703, 12281712, 11919437, 11205242, 10269996, 9878569, 9706372, 9092714, 8230573, 7684032, 7380954, 7379438, 7589817, 7560741, 7155395, 6828922, 6836645]
12840F836645O7593K58709M18591M87233J18797p35024m12517L28057J83894N4789
12830G606767K83787M14092M06459M86019K67645K51828R00572Q99392J085812
12821A2602373Q65106M07376M34748R43878J308001J955784K500998K699390L361085
12812B7078739M245619N217542O358069Q046584J0570474J4198078J8725999K4964365
12804A19405469L3924054M6510968O2232239P4754185O5659854K0474392l6774972
12797C86186189o7708446o7605355n4469174m0794314k9836191k2409010j7928759
12790H5434940j4047059j0627213q307049o681866n734556m845967m117312l080837
12782B7993081k431724k225979k204472k031708k116480j744118r83988m42497
$$ y = [6836645, 6904238, 7162947, 7581538, 8068771, 8187568, 7452544, 7040027, 7368084, 7551978, 7606767, 7890554, 8304646, 8711105, 9197124, 9464769, 9716597, 10617169, 11516561, 12602373, 13467479, 13874855, 14309603, 15253481, 16561482, 18517266, 21018264, 23717654, 27078739, 31324358, 36541900, 42899969, 50946553, 61517027, 75715105, 94441104, 119405469, 153329523, 199840491, 262072730, 336826915, 402486769, 422961161, 386186189, 318477743, 250872388, 196403214, 155608900, 125772709, 103363699, 85434940, 71387881, 60760668, 52453619, 45771753, 40037197, 35191230, 31073918, 27993081, 25561357, 23335378, 21130906, 19099198, 16982718, 15238600, 14254612, 13812115]
12774A3812115r70981j714225j318756j071780n31712j18958l47263q21753q78681
12765F038006k91063N9691k84881o87593l30406m8916l08686l84375k69766m3020
12755C448991R4247j99644j3953K81522j43116k73698j33224J95352N6492j03903
12745C209066n2988m2186j08618j92127K20240M04031n5305l39009k51106m994
12735B787004n17494j072822l97952L45461K79653J42881l2413k88787k9949J22913
12725A338495J12087J65651m5639N7525M30030J45494j55665q03111q94520o8292
12715B82055L15661J08748O13773P79168l8665j40360l048j27996r7895k00150
12705A491291j40425k0231P743R8743Q8531q9119j25774j51664J60970q1609k84527
$$ y = [13812115, 12841134, 11126909, 9808153, 8736373, 8204661, 8085703, 7738440, 6916687, 6038006, 5746943, 5806634, 5521753, 4834160, 4503754, 4454838, 4146152, 3761777, 3492011, 3448991, 3543238, 3343594, 3329641, 3611163, 3468047, 3194349, 3061125, 3256477, 3312969, 3209066, 3156078, 3113892, 3005274, 2813147, 3033387, 3437418, 3382113, 3043104, 2791998, 2787004, 2269510, 1196688, 798736, 1144197, 1423850, 1566731, 1534318, 1245531, 1215582, 1338495, 1450582, 1616233, 1570594, 1628119, 2058149, 2203643, 2047978, 1244867, 350347, 282055, 597716, 706464, 1320237, 2099405, 2060740, 1920380, 1917332, 1789336, 1691441, 1491291, 1350866, 1330635, 1338378, 1437121, 1525652, 1436533, 1310759, 1159095, 1320065, 1238456, 953929]
12694I53929M9799K41000p2018p7745K11279J74978M24440J56025J9564P3939
12684B155190J34297j47730k51402m91930m05540k1853m27054j68991N63263J51711
12674A089961r192K52758J89612j98347k60975m6754q3523m9298l95939m95449
12664g146l51294m448M27475O69702N95765M0430j86124k0494J75203K31765j97021
12653A373813l02947k13065J23901L26644R9667j0535k29082n38885k06446N04163
12643I27228N12631m45121o12332L3029J36088J26616J19892l29304M4616J32640
12633F45983J85481O3544j23198N0303K03553j45621k67083j64430n20236k91148
12623c62852K40273O74182O83746J7273n12838l79369L38190O60878K25496m77348
$$ y = [953929, 1003728, 1244728, 1172710, 1094965, 1306244, 1481222, 1905662, 2061687, 2081251, 2155190, 2289487, 2141757, 1890355, 1398425, 992885, 971032, 543978, 374987, 938250, 1089961, 1080769, 1333527, 1523139, 1324792, 1063817, 1017063, 933540, 884242, 488303, -7146, -358440, -362888, 64587, 734289, 1330054, 1370484, 1184360, 1163866, 1339069, 1570834, 1373813, 1070866, 857801, 981702, 1308346, 1408013, 1397478, 1168396, 629511, 423065, 927228, 1439859, 994738, 382406, 415435, 551523, 678139, 798031, 468727, 513343, 645983, 831464, 895008, 771810, 822113, 1025666, 880045, 612962, 448532, -71704, -362852, -122579, 551603, 1235349, 1252622, 739784, 360415, 698605, 1359483, 1584979, 1107631]
12613A107631o04034k85041j19717j15356J92011L34932L91379L57914O6901j2327
12603A314293k10178j36384M6829j10337n6924J32173k42892l34215k11733m5163
12593A45469M9771j9147p3901M41270P53885L60193j70657l87324o10339j90962
12583B98258m0159l3212O0533o565Q7929L18408K72710K1661j27982j02641M0370
12572G89310J2806p5072j34416J27764P0081j07632k24044l09637l3963J76534
12562B91731J2150J56527K16538L9000k56506o4253j44640n26049p6528N14460
12552A62430M10316K77154L67041l6947l4535m8523k04255l1238k38579l79622
12542B43242n90057l70524N81272P66646J91506M1138o2917L29633M91355N1221
$$ y = [1107631, 503597, 218556, 98839, -16517, 175494, 510426, 901805, 1259719, 1326620, 1314293, 1104115, 967731, 1014560, 904223, 847299, 979472, 736580, 402365, 190632, 145469, 195240, 176093, 102192, 543462, 1297347, 1657540, 1486883, 1099559, 489220, 298258, 258099, 224887, 285420, 278855, 366784, 685192, 957902, 979563, 851581, 748940, 789310, 802116, 727044, 592628, 720392, 790473, 682841, 458797, 149160, 115197, 291731, 303881, 460408, 676946, 715946, 459440, 395187, 250547, -275502, -352030, 162430, 572746, 849900, 1216941, 1179994, 1145459, 1096936, 892681, 861443, 622864, 243242, -346815, -717339, -136067, 630579, 822085, 863223, 800306, 1129939, 1621294, 1672515]
12532A672515j95962n45681q39294o74375l2081N07660L70935m2898j32095j78720
12522h9996m25878m75733l30302j24442m343L01344K71311k25705K5806N99144
12512d78794M90454j29157k14470r3170R7425j4529J84978L12989j71987j19204
12502a35465J9853J29287K60067J24464K4732L4608J43806m8239J79337K31898
12492I64348M78666K22292k39698m14282n77992l92946L2497J7514J48999o087
12482B33311Q1360j8640j60616J24428J21352J29006J02337o2441K7566l47467
12472B30196o17995k41940l68761M827K48806J07536N48175L58365k9268k63046
12462b3105k2212N00177J87291O21q7697l25799l93252n95M25250K39750K49929
$$ y = [1672515, 1476553, 930872, 91578, -582797, -614878, -107218, 263717, 220819, 88724, -89996, -515874, -991607, -1321909, -1446351, -1450694, -1149350, -878039, -1103744, -1077938, -478794, 11660, -117497, -331967, -425137, -327712, -342241, -157263, 155726, -16261, -135465, -115612, 13675, 273742, 398206, 422938, 457546, 601352, 553113, 732450, 964348, 1443014, 1665306, 1425608, 1011326, 433334, 40388, 72885, 90399, 239398, 233311, 314671, 296031, 135415, 259843, 381195, 510201, 612538, 550097, 577663, 230196, -387799, -629739, -998500, -993673, -744867, -637331, -89156, 269209, 239941, -23105, -45317, 454860, 642151, 642772, 555075, 229276, -163976, -164571, 260679, 500429, 750358]
12451G50358m4060j83938M54207M37222j72178o34811q8758M51915o9455m71625
12441D28877j48528l1631J87497k14594n16867l13928r8357M8486K22010L25911
12431a11124Q0015m27186k46157J65999J01312J64972L46112q5933j66961K97280
12421A18329K6384o263K76394M03992K28052k74942l53496n7830P6604l25856
12411A11368l60863l36614k21674K68959O11285L62823j30025m31504p6525N16387
12401C13617M07579k46600n85745J08948O17793p0615m52126j98173J17623K00107
12391B12408l8812O9676J12378m2178K12896P61262J216930J201352l31561o22892
12381B751459K3902N44812J104309J804983K284733L270323N034365N165241l39331
$$ y = [750358, 706298, 522360, 976567, 1413789, 1241611, 606800, 518042, 969957, 900502, 428877, 280349, 248718, 436215, 221621, -295246, -609174, -707531, -659045, -437035, -111124, -31109, -458295, -704452, -538453, -437141, -272169, 73943, -11990, -178951, 118329, 144713, 138450, 414844, 818836, 1046888, 771946, 418450, 360620, 437224, 111368, -249495, -586109, -807783, -538824, 72461, 435284, 305259, -126245, -202770, 313617, 721196, 474596, -111149, -2201, 615592, 544977, 92851, -105322, 12301, 212408, 173596, 243272, 355650, 313472, 526368, 1287630, 2504560, 3705912, 3374351, 2751459, 2775361, 3320173, 4424482, 6229465, 8514198, 11784521, 16818886, 21984127, 21644796]
12372B1644796n821129n171875l093536j684566r89307r01674o68842j75726j88976
12363B949165m52176q03083o36050m00712M4373P1981j55463j46466J7688K83147
12353G72404K90726Q6842n4597k09321J05242R3526l29218m06787l31570J23424
12343A40671L79941K38419l14487k81017L67882K93985O0345m4082K65573L03637
12333A410867k15614k46611m21964k42900O5568J9732L47401L5836r7299L80271
12323A035287r994l30471l30377q7927j93916j88979n852N45523M82444j85025
12313G30713k30814j68289l89651j43306Q1283O332p7419j63625K04108K64248
12303A13580j09072o1049P9561P6227k28657k64242J10183J70487J17459J36903
$$ y = [21644796, 15823667, 10651792, 7558256, 5873690, 4884383, 3982709, 3313867, 3138141, 2949165, 2496989, 1693906, 1057856, 657144, 701517, 773498, 618035, 471569, 489257, 772404, 1063130, 1149972, 1095375, 886054, 991296, 1084822, 755604, 348817, 17247, 140671, 520612, 759031, 444544, 163527, 531409, 825394, 885739, 841657, 1107230, 1410867, 1195253, 948642, 526678, 283778, 349346, 369078, 716479, 752315, 655016, 1035287, 1025293, 694822, 364445, 276518, 82602, -106377, -112229, 433294, 915738, 730713, 499899, 331610, -58041, -201347, -120064, -113732, -191151, -354776, -150668, 113580, 4508, -56541, 23020, 99247, -129410, -393652, -283469, -112982, 4477, 141380]
12293A41380L14683j4138J07637o7974j51377L9228j54540l06729j71010J02930
12283a59910O6386m2575J02076P9776N6630k88222k9328O3598N0590J439k10734
12272c10274j03406J82275L17587p4078p0353k8315r1253l38420n78552p4734
12262a169523J77703P7617K92172J33237Q937m71k3096P0304O3577J25182k2506
12251b66867j29260P4572L48566m4350m1762p9855o29487j71273r5J24132O38363
12240a77316O47543M35714J53028m1396k27889k6829k07128p0384k68434j59726
12230E7183j08509K68248O37280O1173m01511j89019n48467q44233j53459j5624
12220a236938J10055L97705N07839J6850o5738J17409J62588j16280Q0468K86314
$$ y = [141380, 456063, 441925, 549562, 481588, 330211, 369439, 214899, -91830, -262840, -159910, -93524, -136099, -34023, 45753, 102383, -185839, -215167, -151569, -100979, -99540, -310274, -413680, -231405, 86182, 12104, -58249, -86564, -177817, -516237, -1094789, -1169523, -991820, -914203, -622031, -488794, -479857, -480328, -503424, -433120, -369543, -244361, -266867, -396127, -321555, 27011, -17339, -59101, -138956, -768443, -939716, -939811, -815679, -177316, 470227, 905941, 1058969, 1017573, 789684, 762855, 555727, 485343, 216909, 57183, -51326, 216922, 854202, 915375, 513864, 324845, -223622, -1067855, -1221314, -1236938, -1126883, -729178, -221339, -204489, -270227, -152818, 9770, -106510, -26042, 260272]
12210B60272m204k57738n26514k47860J47853L03871L66560M16122J43015j91332
12200D10045n18710o24391m53502K40536K38841j51792K48727L13139O95579N41841
12190I40313j23748k29607l01319j34130j89354j86279J21936J39364L37829N28705
12180I03710J69569j25829m2816q216j28093l23647j65309l34538L6948L41808
12170C23587L75775L9459J94228J90158m94191p20372k31690l16233o14833m69556
12160a723668K33525M20266M30809J57182k91139k18744j8239j2041M38452M63253
12150a20344q4709m51575J23277K63197J23752L48738Q7978j12483j06119k14144
12140a42432Q1303K91012J20022l6753K09957M82570L7382m11082l41635l4844
$$ y = [260272, 256068, -1670, -528184, -776044, -628191, -324320, 42240, 458362, 601377, 410045, -108665, -733056, -1186558, -946022, -707181, -858973, -610246, -297107, 398472, 940313, 816565, 586958, 285639, 151509, -37845, -224124, -102188, 37176, 375005, 903710, 1073279, 947450, 904634, 896418, 768325, 444678, 279369, -55169, -18221, 323587, 699362, 738821, 933049, 1123207, 629016, -91356, -323046, -639279, -1254112, -1723668, -1490143, -1069877, -639068, -481886, -773025, -991769, -1010008, -1022049, -583597, -120344, -205053, -656628, -533351, -270154, -146402, 202336, 290314, 177831, 71712, -142432, -61129, 229883, 349905, 313152, 523109, 1005679, 1043061, 631979, 290344, 255500]
12130B55500K5965r2090Q3895L46042J76811m67696k99322L38206L57942L8801
12120G64054o6418o27045l69001j5920n7870J26876j66794r1140M27463N24498
12110D48703L25304O2459O6904J35870M44247P88908j84217o27430l58247j16629
12100I85872l79982k35834J23142J41918j52738J1411l4624j82152l86388m45244
12090e54619k64567k14113l35439q6595K83553J87260j8965K41167N56001J361
12080b04956l39336m05376l52009K15173N10091L26238j28401j2908O53097M31486
12070F93099J06133j36011k10481N7441l01795k88156n2557L3797J40606o6997
12060b4921r6711j03729p138M9585J94303J64780l0069j67666l06926l82008k72112
$$ y = [255500, 281465, 189375, 273270, 619312, 796123, 328427, 29105, 367311, 725253, 764054, 697636, 70591, -298410, -314330, -372200, -245324, -412118, -503258, -75795, 448703, 774007, 836466, 903370, 1039240, 1483487, 2272395, 2088178, 1460748, 1102501, 985872, 605890, 370056, 493198, 635116, 482378, 493789, 459165, 277013, -109375, -554619, -819186, -1033299, -1368738, -1455333, -1171780, -984520, -1003485, -762318, -206317, -204956, -544292, -949668, -1301677, -1086504, -576413, -250175, -378576, -391484, 261613, 693099, 799232, 663221, 452740, 510181, 208386, -79770, -132327, -98530, 42076, -24921, -121632, -225361, -232499, -182914, 11389, 176169, 146100, -21566, -328492, -710500, -982612]
12049i82612J22376J47185j08518j88256L81959P09370K26099R5187K0412M8252
12039D71454J24943K36181k02399l10021k76444p143K08035M85370L31415j68706
12029H92685j43980l41447j05783J9809J93756j6755k75771M1825P480m04933
12019a33114M7899K14980j12142R4641L59513J96663l4112r4428n3418j17752
12009C68730l27626l28308l9605K67711K08877K43727m1003n3700Q2761j29476
11999B52088m7451l79785m9807M820M3538K92636j17485n34587m57869j32986
11989a126888n236n2065p5919j34843J23797L22609j60641j07136O0822j41591
11979a297091j48386K40663M18731J19947M9531l82565k57122o9333N34203P16321
$$ y = [-982612, -860236, -713051, -821569, -1009825, -627866, 81504, 307603, 402790, 423202, 471454, 596397, 832578, 630179, 320158, 43714, 36571, 244606, 729976, 1061391, 892685, 748705, 407258, 301475, 321284, 515040, 498285, 222514, 264339, 271819, -133114, -85215, 129765, 17623, 112264, 471777, 668440, 634328, 539900, 486482, 368730, 41104, -287204, -326809, -59098, 149779, 393506, 352503, 298803, 381564, 252088, 204637, -175148, -224955, -220135, -176597, 116039, -1446, -536033, -993902, -1126888, -1132124, -1184189, -1260108, -1394951, -1271154, -948545, -1109186, -1216322, -1155500, -1297091, -1445477, -1204814, -786083, -666136, -616605, -999170, -1256292, -1325625, -791422, -75101]
11969g5101L8989m39670j35664k5832K91735L97375J15274j6229o9554M6066j59409
11958c2020l57015q5829P8898N81569N70919K68819l04574k82645j18926p0914
11948B48282l0780n3029j0257l23400m86267r9565J15472K44024O5715L6337M43122
11937A49654M1189l06890N8389L19643o5454l43358j17046N1044L1040K42506
11927F0717q7351p0938m9495j15708J26108l6241q2408k21727M48144M38118j00074
11916C09145q2816m20969l96507J65742K49166M24279M41086j88572k44962m72350
11906b16758j15843L85212Q2927o2684K38869K68803O0280k82658K47533L48361
11896I54042N777j46425j98018j14651L9846M57922M80399k20321k92216j8971
$$ y = [-75101, -36112, -475782, -611446, -637278, -345543, 51832, 167106, 150877, 81323, 127389, -32020, -389035, -474864, -395966, 185603, 756522, 1025341, 720767, 438122, 319196, 248282, 217502, 164473, 154216, -169184, -655451, -755016, -639544, -395520, -329805, -293468, 149654, 190843, -116047, -57658, 261985, 196531, -146827, -263873, -212829, -181789, 60717, -26634, -97572, -147067, -262775, -136667, -172908, -255316, -477043, -28899, 409219, 309145, 226329, -194640, -591147, -425405, -176239, 248040, 689126, 500554, 255592, -216758, -332601, 52611, 135538, 72854, 311723, 580526, 640806, 358148, 605681, 954042, 959819, 813394, 615376, 500725, 540571, 998493, 1478892, 1258571, 966355, 947384]
11886I47384k39589l74596J24686M96398Q0793l01842l70048j60969K6993j17975
11876A11235J66775K87422J75716j10516P2695P7585M8920L3139m44719q989K30746
11865F40009r5464k44211K33008J82886m17180n90340k43448K88365M53788Q4086
11855B91499j57372l79998j45285K12104K32712K20980J44246k12438n244J63164
11845C64368k39687j58413N4254m4662k3770J17229j14719p6190N1231J14996
11835D4637j17922j00192N11642N94643Q3982m31994n45475L2947J63564J3583
11825B49415k53798k29766k11089J48028K76704j05595j97722J70214J36604J85224
11815A68219m4589J66924L66383n96816n74626J26957L10601l2811k76489j99200
$$ y = [947384, 707795, 333199, 457885, 954283, 1035076, 733234, 363186, 202217, 229210, 111235, 278010, 565432, 741148, 630632, 703327, 780912, 829832, 862971, 418252, 409263, 640009, 544545, 300334, 533342, 716228, 299048, -291292, -534740, -246375, 207413, 291499, 134127, -245871, -391156, -179052, 53660, 274640, 418886, 206448, 201204, 364368, 124681, -33732, 20522, -24140, -47910, 69319, -45400, -121590, -70359, 44637, -73285, -173477, 338165, 932808, 1016790, 584796, 39321, 72268, 235832, 249415, -4383, -234149, -445238, -297210, -20506, -126101, -323823, -153609, -17005, 168219, 123630, 290554, 656937, 60121, -514505, -387548, -76947, -109758, -386247, -585447]
11805e85447j84118k03410J01904L29535L27822j20262k29295m15836m43396r4989
11795a517492L22209K48729L76987N46919K05930J4706j79296k04369J27536Q7938
11785B9797J10175J04740k98145m80168l30351N5970K35993K93021M4333k19716
11775d54351j85965J14530j11646l6591j06203j04444N18963O04547N8857j21891
11765A75806j50536Q8269L90450k68616m02986j15825r810J87688K2567p7346
11755a60339O9914J73672j04098k24988N6710L54185N11627N06556k04065m32657
11745E46517l40927k2115o5586j66544j41089j21368N6401K27700Q0519L2229
11735H5737K43445L67904o1047k8833m538k05156k59740L21649P13545M25819
$$ y = [-585447, -769565, -972975, -871071, -541536, -213714, -333976, -563271, -979107, -1422503, -1517492, -1195283, -946554, -569567, -22648, 183282, 197988, 18692, -185677, -58141, 29797, 139972, 244712, -53433, -533601, -863952, -807982, -571989, -278968, -234635, -454351, -640316, -525786, -637432, -674023, -780226, -884670, -365707, 238840, 297697, 175806, 25270, 113539, 503989, 235373, -167613, -283438, -293248, -105560, -82993, -160339, -90425, 83247, -20851, -245839, -189129, 165056, 676683, 1183239, 979174, 546517, 205590, 183475, 117889, -48655, -189744, -311112, -254711, -27011, 53508, 85737, 329182, 697086, 636039, 607206, 602668, 397512, 137772, 459421, 1172966, 1598785]
11725A598785m2828N20577J405048O04182n79512k001872j240816j75863J15113
11716B02814J54163q5176q3248J81333M94183o7203k95704k08743k4917O7313
11706C34815k27142n15304l88862K55656P91332M01044k27627l01483L42543M99813
11696I64785o4058q03309o42529K10388L43958K56887Q1558j96237m71622k62702
11686e82881n4160p6205m7472r4334k12809L62239J52393O9690J216j97722K66533
11675d13512L28976l10538m98643l0114L70894o2461j73442K32806q430O7921
11665d96543N6122J44391K28490l71261l54133L9901P2269L70685K73129j15788
11655a52738k95610l72K8617j25135n3348K12444N16755O60403M78616j31431
$$ y = [1598785, 1555957, 2076534, 3481582, 4085764, 3506252, 1504380, 263564, 87701, 202814, 356977, 271801, 188553, 369886, 864069, 796866, 501162, 292419, 267502, 334815, 107673, -407631, -796493, -540837, 250495, 651539, 423912, 122429, 464972, 964785, 900727, 97418, -545111, -334723, 9235, 266122, 347680, 151443, -320179, -582881, -637041, -713246, -760718, -855052, -1067861, -705622, -553229, -483539, -482323, -680045, -413512, -84536, -395074, -893717, -923831, -552937, -615398, -788840, -556034, -564464, -496543, -440421, -296030, -67540, -438801, -792934, -753033, -680764, -310079, -36950, -152738, -448348, -448720, -420103, -545238, -598586, -386142, 130613, 791016, 1269632, 1138201]
11645A138201k94541l42972k52574k83402k82145P0248m2296k53703k26755k23300
11635i93239K80441M14300J7740K1621r3669k99063r9166M53309L42602n0265
11625e389n51976k92978Q0095L74290L21708r6710Q2807K42902J80940l1245j23965
11614A80479L46902j59581m80322N3790J66402Q1719O8185R2662L36613K3949
11604G10798k10298o59812r06785m58395k5682j50178K3524N91859Q09587N71056
11594B95674K15174m1575l38210k07596R2285L19210N1275K91714L00247M3967
11584A022165l45004n99940l06546L07892L08670L3790k09462L67401M69724j85781
11574H62909l64570l9742l52163j12102J89052k45456l09657P20K05966J05162
$$ y = [1138201, 843660, 500688, 248114, -35288, -317433, -247185, -289481, -543184, -769939, -993239, -712798, -298498, -280758, -259137, -352806, -651869, -751035, -297726, 44876, -5389, -557365, -850343, -770248, -395958, -74250, -170960, -88153, 154749, 335689, 304444, 180479, 527381, 367800, -112522, -58732, 107670, 189389, 257574, 350236, 686849, 710798, 500500, -159312, -1066097, -1524492, -1550174, -1700352, -1676828, -1084969, -275382, 295674, 510848, 469273, 131063, -76533, 15752, 334962, 386237, 677951, 978198, 1022165, 677161, 77221, -229325, 78567, 387237, 421027, 211565, 578966, 1048690, 862909, 498339, 458597, 106434, -5668, 183384, -62072, -371729, -371009, -165043, -59881]
11564e9881k7342K36479J0950k74036M1614P0612r6409K9983j69400k43602M5681
11553d35351M53166K05255O3813K33804J09541k25627j95864l0459k5121k31995
11543g8838l79055p9994k14480k56214K45998M74490L55280R479K7986J9091j28247
11532d504n71227p28920J16021M15954J21618o7212J39003K01373J18097J35663
11522a24134j56048j25793Q0184K94365M3223k84409N9347J51845R4707L1758
11512F5045j8847J465K58190J83405k952l84021j08613J1086L13273L74267j32043
11501E60255j80488Q1577K9362l30258o07678n57249k3914M25663N74715L66518
11491C38503J24131j01957j55265k34555k43054K4199J09490J16218M5042L5866
$$ y = [-59881, -87223, 149256, 160206, -113830, -72216, -1604, -98013, -68030, -237430, -481032, -435351, 17815, 223070, 286883, 520687, 630228, 404601, 208737, 178278, 153157, -78838, -457893, -537887, -752367, -1008581, -762583, -288093, 67187, 76666, 104652, 123743, -4504, -575731, -1304651, -1188630, -772676, -651058, -718270, -579267, -377894, -259797, -124134, -280182, -405975, -325791, -31426, 11797, -272612, -213265, -61420, 33287, 65045, 46198, 47663, 305853, 489258, 486306, 102285, -6328, 4758, 318031, 692298, 560255, 379767, 461344, 490706, 160448, -447230, -1004479, -1028393, -602730, -28015, 338503, 462634, 360677, 205412, -29143, -272197, -247998, -138508, -22290, 22752, 58618]
11481E8618J620k51214j40999L2201o7827q661N52565K85478q0665k05365p8451
11470I7300j27173l13751j57406r2271J97436K63842J22133j55558k39422L36075
11460f8795L28367K82454q1135l83291j96218k00349j63731J39874M47405N01199
11450F05780J06352k83755k00018k96787k48639k48009k57668j31963p4806J38392
11440h91121K7844J0015L08803K37089M10161O13267L047J36667j4775k32349
11430F08648k90226j57787m2876l12941k38207j42776M16643P75548K87114j10092
11420G93048k57944k73725M8965K05925P8508l9086J14786L88735m8676p88451
11410B22085J35226M57731q6636K44054M2297n06140o67515r0566M28147L41530
$$ y = [58618, 60238, -190976, -331975, -299774, -367601, -376262, 176303, 461781, 381116, 175751, 97300, -29873, -343624, -501030, -593301, -395865, -132023, -9890, -165448, -404870, -68795, 259572, 542026, 460891, 77600, -118618, -318967, -482698, -342824, 104581, 605780, 712132, 428377, 228359, -68428, -317067, -565076, -822744, -954707, -1029513, -891121, -863277, -853262, -544459, -307370, 102791, 716058, 719105, 855772, 840997, 608648, 318422, 160635, 117759, -195182, -433389, -576165, -159522, 616026, 903140, 793048, 535104, 261379, 310344, 516269, 594777, 555691, 670477, 1059212, 1010536, 222085, 357311, 815042, 728406, 972460, 1014757, 508617, -158898, -249464, 178683, 520213]
11400E20213K77941N5933m83281j79811J55984K02423j4672m17975l10305J2629
11390a80921j578m44J18440K09828l05865j83656J02231j53892j86882j51639
11380g34378J57305K92874L84858M43348L91116L5707j47015j48298k188n189
11370F68140J3678M5979N2451m04172n01924j17776O0412J26838N40787J95629
11360F80042r0763o5712J31705J39633k6085K62814O3649o03107k99282K96794
11350D89688k7994l20017J78636J6387j51874K41374K54448J51002j26062l5234
11340F70354K26293M7320j70801m92532n40068k34833K63574L41559J56690J71463
11330D39019K5349j57146k69308m5044R714k29886j3691N4713J48746J76725J20618
$$ y = [520213, 798154, 854087, 370806, 190995, 346979, 549402, 534730, 116755, -193550, -180921, -182499, -182943, -64503, 145325, -160540, -344196, -241965, -395857, -582739, -734378, -577073, -284199, 100659, 544007, 935123, 970830, 823815, 675517, 673329, 668140, 681818, 727797, 780248, 376076, -125848, -243624, -183212, -56374, 484413, 680042, 589279, 523567, 655272, 794905, 768820, 1031634, 1095283, 492176, 192894, 489688, 461694, 141677, 320313, 336700, 184826, 426200, 680648, 831650, 705588, 670354, 896647, 943967, 773166, 280634, -259434, -494267, -230693, 110866, 267556, 439019, 464368, 307222, 37914, -7130, 2584, -227302, -240993, -186280, -37534, 139191, 259809]
11319B59809l04707l39980R4797J75517N98453K59617o33543n13953l00675l07110
11309a011775l4297J85848J75128J83257O43848J73481o68604k65304p789J07304
11299e18903L11682K95514r8703j61908J19412Q0698k27058j03266o1927j50253
11289e14712j96413K20511M13989L01434J39892k00663n10745N203J96878J22660
11279b1966K44199L61216l5441m07500m72491J33431O8418m98433l07848j31327
11269a067742L8592J48962L8195l5078N92112M87489J50766K5794k09607k586
11259A66897L0620J32530N64694K37455n41349o05302n30586l92684k53579l20742
11249a512046J92391L46251N53472M69638J08102J67086M0245M1162J63012Q0537
$$ y = [259809, -44898, -384878, -290081, -114564, 483889, 743506, 109963, -403990, -704665, -1011775, -1046072, -860224, -685096, -501839, 142009, 315490, -353114, -618418, -626207, -518903, -207221, 88293, -10410, -172318, -52906, 27792, -199266, -302532, -364459, -514712, -711125, -490614, -76625, 224809, 364701, 164038, -346707, -341504, -144626, -21966, 222233, 583449, 548008, 140508, -331983, -198552, -130134, -628567, -936415, -1067742, -1029150, -880188, -841993, -877071, -284959, 202530, 353296, 379090, 169483, 166897, 197517, 330047, 894741, 1132196, 590847, -14455, -545041, -937725, -1191304, -1512046, -1319655, -973404, -419932, 49706, 157808, 324894, 365139, 406301, 569313, 649850]
11239F49850j03710l3135j28376k36278o49260l60358J33508K42033J84428K14625
11229h6673K65968K65413O9174n1432j168j14996J71108M48283L71031n5089o2905
11218A218714m2071L3369k03046o54276n49091l66174J43292K83448K31985N43984
11208F40134L61291L485m29661j26651N1832n3343k65258r2125J76567k09540
11198E6731k91762J67357M08215J10057J37989k3586n04527m91191l81507j65322
11188i77546J29109Q5527o6001j20600K44196P71503M12214k52764k30585L1073
11178B6126k39577m6010J08139K42429m7640k63325K01981L10716l49154L2661
11168b3654O44960j29832k06117Q0438K8603K79898r1769J8948j13637l93279
$$ y = [649850, 546140, 513005, 384629, 148351, -500909, -861267, -727759, -485726, -301298, -86673, 179295, 444708, 513882, 462450, 461282, 346286, 517394, 965677, 1336708, 1281619, 1218714, 1176643, 1210012, 1006966, 352690, -196401, -562575, -419283, -135835, 96150, 640134, 1001425, 1004910, 575249, 448598, 500430, 447087, 181829, 89704, 266271, 56731, -235031, -67674, 340541, 450598, 588587, 565001, 60474, -430717, -812224, -977546, -848437, -762910, -828911, -949511, -705315, 66188, 478402, 225638, -4947, 26126, -213451, -259461, -151322, 91107, 43467, -219858, -17877, 292839, -56315, -23654, 621306, 491474, 285357, 365795, 394398, 674296, 582527, 601475, 487838, 94559]
11158I4559l07160j21580l2336j17494J10235M24692L62028l5465q9439K25330
11148E13370j2775J06124o7700l96575m02564m05311P8604M69654M31792R7470
11138D12089j23988K11946K17224J10355n18493q57481j59292K83246K46268J31688
11128d6438L43488L80670k6355j4785j30088R1391K517j98092m2968K1340j47943
11117B32737n7979J34136M10780L10044j78111J32921K93753j36964o02094o45058
11107a05835j72602O7109J15254r7008j53295J20050M7441k14503J8578L14448
11097f0363k7913o00096k48555m3466O5985L05818J49278Q1090K85361J25940
11087C3079l11929l05993k51623L16354K03387j01627Q145m7763K7151N5837K45470
$$ y = [94559, -212601, -334181, -366517, -484011, -373776, 50916, 412944, 377479, 288040, 513370, 500595, 606719, 539019, 142444, -260120, -665431, -586827, -117173, 314619, 412089, 288101, 500047, 717271, 827626, 309133, -548348, -707640, -424394, -178126, -46438, 297050, 677720, 651365, 636580, 506492, 597883, 600400, 402308, 359340, 380680, 232737, 174758, 308894, 719674, 1029718, 851607, 984528, 1278281, 1141317, 539223, -105835, -278437, -211328, -96074, -193082, -346377, -226327, -178886, -393389, -374811, -60363, -88276, -688372, -936927, -980393, -914408, -608590, -459312, -378222, -92861, 33079, -278850, -584843, -836466, -520112, -316725, -418352, -410207, -457970, -430819, -374982, -129512]
11076a29512J84386k49409j8716q2070k71594j86277L35928N12894M52002J68012
11066G15644J12241q9504j33239j40221l70152k86993J81300J42399j67811K27146
11056A90810Q9553n2917K7442j50756l92828r6842L26980J30822j16557k05464
11046b49757k65576l60928J5503K33497L39041O7451n4796M07794O62021L73734
11036A167984l7875l65792n16093m96749j66717K93561j8620m52243k86445L55253
11026e23736K89376k82711j574N7471m0681M33072O89755j9055l03907j45945
11016A52065j46929m8291m92721m55750K98197P73907N95861P4517n31388m2553
11006A76915P7515j67287P2039M94196M11438L0532n58222n84167q5458J69865
$$ y = [-129512, 54874, -194535, -213251, -295321, -566915, -753192, -417264, 95630, 547632, 715644, 827885, 738381, 605142, 464921, 94769, -192224, -10924, 131475, -36336, 190810, 280363, 227446, 254888, 104132, -288696, -385538, -58558, 72264, -44293, -249757, -515333, -876261, -860758, -627261, -288220, -220769, -275565, 132229, 794250, 1167984, 1130109, 764317, 248224, -248525, -415242, -121681, -140301, -592544, -878989, -523736, -234360, -517071, -518645, -461174, -501855, -68783, 620972, 601917, 298010, 152065, 5136, -43155, -535876, -991626, -693429, 80478, 676339, 750856, 219468, 176915, 254430, 87143, 159182, 653378, 1064816, 1095348, 537126, -47041, -132499, 37366]
10996C7366J50310k1639k07784j13452m1525k67112k1562r2067j24921j90108
10986h92494K03839J23938k2661O7863K48035P4585k99865o7603j90469j05382
10976h60214r6655M9893M07863L30473M34095M3202Q9356R563k39343K7055o5109
10965A30179l87096L016n7494o2072J92097J15015n2350k36903O5112K89934K21659
10954B21097K02512k70067l77810j19577L1090J20371J26857J95195L31422J74889
10944F35979j72719K47523K20449l3412K5640j29278q5238l8297k49438j88535
10934B32674j61357k10348k55928j5281m4441j99997K3834L69840K35824l6381
10924f1561j73855K88981M45149m72303J4436K11754J57651K19887J35009P0398
$$ y = [37366, 187676, 166037, -41747, -155199, -196724, -463836, -485398, -577465, -702386, -892494, -688655, -564717, -587378, -519515, -271480, -196895, -496760, -564363, -754832, -860214, -956869, -906976, -499113, -168640, 265455, 308657, 398013, 407576, 168233, 195288, 130179, -256917, -253901, -311395, -373467, -181370, -66355, -118705, -355608, -290496, -562, 221097, 423609, 153542, -224268, -343845, -312755, -192384, -65527, 129668, 461090, 635979, 463260, 710783, 931232, 897820, 923460, 794182, 708944, 670647, 421209, 232674, 71317, -139031, -394959, -410240, -454681, -654678, -630844, -261004, -25180, -61561, -235416, 53565, 498714, 26411, 40847, 252601, 410252, 630139, 765148, 835546]
10914H35546j03711k69744l98938l65206K80713M60782j55066m38548k65963j18775
10904e38910p4881J17251K78545J02302l87150l14869L90860K89743J0327L38977
10894B12195K46103m4084P229n6145k35763l08707K02345L12307j13870j46128
10884G5482j1677L81898J17220k87019j57675l62842K3151L87423O0968K29026
10874D55955J51425n0042l72834o2755L83369J21174o17877n88966R6341J39637
10864c44573L6459J09974j4773N53704M01051r5319o6780n19650m38256j96332
10854e74495j43926j46708k32294r6329O6198k1545L67595N11162K65324J94984
10844A89966J70875L2253p0233l4402j4343m00152n05408j45438L9849J49815
$$ y = [835546, 731835, 462091, 63153, -302053, -21340, 439442, 284376, -154172, -420135, -538910, -613791, -496540, -217995, -115693, -502843, -817712, -426852, -137109, -126782, 212195, 458298, 414214, 421443, 365298, 129535, -179172, 23173, 335480, 221610, 75482, 63805, 445703, 562923, 275904, 118229, -244613, -221462, 165961, 226929, 455955, 607380, 557338, 184504, 121749, 505118, 626292, 8415, -580551, -484210, -344573, -308114, -198140, -212913, 340791, 741842, 646523, 579743, 60093, -378163, -574495, -718421, -865129, -1097423, -1193752, -1127554, -1149099, -781504, -270342, -5018, 189966, 360841, 393094, 322861, 288459, 274116, -126036, -631444, -776882, -737033, -587218]
10834e87218K11952k73615l20950J77821L70358M57619J17141K4789m3862j52797
10824a8762k97534k20037J96699n3654O5670M27542n1000l13957k44550j96083
10814g05666q3235J21826J75634J22712p819j51842m01145N8527L16413j97235
10804g51830k80423O8993L76752K70884K86752m79N0025N05483J33379k70296
10794C89240k19807m37473Q0974O01595J17915m44230l13406j60459P5011R9946
10784b10694k14470J50595M08320j35308k27518m6675m98155p04324K2090M76433
10774i79706J23396k70435J6604K37624Q493k3891p9633r6582J18673M02317K33993
10763c09147m33975k81175M26339K91142K99170L33965J13361J06917j16711m0900
$$ y = [-587218, -375266, -648881, -969831, -792010, -421652, 35967, 153108, 177897, 134035, -18762, -316296, -536333, -339634, -393288, -327618, 99924, 48924, -265033, -509583, -705666, -788901, -667075, -491441, -368729, -376548, -528390, -929535, -871008, -554595, -751830, -1032253, -963260, -586508, -315624, -28872, -29351, 20674, 526157, 659536, 389240, 169433, -268040, -187066, 414529, 532444, 88214, -225192, -385651, -310640, -210694, -425164, -274569, 133751, -1557, -229075, -275750, -773905, -1478229, -1456139, -979706, -856310, -1126745, -1110141, -872517, -864024, -887915, -967548, -1064130, -945457, -543140, -309147, -743122, -1024297, -597958, -306816, -7646, 326319, 439680, 546597, 429886, 388986]
10753C88986k42605n06046j47695Q6706j38095j13214N9212j30902k82617o14540
10743a640810l09396R0922L61434L05758K78014N61883J43503l68618k35796P863
10733h05243L27989J43732K51264J88857k43656j24207j894j87705n4965K54552
10723b51276K60223l40195J40902K89906j57023m69824l08318p6376M4981P2865
10713g94135K69232M9876j05507j75499l78970J76838O62333M13361j25911k19828
10703b28210M15715N01144K52824Q6496N9060k67564j45526j85772m41837l31446
10693b85116n1420O749j48173j33992j44087j25406J25457O65073L09593m48051
10683b29373l90941j69778L37749L66740J70958J1926J58724K71381k2809r5051
$$ y = [388986, 146381, -359665, -507360, -420654, -558749, -671963, -612751, -743653, -1026270, -1640810, -1950206, -1859284, -1497850, -1192092, -914078, -352195, -208692, -577310, -813106, -805243, -477254, -333522, -82258, 106599, -137057, -261264, -263158, -450863, -505828, -251276, 8947, -331248, -190346, 99560, -57463, -527287, -835605, -911981, -867000, -794135, -524903, -475027, -580534, -756033, -1135003, -958165, -295832, 117529, -8382, -228210, 187505, 688649, 941473, 1027969, 1087029, 819465, 673939, 488167, 46330, -285116, -336536, -329787, -477960, -611952, -756039, -881445, -755988, -90915, 218678, -229373, -620314, -790092, -452343, -85603, 85355, 97281, 256005, 527386, 504577, 409526]
10673D09526k27593k15298j33650j0382K62254O4635l92218j42360l09895k66696
10663i61677J64215N94396M45232K98492k8829m19515o68479k80375l9095J47493
10653g48142K09588j18714J19181L46354O43196K25841m1192n0008o2280o2298
10643D61526l79811m33N20724P3405j32184J23595l7913K21662J13410j53571
10633H10410l1219k64840k85572q1974P1452j71130k48776j50695O7173j05746
10623c90917o02373k37255j1320K61510M34503L02468K86550o3984j06114K96766
10613A69834Q7713r0255K6156O5249n6166j20123j2926k76226l46739q8202R0770
10602e50915M7912N2571L46690l1149j6938j65663J3517j79220j67305K70829
$$ y = [409526, 181933, -33365, -167015, -177397, 84857, 149492, -242726, -385086, -694981, -961677, -797462, -203066, 242166, 540658, 511829, 92314, -576165, -856540, -895635, -748142, -538554, -657268, -538087, -191733, 451463, 677304, 636112, 586104, 523824, 461526, 81715, 81282, 602006, 675411, 543227, 666822, 628909, 850571, 963981, 810410, 779191, 514351, 228779, 146805, 218257, 47127, -201649, -352344, -285171, -390917, -993290, -1230545, -1241865, -980355, -545852, -243384, 43166, -20818, -126932, 169834, 257547, 167292, 193448, 258697, 202531, 82408, 69482, -206744, -553483, -641685, -550915, -503003, -450432, -103742, -134891, -151829, -317492, -303975, -483195, -650500, -379671]
10592c79671K95047K8362j76523j96306j43110j30750J75961M95214O32607j12664
10582D88167m68361j37443P7224k05193m19112l65313K95842L74751L05452J75579
10572A21593q6953n9098o0577L03274J86486k36914j96962O5936l71163l34524
10562f68902J66965M82191K66928L03079k2313l84962j6171j76767j01251Q5561
10552f5642l49116k59982J08145K17760J51364J54979K90725J69109K5492J29059
10542E71893K1882M7051J15931R50O2628K89378M6447k43672k41000j96984K07275
10531F81779K97647K4082J05112l559j09415k94961l61049k36227k32001k1931
10521a50523p0561J23662J43914j11517j7568J19768O7915K50199J18909k04065
$$ y = [-379671, -84624, -56262, -232785, -429091, -572201, -702951, -526990, -31776, 600831, 488167, 19806, -117637, -40413, -245606, -664718, -1030031, -734189, -359438, -53986, 121593, 34640, -24458, -85035, 218239, 404725, 167811, -29151, 36785, -334378, -668902, -501937, -19746, 247182, 550261, 527948, 142986, 126815, -49952, -151203, -65642, -414758, -674740, -566595, -348835, -197471, -42492, 248233, 417342, 442834, 571893, 593775, 640826, 756757, 757707, 820335, 1109713, 1156160, 912488, 671488, 474504, 681779, 979426, 1003508, 1108620, 1105061, 995646, 700685, 339636, 103409, -128592, -150523, -221084, -97422, 46492, -65025, -82593, 37175, 105090, 355289, 474198, 270133]
10511B70133n09916l31015J35380M56920L88693j60108j86237j19790n8507k77841
10501c92288k8825K79786L78051M94381M01470j05182m20982n20113n30792n662
10491d50156M74184L81502j32032j40887j68243k06492L52525O19821M37796K84502
10481A452520k21934m30191j91505j3024J05233m3152j35818r1253J9018K9847
10471D79741L45542k94580n60675K54876J83017O8783O2793j0269j59589k80625
10461H9014m09192l51146n6400L35901K57475R9421j57699K32429L10284j3177
10451C36910k68581l29370l35222r9546K69326K92527j01644k42164J47417J93307
10441a37040k67317k08574N9986J41571M1731k19040k01188R2619q4237K40143
$$ y = [270133, -239783, -570798, -435418, 21502, 410195, 250087, 63850, -55940, -114447, -392288, -421113, -141327, 236724, 731105, 1132575, 1027393, 606411, 86298, -444494, -450156, 24028, 405530, 273498, 132611, -35632, -242124, 110401, 730222, 1168018, 1452520, 1230586, 800395, 608890, 595866, 701099, 657947, 522129, 430876, 449894, 479741, 825283, 530703, -29972, 224904, 407921, 476704, 539497, 529228, 369639, 89014, -320178, -671324, -727724, -391823, -134348, -34927, -192626, 39803, 350087, 336910, 68329, -261041, -596263, -695809, -426483, -133956, -235600, -477764, -330347, -137040, -404357, -612931, -552945, -411374, -369643, -588683, -789871, -697252, -781489, -541346]
10431e41346J29718n8746L05409L23257M23374R1363j85088j67103j30776J41910
10421C31972K42402k63153k38638j21725k52821J40105J95662J82296J23161J18441
10411D57702K50719J5121j35444k38969q2495p50944k07996K94375J02545J73001
10401a22385K62546L64629O71957N14671j95777l28695l21811l16496j13383j71104
10391B44152j45073m2544l84167o36049n24877J62018M02381N10566O43312k6570
10381B03149J9J18043k40076k52229j65734j77388k79972j89154O057L33289J17708
10370e26288j2722J7778l9484K64634K92258L37503J91526L34717K89215l2312
10360A116825m02571n20234j31738k39633J5144L63538J53552L50561l3770k81781
$$ y = [-541346, -411628, -470374, -164965, 158292, 581666, 673029, 487941, 320838, 190062, 331972, 574374, 311221, 72583, -49142, -301963, -161858, 33804, 216100, 339261, 457702, 708421, 723542, 588098, 349129, 266634, -484310, -692306, -397931, -295386, -122385, 140161, 504790, 1176747, 1691418, 1495641, 1166946, 845135, 528639, 415256, 244152, 99079, 56535, -327632, -963681, -1488558, -1326540, -924159, -413593, 229719, 203149, 203168, 321211, 81135, -171094, -336828, -514216, -794188, -983342, -977285, -643996, -526288, -539010, -521232, -560716, -296082, -3824, 333679, 525205, 859922, 1149137, 1116825, 714254, 194020, 62282, -177351, -162207, 201331, 354883, 705444, 671674, 389893]
10350C89893k83683k64513l88895l82675K48759L82852m7396j46778J40891O28809
10340B77264K77535o40568p53043l37930K21848L09815Q8777j12407P8205L22018
10330b68486K12596K62436L93469J629l73488j31528j01425m08464m15676m8003
10320h76940l0336K17884L77639K58741K59516K69878j77642j20823R7136M8426
10310C23479m7379l57990j00038N30444Q2974o92085l75688r8681K15409J31778
10300c87777p9490L3726M03044J74085j91657o7717k93302R347M29188L72900
10290D02347M94714K35277n33024p47977j65997P05373Q86240k71q65406n96046
10280a84770K46809R2802J32965K37816k10870m21617j68953k944j39288j76521
$$ y = [389893, 106210, -158303, -547198, -929873, -681114, -298262, -345658, -492436, -351545, 277264, 554799, -85769, -838812, -1176742, -954894, -645079, -556302, -668709, -590504, -268486, -55890, 206546, 600015, 601644, 228156, 96628, -4797, -413261, -828937, -876940, -907276, -689392, -311753, -53012, 206504, 476382, 298740, 177917, 275053, 323479, 276100, -81890, -181928, 348516, 431490, -260595, -636283, -734964, -519555, -387777, -467267, -433541, -30497, 143588, -48069, -115786, -409088, -399741, 29447, 402347, 897061, 1132338, 599314, -148663, -314660, 390713, 1276953, 1276682, 411276, -184770, 62039, 154841, 287806, 525622, 314752, -106865, -275818, -278762, -418050, -594571]
10270e94571k0712j0071k71420m78936k22800L18753L59499O19968M41559j80627
10260c9358j33533J16147j65479k94856k97710Q5994L88969M56536k07965j82913
10250b74168l45145o7083J76249M871n381m757O643l6979P8369L44310L12685
10239A89614M177J91950Q8002m2057l68485M3451M10375M30580M41700L17758
10229A707065m72138l51413Q2410m91174l55635l09515j34463J83671j47448j87476
10219d76116L14852J88094j56101r0976m48489l13910n6654l63342j13056K50762
10209a264936K51897K17287J85211K11487M62610M21114j35421l73558r6029N6366
10199f3972j2276l12724j17034K10698P1850K97877J80187m16162m76960k56949
$$ y = [-594571, -615283, -625354, -896774, -1375710, -1598510, -1279757, -920258, -300290, 141269, -39358, -172891, -56744, -222223, -517079, -814789, -728795, -339826, 116710, -91255, -274168, -619313, -686396, -510147, -505276, -510657, -515414, -508771, -545750, -467381, -123071, 189614, 193791, 385741, 473743, 431686, 63201, 106652, 517027, 947607, 1389307, 1707065, 1234927, 883514, 965924, 474750, 119115, -190400, -324863, -141192, -288640, -476116, -161264, 26830, -129271, -220247, -668736, -982646, -1039300, -1402642, -1515698, -1264936, -1013039, -795752, -610541, -399054, 63556, 484670, 349249, -24309, -120338, -63972, -76248, -388972, -506006, -295308, -223458, 74419, 254606, -161556, -638516, -895465]
10189h95465M27867N35111J59750P6788r6298j54762m3145j23572j65897r48M61679
10178A81108N89287N20168K14755k84707n88865j44319j75033k01782K5002j13754
10168B1860J3083J95837K28558K95664K85754Q2909m36454p29509m81762m46202
10158i70262m1433M52168L01358K56411M19532J65772K5383j60177J92431J67278
10148H08461L7531j99729n24071J67219L34975K07437j3936k19575p7899k42118
10138B78295l29726m38577j69855l371j9172m8847k80131k15668J67532M1210
10128a018310j14817K23800R4412j9904M40429L12764R9481J70736j35272m59901
10118d06582q4388L5857K66033M68400Q8734j11597k28652m98216L3773K55744
$$ y = [-895465, -467598, 67513, 227263, 304051, 207753, 52991, 9846, -113726, -279623, -280571, 181108, 770395, 1290563, 1505318, 1220611, 631746, 487427, 312394, 110612, 135614, 21860, 34943, 230780, 459338, 755002, 1040756, 1123665, 687211, -42298, -524060, -970262, -1011695, -559527, -258169, -1758, 417774, 583546, 608929, 448752, 641183, 808461, 845992, 646263, 122192, 289411, 624386, 831823, 817887, 598312, 520413, 278295, -51431, -490008, -659863, -663234, -682406, -731253, -1011384, -1227052, -1059520, -1018310, -1133127, -909327, -814915, -834819, -394390, -81626, 17855, 188591, 53319, -406582, -490970, -455113, -189080, 279320, 368054, 256457, 27805, -470411, -436638, -180894]
10108a80894J63491j30789r4624K9344q2957j02827L48620K84716j25962l91887
10098b83769l03060K0810M1884J15930J25740j08946J76688M03862k3883j28352
10088C6904k6048n7475n91381k22006L16628M60123J68875J05276M97906j04325
10078E84477n79616l84056K74321J50648M0071l13967j81775M42885M1773m30045
10068c55284k75084J97279J48521k11841J21691L70504k61922m02817M84291J39734
10058d4928k30619J01334L03479K36989O7849n6470L86518l0115n91319j20713
10048B2005K26244J9389p7635q1890J29597r860l54474k51092L37931M26039j45283
10037B40971l79069k74046j12469o1661k7092K81416Q1601n723M90048O20851
$$ y = [-180894, -17403, -148192, -242816, -213472, -296429, -399256, -50636, 234080, 108118, -283769, -586829, -566019, -524135, -408205, -282465, -391411, -214723, 189139, 165256, 36904, 10856, -46619, -638000, -860006, -543378, -83255, 85620, 190896, 688802, 584477, 4861, -379195, -104874, 45774, 85845, -228122, -409897, 32988, 74761, -355284, -630368, -433089, -284568, -496409, -374718, -4214, -266136, -668953, -184662, -44928, -275547, -174213, 129266, 366255, 434104, 377634, 764152, 734037, 142718, 22005, 248249, 267638, 190003, 108113, 237710, 227850, -126624, -377716, -39785, 386254, 240971, -138098, -412144, -524613, -586274, -613366, -331950, -250349, -256072, 233976, 854827]
10027H54827K53261j38318q4242j77179l67993m08832m48690n64734n3432K9395
10017a105937M77975N05710L10664n6225l22394k02981j49946k81773j25365N76087
$$ y = [854827, 1108088, 969770, 885528, 708349, 340356, -68476, -517166, -1081900, -1135332, -1105937, -627962, -122252, 188412, 132187, -190207, -393188, -543134, -824907, -950272, -374185]
$$ [...]
##END NTUPLES=NMR SPECTRUM
##END=
