##TITLE=C13_SL1-5ID(A)
 CDCl3, 22200sc

 8.12.2021
##JCAMPDX= 6.0         $$ Bruker NMR JCAMP-DX V2.0
##DATA TYPE= NMR SPECTRUM
##DATA CLASS= NTUPLES
##ORIGIN= UXNMR, Bruker Analytische Messtechnik GmbH
##OWNER= root
$$ XWIN-NMR		Version 3.5
$$ Thu Dec  9 11:10:35 2021 Russian Standard Time (UT+4h)  she@DPX200
##.OBSERVE FREQUENCY= 50.327896
##.OBSERVE NUCLEUS= ^13C
##.ACQUISITION MODE= SIMULTANEOUS
##.ACQUISITION SCHEME= undefined
##.AVERAGES= 22204
##.DIGITISER RES= 17
##SPECTROMETER/DATA SYSTEM= spect
##.PULSE SEQUENCE= zgpg30
##.SOLVENT NAME= CDCl3
##.SHIFT REFERENCE= (INTERNAL, CDCl3, 0, 225.239)
##AUDIT TRAIL= $$ (NUMBER, WHEN, WHO, WHERE, WHAT)
$$ ##TITLE= Audit trail, XWIN-NMR		Version 3.5
$$ ##JCAMPDX= 5.01
$$ ##ORIGIN= Bruker BioSpin GmbH
$$ ##OWNER= she
$$ F:/spectra/data/she/nmr/c13/1/pdata/1/auditp.txt
$$ ##AUDIT TRAIL=  $$ (NUMBER, WHEN, WHO, WHERE, WHAT)
(   1,<2021-12-09 11:09:24.14 +0400>,<she>,<DPX200>,
      <created by zg, POWCHK disabled, PULCHK disabled
       terminated by command 'halt'
       configuration hash MD5:
       00 E9 B6 7A A2 85 ED C7 34 08 36 98 17 FE 4E 26
       data hash MD5: 32K
       A7 3A 79 6C 39 B8 5E BD EA 89 59 90 2F 1E 4A B6>)
(   2,<2021-12-09 11:09:31.06 +0400>,<she>,<DPX200>,
      <Start of raw data processing
       efp BC_mod = 2 LB = 1 FT_mod = 6 PKNL = 1 PHC0 = -321.4289 PHC1 = 27.96237 SI = 32K 
       data hash MD5: 32K
       1E 84 D7 62 31 2D E7 64 0B 4D 68 29 9F 78 34 BD>)
(   3,<2021-12-09 11:09:33.75 +0400>,<she>,<DPX200>,
      <abs ABSG = 5 
       data hash MD5: 32K
       DE 3E 26 A6 E6 53 D1 11 67 11 E7 26 8F 13 33 8B>)
(   4,<2021-12-09 11:10:02.70 +0400>,<she>,<DPX200>,
      <pk PHC0 = 0.9971542 PHC1 = 0 
       data hash MD5: 32K
       26 40 22 AB 97 0F 6F E5 11 2C 9A DC 61 01 D1 B9>)
$$ ##END=
$$ 
$$ hash MD5
$$ 04 69 57 9C 77 DE D4 71 1B C2 B3 70 B8 F9 89 B2
##$RELAX= 
##$RELAX= 
##$RELAX= 
##$RELAX= 
##$RELAX= 
##$RELAX= 
##$RELAX= 
##$RELAX= 
$$ Bruker specific parameters
$$ --------------------------
##$DU= <F:/spectra>
##$EXPNO= 1
##$NAME= <c13>
##$PROCNO= 1
##$TYPE= <nmr>
##$USER= <she>
##$AMP= (0..31)
100 100 100 100 100 100 100 100 100 100 100 100 100 100 100 100 100 100 
100 100 100 100 100 100 100 100 100 100 100 100 100 100 
##$AQSEQ= 0
##$AQ_mod= 1
##$AUNM= <au_zg>
##$AUTOPOS= <>
##$BF1= 50.322709
##$BF2= 200.13
##$BF3= 50.322709
##$BF4= 500.13
##$BF5= 500.13
##$BF6= 500.13
##$BF7= 500.13
##$BF8= 500.13
##$BYTORDA= 1
##$CFDGTYP= 0
##$CFRGTYP= 5
##$CHEMSTR= <none>
##$CNST= (0..31)
1 1 145 1 1 1 1 1 1 1 1 1 1 1 1 1 1 1 1 1 1 1 1 1 1 1 1 1 1 1 1 1 
##$CPDPRG= <waltz16>
##$CPDPRG1= <>
##$CPDPRG2= <waltz16>
##$CPDPRG3= <>
##$CPDPRG4= <mlev>
##$CPDPRG5= <mlev>
##$CPDPRG6= <mlev>
##$CPDPRG7= <mlev>
##$CPDPRG8= <mlev>
##$CPDPRGB= <>
##$CPDPRGT= <>
##$D= (0..31)
0 2 0.00345 0 0 0 0 0 0 0 0 0.03 2e-05 3e-06 0 0 0 0 0 0 0 0 0 0 0 0 0 
0 0 0 0 0 
##$DATE= 1639033531
##$DBL= (0..7)
120 120 120 120 120 120 120 120 
##$DBP= (0..7)
150 150 150 150 150 150 150 150 
$$ [...]
##$SUBNAM4= <"">
##$SUBNAM5= <"">
##$SUBNAM6= <"">
##$SUBNAM7= <"">
##$SUBNAM8= <"">
##$SUBNAM9= <"">
##$SW= 239.972175391363
##$SWIBOX= (0..15)
0 1 3 0 0 0 0 0 0 0 0 0 0 0 0 0 
##$SW_h= 12077.2946859903
##$TD= 32768
##$TD0= 1
##$TE= 0
##$TE2= 300
##$TE3= 300
##$TEG= 300
##$TL= (0..7)
120 120 120 120 120 120 120 120 
##$TP= (0..7)
150 150 150 150 150 150 150 150 
##$TP07= 0
##$TPNAME0= <>
##$TPNAME1= <>
##$TPNAME2= <>
##$TPNAME3= <>
##$TPNAME4= <>
##$TPNAME5= <>
##$TPNAME6= <>
##$TPNAME7= <>
##$TPOAL= (0..7)
0.5 0.5 0.5 0.5 0.5 0.5 0.5 0.5 
##$TPOFFS= (0..7)
0 0 0 0 0 0 0 0 
##$TUNHIN= 0
##$TUNHOUT= 0
##$TUNXOUT= 0
##$USERA1= <user>
##$USERA2= <user>
##$USERA3= <user>
##$USERA4= <user>
##$USERA5= <user>
##$V9= 5
##$VALIST= <valist>
##$VCLIST= <CCCCCCCCCCCCCCC>
##$VD= 0
##$VDLIST= <DDDDDDDDDDDDDDD>
##$VPLIST= <PPPPPPPPPPPPPPP>
##$VTLIST= <TTTTTTTTTTTTTTT>
##$WBST= 1024
##$WBSW= 4
##$XGAIN= (0..3)
0 0 0 0 
##$XL= 0
##$YL= 0
##$YMAX_a= 143357860
##$YMIN_a= -33648627
##$ZGOPTNS= <>
##$ZL1= 120
##$ZL2= 120
##$ZL3= 120
##$ZL4= 120
##$ABSF1= 225.2393
##$ABSF2= -14.75813
##$ABSG= 5
##$ABSL= 3
##$ALPHA= 0
##$AQORDER= 0
##$ASSFAC= 0
##$ASSFACI= 0
##$ASSFACX= 0
##$ASSWID= 0
##$AUNMP= <proc_1d>
##$AZFE= 0.1
##$AZFW= 0.5
##$BCFW= 0
##$BC_mod= 2
##$BYTORDP= 0
##$COROFFS= 0
##$CY= -3
##$DATMOD= 1
##$DC= 0
##$DFILT= <>
##$DTYPP= 0
##$F1P= 0
##$F2P= 0
##$FCOR= 0.5
##$FTSIZE= 32768
##$FT_mod= 6
##$GAMMA= 0
##$GB= 0
##$INTBC= 1
##$INTSCL= 4.134877e-10
##$ISEN= 128
##$LB= 1
##$LEV0= 0
##$LPBIN= 0
##$MAXI= 10000
##$MC2= 0
##$MEAN= 0
##$ME_mod= 0
##$MI= 0.1934396
##$NCOEF= 0
##$NC_proc= 3
##$NLEV= 6
##$NOISF1= 120.0001
##$NOISF2= 80.00006
##$NSP= 0
##$NTH_PI= 0
##$NZP= 0
##$OFFSET= 225.2393
##$PC= 1.4
##$PHC0= -320.4317
##$PHC1= 27.96237
##$PH_mod= 1
##$PKNL= yes
##$PPARMOD= 0
##$PSCAL= 0
##$PSIGN= 0
##$REVERSE= no
##$SF= 50.3226000198075
##$SI= 32768
##$SIGF1= 140
##$SIGF2= 120
##$SINO= 11.81781
##$SIOLD= 32768
##$SREGLST= <13C.CDCl3>
##$SSB= 0
##$STSI= 32768
##$STSR= 0
##$SW_p= 12077.2946859903
##$SYMM= 0
##$S_DEV= 0
##$TDeff= 32768
##$TDoff= 0
##$TI= <>
##$TILT= no
##$TM1= 0
##$TM2= 0
##$TOPLEV= 0
##$USERP1= <user>
##$USERP2= <user>
##$USERP3= <user>
##$USERP4= <user>
##$USERP5= <user>
##$WDW= 1
##$XDIM= 32768
##$YMAX_p= 276906692
##$YMIN_p= -1630582
$$ End of Bruker specific parameters
$$ ---------------------------------
##NTUPLES= NMR SPECTRUM
##VAR_NAME=  FREQUENCY,     SPECTRUM/REAL,   SPECTRUM/IMAG
##SYMBOL=    X,             R,               I
##VAR_TYPE=  INDEPENDENT,   DEPENDENT,       DEPENDENT
##VAR_FORM=  AFFN,          ASDF,            ASDF
##VAR_DIM=   32768,         32768,           32768
##UNITS=     HZ,            ARBITRARY UNITS, ARBITRARY UNITS
##FACTOR=    0.368581032318806, 1,           1
##FIRST=     11334.6273832426, 0,            0
##LAST=      -742.667302747745, 0,           0
##MIN=       -742.667302747745, -1630582,    0
##MAX=       11334.6273832426, 276906692,    0
$$ Real data points
##PAGE= N=1
##DATA TABLE= (X++(R..R)), XYDATA
$$ [...]
16023b93127Q2638J60884k2072N0923j41142k50473l2530j9682j43533R8696L54510
$$ -293127 -210489 -49605 -71677 -20754 -161896 -412369 -444899 -464581 -608114 -509418 -154908
16012a54908J52411j944j52288j39068l4557J61644J30236J9757q4064o1865M3183
$$ -154908 -2497 -4441 -156729 -295797 -330354 -168710 -38474 -18717 -102781 -164646 -121463
16001a21463n5694j73572N4338K07554N234j82614L1338J98272j28380q6495J52929
$$ -121463 -177157 -350729 -296391 -88837 -83603 -266217 -234879 -36607 -164987 -251482 -98553
15990i8553O2982R060J52295n6129k24876K5928o3736q9302m9326N4411Q4456
$$ -98553 -35571 -26511 125784 69655 -155221 -129293 -193029 -282331 -331657 -277246 -192790
15979a92790Q8968J09196o0915j0315l8888r5162j21420j61238R1442K54842J46432
$$ -192790 -103822 5374 -55541 -65856 -104744 -199906 -321326 -482564 -391122 -136280 10152
15968A0152L0167Q0426j52969k87615k4020R3703L36011K83354J2980j90600k48866
$$ 10152 40319 120745 -32224 -319839 -343859 -250156 85855 369209 382189 191589 -57277
15957e7277k10558K921K21892J06809j23614R3404P0455R9381J27090j18904j20352
$$ -57277 -267835 -264914 -43022 63787 -59827 33577 104032 203413 330503 211599 91247
15946I1247q8149j23755q7525R3125j46632j16450N8945m3088O4601J90071Q9199
$$ 91247 3098 -120657 -208182 -115057 -261689 -378139 -319194 -362282 -297681 -107610 -18411
15935a8411q7622o8130M9085L531N5019J60468R5780j25072k69513j62950M5274
$$ -18411 -106033 -174163 -125078 -121547 -66528 93940 189720 64648 -204865 -367815 -322541
15924c22541o2520l1069R4289R8793J32248J63145l492j58786q8944O2649J5956
$$ -322541 -385061 -416130 -321841 -223048 -90800 72345 68853 -89933 -178877 -116228 -100272
15913a00272K3683J88573J47918k7249k28004k46429r2069J08723N1215k29488
$$ -100272 -76589 111984 259902 232653 4649 -241780 -333849 -225126 -173911 -403399
15903d03399k24294J26226L22220J15323n9804j38427r0638j01314r6498J5910
$$ -403399 -627693 -501467 -179247 -63924 -123728 -262155 -352793 -454107 -550605 -534695
15893e34695K20377K40475O9666j14055l10466j19713J22098K59472L8037k8785
$$ -534695 -314318 -73843 -4177 -118232 -428698 -548411 -426313 -166841 -128804 -157589
15883a57589P420n2025q7020j797m1254p9449O509j19596k52336k67217k26734
$$ -157589 -150169 -202194 -289214 -291011 -332265 -411714 -405205 -524801 -777137 -1044354 -1271088
15872a271088N4649K12550Q2953K3470J56751J00160K03566J42909J6513q9817
$$ -1271088 -1216439 -1003889 -920936 -897466 -740715 -640555 -436989 -294080 -277567 -367384
15862c67384k2274M7538p5774M8662R5149j18136k51418K6932M640p2894R4656
$$ -367384 -389658 -342120 -417894 -369232 -274083 -392219 -643637 -616705 -612065 -684959 -590303
15851e90303K0514j88790j32023J39911n3200j51592O3913J81199R9970N2627
$$ -590303 -569789 -758579 -890602 -750691 -803891 -955483 -891570 -710371 -610401 -557774
15841e57774K22794R838j49246Q9656Q4423K41386M35634L1169k17768k75285
$$ -557774 -334980 -325142 -474388 -384732 -300309 -58923 376711 407880 190112 -85173
15831h5173j25418j34768j78995J2149j12580l0776k8389K17136L01455P8839
$$ -85173 -210591 -345359 -524354 -512205 -624785 -655561 -683950 -466814 -165359 -86520
15821h6520q187K1347J2845r7948P7071J98509N487R0948J36748O9438j0553j49304
$$ -86520 -94707 -73360 -60515 -158463 -81392 117117 122604 213552 350300 419738 409185 259881
15809B59881k21790j82254J03851Q5897j42113M9339k625j74349k23711J04102
$$ 259881 38091 -144163 -40312 45585 -96528 -47189 -49814 -224163 -447874 -343772
15799c43772L76832J69646j92249k79403k06239j29859m2658r5878J01528J23968
$$ -343772 33060 202706 10457 -268946 -475185 -605044 -647702 -743580 -642052 -518084
15789e18084J25131L61049K84701p0802j44946K8525J01713k7971j08553j09824
$$ -518084 -392953 -31904 252797 181995 37049 65574 167287 139316 30763 -79061
15779g9061j44498m8452J31411j9329l9135J00039K851j36229j07976r1659J79769
$$ -79061 -223559 -272011 -140600 -159929 -199064 -99025 -96174 -232403 -340379 -432038 -252269
15768b52269N0704J9225J74119J4765r1229Q8902O2548M7035O394j25284j7554
$$ -252269 -201565 -182340 -8221 6544 -84685 4217 66765 113800 120194 -5090 -22644
15757b2644J65024k1315j29755o2187K724p9936k94809k44302J8929R6190N6207
$$ -22644 142380 121065 -8690 -70877 -68153 -148089 -442898 -687200 -668271 -572081 -515874
15746e15874o0613N2041P8426N2229J63977O5380k33398k79437l57097N633L87915
$$ -515874 -576487 -524446 -446020 -393791 -229814 -164434 -397832 -677269 -1034366 -1028733 -640818
15735f40818J06249k6601J08049J30411J68298K2090q9837j73106j80913J1497
$$ -640818 -534569 -561170 -453121 -322710 -154412 -132322 -222159 -395265 -576178 -564681
15725e64681N3663l0301n218n0364L4411K52997Q0051O5419O9840J01953J47937
$$ -564681 -511018 -541319 -546537 -596901 -562490 -309493 -229442 -164023 -94183 7770 155707
15714A55707Q8036p8435k02236j1193n5945r1046O954J6393j36096p6004j67899
$$ 155707 243743 165308 -36928 -48121 -104066 -195112 -188158 -171765 -307861 -383865 -551764
15703e51764k68113MM1204k0795m9454J27185M7914k307K7603M4454Q0460O3693
$$ -551764 -819877 -819873 -778669 -799464 -848918 -721733 -673819 -676126 -648523 -604069 -523609 -459916
15691d59916M0448J14257J49380J00916J29007m617k21619j86844J85j2422Q6528
$$ -459916 -419468 -305211 -155831 -54915 74092 69475 -152144 -338988 -338803 -351225 -264697
15680b64697O0206j24927j15942k6666O0530J51700R5001r5494q2426K7348R0575
$$ -264697 -204491 -329418 -445360 -472026 -411496 -259796 -164795 -260289 -342715 -315367 -224792
15669b24792j9996N3515J16393J68887J6955j19162j14351l1469J60780k8024
$$ -224792 -244788 -191273 -74880 94007 110962 -8200 -122551 -154020 6760 -21264
15659b1264j92964p6316P5966R6330J26778J47237j24584l18074j53268o2126
$$ -21264 -214228 -290544 -214578 -118248 8530 155767 31183 -286891 -440159 -502285
15649e02285k83018j19784J49790J77251L4606k4965K4522K3629o0181n3172J58107
$$ -502285 -785303 -905087 -755297 -578046 -543440 -568405 -543883 -520254 -580435 -633607 -475500
15638d75500K84610J3078L4085P9618m3533p3384l785j00662n9850l6530n9789
$$ -475500 -190890 -177812 -143727 -64109 -107642 -181026 -184811 -285473 -345323 -381853 -441642
15627d41642r3300P7273Q5494M438P2308q7126k30618p6770P5175J58977K75984
$$ -441642 -534942 -457669 -372175 -367737 -295429 -382555 -613173 -689943 -614768 -455791 -179807
15616a79807J76057j9134m9991l7556j59457m1083J27161M453k11071j31419K09760
$$ -179807 -3750 -22884 -72875 -110431 -269888 -310971 -183810 -179357 -390428 -521847 -312087
15605c12087K06817m2264k07086j41737O8761J02431r6442j85738K4270J70195
$$ -312087 -105270 -147534 -354620 -496357 -427596 -325165 -421607 -607345 -583075 -412880
15595d12880J18271k46528k51009K81698K25181l0828n230L9578o0503j74357
$$ -412880 -294609 -541137 -792146 -510448 -285267 -316095 -321325 -281747 -342250 -516607
15585e16607J18744O0094M9193K33104K63713O843j70301j34308k79459j45038
$$ -516607 -397863 -337769 -288576 -55472 208241 215084 44783 -89525 -368984 -514022
15575e14022P3854J65546J93481R2912r7292q2000J9853O1917Q8967p3434j70011
$$ -514022 -440168 -274622 -81141 11771 -85521 -167521 -147668 -85751 3216 -70218 -240229
15564b40229j26345j45977M3111R2275j7964k90634j99307M8415L6913J92955
$$ -240229 -366574 -512551 -469440 -377165 -395129 -685763 -885070 -836655 -799742 -606787
15554f06787K82842L51324R0729k11685k55334l2203j00359k60628j23512o082
$$ -606787 -323945 27379 118108 -93577 -348911 -381114 -481473 -742101 -865613 -871695
15544h71695K22741K84828K41480j96n9230j44129o9771k05896o963J17394K8376
$$ -871695 -648954 -364126 -122646 -122842 -182072 -326201 -395972 -601868 -608831 -491437 -463061
15533d63061L568k820N600J09886J49180P4752M2646Q685O510q9764p4858r3043
$$ -463061 -459493 -462313 -456713 -346827 -197647 -122895 -80249 -71564 -65054 -154818 -229676 -322719
15521c22719L7280O7414K1739R4820L21780Q8607j11156k07029j9566J02725J60923
$$ -322719 -285439 -218025 -196286 -101466 220314 308921 197765 -9264 -28830 73895 234818
15510B34818p8693k45634m1169j28677K415j3342p4054J03967L9648P584J14281
$$ 234818 156125 -89509 -130678 -259355 -256940 -270282 -344336 -240369 -200721 -193137 -78856
15499g8856j2229k08541k18979j19726j4850j44474R6066J51745O6938k8881j31957
$$ -78856 -91085 -299626 -518605 -638331 -653181 -797655 -701589 -549844 -482906 -511787 -643744
15488f43744j43008N0558O5753Q0717j0651Q2882J54821N0483m606J06512m5185
$$ -643744 -786752 -736194 -670441 -589724 -600375 -517493 -362672 -312189 -316795 -210283 -255468
15477b55468J9844J21909J8889J6199M6598n8979k22669k24312R0506J59237N7190
$$ -255468 -235624 -113715 -94826 -78627 -32029 -91008 -313677 -537989 -447483 -288246 -231056
15466b31056J55107K9703j63305p9325k5561m8571K25317J42218j20925k20202
$$ -231056 -75949 -46246 -209551 -288876 -314437 -363008 -137691 4527 -116398 -336600
15456c36600O4464J94754J56143q0378k70469l08870q6634M5802j535O2032J08691
$$ -336600 -272136 -77382 78761 -1617 -272086 -580956 -667590 -621788 -623323 -561291 -452600
15445d52600J71230K14386Q8147q7583n5761j62791k16755j6254N8887m9928P9041
$$ -452600 -281370 -66984 21163 -66420 -122181 -284972 -501727 -517981 -459094 -509022 -429981
15434d29981K26336J13183j03318j84361R4663m1517r6495O6641q7832k11756
$$ -429981 -203645 -90462 -193780 -378141 -283478 -324995 -421490 -354849 -442681 -654437
15424f54437o3913j632K58220M40939J58685p1300l1798m7818k42671k40313j57151
$$ -654437 -718350 -719982 -461762 -20823 137862 66562 34764 -13054 -255725 -496038 -653189
15413f53189M4596J07834j18032j77210r1336P4694J05362J11164L14479K79143
$$ -653189 -608593 -500759 -618791 -796001 -887337 -812643 -707281 -596117 -281638 -2495
15403b495J2859k65454k49873j57129K09278R7267J1757Q8434J24433M0574M4607
$$ -2495 10364 -255090 -504963 -662092 -452814 -355547 -343790 -255356 -130923 -90349 -45742
15392d5742J67358Q7822j71683k05017j05833j4994p1956q3941j7697k24370k31384
$$ -45742 121616 209438 37755 -167262 -273095 -288089 -360045 -443986 -461683 -686053 -917437
15381i17437P5555J92164J20217O094K77068L25480j171k87694k96333P3998J45783
$$ -917437 -841882 -649718 -529501 -523407 -246339 79141 77970 -209724 -506057 -432059 -286276
15370b86276N4471j30581j07898q6785J39693P6200k8404O1605M795J06817J04313
$$ -286276 -231805 -362386 -470284 -557069 -417376 -341176 -369580 -307975 -303180 -196363 -92050
15359i2050j25684j29999J36924K3457j22645J9795j05822j33467j04080O1185
$$ -92050 -217734 -347733 -210809 -187352 -309997 -290202 -396024 -529491 -633571 -572386
15349e72386J78292J56264J964M2624J22516R0683N4545n7509j00223r2769J0876
$$ -572386 -394094 -237830 -235866 -193242 -70726 19957 74502 16993 -83230 -175999 -165123
15338a65123L4697q0239j87236l48231l34044J08948L04370O3508o729l6223q8602
$$ -165123 -130426 -210665 -397901 -746132 -1080176 -971228 -666858 -603350 -610079 -646302 -734904
15327g34904l9070P7573K69361J14929q2914J8305N3384O7440l5878l8835Q6880
$$ -734904 -773974 -696401 -427040 -312111 -395025 -376720 -323336 -255896 -291774 -330609 -243729
15316b43729N2311J08577J0491j28046n272J23785J286k54512n6209l622P3188
$$ -243729 -191418 -82841 -72350 -200396 -205668 -81883 -80597 -335109 -391318 -394940 -321752
15305c21752J24079l8377l6494n0976K0483Q8205o7240j51633j16450J7446O4806
$$ -321752 -197673 -236050 -272544 -323520 -303037 -214832 -282072 -433705 -550155 -532709 -467903
15294d67903K65606K36269M4932L6959Q4771o8819j31671k2087R0270N1233o4059
$$ -467903 -202297 33972 78904 115863 200634 131815 144 -21943 68327 119560 55501
15283E5501r4510j06913j45628j86009j2054N6866k8938j2777J25794j0085l9560
$$ 55501 -39009 -145922 -291550 -477559 -489613 -432747 -461685 -474462 -348668 -358753 -398313
15272c98313J57050L44827l5894N0642K85263O1495k38595k16691L1824R6141
$$ -398313 -241263 103564 67670 118312 403575 465070 226475 9784 41608 137749
15262A37749o365L2007k6471r6873n0493r6393J3962J12343K00794J37108k7263
$$ 137749 131384 163391 136920 40047 -10446 -106839 -92877 19466 220260 357368 330105
15251C30105m7432j46937j09692k3088j30938k12999m5192L1484j61782k22409
$$ 330105 282673 135736 26044 2956 -127982 -340981 -386173 -354689 -516471 -738880
15241g38880j22112o363J51060J48511j2645O8192M5137P1359K5505j72574P2607
$$ -738880 -860992 -867355 -716295 -567784 -580429 -512237 -467100 -395741 -370236 -542810 -470203
15230d70203L56095L7969l3035L5934K0168p1533J3192K79632K27012l0992l9558
$$ -470203 -114108 -76139 -109174 -73240 -53072 -124605 -111413 168219 395231 364239 324681
15219C24681q3841k47119j03089j2877r4869N7183j891J7773K2738M5383M3196
$$ 324681 240840 -6279 -109368 -122245 -217114 -159931 -161822 -144049 -121311 -75928 -32732
15208c2732R1351j45986l24939k78251j11419J39727K18273J11582J84206J09418
$$ -32732 58619 -87367 -412306 -690557 -801976 -662249 -443976 -332394 -148188 -38770
15198c8770L932k8564r8977j44732k41132k17719j12574L7881J49017K82894J65234
$$ -38770 -34838 -63402 -162379 -307111 -548243 -765962 -878536 -840655 -691638 -408744 -243510
15187b43510n8637m9874l5763j15684M764K58208J87333j49298l69196o1290J90656
$$ -243510 -302147 -352021 -387784 -503468 -498704 -240496 -53163 -202461 -571657 -632947 -442291
15176d42291K92944K59463q6927k07138j77426J12864O3949l14837k60838R3630
$$ -442291 -149347 110116 23189 -183949 -361375 -248511 -184562 -499399 -760237 -666607
15166f66607M33888K23563M1654J18494j40613q1269q472j3489j66429j77366
$$ -666607 -232719 -9156 32498 150992 10379 -70890 -79362 -92851 -259280 -436646
15156d36646J62813q8879k00450k616n3045j6105J35366J89083j13175j27344
$$ -436646 -273833 -362712 -563162 -565778 -618823 -634928 -499562 -310479 -423654 -550998
15146e50998P4027J66940J24277k17067j87638k0338M7266N4388L5456k3247o0844
$$ -550998 -476971 -310031 -185754 -402821 -590459 -610797 -563531 -509143 -473687 -496934 -557778
15135e57778J39271m427j00582O5970J58072M0605n4173j76596N5336J96848J6936
$$ -557778 -418507 -422934 -523516 -457546 -299474 -258869 -313042 -489638 -434302 -237454 -220518
15124b20518J0872o5309J8868o3458K7900P7564M0985j9670j12523k5659M4309
$$ -220518 -209646 -274955 -256087 -319545 -291645 -214081 -173096 -192766 -305289 -330948 -286639
15113b86639j07294k66973n8293m4257K0176R8453n9003M1918O9640K4862M7347
$$ -286639 -393933 -660906 -719199 -763456 -743280 -644827 -703830 -661912 -592272 -567410 -520063
15102e20063Q5922J68885j11544o0445J21642j82360j38213K24955K17270O7386
$$ -520063 -434141 -265256 -376800 -437245 -315603 -497963 -636176 -411221 -193951 -126565
15092a26565k0283R2657J51439j08414k4414k252k25760j87992K8515J5824k9142
$$ -126565 -146848 -54191 97248 -11166 -35580 -37832 -263592 -451584 -423069 -407245 -436387
15081d36387j17049j83888P3979K65644J98336O9704M7245l2438J6513P3960j0916
$$ -436387 -553436 -737324 -663345 -397701 -199365 -129661 -82416 -114854 -98341 -24381 -35297
15070c5297k7511j65777N7056J23837P6946J11790R9822k8198k43386j7083L1580
$$ -35297 -62808 -228585 -171529 -47692 29254 141044 240866 212668 -30718 -47801 -16221
15059a6221m7801k9220n1527j76357n0627O9266o9844j63860N9234J67462L1614
$$ -16221 -64022 -93242 -144769 -321126 -371753 -302487 -372331 -536191 -476957 -309495 -277881
15048b77881L7247k1509j12909N220m7719o2388M9037J65504l552j09319j84370
$$ -277881 -240634 -262143 -375052 -369832 -417551 -479939 -430902 -265398 -268950 -378269 -562639
15037e62639L3824K02933k9440k03971J9170J49738J54080K01497O7825p8475
$$ -562639 -528815 -325882 -355322 -559293 -540123 -390385 -236305 -34808 33017 -45458
15027d5458o0060j02369k36422j04865K15959K42052R022j37297j39701j65819
$$ -45458 -105518 -207887 -444309 -549174 -333215 -91163 -82141 -219438 -359139 -524958
15017e24958l5934K34951K33736L1217j34762k19103k01323K4337K76511K7175
$$ -524958 -560892 -325941 -92205 -60988 -195750 -414853 -616176 -591839 -315328 -288153
15007b88153l3486M6173o490n3597j14385P4912j9462j41781O0533J2646k90458
$$ -288153 -321639 -275466 -281956 -335553 -449938 -375026 -394488 -536269 -475736 -463090 -753548
14996g53548n6883K67707K73986J43612j48591k61874k08508M9846P4455j5534
$$ -753548 -810431 -542724 -268738 -125126 -273717 -535591 -744099 -694253 -619798 -635332
14986f35332k9994J03613K73397J67518M4511L2917J5489q7087j43147j87685
$$ -635332 -665326 -561713 -288316 -120798 -76287 -43370 -27881 -114968 -258115 -445800
14976d45800j53741J49864L4588j84626k00079L274J31153K92833N38005K80096
$$ -445800 -599541 -449677 -415089 -599715 -799794 -796520 -665367 -372534 165471 445567
14966D45567k11969l35571j50843J15577n821j76836j24877J0185q5884m0971
$$ 445567 233598 -101973 -252816 -137239 -143060 -319896 -444773 -434588 -520472 -561443
14956e61443j80944j33275J22227J51651K15236j01009k77856k26200O2487N0898
$$ -561443 -742387 -875662 -753435 -601784 -386548 -487557 -765413 -991613 -929126 -878228
14946h78228j38234J43572K75280K68317L04823J44806M6149r2258J23569J57004
$$ -878228 -1016462 -872890 -597610 -329293 -24470 120336 166485 74227 197796 354800
14936C54800O8386K87772K38208j66357k05299j73522n59661n68552j10238J95170
$$ 354800 423186 710958 949166 782809 577510 403988 -155673 -724225 -834463 -639293
14926f39293L56589J72907L9852o2608l6340L477o6355K943r5527R2059J01598
$$ -639293 -282704 -109797 -69945 -132553 -168893 -165416 -231771 -228828 -324355 -232296 -130698
14915a30698p6189P485j23124k66160N9606L37020J69873n0967m8407P0592N3049
$$ -130698 -206887 -199402 -322526 -588686 -529080 -192060 -22187 -73154 -121561 -50969 2080
14904B080J2489j04838n8172M0062j6415K9807R673n0366P8940j38216m27824
$$ 2080 14569 -90269 -148441 -108379 -124794 -94987 -85314 -135680 -56740 -194956 -622780
14893f22780k79775J65052N27739L82091P3233r0250p5836j17827k36580k62247
$$ -622780 -902555 -737503 -209764 172327 245560 155310 79474 -38353 -274933 -537180
14883e37180j78406j10113J03908L06502J66928J18492M5815M0540J53432J64583
$$ -537180 -715586 -825699 -721791 -415289 -248361 -129869 -84054 -43514 109918 274501
14873B74501L2650j29937k01603j57327K1328Q7131k884r8831k00004j09616N5748
$$ 274501 307151 177214 -24389 -181716 -160388 -73257 -76141 -174972 -374976 -484592 -428844
14862d28844J78786P273Q4130q073k92135l28057q1646q866J49112L73860Q0737
$$ -428844 -250058 -242785 -158655 -166728 -458863 -786920 -868566 -877432 -728320 -354460 -273723
14851b73723q7889j54247j72087J9819J54430J29340J17523L8456N4478J66727
$$ -273723 -361612 -515859 -687946 -668127 -513697 -384357 -266834 -228378 -173900 -7173
14841g173J56413k5159K5538j55315j99298j13958J34387J88312J20538o5284
$$ -7173 149240 124081 149619 -5696 -204994 -318952 -184565 3747 124285 59001
14831E9001j11327m006K6736r5277k10927n2577J52838J77854P1961O1239m8465
$$ 59001 -52326 -56332 -29596 -124873 -335800 -388377 -235539 -57685 14276 75515 27050
14820B7050j52823q5482l6627j65896k02130o1021p4139j39796J35233J42863
$$ 27050 -125773 -211255 -247882 -413778 -615908 -676929 -751068 -890864 -755631 -612768
14810f12768q7650N8256K9882J59120L26707K40922R8350K7328j76853j54590
$$ -612768 -700418 -642162 -612280 -453160 -126453 114469 212819 240147 63294 -91296
14800i1296l0185j422J9357j39537m6119j46231N8631J36627k32494k76508K19495
$$ -91296 -121481 -122903 -103546 -243083 -289202 -435433 -376802 -240175 -472669 -749177 -529682
14789e29682K04238J44052M3561J2344K5244j1950L0796J65189P7348N2572n5107
$$ -529682 -325444 -181392 -137831 -125487 -100243 -112193 -81397 83792 161140 213712 158605
14778A58605l38135k47107n9423o8382r293Q3190J31692R9557j26357m189l0948
$$ 158605 -179530 -426637 -486060 -554442 -563735 -480545 -348853 -249296 -375653 -379842 -410790
14767d10790o2923M5429N6925N8235J43989J77134o6310j07585J048j19230l18892
$$ -410790 -473713 -428284 -371359 -313124 -169135 7999 -58311 -165896 -164848 -284078 -602970
14756f02970L8540K87564j6806q8330N5404o8747j971J61880J16419l7249L4637
$$ -602970 -564430 -276866 -293672 -382002 -326598 -395345 -397316 -235436 -119017 -156266 -121629
14745a21629j6424j00022M3517J38261l1991J9530L1861r6446k59041p7198J04424
$$ -121629 -138053 -238075 -194558 -56297 -88288 -68758 -36897 -133343 -392384 -469582 -365158
14734c65158J11744Q1779J50870k5525j9948k8927j07745J19928J55916P2202
$$ -365158 -253414 -171635 -20765 -46290 -66238 -95165 -202910 -82982 72934 145136
14724A45136M9510m3349J05236L1230k61279m53455j6273L01863J20525j46989
$$ 145136 194646 151297 256533 287763 26484 -426971 -443244 -141381 -20856 -167845
14714a67845k47998J13860K59501K16082q5854j71660L1418k5509j78468M0292
$$ -167845 -415843 -301983 -42482 173600 87746 -83914 -52496 -78005 -256473 -216181
14704b16181R2382j26708j10280j67301r2652o3087j43589M5519J63237j16088
$$ -216181 -123799 -250507 -360787 -528088 -620740 -683827 -827416 -781897 -618660 -734748
14694g34748j51593J09215P3914J38525K55547J31460L6618J31336k2134j50104
$$ -734748 -886341 -777126 -703212 -564687 -309140 -177680 -141062 -9726 -31860 -181964
14684a81964j08279J18101J37411k9411k7685Q1365r0268j04452j85829n5300
$$ -181964 -290243 -172142 -34731 -64142 -91827 -10462 -100730 -205182 -391011 -446311
14674d46311M7359K29814K52252j49256r1604o0538o9287Q0040p0673j14647M6401
$$ -446311 -398952 -169138 83114 -66142 -157746 -218284 -287571 -207531 -278204 -392851 -346450
14663c46450K58383K82945r5171k25967k01584k03702j5225J92118M3467L5615
$$ -346450 -88067 194878 99707 -126260 -327844 -531546 -546771 -354653 -311186 -275571
14653b75571J17732l8621Q6019M8052n6966J5386K45926L01703L39438j05397
$$ -275571 -157839 -196460 -110441 -62389 -119355 -103969 141957 443660 783098 677701
14643F77701m51634l10959p935p1408q4512j07779j00929N0849k4459j07976j52067
$$ 677701 226067 -84892 -92827 -164235 -248747 -356526 -457455 -406606 -431065 -539041 -691108
14632f91108J9222P8291k8198J09601L41838J55498K03431K18151J524O0970N5927
$$ -691108 -671886 -593595 -621793 -512192 -170354 -14856 188575 406726 408250 469220 525147
14621E25147j44502k71270j26049L0750p480j17806M9474J2560q4122L5202l5444
$$ 525147 380645 109375 -16674 14076 6596 -111210 -61736 -49176 -133298 -98096 -133540
14610a33540j26263l130J30505Q921j52938j88909r5840j44691m1644N0073r9809
$$ -133540 -259803 -262933 -132428 -123507 -276445 -465354 -561194 -705885 -747529 -697456 -797265
14599g97265p6327K20801K98416k4243J08065J56871j17062k47277j98201j1804
$$ -797265 -873592 -652791 -354375 -378618 -270553 -113682 -230744 -478021 -676222 -688026
14589f88026J10782J91843J26638L1597J2166j9089j56723l9996p1361j26395
$$ -688026 -577244 -385401 -258763 -227166 -215000 -234089 -390812 -430808 -502169 -628564
14579f28564j11134k01403j87514J07269L86040K17019k38023m183L09155P2492
$$ -628564 -739698 -941101 -1128615 -1021346 -635306 -418287 -656310 -660493 -351338 -278846
14569b78846M7398J81352K04324N8745j10030j47790k05223l50970j47872L6886
$$ -278846 -231448 -50096 154228 212973 102943 -44847 -250070 -601040 -748912 -712026
14559g12026M4994J3808j21272K8147P5070J34685M3277o917J66721R7283J54696
$$ -712026 -667032 -653224 -774496 -746349 -671279 -536594 -493317 -500234 -333513 -236230 -81534
14548h1534k9245j03345j2229J8565M7584k7296P0881J69279n1255q6960O4639
$$ -81534 -110779 -214124 -226353 -207788 -160204 -187500 -116619 52660 1405 -85555 -20916
14537b0916N4980j53835j82612j36697j2572R9308J08171J9554j4963J72788J04050
$$ -20916 34064 -119771 -302383 -439080 -451652 -352344 -244173 -224619 -239582 -66794 37256
14526C7256j25232j22257k491K2792m5235M7413k5690p5446o1515p2787o7896
$$ 37256 -87976 -210233 -212724 -189932 -235167 -187754 -213444 -288890 -350405 -423192 -491088
14515d91088R5624J49323m8981j43204q8035J00495K44097K77402N2512j92634
$$ -491088 -395464 -246141 -295122 -438326 -526361 -425866 -181769 95633 148145 -44489
14505d4489j71799J90093K65364j3639k07820j87144O1821j10947j68044O3781
$$ -44489 -216288 -26195 239169 225530 17710 -169434 -107613 -218560 -386604 -322823
14495c22823K70255R0492j22884m1549L9929m7221M6934p1963l7123J28673q6578
$$ -322823 -52568 37924 -84960 -126509 -86580 -133801 -86867 -158830 -195953 -67280 -153858
14484a53858k52017l75625j51013J83241K80171J84121j22483m3044r0234j84803
$$ -153858 -405875 -781500 -932513 -749272 -469101 -284980 -407463 -450507 -540741 -725544
14474g25544K0711L07086K70976R1466k35632k26215r9886m6502J50921O4031
$$ -725544 -704833 -397747 -126771 -35305 -270937 -497152 -597038 -643540 -492619 -428588
14464d28588m4823n7625J74255R8107m2985K6788J56185P0594m3625j81974j35877
$$ -428588 -473411 -531036 -356781 -258674 -301659 -274871 -118686 -48092 -91717 -273691 -409568
14453d09568P4069K9110m5154K95J52638R1495j6399Q9983K48539J91727J10548
$$ -409568 -335499 -306389 -351543 -351248 -198610 -107115 -123514 -33531 215008 406735 517283
14442E17283j23711j41682k60206m54938j04231k2731r5990j64799j19076j35329
$$ 517283 393572 251890 -8316 -463254 -567485 -590216 -686206 -851005 -970081 -1105410
14432a105410j78413N4765M49938J96858N9478K5642j52901m64933k11915J28653
$$ -1105410 -1283823 -1229058 -779120 -582262 -522784 -497142 -650043 -1114976 -1326891 -1198238
14422a198238J18664P7142L3101N2970Q7100J73693Q9986O8806R7599j5541J26587
$$ -1198238 -1079574 -1002432 -969331 -916361 -829261 -655568 -565582 -496776 -399177 -414718 -288131
14411b88131L37035L1760j02769j36767j55294n8364m3710j740R2559O0473J37505
$$ -288131 48904 80664 -22105 -158872 -314166 -372530 -416240 -417980 -325421 -264948 -127443
14400a27443J33031N9906P2356P0585j8342r3459j64074j59744Q4999K0890k3446
$$ -127443 5588 65494 137850 208435 190093 96634 -67440 -227184 -142185 -121295 -144741
14389a44741k0126m4965j40163l29856q7031J02821J74338J75601p2189j76765
$$ -144741 -164867 -209832 -349995 -679851 -766882 -664061 -489723 -314122 -386311 -563076
14379e63076j96257n6044K27513J18272r8638m4220J41774J06689n1349q1551
$$ -563076 -759333 -815377 -587864 -469592 -568230 -612450 -470676 -363987 -415336 -496887
14369d96887j60428j16848J79586J79570l3789n855K02279R2083j50849n2977
$$ -496887 -657315 -774163 -594577 -415007 -448796 -454651 -252372 -160289 -311138 -364115
14359c64115j3783j54646m5081J62350J26260q0055j70400N295q5858j87926j65277
$$ -364115 -377898 -532544 -577625 -415275 -289015 -369070 -539470 -534175 -620033 -807959 -973236
14348i73236k30163j96834J30650M33225J90613p9867J70395L30479K55522M7795
$$ -973236 -1203399 -1400233 -1269583 -836358 -645745 -725612 -555217 -224738 30784 78579
14338G8579q9447j84022k93625j7151J73464J81010o188k85660j54768L2645J51836
$$ 78579 -10868 -194890 -488515 -505666 -332202 -151192 -157380 -443040 -597808 -565163 -413327
14327d13327J26293K91353K30830r6568j34783j7395n9564p5859n9969k03273
$$ -413327 -287034 4319 235149 138581 3798 -13597 -73161 -149020 -208989 -412262
14317d12262j47163j9535J19532J23987P1550J26320J68630j23036l16411N1915
$$ -412262 -559425 -578960 -459428 -335441 -263891 -137571 31059 -91977 -408388 -356473
14307c56473N8988R430J85352L7732k02689k37097k31177q1806Q2579J11204J35141
$$ -356473 -297485 -288055 -102703 -64971 -267660 -504757 -735934 -817740 -735161 -623957 -488816
14296d88816K43230J52599l0082M1969K4800j14617q345L7015R1686N7068K05966
$$ -488816 -245586 -92987 -123069 -81100 -56300 -170917 -179262 -142247 -50561 6507 212473
14285B12473L30667Q4523o2053k61950l01090k60436j62712l0751l5101j02341
$$ 212473 543140 627663 565610 303660 2570 -257866 -420578 -451329 -486430 -588771
14275e88771j99147j06766K57350L59995J39584l8929L1826j24354j33260o4392
$$ -588771 -787918 -894684 -637334 -277339 -137755 -176684 -144858 -269212 -402472 -466864
14265d66864L6698P9870M7681o4154j15355J84554Q2419N6607J21995j2287K1386
$$ -466864 -430166 -350296 -302615 -366769 -482124 -297570 -215151 -158544 -36549 -48836 -27450
14254b7450J27160q0376j50939p1023p9158L2841p2279k06841L9859J41931j18754
$$ -27450 99710 19334 -131605 -202628 -281786 -248945 -321224 -528065 -488206 -346275 -465029
14243d65029j88417j193L5457j74377q7819m157L7224L05717K23127K02778K5932
$$ -465029 -653446 -654639 -619182 -793559 -881378 -885535 -848311 -542594 -319467 -116689 -90757
14232i0757P2164M2937k15133k14818q4054N9654L27962K91706R476j32758j23750
$$ -90757 -18593 24344 -190789 -405607 -489661 -430007 -102045 189661 199137 66379 -57371
14221e7371k40928k18538j43750j40568O0663Q3905M8473J68625J20454J7030
$$ -57371 -298299 -516837 -660587 -801155 -740492 -656587 -608114 -439489 -319035 -302005
14211c02005q7016J46455K92746J54323R9350p2495J4288J40653n729k04510j19920
$$ -302005 -389021 -242566 50180 204503 303853 231358 245646 386299 380570 176060 56140
14200E6140l1702j30857J52719J59558o1689k32649j27500j9335l0588o0636j60545
$$ 56140 24438 -106419 46300 205858 144169 -88480 -215980 -235315 -265903 -326539 -487084
14189d87084n1018j9767K78854J79863j3527j76620j79246J60591J24984K5278
$$ -487084 -538102 -557869 -279015 -99152 -112679 -289299 -468545 -307954 -182970 -157692
14179a57692p0367j71624j60949l3907J44789J82759K15563J05727J93961J58390
$$ -157692 -228059 -399683 -560632 -594539 -449750 -266991 -51428 54299 248260 406650
14169D06650o3224k56196k25373j77478j67860j74095P2954J66772N8436J28495
$$ 406650 343426 87230 -138143 -315621 -483481 -657576 -584622 -417850 -359414 -230919
14159b30919R9848j35918k70515o7061O638k8374J04158J81473K22892J74192
$$ -230919 -131071 -266989 -537504 -604565 -597927 -626301 -522143 -340670 -117778 56414
14149E6414N6133L9171P440k7839p2145J40446N786j05013o3862n5696l29886
$$ 56414 112547 151718 159158 131319 59174 199620 205406 100393 36531 -19165 -349051
14138c49051l16879j14291J42209L92442J88738k2504l1778L0413n5754j50483
$$ -349051 -665930 -780221 -638012 -245570 -56832 -79336 -111114 -80701 -136455 -286938
14128b86938o9076q0202k12032M3659L28529J64918k7474j12555j93931j9730
$$ -286938 -356014 -436216 -648248 -604589 -276060 -111142 -138616 -251171 -445102 -464832
14118d64832j7839n7194P374J28084R2012J72865K60507n2673n3842j04184O1830
$$ -464832 -482671 -539865 -532491 -404407 -312395 -139530 120977 68304 14462 -89722 -27892
14107b7892J45833R6666n0544j90676j09113M0301J19714j86763k59864m8030
$$ -27892 117941 214607 164063 -26613 -135726 -95425 24289 -162474 -422338 -470368
14097d70368J92263l1601k77277k17972L5742K43107J71873J44346n301j71886
$$ -470368 -278105 -309706 -586983 -804955 -769213 -526106 -354233 -209887 -215188 -387074
14087c87074j26789q429J25531n5094K7454J95591J45631N6192j0749j73708k58999
$$ -387074 -513863 -522292 -396761 -451855 -424401 -228810 -83179 -26987 -37736 -211444 -470443
14076d70443k50523k9328J77777j681k2164J19845K9035o0943j24618N6704K43754
$$ -470443 -720966 -750294 -572517 -574198 -596362 -476517 -447482 -508425 -633043 -576339 -332585
14065c32585K31444J82672j10923q9257q6481j61656j42458R425J41589J04994
$$ -332585 -101141 81531 -29392 -118649 -205130 -366786 -509244 -499819 -358230 -253236
14055b53236J23286J80874J40702k06171j66224J05653J51126J55614l1740k94474
$$ -253236 -129950 50924 191626 -14545 -180769 -75116 76010 231624 199884 -94590
14045i4590k60043R1501K04382j11203j26041K5367J35964P1691j12721o067J8800
$$ -94590 -354633 -263132 -58750 -169953 -295994 -270627 -134663 -62972 -175693 -181760 -162960
14034a62960k66476j70527K08176J46407J72653K34630q726m7074j42068r5887
$$ -162960 -429436 -599963 -391787 -245380 -72727 161903 153177 106103 -35965 -131852
14024a31852j67372k91605j97069J28036J35920J50846J69047R1951o8191M1926
$$ -131852 -299224 -590829 -787898 -659862 -523942 -373096 -204049 -112098 -180289 -138363
14014a38363O0633j02850j91650j48185P124n5671o0988J23308L8571l62M5191
$$ -138363 -77730 -180580 -372230 -520415 -513291 -568962 -629950 -506642 -468071 -468433 -423242
14003d23242O4646K34461P9854r7050P791J2071l771j18611j71837o7548q4726
$$ -423242 -358596 -124135 -44281 -141331 -133540 -121469 -125240 -243851 -415688 -483236 -567962
13992e67962m4011m1955o3917N5026J05753K22753K75140J0136q7966k20697j79307
$$ -567962 -611973 -653928 -717845 -662819 -557066 -334313 -59173 -49037 -137003 -357700 -537007
13981e37007O6758J48547r565O1689J30592K5599j67332j13813J5455o4194N5752
$$ -537007 -470249 -321702 -331267 -269578 -138986 -113387 -280719 -394532 -379077 -443271 -387519
13970c87519K4420O358p3410m2463M0917q185K144N5640r1100m658j77112l2964
$$ -387519 -363099 -356741 -430151 -472614 -431697 -439882 -437738 -382098 -473198 -477856 -654968 -687932
13958f87932L07227J81856N1196m336p4241j31490j58259m7572o892j23165k1023
$$ -687932 -380705 -198849 -147653 -151989 -226230 -357720 -515979 -563551 -570443 -693608 -714631
13947g14631K49122K07828J63785L03993K4513l74304k96222P9300J29520N3660
$$ -714631 -465509 -257681 -93896 210097 234610 -139694 -435916 -356616 -227096 -173436
13937a73436j37303n2117O2435j03524k17223r2607j01711J10228L30910K57380
$$ -173436 -310739 -362856 -300421 -403945 -621168 -713775 -815486 -705258 -374348 -116968
13927a16968Q7851K33449L4636l60544l70247j89368j26272j66976Q6025K19034
$$ -116968 -29117 204332 238968 -121576 -491823 -681191 -807463 -974439 -888414 -669380
13917f69380J15840N6335Q6468l2914q5851K0934L17899K12457j12350j48949
$$ -669380 -553540 -497205 -410737 -443651 -529502 -508568 -190669 21788 -90562 -239511
13907b39511j35094j07611O018O7024n77K6778P272o4128O9467J7951j93827j27397
$$ -239511 -374605 -482216 -476198 -409174 -409751 -382973 -375701 -439829 -370362 -352411 -546238 -673635
13895f73635J14303L05646J97715K07604Q1673j62027o6021K7746k3541q1922
$$ -673635 -559332 -253686 -55971 151633 233306 71279 5258 33004 9463 -72459
13885g2459j65689j49325j714j712p1621Q7403J52842P0564l1808j23669L2530
$$ -72459 -238148 -387473 -389187 -390899 -462520 -375117 -222275 -151711 -183519 -307188 -274658
13874b74658L98162J74795J38250j20062m10439l43877j51161J60454L62863K04973
$$ -274658 123504 298299 436549 316487 -93952 -437829 -588990 -428536 -65673 139300
13864A39300L5396q1476K3101J16860j01436k78051q7633p7555j12286L5908M3579
$$ 139300 174696 93220 116321 233181 131745 -146306 -233939 -311494 -423780 -387872 -344293
13853c44293K9934k7729q8450n7835P9756J31694J01079r0813p0112J03218J39569
$$ -344293 -314359 -342088 -430538 -488373 -408617 -276923 -175844 -266657 -336769 -233551 -93982
13842i3982n3750j49380K3076P5909N310J4840L5435m1112J0159K16183J30780
$$ -93982 -147732 -297112 -274036 -198127 -192817 -177977 -142542 -183654 -173495 42688 173468
13831A73468o6456j98760l1869j0965q5616k15417j68842P4318N4826j52605O4274
$$ 173468 107012 -91748 -123617 -134582 -220198 -435615 -604457 -530139 -475313 -627918 -563644
13820e63644K90824K9523j47899n7152L8064j85369j67007R7165K15691K39273
$$ -563644 -272820 -243297 -391196 -448348 -410284 -595653 -762660 -665495 -449804 -210531
13810b10531j7906j09345J33975n7564l36424j45241o3960L1323J15475J44366
$$ -210531 -228437 -337782 -203807 -261371 -597795 -743036 -806996 -775673 -660198 -515832
13800e15832k5113j78347j01286J00072J01906N9014J32585P317P8400J54683
$$ -515832 -540945 -719292 -820578 -720506 -618600 -559586 -427001 -419684 -341284 -186601
13790a86601J27657L4448Q3218N3116J28383N8503j17789l27377l19448q8049
$$ -186601 -58944 -24496 58722 111838 240221 298724 180935 -146442 -465890 -553939
13780e53939P8651J02859j4574r2648p9329J02585Q2031n4618L4082J41249J1761
$$ -553939 -475288 -372429 -387003 -479651 -558980 -456395 -374364 -428982 -394900 -253651 -241890
13769b41890m4990n8666o9686L5647l0492J54170K53841j5943o6375j74319l42304
$$ -241890 -286880 -345546 -415232 -379585 -410077 -255907 -2066 -18009 -84384 -258703 -601007
13758f01007j87950M9073l3376m0290p368L6110R9361M5172P7407L19274O4886
$$ -601007 -788957 -739884 -773260 -813550 -820918 -784808 -685447 -640275 -562868 -243594 -178708
13747a78708j2913k7186L3139m3323j90546P9146J90368J25352m3060j71684j45600
$$ -178708 -191621 -218807 -185668 -228991 -419537 -340391 -150023 -24671 -67731 -239415 -385015
13736c85015J98305K25228l318j54123O1547L20298J44965q0662j13168k29072
$$ -385015 -186710 38518 35200 -118923 -57376 262922 407887 327225 214057 -15015
13726a5015m23969l44241r4311K0538K7112K7779P9748P8285J28886M4265j3644
$$ -15015 -438984 -783225 -877536 -856998 -829886 -802107 -722359 -644074 -515188 -470923 -484567
13715d84567J04389J10199L0981M2077O1095P2741j36454k4700J10642N4247j09848
$$ -484567 -380178 -269979 -238998 -196921 -135826 -63085 -199539 -224239 -113597 -59350 -169198
13704a69198l2783M5949O8162q147k12992j57524O8672j3365k19574O2120J35140
$$ -169198 -201981 -156032 -87870 -96017 -309009 -466533 -397861 -411226 -630800 -568680 -433540
13693d33540J14209j09875j10550L7614k6088J46126j4502o1448j1200O8921O630
$$ -433540 -319331 -429206 -539756 -502142 -528230 -382104 -396606 -458054 -469254 -400333 -393703
13682c93703n7014p6733p9616j6450J9718M2017j3291J9554J92305R324j27407
$$ -393703 -450717 -527450 -607066 -623516 -603798 -561781 -575072 -555518 -363213 -353889 -481296
13671d81296L8021L3360J1364j480N1887J9991r2705M4451J75890P6851L0990
$$ -481296 -443275 -409915 -398551 -400031 -348144 -328153 -420858 -376407 -200517 -123666 -92676
13660i2676Q2209k097j18700k53472O9295J47480J4443k2581L1125P272k08416
$$ -92676 -10467 -12564 -131264 -384736 -315441 -167961 -153518 -176099 -144974 -137702 -346118
13649c46118j89529q9071r4663j3439J42348j06972j36763o373J28059K22454
$$ -346118 -535647 -624718 -719381 -732820 -590472 -697444 -834207 -840580 -712521 -490067
13639d90067o1285j25481J75862O6423O2072J59317l6643j01659O6650K5717J07315
$$ -490067 -551352 -676833 -500971 -434548 -372476 -213159 -249802 -351461 -284811 -259094 -151779
13628a51779O5584j16217k14202j59748k79183M29K46444L29272J88833j52085
$$ -151779 -86195 -202412 -416614 -576362 -855545 -855116 -608672 -279400 -90567 -242652
13618b42652j87862m8832o3038J7356j7372K2044K22156L3550j08687k7421Q0391
$$ -242652 -430514 -479346 -542384 -525028 -542400 -520356 -298200 -264650 -373337 -400758 -320367
13607c20367J71942K08661k4760k9414n5943o6152J7717J1897K4156J64844J00982
$$ -320367 -148425 60236 35476 6062 -49881 -116033 -98316 -86419 -62263 102581 203563
13596B03563M539l6339j29064j70014q727K4063p659o9637k1758Q0348J4988M0631
$$ 203563 208102 171763 42699 -127315 -136042 -111979 -119638 -189275 -211033 -130685 -115697 -75066
13584g5066k6720j8817J17988J34343K9926O5814Q3488J13408q4240k49315j11713
$$ -75066 -101786 -120603 -2615 131728 161654 227468 310956 424364 340124 90809 -20904
13573b0904r1616p1672J35257J47964j49448J3355J61616O8253P625j99887j73207
$$ -20904 -112520 -184192 -48935 99029 -50419 -37064 124552 192805 200430 543 -172664
13562a72664j132P6532m3951j50695l08216j19671L936K66549M36090J8311N175
$$ -172664 -173796 -97264 -141215 -291910 -600126 -719797 -715861 -449312 -13222 5089 10264
13551A0264J58897N8884j9941j19143j76530n5837r931j33968R363J73021j12272
$$ 10264 169161 228045 208104 88961 -87569 -143406 -153337 -287305 -277942 -104921 -217193
13540b17193l09953k28407j8141P8467J75019K04722j43491J3117J13209j59641
$$ -217193 -527146 -755553 -773694 -695227 -520208 -315486 -458977 -445860 -332651 -492292
13530d92292P708J08980M7190J279O3847K19972r1934j26300j84120k84718m5339
$$ -492292 -484584 -375604 -328414 -327135 -263288 -43316 -135250 -261550 -445670 -730388 -775727
13519g75727K64364K16916R5298K05869L1527j58419l4845j2396Q1915n7387k48026
$$ -775727 -511363 -294447 -199149 6720 38247 -120172 -155017 -167413 -85498 -142885 -390911
13508c90911k13560J6725R8748J64124K6461k0488l6467p2144r2210m2566m8689
$$ -390911 -604471 -587746 -488998 -324874 -298413 -318901 -355368 -427512 -519722 -562288 -610977
13497f10977n239L6754O350J25225J70630Q0238o8515j21704N2919J69167K02436
$$ -610977 -616216 -579462 -573112 -447887 -277257 -197019 -265534 -387238 -334319 -165152 37284
13486C7284j3476j96173j21391j49166j50529P6912K02311J62064J29238j80939
$$ 37284 23808 -172365 -293756 -442922 -593451 -516539 -314228 -152164 -22926 -203865
13476b03865j41448q6934J41021K17920n615j92453m4017n7253m1326M9728R7159
$$ -203865 -345313 -432247 -291226 -73306 -78921 -271374 -315391 -372644 -413970 -364242 -267083
13465b67083q573k61894j84737N7458l1498j53570N714l5900J88540K56093J15899
$$ -267083 -275656 -537550 -722287 -664829 -696327 -849897 -844183 -880083 -691543 -435450 -319551
13454c19551J04876j03565j12631j76J8378l8491Q8222J59946P7674K23695K86724
$$ -319551 -214675 -318240 -430871 -431047 -412669 -451160 -362938 -202992 -125318 98377 385101
13443C85101R2084j20101r9620l5114K16739q4905l10824j74471k31744M7683
$$ 385101 477185 357084 257464 222350 439089 354184 43360 -131111 -362855 -315172
13433c15172K41362Q5684k02937j35268j55552j81465L159Q2445j2911L3559m2007
$$ -315172 -73810 11874 -191063 -326331 -481883 -663348 -660189 -577744 -590655 -557096 -599103
13422e99103j4328O2310j6740j52487j30214J11262J95973J07951J51110k5546
$$ -599103 -613431 -551121 -567861 -720348 -850562 -739300 -543327 -435376 -284266 -309812
13412c09812j40819K44353M06760J92711o909R670j97249j32366J19542p1992
$$ -309812 -450631 -206278 200482 393193 386284 395954 198705 66339 185881 113889
13402A13889l46604k07760O6985K77696L93631J77790m9361j10383j24143j25413
$$ 113889 -232715 -440475 -373490 -95794 297837 475627 426266 315883 191740 66327
13392F6327J8888J81949q4942k42054j59724j1040K4916j466J08079J25908N1441
$$ 66327 85215 267164 182222 -59832 -219556 -230596 -205680 -207146 -99067 26841 78282
13381G8282l2911l8753j62024k80958k40352k06413K2190J0967k8118M4446K413
$$ 78282 45371 6618 -155406 -436364 -676716 -883129 -860939 -849972 -878090 -833644 -831231
13370h31231m3579r4596m5553K76911L79464K17313O2584J79426K05691j11399
$$ -831231 -874810 -969406 -1014959 -738048 -358584 -141271 -78687 100739 306430 195031
13360A95031j97938K1321J6584l27417k07046k13948k87528m6637P1230K01561
$$ 195031 -2907 18414 34998 -292419 -499465 -713413 -1000941 -1047578 -976348 -774787
13350g74787J84006J05747J78625J24159r0996n0293P5965J03990j69552l9701
$$ -774787 -590781 -485034 -306409 -182250 -273246 -323539 -247574 -143584 -313136 -352837
13340c52837J61675k2093k26460j43581J08237j25986p4969o1398l3615K53643
$$ -352837 -191162 -213255 -439715 -583296 -475059 -601045 -676014 -737412 -771027 -517384
13330e17384L56041l9417j48712j49691L250J20913O9739O7K96746J95893J11172
$$ -517384 -161343 -200760 -349472 -499163 -495913 -375000 -305261 -305194 -8448 187445 298617
13319B98617J76820k3303o4269l6214j48373r9673n3216r0480J4409m2138M659
$$ 298617 475437 452134 387865 351651 203278 103605 50389 -40091 -25682 -67820 -63161
13308f3161J81892K15432R4858J20945j5580k15986k38371k36076j52837L4905
$$ -63161 118731 334163 429021 549966 534386 318400 80029 -156047 -308884 -273979
13298b73979K72199N6237l9370O5330j801P6283L0812j42079j02385N486j6847
$$ -273979 -1780 54457 15087 80417 78616 154899 185711 43632 -58753 -53267 -70114
13287g0114j03176j74359j10397j3708J5839J2775K19457K49113m1966J38255
$$ -70114 -173290 -347649 -458046 -471754 -455915 -443140 -223683 25430 -16536 121719
13277A21719J39103k4743p3414m4571j04885j43140j27717k8828O5964J68748
$$ 121719 260822 236079 162665 118094 13209 -129931 -257648 -286476 -220512 -51764
13267e1764M8363J849J01231k3588j72389m8684J39045K953n8684l9055q6556
$$ -51764 -3401 -1552 99679 76091 -96298 -144982 -5937 -2984 -61668 -100723 -187279
13256a87279L3721J39497L34786J18661j42302k66551k91903l05319j23058J96765
$$ -187279 -153558 -14061 320725 439386 297084 30533 -261370 -566689 -689747 -492982
13246d92982J35120J28578J66665R8541O5534J46650J59339N2814J0069N0087
$$ -492982 -357862 -229284 -62619 35922 101456 248106 407445 460259 470328 520415
13236E20415J07965P0621j16668k49785j31895O8800J43939k2871n9817j79012
$$ 520415 628380 699001 582333 332548 200653 269453 413392 390521 330704 151692
13226A51692j96034j45811J22030J30950J1996J51893J62874j8144j06389q2434
$$ 151692 -44342 -190153 -68123 62827 74823 226716 389590 371446 265057 182623
13216A82623j46985Q1364R4927o4043J1097J783K3386M6874j87041J3663j2760
$$ 182623 35638 117002 211929 147886 158983 160766 184152 231026 43985 57648 44888
13205D4888j0330N3476K3036l4900m5842l0108o0023o3107L1971R282J14707J19408
$$ 44888 34558 88034 111070 76170 30328 220 -59803 -122910 -90939 -81657 33050 152458
13193A52458J66021P8001j48816l04957k52877j0640m3183n4594L9879J27049
$$ 152458 318479 396480 247664 -57293 -310170 -320810 -363993 -418587 -378708 -251659
13183b51659j0257n6703J06479Q7846j27954N782L33173L06313N9274O0624K5296
$$ -251659 -261916 -318619 -212140 -124294 -252248 -246466 86707 393020 452294 512918 538214
13172E38214j26649J4192o8784j08253l1919J15025p8254j15076J38957P6302
$$ 538214 411565 425757 356973 248720 216801 331826 253572 138496 277453 353755
13162C53755j60887j03561R3446K01578K32654L57576Q501q8841j519o6974L8194
$$ 353755 192868 89307 182753 384331 616985 974561 983062 894221 892702 825728 863922
13151H63922M2969j07119l20563j14187R000P6310k6749l01913j17499K007K45644
$$ 863922 906891 799772 479209 365022 374022 450332 423583 121670 4171 6178 251822
13140B51822K45454L7291l6154q7748p7565o8884k17528p8776J6827k8862O2448
$$ 251822 497276 534567 498413 410665 333100 264216 46688 -32088 -15261 -44123 18325
13129A8325K97203J87451j63057L072J43867K31014K68228M794m1872Q0226o7238
$$ 18325 315528 502979 339922 342994 486861 717875 986103 990897 949025 1029251 962013
13118I62013o6906n4351k46662k41908o5431P7694J79942j2244p5061R4091L4677
$$ 962013 895107 840756 594094 352186 286755 364449 544391 532147 457086 551177 585854
13107E85854n4878k732J4699k22069j23974R0592J41581m3898O6284J77153Q8312
$$ 585854 530976 528244 542943 320874 196900 287492 429073 385175 451459 628612 716924
13096G16924j4227j6777J05751R929Q9120M4975j88121j55005J27328M46325M19749
$$ 716924 702697 685920 791671 801600 890720 935695 747574 592569 719897 1166222 1585971
13085A585971Q3092P0145K00082N1674j7179n8803j93500l17546k84803j12056
$$ 1585971 1669063 1739208 1939290 1990964 1973785 1914982 1721482 1403936 1119133 1007077
13075A007077J96702P5394J10362M71882M16858K37183K55004R5397J37451M09367
$$ 1007077 1203779 1279173 1389535 1861417 2278275 2515458 2770462 2865859 3003310 3412677
13065C412677K86656K05128L43337M42174O40254R97553J373895J637228K041330
$$ 3412677 3699333 3904461 4247798 4689972 5330226 6327779 7701674 9338902 11380232
13056A1380232K389618K242261R03145j199515k228286k300009j888081j469415
$$ 11380232 13769850 16012111 16915256 15715741 13487455 11187446 9299365 7829950
13048G829950j352080j043553o60278o52338l92707j51496l7731o4375j40813
$$ 7829950 6477870 5434317 4774039 4121701 3728994 3577498 3539767 3475392 3334579
13039C334579k09317l02727k16474j06855k75402k12593K7448R9582K94176L37110
$$ 3334579 3125262 2822535 2606061 2499206 2223804 2011211 2038659 2138241 2432417 2769527
13029B769527K62766J57433M0932k64011j52539M4481N0012j45394k03748J09579
$$ 2769527 3032293 3189726 3230658 2966647 2814108 2858589 2908601 2763207 2559459 2669038
13019B669038K34310p2492o2172K26733L12584N28455K01363j90748j26640N2538
$$ 2669038 2903348 2830856 2768684 2995417 3308001 3836456 4037819 3847071 3720431 3772969
13009C772969K24872L58334L14885K04567J92108K60315J92430K19201L87458
$$ 3772969 3997841 4356175 4671060 4875627 5067735 5328050 5520480 5739681 6127139
13000F127139N64105N87971O94325P74485R58180J101443J079976J088152J481665
$$ 6127139 6691244 7279215 7973540 8748025 9706205 10807648 11887624 12975776 14457441
12991A4457441J770181J992336K678985L483012M228937N385828O783197Q684603
$$ 14457441 16227622 18219958 20898943 24381955 28610892 33996720 40779917 49464520
12983D9464520J1141083J4472134J8816091K4896953L2849079M1267153M3999717
$$ 49464520 60605603 75077737 93893828 118790781 151639860 192907013 236906730
12976B36906730L0004304k367456l2691780m3617161l9686748l1385949k3563885
$$ 236906730 266911034 264543578 231851798 188234637 148547889 117161940 93598055
12969I3598055j7661974j3376825j0344206q023732o420194n112167m239356l627058
$$ 93598055 75936081 62559256 52215050 44191318 37771124 32658957 28419601 24792543
12961B4792543k732812k129638j937652j842225j517347j318722j057645q97479
$$ 24792543 22059731 19930093 17992441 16150216 14632869 13314147 12256502 11359023
12953A1359023q02015q10556o24309m39590m87695n71166k69939r9769l14159
$$ 11359023 10557008 9746452 9122143 8682553 8194858 7623692 7353753 7253984 6939825
12944F939825l77735j31430k12536k83022R605O504k95224m17533l67117j87468
$$ 6939825 6562090 6430660 6218124 5935102 5944707 5951211 5655987 5238454 4871337 4683869
12934D683869K8165K60624K77116J04869O4427J52504K62675L03354L01813J79644
$$ 4683869 4712034 4972658 5249774 5354643 5419070 5571574 5834249 6137603 6439416 6619060
12924F619060K85443M71876P04549R77341J312257J289281J348199J315681N09140
$$ 6619060 6904503 7376379 8080928 9058269 10370526 11659807 13008006 14323687 14832827
12915A4832827l93744o55327n43987O2423P89992J091596J810034K618311L285610
$$ 14832827 14439083 13783756 13239769 13302192 14092184 15183780 16993814 19612125 22897735
12906B2897735M559758O048870M785823m1624j998048k59834K072978M282531
$$ 22897735 27457493 33506363 38292186 38250562 36252514 35992680 38065658 42348189
12898D2348189O042766Q203266J0946914J4939901J9823555K6620378L5566173
$$ 42348189 48390955 56594221 67541135 82481036 102304591 128924969 164491142
12891A64491142M4102962M4279472K4033116j2276874l9322729m5154322l8732718
$$ 164491142 208594104 252873576 276906692 264629818 225307089 180152767 141420049
12884A41420049k9829643k2262080j6802449j2601765r601908p449629n999850
$$ 141420049 111590406 89328326 72525877 59924112 50322204 42872575 36872725
12877C6872725m980623m148879l408967k734056k163908j736699j455074j235076
$$ 36872725 31892102 27743223 24334256 21600200 19436292 17699593 16244519 15009443
12869A5009443j130846j158058r84463p24925o32794o09369m44721l45030m01661
$$ 15009443 13878597 12720539 11736076 11011151 10378357 9768988 9324267 8979237 8577576
12860H577576l86900l87327k71499l60040m18566m31320k17953K2391j75408k16259
$$ 8577576 8190676 7803349 7531850 7171810 6753244 6321924 6103971 6126362 5950954 5734695
12850E734695j02354J8060j47320j93721k93044k18967p5957K5467L827O9165
$$ 5734695 5632341 5650401 5503081 5309360 5016316 4797349 4721392 4746859 4750686 4819851
12840D819851J49475K20171J92958k707L0716N7945J58668J10344M4039K15249
$$ 4819851 4969326 5189497 5382455 5379748 5410464 5468409 5627077 5737421 5781460 5996709
12830E996709L37428M80937K83634K01195O58323Q44599O04247O19061P40765
$$ 5996709 6334137 6815074 7098708 7299903 7958226 8802825 9407072 10026133 10766898
12821A0766898P24641R08847J457113J852556J777911K314063L254895M028792
$$ 10766898 11491539 12400386 13857499 15710055 17487966 19802029 23056924 27085716
12813B7085716M879314O238425P888574R763231J2500458J6342395K1424964K8289657
$$ 27085716 31965030 38203455 46092029 55855260 68355718 84698113 106123077 134412734
12805A34412734L7101052M4179528L9775633J5235835j9467460m0880533m2847964
$$ 134412734 171513786 215693314 255468947 270704782 251237322 210356789 167508825
12798A67508825l5647640k7415770k0723487j5425693j1697267r147590p221570
$$ 167508825 131861185 104445415 83721928 68296235 56598968 47451378 40229808
12791D0229808n954220m917343l854294l094349k627000k318329k078796j607013
$$ 40229808 34275588 29358245 25503951 22409602 19782602 17464273 15385477 13778464
12783A3778464j129199j089666j071563q56479q36445q65750o80930l11733l44156
$$ 13778464 12649265 11559599 10488036 9631557 8795112 7929362 7248432 6936699 6592543
12774F592543m10451m84227l84067k15656l55724j20820m0712k51445l86662l79818
$$ 6592543 6182092 5697865 5313798 5098142 4742418 4621598 4580886 4329441 3942779 3562961
12764C562961k90096l42845j02531j22000j82861R400K29376K35164o3967k45943
$$ 3562961 3272865 2930020 2827489 2705489 2522628 2532028 2761404 2996568 2932601 2686658
12754B686658j78590q8637j33613k69816j40751j67705j01329k2591m9068j16835
$$ 2686658 2508068 2419431 2285818 2016002 1875251 1707546 1606217 1583626 1534558 1417723
12744A417723j46172n6908R8961Q5673r436J4862o987j42647l35063k14863O8115
$$ 1417723 1271551 1214643 1313604 1399277 1389841 1404703 1397716 1255069 920006 705143 773258
12733G73258K66213l2457j73228m6632j43531O2723J04512Q8870J1495k40811
$$ 773258 1039471 1007014 833786 787154 643623 706346 810858 899728 911223 670412
12723F70412j95724j60692n4399J9601m4958k6315N481p4002n1900P1844J12202
$$ 670412 474688 313996 259597 279198 234240 207925 213406 139404 87504 159348 271550
12712B71550R5175P8351o4904j34946j43684K5996K46360K29376J00260o8631
$$ 271550 366725 445076 380172 245226 101542 127538 373898 603274 703534 634903
12702F34903r0956n2130O485J24820j03650k06139n9785N2235O7243J43035K14537
$$ 634903 543947 491817 498302 623122 519472 313333 253548 305783 373026 516061 730598
12691G30598Q8033j09517k90445k81379k21535R2816K44250J28292j45241j19485
$$ 730598 818631 709114 418669 137290 -84245 8571 252821 381113 235872 116387
12681A16387K4115J33308o2746k83616J7306L65619J13181l40946k71568j37044
$$ 116387 140502 273810 211064 -72552 -55246 310373 423554 82608 -188960 -326004
12671c26004l8758J22232J22225N3225M0371N0827k1969J90798K00131r7629m896
$$ -326004 -364762 -242530 -120305 -67080 -26709 24118 2149 192947 393078 295449 290553
12660B90553K82121K11970L9102L859r428j17245k4397j4600j21289R4333R5001
$$ 290553 572674 784644 823746 827605 818177 700932 676535 661935 540646 634979 729980
12649G29980J08830n6116k87101l11013j13620N9849K17862O9311M5409q6417
$$ 729980 838810 782694 495593 184580 70960 130809 348671 417982 463391 376974
12639C76974j98867J6866J9400J488M813k41186l46697j06841J61053J05742J46640
$$ 376974 178107 194973 214373 215861 220674 -20512 -367209 -474050 -312997 -207255 -60615
12628f0615R4696p9322J36483L37122J62148m8574n8233J5558j02017j8249l2225
$$ -60615 34081 -45241 91242 428364 590512 541938 483705 499263 397246 378997 346772
12617C46772k04934k7321j61354j99164l2919r8961k06147k23735J95140M73144
$$ 346772 141838 114517 -46837 -246001 -278920 -377881 -584028 -807763 -612623 -139479
12607a39479O0396L254J16340J36340M2745j7533j21135m657P2046J2125j54827
$$ -139479 -79083 -75829 40511 176851 219596 202063 80928 76271 148317 160442 5615
12596E615k33667J05201K83811N2532m0456p5535O0689J4182j82979j5835O8852
$$ 5615 -228052 -122851 160960 213492 173036 97501 158190 172372 -10607 -26442 42410
12585D2410L636J11786O5129J18689J87277O4899j39843m39644k36524j6221Q7924
$$ 42410 46046 157832 222961 341650 528927 593826 453983 14339 -222185 -238406 -150482
12574a50482m6396j66926o3838J19588J27458P1410Q4124J03523O3477R1399K63737
$$ -150482 -196878 -363804 -427642 -308054 -180596 -109186 -25062 78461 141938 233337 497074
12563D97074J76038r4654j91871j79963r4171K5186j22327n6141m5062M7629M8034
$$ 497074 673112 578458 386587 206624 112453 137639 15312 -40829 -85891 -38262 9772
12552I772R4876K0302k23509j89762J0180P5985J45756J07652l5145J9953L2494
$$ 9772 104648 124950 -98559 -288321 -278141 -202156 -56400 51252 16107 36060 68554
12541F8554l203k1246K04344J93214n8726k49345k07538j12340j56016M459J78872
$$ 68554 65351 44105 248449 441663 382937 133592 -73946 -186286 -342302 -337843 -158971
12530a58971K84933N4755k40888j06532J15245o4786n1869J93631K15452N3293
$$ -158971 125962 180717 -60171 -166703 -51458 -116244 -168113 25518 240970 294263
12520B94263J2712J04833j69653k10596k22276k07783n8334J91486J50141m3266
$$ 294263 306975 411808 242155 31559 -190717 -398500 -456834 -265348 -115207 -158473
12510a58473l7053l1883n0051L5398k5048l3442R7780J00573J4864J61719N7018
$$ -158473 -195526 -227409 -277460 -242062 -267110 -300552 -202772 -102199 -87335 74384 131402
12499A31402N6619k9333r3668j18349j60356j61796m9389M02351L39138r2148
$$ 131402 188021 158688 65020 -53329 -213685 -375481 -424870 -22519 316619 224471
12489B24471j50610Q7730J11605J124o6809j90929r7772j14606L609J09240N3803
$$ 224471 73861 161591 273196 274320 207511 16582 -81190 -195796 -192187 -82947 -29144
12478b9144J01229K46668J26790r9337k34720r2697q265P1837o2604k04532J13341
$$ -29144 72085 318753 445543 346206 111486 18789 10524 82361 19757 -184775 -71434
12467g1434L04195M5933j53488o3073j00211p1522j03751k43461p6930J66914
$$ -71434 232761 278694 125206 62133 -38078 -109600 -213351 -456812 -533742 -366828
12457c66828K65518K51214R5297l9206r7313J4799j8926K080J7792o830R9038
$$ -366828 -101310 149904 245201 205995 108682 123481 104555 106635 124427 117597 216635
12446B16635j8505k71824j25073K00392R0422j85455p3041j3798j24225K0344
$$ 216635 198130 -73694 -198767 1625 92047 -93408 -166449 -180247 -304472 -284128
12436b84128J71903L1992j848r2333M9062J11353K21976K48343J73909R9315O3976
$$ -284128 -112225 -80233 -82081 -174414 -125352 -13999 207977 456320 630229 729544 793520
12425G93520m7545r5299j07048q7894j34139j70708j4094J29952J57017k25560
$$ 793520 745975 650676 543628 455734 321595 150887 136793 266745 423762 198202
12415A98202j81124O5725R4555R9500k623m8147j49627j33843j40073p6453q6751
$$ 198202 17078 82803 177358 276858 274235 226088 76461 -57382 -197455 -273908 -360659
12404c60659K5188R9320J63431M7901n3245Q3742o6400j15240M5089L8214q4195
$$ -360659 -335471 -236151 -72720 -24819 -78064 5678 -60722 -175962 -130873 -92659 -176854
12393a76854l29016j94062N1511J62258K08575q3502J4873J74156K9313K6243
$$ -176854 -505870 -699932 -648421 -486163 -277588 -361090 -346217 -172061 -142748 -116505
12383a16505M0344J13471J8491j21214p9841k9104N2181J03576J12194J4260k491
$$ -116505 -76161 37310 55801 -65413 -145254 -174358 -122177 -18601 93593 107853 105362
12372A05362M8340o4177j34540m6535o1148P7871P9475n8823N3822L8122n4745
$$ 105362 153702 89525 -45015 -91550 -152698 -74827 4648 -54175 -353 37769 -16976
12361a6976j75736k29674j13004P9387K09538K71024J44096j34426j14108j4328
$$ -16976 -192712 -422386 -535390 -456003 -246465 24559 168655 34229 -79879 -94207
12351i4207J57939O16Q1133Q7753l6871m25278m43572j84464j46273j0766L0696
$$ -94207 63732 64348 145481 233234 196363 -228915 -672487 -856951 -1003224 -1013990 -983294
12340i83294R8255L73620L42819K93856K30086K186j20862j91289j45311j19447
$$ -983294 -885039 -511419 -168600 125256 355342 357528 236666 45377 -99934 -219381
12330b19381p0478K054J42758J42022m7977k215J86095J58074l0283m2698K0791
$$ -219381 -289859 -287805 -145047 -3025 -51002 -53217 132878 290952 260669 217971 238762
12319B38762Q0035J40633r1985k58987j55213j88565j20937m3322J97265M2010
$$ 238762 318797 459430 367445 108458 -46755 -235320 -356257 -399579 -202314 -160304
12309a60304j58666J31745J98065J08842J12653J99840J88876k420k79485k33024
$$ -160304 -318970 -187225 10840 119682 232335 432175 621051 618631 339146 106122
12299A06122q9504n4148P1138Q2315R6811j90618k76498L6109J09336Q0044n0812
$$ 106122 16618 -37530 33608 115923 212734 22116 -254382 -218273 -108937 -28893 -79705
12288g9705k75001j19037J36610J38490K09545J33430R7880J21291l9437j40875
$$ -79705 -354706 -473743 -337133 -198643 10902 144332 242212 363503 324066 183191
12278A83191j4884n789j241M9318r0654k02305j17918p5917n7957K5732R8547
$$ 183191 168307 162518 161277 210595 119941 -82364 -200282 -276199 -334156 -308424 -209877
12267b09877M6703P1143R4978L8440J86634R9604l9957j04830r9975n2295K2885
$$ -209877 -163174 -92031 2947 41387 228021 327625 287668 182838 82863 30568 53453
12256E3453k5103k11735j69873k17194k6302J78784J38983O143j42691k4611J92630
$$ 53453 28350 -183385 -353258 -570452 -596754 -417970 -278987 -272844 -415535 -440146 -247516
12245b47516j0407j38964K3743j72554q544L06119J80661j7953k72830j13482
$$ -247516 -257923 -396887 -373144 -545698 -554242 -248123 -67462 -85415 -358245 -471727
12235d71727J5990J32490J00070N0332L3796N0894J41076R7933r6242j38654K4437
$$ -471727 -455737 -323247 -223177 -172845 -139049 -88155 52921 150854 54612 -84042 -59605
12224e9605l2683p1374j8686R0207O1952p1448q1495J00753M3512O7794K01895
$$ -59605 -92288 -163662 -182348 -92141 -30189 -101637 -183132 -82379 -38867 28927 230822
12213B30822J21121J37115Q9574J009j45712j05847j48440r2321m7101j10194
$$ 230822 351943 489058 578632 579641 433929 328082 179642 87321 40220 -69974
12203f9974p8143O338R1898J67652p426j11002k00453P79J13020J55230R1341
$$ -69974 -148117 -141779 -49881 117771 110345 -657 -201110 -200331 -87311 67919 159260
12192A59260K8300N5871R9048N1631k08474k18823j80633k35137n5420R9663J73571
$$ 159260 187560 243431 342479 394110 185636 -33187 -213820 -448957 -504377 -404714 -231143
12181b31143K48315J71207m1187j2569Q5913P8789q8706k18259j79356l641O0320
$$ -231143 17172 188379 147192 134623 220536 299325 210619 -7640 -186996 -190637 -130317
12170a30317R212j90513q3320J72835J41215J96766K01669P7621j2109j64402
$$ -130317 -121105 -311618 -394938 -222103 -80888 115878 317547 395168 383059 218657
12160B18657l2010j7832k22277k17931j16861Q2229J09182J2865j28985n4271
$$ 218657 186647 168815 -53462 -271393 -388254 -306025 -196843 -183978 -312963 -367234
12150c67234q6737L660K15426J31569R2072Q0951j52433L6631J87982q8136q2736
$$ -367234 -453971 -450311 -234885 -103316 -11244 69707 -82726 -46095 141887 53751 -28985
12139b8985L5834o6049p6521J6914j2194j46364j40412j33789k924m8344q7341
$$ -28985 6849 -59200 -135721 -118807 -131001 -277365 -417777 -551566 -554490 -602834 -690175
12128f90175L7433K7278n0482K035q382M3297J10152J47502J13253j2960l8320
$$ -690175 -652742 -625464 -675946 -673911 -682293 -638996 -528844 -381342 -268089 -281049 -319369
12117c19369n1556m6146j10899m6574L2854n4363l00620j66784J09400L63322
$$ -319369 -370925 -417071 -527970 -574544 -541690 -596053 -896673 -1063457 -954057 -590735
12107e90735K61454j46139L086M8598j9057p2372k21436j30206m0163K1676j3285
$$ -590735 -329281 -475420 -472334 -423736 -442793 -515165 -736601 -866807 -906970 -885294 -898579
12096h98579J0J8701L34398N11287K17040j3606j68286k45108j55800j09679Q3683
$$ -898579 -898569 -879868 -545470 -34183 182857 169251 965 -244143 -399943 -509622 -425939
12085d25939O8204r8031N849J69657J59135l6727R1499J73926q1057m8301M9541
$$ -425939 -357735 -455766 -449917 -280260 -121125 -157852 -66353 107573 26516 -21785 27756
12074B7756k0747k9132r9923m4276q2651Q1121M8241p1383K8361K09009j129m8677
$$ 27756 7009 -22123 -122046 -166322 -248973 -167852 -119611 -190994 -162633 46376 45247 -3430
12062c430m3101l0319K2549m1636K4232J11353l9625k3823J35760L121p0012j5769
$$ -3430 -46531 -76850 -54301 -95937 -71705 39648 23 -23800 111960 115081 45069 29300
12050B9300K06165K20514j41120k64960k58209k3282M6172P1980k0732k22560
$$ 29300 235465 455979 314859 49899 -208310 -231592 -185420 -113440 -134172 -356732
12040c56732j37585O940m4810l1907L5682Q3347J42024k2953L6740M1270n8167
$$ -356732 -494317 -487377 -532187 -564094 -528412 -445065 -303041 -325994 -289254 -247984 -306151
12029c06151n6295j40118m0251m7040k9336j5536M2479M319j385J70966J22939
$$ -306151 -362446 -502564 -542815 -589855 -619191 -634727 -592248 -587929 -589314 -418348 -295409
12018b95409k1642o635J87965K63897J26859N059n4423q3919L7945n3871p0247
$$ -295409 -317051 -323686 -135721 128176 255035 260094 205671 121752 159697 105826 35579
12007C5579p7207j8827j5182k1477o0766k08175J02099J53877j4386J94165J47883
$$ 35579 -41628 -60455 -75637 -97114 -157880 -366055 -263956 -110079 -124465 69700 217583
11996B17583L8083j47J09479M7982p1547p098L0469k6239r5053J38725m5791n450
$$ 217583 255666 255519 364998 412980 341433 334335 364804 338565 243512 382237 336446 330996
11984C30996k2652p4179m0969l2576O1372J32598j34405q3723O113l575O0031
$$ 330996 308344 234165 193196 160620 221992 354590 220185 136462 142575 139000 199031
11973A99031o2364j27875P3523J42275j94218j32646O3419O5025j6499j35063
$$ 199031 136667 8792 82315 224590 30372 -102274 -38855 26170 9671 -125392
11963a25392j76081j6005Q9322J62735J85355R5593J9367L376p3020r6538j61313
$$ -125392 -301473 -317478 -228156 -65421 119934 215527 234894 238270 165250 68712 -92601
11952i2601j62439m9014N2650J64002L30849J82406k46539j48775l8218k7505
$$ -92601 -255040 -304054 -251404 -87402 243447 425853 179314 30539 -7679 -35184
11942c5184j61582o8231R5679l1383K4286J04877J66434O8978K688J7239J72360
$$ -35184 -196766 -264997 -169318 -200701 -176415 -71538 94896 163874 166562 183801 356161
11931C56161K01833Q3201K34517M46266L30840K12912M25218O11686M76577M17030
$$ 356161 557994 641195 875712 1321978 1652818 1865730 2290948 2902634 3379211 3796241
11921C796241L54229P63442J239081J543015J169056R03224P40669K44642m47999
$$ 3796241 4150470 4913912 6152993 7696008 8865064 9768288 10508957 10753599 10305600
11912A0305600r73794j219015j082905q96647p99739o09834o03539n02056n09999
$$ 10305600 9331806 8112791 7029886 6133239 5333500 4723666 4120127 3618071 3108072
11903C108072m73856k01297m2813k14686l87660m12639k75331k881n1201k0347
$$ 3108072 2634216 2432919 2390106 2175420 1787760 1375121 1099790 1096909 1045708 1025361
11893A025361J05773j71066k79196j24455O4347k67133j29226N6443q2889k4871
$$ 1025361 1131134 960068 680872 556417 620764 353631 224405 280848 197959 173088
11883A73088J3455M8711m0160j78191l8342R237j63361j75414m426p6591k31685
$$ 173088 186543 235254 195094 16903 -21439 -12202 -175563 -350977 -355403 -431994 -663679
11872f63679J07178R7258O3988l0652N1549J97942L26579L42320P20112O23302
$$ -663679 -556501 -459243 -395255 -425907 -374358 -176416 150163 492483 1212595 1835897
11862A835897M52010O41387J269059O07597j309489j239297p04113l54084n5770
$$ 1835897 2287907 2929294 4198353 4805950 3496461 2257164 1553051 1198967 1143197
11853A143197k64060k58366j25996J66950J97608P299j07194k55867l79678k95373
$$ 1143197 879137 620771 494775 661725 859333 866632 759438 503571 123893 -171480
11843a71480K014J83716J1367j09219N4986l2966j23323J8242l6150p6792k1205
$$ -171480 -169466 14250 25617 -83602 -28616 -61582 -184905 -166663 -202813 -279605 -300810
11832c00810m0080j01926m9400J87477K84133J92472O1315j3296j14303j02140
$$ -300810 -340890 -442816 -492216 -304739 -20606 171866 233181 219885 105582 3442
11822C442m1944Q1060J04442p1460L9055J47871m336j31836j87252n8902l33450
$$ 3442 -38502 42558 147000 75540 114595 262466 258130 126294 -60958 -119860 -453310
11811d53310j95460J08336K50788J39338J39633k6628M1907J91182k9366m5848
$$ -453310 -648770 -540434 -289646 -150308 -10675 -37303 4604 195786 166420 120572
11801A20572j16668j80973P910J75626J34404P4788j21031k12176j60756m6180
$$ 120572 3904 -177069 -169159 6467 140871 215659 94628 -117548 -278304 -324484
11791c24484p1907r0051j7597l118k28853j40583O7674J21934Q5258J33216J98946
$$ -324484 -396391 -486442 -504039 -507157 -736010 -876593 -808919 -686985 -601727 -468511 -269565
11780b69565J1070j70010p7250J27976J99507K62521Q1775j39162j15651K1983
$$ -269565 -258495 -428505 -505755 -377779 -178272 84249 166024 26862 -88789 -66806
11770f6806K8959j80130j91286l5919j7680J62154R6744j9682J98777J48912k71426
$$ -66806 -37847 -217977 -409263 -445182 -462862 -300708 -203964 -223646 -24869 124043 -147383
11759a47383l49757q9265M8422J64927M6011k6152p1028J1533J64721J56289J00710
$$ -147383 -497140 -586405 -537983 -373056 -327045 -353197 -424225 -412692 -247971 -91682 9028
11748I028o8850j96524q6536q3038k48902j08769P298O9968L724M5863o3757j53894
$$ 9028 -59822 -256346 -342882 -425920 -674822 -783591 -776293 -706325 -702601 -656738 -720495 -874389
11736h74389M9037K69527J53785J52320L6658m5092j81031k30335O0463m2622
$$ -874389 -825352 -555825 -402040 -249720 -213062 -258154 -439185 -669520 -609057 -651679
11726f51679j27190q940J6290M0922K61846J71377q9568l52540l31982K23270
$$ -651679 -778869 -787809 -771519 -730597 -468751 -297374 -386942 -739482 -1071464 -848194
11716h48194L15637J59652P06999L57042k78811n2188J65081J24977q059n7220
$$ -848194 -532557 -372905 334094 691136 412325 360137 525218 650195 642136 584916
11706E84916j07027k18001k51156J45837K50858j25599j28274J63966J10985q0201
$$ 584916 477889 259888 8732 154569 405427 279828 151554 315520 426505 346304
11696C46304o3963j32555L1762J99216o211k30632j85972j39147j05687K85704
$$ 346304 282341 149786 181548 380764 374553 143921 -42051 -181198 -286885 -1181
11686a181P1148k32192k60170k22255K4556L34836K96999O231j30098j50068K0750
$$ -1181 69967 -162225 -422395 -644650 -620094 -285258 11741 17972 -112126 -262194 -241444
11675b41444J61504K71978M42984R3781o8053q9554j44293k63503j49745j42614
$$ -241444 -79940 192038 635022 728803 660750 571196 426903 163400 13655 -128959
11665a28959j51294L9089N9601o3964j27669p8681P8039o1747k71724j3162J17868
$$ -128959 -280253 -241164 -181563 -245527 -373196 -451877 -373838 -435585 -707309 -720471 -602603
11654f02603J19324l1470Q4116j4353K9702P8121l8498l9744n9820M9800J85803
$$ -602603 -483279 -514749 -430633 -444986 -415284 -337163 -375661 -415405 -475225 -425425 -239622
11643b39622M5426j57819j2986P6519N7720L3554n6906q7858M1670J07519J42823
$$ -239622 -194196 -352015 -365001 -288482 -230762 -197208 -254114 -341972 -300302 -192783 -49960
11632d9960J5456m2190J9034R3293m259m9217q4195j41835J5132l5918j30468
$$ -49960 -34504 -76694 -57660 35633 31374 -17843 -102038 -243873 -228741 -264659 -395127
11621c95127o5379n2066K2621K50897K28372j59451l47898j32678J3469J43539
$$ -395127 -460506 -512572 -489951 -239054 -10682 -170133 -518031 -650709 -637240 -493701
11611d93701K90407K21589J11157o3482k21038p3425J50655j05280k79574Q9126
$$ -493701 -203294 18295 129452 65970 -155068 -228493 -77838 -183118 -462692 -373566
11601c73566J87284J76698J53070r8563j53860L2225Q2640K13407M5665q9967
$$ -373566 -186282 -9584 143486 44923 -108937 -76712 5928 219335 265000 175033
11591A75033n6129J20659J72978J20300O0077J18190R7977p5725k68268l19759
$$ 175033 118904 239563 412541 532841 592918 711108 809085 733360 465092 145333
11581A45333j84486O3713J22858J15423K27910J64737J61891N734L9336j48423
$$ 145333 -39153 24560 147418 262841 490751 655488 817379 823113 862449 714026
11571G14026j00715p7544q9083o3353m0926P5311K5064K22527M9713j99121q0639
$$ 714026 613311 535767 446684 383331 342405 417716 442780 665307 715020 515899 435260
11560D35260j7229j16344K5969J70589K66547L45022M17648M37474K62041J45289
$$ 435260 418031 301687 327656 498245 764792 1109814 1527462 1964936 2226977 2372266
11550B372266L95388P60780R46784J327911J479647J422275J488601J194737M23015
$$ 2372266 2767654 3528434 4475218 5803129 7282776 8705051 10193652 11388389 11811404
11541A1811404n04800j137531j488363j162205r45217r25867p57443o35788n75587
$$ 11811404 11306604 10169073 8680710 7518505 6573288 5647421 4889978 4254190 3678603
11532C678603m64410l80193k02754j70851j38604K3327j00131j68832j85010l20160
$$ 3678603 3214193 2834000 2631246 2460395 2321791 2345118 2244987 2076155 1891145 1570985
11522A570985m82109n5611J7759o4464J71251Q3574M6840l7165j58424p5316P1474
$$ 1570985 1088876 1033265 1051024 986560 1157811 1241385 1288225 1251060 1092636 1017320 1088794
11511A088794K15446J21023q1780m9081P5599J00197p1781k7257J49449J53133
$$ 1088794 1304240 1425263 1343483 1294402 1370001 1470198 1398417 1371160 1520609 1673742
11501A673742M5386J67064J29739J1965J67361K65808K83876O33200P44846Q03380
$$ 1673742 1719128 1886192 2015931 2027896 2195257 2461065 2744941 3378141 4122987 4926367
11491D926367Q07458J019794J502154J818463J678399J243472M53081q43304j742795
$$ 4926367 5733825 6753619 8255773 10074236 11752635 12996107 13449188 12605884 10863089
11482A0863089j924301j759926j402327q37788m77050l93339m58614n93532m15876
$$ 10863089 8938788 7178862 5776535 4938747 4461697 4068358 3609744 3016212 2600336
11473B600336j48143j39410k89995k70764k20689k36334j64783j07208n2806j26723
$$ 2600336 2452193 2312783 2022788 1752024 1531335 1295001 1130218 1023010 970204 843481
11463H43481r5048j09577n0010n4094j80673n9809J69765K12841O1272L5485j31037
$$ 843481 748433 638856 588846 534752 354079 294270 464035 676876 738148 773633 642596
11452F42596j51953j74573j27455R8497L32741L20048j98584k59768J2870n6365
$$ 642596 490643 316070 188615 287112 619853 939901 741317 481549 494419 438054
11442D38054j69376k29747j13485J52608K44848M6281k10068k27068r2493L2962
$$ 438054 268678 38931 -74554 78054 322902 369183 159115 -67953 -160446 -127484
11432a27484K23004J31426n8446j53488K22567K05023r3999j26384p8110P6301
$$ -127484 95520 226946 168500 15012 237579 442602 348603 222219 144109 220410
11422B20410R0000K1524j12643M208j67816l0440J32563k43099r4268L6358J57625
$$ 220410 310410 331934 219291 223499 55683 25243 157806 -85293 -179561 -143203 14422
11411A4422J10512j34363k36238M7449L63545K52189j98373j36694K65485k41451
$$ 14422 124934 -9429 -245667 -198218 165327 417516 219143 82449 347934 106483
11401A06483j18850L34092L79253j7503k08208j75841o3069l6100Q6063L8555
$$ 106483 -12367 321725 700978 683475 475267 299426 236357 200257 286320 324875
11391C24875R0081J2620p1202l5846j37188j35072k17647L025L21153J66410j00456
$$ 324875 414956 427576 356374 320528 183340 48268 -169379 -166354 154799 321209 220753
11380B20753J35903J80181M4175j70996j91811j86237k4266J59267J2592j58661
$$ 220753 356656 536837 581012 410016 218205 31968 7702 166969 179561 20900
11370B0900j59521R2791Q7135p3911r1676j01K8356Q8679J04011j20095O0454
$$ 20900 -138621 -45830 41305 -32606 -124282 -124383 -96027 -7348 96663 -23432 37022
11359C7022J39682Q9583M6282q1292k21295q1635K58339P352j05873j44157n2897
$$ 37022 176704 266287 312569 231277 9982 -71653 186686 194038 88165 -55992 -108889
11348a08889J08126M8063k44305o778K10791m2636j32647O8475J36650n4759j29009
$$ -108889 -763 47300 -197005 -203783 7008 -35628 -168275 -99800 36850 -17909 -146918
11337a46918q14J22756J22125J55089R7201j73524l41559k61374j45201L2043
$$ -146918 -147732 -24976 97149 252238 349439 175915 -165644 -427018 -572219 -540176
11327e40176L31162K43087r282j57834j56811q8949j7526J47858J10024L3235
$$ -540176 -209014 34073 24791 -133043 -289854 -378803 -396329 -248471 -138447 -105212
11317a05212M9865P1104K48410K3526k72756j54203o7650l0208l4942k55938K5013
$$ -105212 -55347 15757 264167 287693 14937 -139266 -206916 -237124 -272066 -528004 -502991
11306e02991L27840K90219o7969j17399m7934j64411M8485L17685J91649j03138
$$ -502991 -175151 115068 47099 -70300 -118234 -282645 -234160 83525 275174 172036
11296A72036k75435k18815O4035J87952j6955L0184M0539m7417K19484N7692j80864
$$ 172036 -103399 -322214 -258179 -70227 -87182 -56998 -16459 -63876 155608 213300 32436
11285C2436m8624J83038K16894J4236j03927r3143j43003j33707k64839j65529
$$ 32436 -16188 166850 383744 397980 294053 200910 57907 -75800 -340639 -506168
11275e06168L19273L63191j21781m96248l10596K5755J07743Q76J78139J30728
$$ -506168 -186895 176296 54515 -441733 -752329 -726574 -618831 -617955 -439816 -309088
11265c09088N9371Q5339P781l283J10003k0645k49271j73222M5455Q8386J37892
$$ -309088 -249717 -164378 -156597 -159880 -49877 -70522 -319793 -493015 -447560 -359174 -221282
11254b21282J83640K08506n7488j99866o1405o6749o6497R3801N1914j41559m5879
$$ -221282 -37642 170864 113376 -86490 -147895 -214644 -281141 -187340 -135426 -276985 -322864
11243c22864K215J17217J39381j24502j16901P3633K19377J75486P889M6412M7064
$$ -322864 -320649 -203432 -64051 -188553 -305454 -231821 -12444 163042 170931 217343 264407
11232B64407j25789j70924r0466O006l8415j72733J30551K10407p7222l1835J30021
$$ 264407 138618 -32306 -122772 -116766 -155181 -327914 -197363 13044 -64178 -96013 34008
11221C4008Q2510L7484q8953j75657r6584J92383K00104j59109j87628j23260
$$ 34008 116518 154002 65049 -110608 -207192 -14809 185295 26186 -161442 -284702
11211b84702j173K21867K9414q5598k14561j87326j11781J20357J85157J81761
$$ -284702 -285875 -64008 -34594 -120192 -334753 -522079 -633860 -513503 -328346 -146585
11201a46585J21608k2919k20794j51325J1764J86505J5565j2223R7042k36580
$$ -146585 -24977 -47896 -268690 -420015 -408251 -221746 -206181 -218404 -121362 -357942
11191c57942j39737K7573J48770K06320L1253n1059J43436J25147k7482k04846
$$ -357942 -497679 -470106 -321336 -115016 -83763 -134822 8614 133761 106279 -98567
11181i8567k17182q9237K2426J94821M0778r0645k5926K32799J11335l98299l84008
$$ -98567 -315749 -404986 -382560 -187739 -146961 -237606 -263532 -30733 80602 -317697 -701705
11170g01705j06034Q5274L57435M01796O7881n015Q9039J12448j16067k68536
$$ -701705 -807739 -722465 -365030 36766 104647 99632 188671 301119 185052 -83484
11160h3484o2994O7566J7197N2456P7992P0582J19423k2509j50363j77689j37760
$$ -83484 -146478 -78912 -61715 -9259 68733 139315 258738 236229 85866 -91823 -229583
11149b29583L6378L7339P119Q1766L9545J36965K06671J64409J4162k34055l03043
$$ -229583 -193205 -155866 -148747 -66981 -27436 109529 316200 480609 494771 260716 -42327
11138d2327j85125j88911n73K28075K34193J88911k476k18905k12571j58791j08948
$$ -42327 -227452 -416363 -416936 -188861 45332 234243 231767 12862 -199709 -358500 -467448
11127d67448J68658L20785N7203j12812k43007j19626N5618J53319J05106j8453
$$ -467448 -298790 21995 79198 -33614 -276621 -396247 -340629 -187310 -82204 -100657
11117a00657L8448k12558j12996J64626R3394r3442j90047j34244o988n982n7163
$$ -100657 -62209 -274767 -387763 -223137 -129743 -223185 -413232 -547476 -554464 -560446 -617609
11106f17609J87437K97129K11124M8016m4920j33590j71750M0164K9560j87981
$$ -617609 -430172 -133043 78081 126097 81177 -52413 -224163 -183999 -154439 -342420
11096c42420k85580l32965j36747M5184O3817J62025M02140L51186J72265L0542
$$ -342420 -628000 -960965 -1097712 -1052528 -988711 -826686 -424546 -73360 98905 129447
11086A29447J28535J55040p0564k49929j39311j06531J19088J01338j15625j30658
$$ 129447 257982 413022 342458 92529 -46782 -153313 -34225 67113 -48512 -179170
11076a79170j22597J57902M7646j36923j30765l6826J52922J20559K5097j61083
$$ -179170 -301767 -143865 -96219 -233142 -363907 -400733 -247811 -127252 -102155 -263238
11066b63238j18603o2925J71862K08311J65619J64993M7691k42777k75041m0773
$$ -263238 -381841 -444766 -272904 -64593 101026 266019 313710 70933 -204108 -244881
11056b44881K04768M32856J52149p0667j32599q1662j21999n8499n905p0289m214
$$ -244881 -40113 392743 544892 474225 341626 259964 137965 79466 73561 3272 -942
11045i42j2162l7402j67508j63042j3226O957r8527R8933J38515j7544n1582L658
$$ -942 -13104 -50506 -218014 -381056 -394282 -387325 -485852 -386919 -248404 -265948 -317530 -313872
11033c13872L2497K0223K07066K37714l8292j77035j43225j51187r5663Q078N4724
$$ -313872 -281375 -261152 -54086 183628 145336 -31699 -174924 -326111 -421774 -413696 -358972
11022c58972J1649m3171j13591p4057n8748N1212R5099l293l488J36173K82861
$$ -358972 -347323 -390494 -504085 -578142 -636890 -585678 -490579 -493872 -497360 -361187 -78326
11011g8326O8821k3440R169n9693j1146K5117M0674J21485J64152L4673j13303
$$ -78326 -9505 -32945 -23776 -83469 -94615 -69498 -28824 92661 256813 291486 178183
11000A78183k6541L7835M9456Q2867L6277J10201j24681m15652m08284j67368
$$ 178183 151642 189477 238933 321800 358077 468278 343597 -72055 -480339 -647707
10990f47707M1735J21531P5519Q1046p7303j95105j56827o8680q2264R2860L9042
$$ -647707 -605972 -484441 -408922 -327876 -405179 -600284 -757111 -825791 -908055 -815195 -776153
10979g76153o5477j8403j7642J09024J84884J63273O865k03752j5956J86667K93765
$$ -776153 -841630 -860033 -877675 -768651 -583767 -420494 -413629 -617381 -633337 -446670 -152905
10968a52905J68387n3547j10060j51945k75286l02756L5187M15870K70826J1796
$$ -152905 15482 -38065 -148125 -300070 -575356 -878112 -842925 -427055 -156229 -144433
10958a44433r2090Q1012O4397m2931K4352l8551j9737o6244J6656J59423j2388
$$ -144433 -236523 -155511 -91114 -134045 -109693 -148244 -167981 -234225 -217569 -58146 -70534
10947g0534r2454j5108j06996l6015L2056K9200o6441k20507J9761L76414P5062
$$ -70534 -162988 -178096 -285092 -321107 -289051 -259851 -326292 -546799 -527038 -150624 -75562
10936g5562o278R7004l588J500j05827o0083q0559q9624J56807L10525k5074p4173
$$ -75562 -81840 15164 11576 13076 -92751 -152834 -233393 -323017 -166210 144315 119241 45068
10924D5068J8448j1900p5543j93224j25267N8360m3354j29032K18687K68744L205
$$ 45068 63516 51616 -23927 -217151 -342418 -284058 -327412 -456444 -237757 30987 34192
10913C4192k67900j66526n4839m766N0716M3282M4444j19918k67670k1082K09727
$$ 34192 -233708 -400234 -455073 -459839 -409123 -365841 -321397 -441315 -708985 -730067 -520340
10902e20340J81411n6268j33608j47008q9501R7295Q3077j34928J04691J63702
$$ -520340 -338929 -395197 -528805 -675813 -765314 -668019 -584942 -719870 -615179 -451477
10892d51477O6183K69028K76773O9008o8058P2522J16049o6064j67234j79584
$$ -451477 -385294 -116266 160507 229515 161457 233979 350028 283964 116730 -62854
10882f2854k41125p3451q3602j42959l3430j98309j25096J40744M8872J54606
$$ -62854 -303979 -377430 -461032 -603991 -637421 -835730 -960826 -820082 -771210 -616604
10872f16604J15584M7254M8269l9093q6980N2045j0265N8262P0708J26652K21559
$$ -616604 -501020 -453766 -405497 -444590 -531570 -479525 -489790 -431528 -360820 -234168 -12609
10861a2609n6808l02650j34588n8199J18689J53429o8411j18968R4202J98545
$$ -12609 -69417 -372067 -506655 -564854 -446165 -292736 -361147 -480115 -385913 -187368
10851a87368L0753J4329L5984j59810o8131K57201J16398L2063J90703RJ1934
$$ -187368 -156615 -142286 -106302 -266112 -334243 -77042 39356 71419 262122 262131 274065
10840B74065P7157J5525k7478l9575L5151j11443j32277q3165J19439K5617j49967
$$ 274065 351222 366747 339269 299694 334845 223402 91125 7960 127399 153016 3049
10829C049j10633j75977j02032j42508j92242J14568K34031J28157J36206J25335
$$ 3049 -107584 -283561 -385593 -528101 -720343 -605775 -371744 -243587 -107381 17954
10819A7954j03077k05572j45208j0688J48777R3436p5535j75510j29976n2684
$$ 17954 -85123 -290695 -435903 -446591 -297814 -204378 -279913 -455423 -585399 -638083
10809f38083q6847Q128L47844L62656N865k12052k32561j69454m9213o4356J30826
$$ -638083 -724930 -716802 -368958 -6302 -437 -212489 -445050 -614504 -663717 -728073 -597247
10798e97247J19038o3848N4551J70105K9678P705J36657J79525k823k76701k28733
$$ -597247 -478209 -542057 -487506 -317401 -287723 -280018 -143361 36164 33341 -243360 -472093
10787d72093n1906J08381J88692J86983J73997L217p7708K7370J36468K1189l46941
$$ -472093 -523999 -415618 -226926 -39943 134054 137271 59563 86933 223401 244590 -102351
10776a02351l95335j85192K6571l08l2318J0088P5932K34209L9919k00991R9673
$$ -102351 -497686 -682878 -656307 -656615 -688933 -678845 -602913 -368704 -328785 -529776 -430103
10765d30103L45586J92712K0057j48301k69063q6569r1828K9737K82371K27913
$$ -430103 -84517 108195 128252 -20049 -289112 -375681 -467509 -437772 -155401 72512
10755G2512J34797O7873N8612N6538n1781j16871r8984j05312j51315J6675J54631
$$ 72512 207309 275182 333794 390332 338551 221680 122696 17384 -133931 -117256 37375
10744C7375J8608M6092J1631p9054M69J08129K11026j05789l54550q1566N4524
$$ 37375 55983 102075 113706 34652 35121 143250 354276 248487 -106063 -187629 -133105
10733a33105j59907n9950j04979j36941O7687K03499K04016J00080L2200J08838
$$ -133105 -293012 -352962 -457941 -594882 -527195 -323696 -119680 -19600 12600 121438
10723A21438J02613j43350j95658P6609J13522J0597j30852j20672j11979j28920
$$ 121438 224051 80701 -114957 -38348 75174 85771 -45081 -165753 -277732 -406652
10713d06652J13317k6272J6691J92240n203k6133k10724K4617M02252J14570j87197
$$ -406652 -293335 -319607 -302916 -110676 -115879 -142012 -352736 -328119 74133 188703 1506
10702A506j89170q7090N5193Q0958l7260k3R8773O612p8483j16687J01250K21776
$$ 1506 -187664 -274754 -219561 -138603 -175863 -175886 -77113 -70501 -148984 -265671 -164421 57355
10690E7355K7791Q1717m7817k81232k37770k79347m3853N3240Q9034R9681O0451
$$ 57355 85146 166863 119046 -162186 -399956 -679303 -723156 -669916 -580882 -481201 -420750
10679d20750Q1090j33930m1366L01529M95251P6973l24213k14753J09756k4826
$$ -420750 -339660 -473590 -514956 -213427 281824 358797 34584 -180169 -70413 -95239
10669i5239j50596j59626j3321J02835q2631o1300O0460j74n6670P7079R8862
$$ -95239 -245835 -405461 -418782 -315947 -398578 -459878 -399418 -399592 -456262 -379183 -280321
10658b80321M3516Q5074J51909L4327j13282R3813Q5883k29486k43207K6186J25604
$$ -280321 -236805 -151731 178 34505 -78777 15036 100919 -128567 -371774 -345588 -219984
10647b19984O4025r6537k93559j22714l1517J20851K25236K3056j28001j1349
$$ -219984 -155959 -252496 -546055 -668769 -700286 -579435 -354199 -331143 -459144 -470493
10637d70493J62134j0561j85795j62737o5312n3485N7977K44591L64142M69799
$$ -470493 -308359 -318920 -504715 -667452 -732764 -786249 -728272 -483681 -119539 350260
10627C50260K224k22522O9368q7388k69072l39234o4954n9561q5977M6162K90775
$$ 350260 352484 129962 199330 111942 -157130 -496364 -561318 -620879 -706856 -660694 -369919
10616c69919L97557J03066k39653k40535l840k1930J7951m0648k21827j93047
$$ -369919 27638 130704 -108949 -349484 -353324 -375254 -357303 -397951 -619778 -812825
10606h12825J56265K07898L63262L62105O3573j76414l15883K9432j43652j27405
$$ -812825 -656560 -448662 -85400 276705 340278 163864 -152019 -122587 -266239 -393644
10596c93644j18500r6440Q6201N360J76579J77010o5138o3181j33733n0028J18315
$$ -393644 -512144 -608584 -522383 -517023 -340444 -163434 -228572 -291753 -425486 -475514 -357199
10585c57199k2697L6283Q3459m5313k40195j71713J12901J84210M2137j71004
$$ -357199 -379896 -343613 -260154 -305467 -545662 -717375 -604474 -420264 -378127 -549131
10575e49131j10625P1185R6107J76572J59567l4298j06120K18387J67769o9658
$$ -549131 -659756 -588571 -492464 -315892 -156325 -190623 -296743 -78356 89413 19755
10565A9755J5868Q0145o3491n8064k6431j55513j26014q7828l319l9998J0815
$$ 19755 35623 115768 52277 -5787 -32218 -187731 -313745 -401573 -404892 -444890 -434075
10554d34075R8801o6590l8857j80923L7175M47650N4205l34510l56115p6138P7826
$$ -434075 -335274 -401864 -440721 -621644 -584469 -136819 -82614 -417124 -773239 -849377 -771551
10543g71551L3042K20107J28209L2918Q8040J4738m4314j23203M85J5743J32601
$$ -771551 -738509 -518402 -390193 -357275 -269235 -254497 -298811 -422014 -421529 -405786 -273185
10532b73185P5267o870O9502K8615n9718j39628L8091j63998k3975J86156j08672
$$ -273185 -197918 -204788 -135286 -106671 -166389 -306017 -267926 -431924 -455899 -269743 -378415
10521c78415j33902m6076M5966J03512P2416q1677j37396j9803Q4387J39009N0839
$$ -378415 -512317 -558393 -512427 -408915 -336499 -418176 -555572 -575375 -490988 -351979 -301140
10510c01140L082j56608k45867j62093J01891J02567R1842J69166J60706K4338
$$ -301140 -298058 -454666 -700533 -862626 -760735 -658168 -566326 -397160 -236454 -212116
10500b12116K05003J89366J82271j1985k15547j74050k43153j92062p1059p6350
$$ -212116 -7113 182253 364524 352539 136992 -37058 -280211 -472273 -543332 -619682
10490f19682k4349m4412J06174J08393R1563j0972k66346j94811R8220N4522P2741
$$ -619682 -644031 -688443 -582269 -473876 -382313 -393285 -659631 -854442 -756222 -701700 -628959
10479f28959J35151K25073K10857o56j34773m1203J06647M089o7119j17923J0449
$$ -628959 -493808 -268735 -57878 -58534 -193307 -234510 -127863 -123774 -190893 -308816 -298367
10468b98367P9778J17762J87878J35268o9615q7309q5216k3823k8546l1523o7410
$$ -298367 -218589 -100827 87051 222319 152704 65395 -19821 -43644 -72190 -103713 -171123
10457a71123J64374R6194k64063k82192Q1689L81818J89480k5985k7245j44672
$$ -171123 -6749 89445 -174618 -456810 -375121 6697 196177 170192 142947 -1725
10447a725j47849k09483j61654Q0685J26631j4684r3841j53962J14627J74176
$$ -1725 -149574 -359057 -520711 -440026 -313395 -328079 -421920 -575882 -461255 -287079
10437b87079P2726l4639j06842m4558j01768J0853K6210O6091N9326J8965m4287
$$ -287079 -214353 -248992 -355834 -400392 -502160 -491307 -465097 -399006 -339680 -320715 -365002
10426c65002K5122K01217K78839P9046k5893j47850n6952Q0260j01609k78367
$$ -365002 -339880 -138663 140176 219222 193329 45479 -11473 68787 -32822 -311189
10416c11189j48244K40888L27192N2040k0351J2640o634J8705n7969k42524j40018
$$ -311189 -459433 -218545 108647 160687 140336 152976 146342 165047 107078 -135446 -275464
10405b75464j69194m1183J76093r5909k05537o2738K06880R4672o4661r9740j27190
$$ -275464 -444658 -485841 -309748 -405657 -611194 -673932 -467052 -372380 -437041 -536781 -663971
10394f63971j74330K1767M2767J0161k4716J7388L11540K79406Q0014K3266o0829
$$ -663971 -838301 -816534 -773767 -763606 -788322 -770934 -459394 -179988 -99974 -76708 -137537
10383a37537n5877j95091n9586M8387m4393L0766P910J2693J45114R1099j276
$$ -137537 -193414 -388505 -448091 -399704 -444097 -413331 -405421 -392728 -247614 -156515 -157791
10372a57791m5404k09456k66101j28379q4404J42673L78814J55770J7040o5706
$$ -157791 -203195 -412651 -678752 -807131 -891535 -748862 -370048 -214278 -197238 -262944
10362b62944j65921j89065J2777J36278K7855j32874M7314K2046P6471M14335
$$ -262944 -428865 -617930 -605153 -468875 -441020 -573894 -526580 -504534 -428063 -13728
10352a3728J2640r5224J5890k4897k3467p6758j21413K4698J85885k8660j13251
$$ -13728 -1088 -96312 -80422 -105319 -128786 -205544 -326957 -302259 -116374 -145034 -258285
10341b58285N1173L4625n6287R0876J43430j83143j42192p0486J07040N706j05501
$$ -258285 -207112 -172487 -228774 -137898 5532 -177611 -319803 -390289 -283249 -277543 -383044
10330c83044J4926L5778j7491R7437O9567m0220J7416j66585r7288K26462J67300
$$ -383044 -368118 -332340 -349831 -252394 -182827 -223047 -205631 -372216 -469504 -243042 -75742
10319g5742o5823k43937J7928L15400J28769l60117l36405m1064K2165R1959n0993
$$ -75742 -141565 -385502 -367574 -52174 76595 -283522 -619927 -660991 -638826 -546867 -597860
10308e97860J7285j14259N6319K89677J44021J93536K92958K37730N0875l38819
$$ -597860 -580575 -694834 -638515 -348838 -204817 -11281 281677 519407 570282 231463
10298B31463l13646j08792n3229R6829J21700o7440r9935J27051q4056j81931
$$ 231463 -82183 -190975 -244204 -147375 -25675 -93115 -193050 -65999 -150055 -331986
10288c31986J1988K02556J71759p0254j65332j37652L6215M8461O6130R5645j03786
$$ -331986 -319998 -117442 54317 -15937 -181269 -318921 -282706 -234245 -168115 -72470 -176256
10277a76256p7211k45476j81990J78353L55316J74480k76659j33447J0871p5749
$$ -176256 -253467 -498943 -680933 -502580 -147264 27216 -249443 -382890 -372019 -447768
10267d47768j50549k0745J37219J97777N9347J68950J95552r3354q8278Q081j07645
$$ -447768 -598317 -619062 -481843 -284066 -224719 -55769 139783 46429 -41849 -33768 -141413
10256a41413j4142J47067J09971q0842J07392K34588M2273j97786l21937o6558
$$ -141413 -155555 -8488 101483 20641 128033 362621 404894 207108 -114829 -181387
10246a81387o176J18998Q1603q2404K3914J56376J55842O0291j1259o7893m3769
$$ -181387 -187563 -68565 13038 -69366 -45452 110924 266766 327057 315798 247905 204136
10235B04136J4949j26455j10073r9806j25188J58790K91272j4615K2773J01792
$$ 204136 219085 92630 -17443 -117249 -242437 -83647 207625 193010 215783 317575
10225C17575K1574K2371k1512M271r8553l52016j86937J36584J27203k29755j81495
$$ 317575 339149 361520 340008 344279 245726 -106290 -293227 -156643 -29440 -259195 -440690
10214d40690J26098J82178J44980J56780o8039l11948j26475J06787R5460L7725
$$ -440690 -314592 -132414 12566 169346 101307 -210641 -337116 -230329 -134869 -97144
10204i7144J38838P2643J0247m4467j29630k23120k15811k0323J63566j3014j59016
$$ -97144 41694 114337 124584 80117 -49513 -272633 -488444 -508767 -345201 -358215 -517231
10193e17231j93092k06126K70409K75104M9457J28744p5042j7333K3445j09948
$$ -517231 -710323 -916449 -646040 -370936 -321479 -192735 -267777 -285110 -261665 -371613
10183c71613j4016j85739j53212j7537m5019P8949J17664J06858J95443p2101
$$ -371613 -385629 -571368 -724580 -742117 -787136 -708187 -590523 -483665 -288222 -360323
10173c60323k18347L4983J46631K32734J03848j28309r7749k17321k84363J47552
$$ -360323 -578670 -543687 -397056 -164322 -60474 -188783 -286532 -503853 -788216 -640664
10163f40664J54602j08982M345O8290r0228J16789J78017l5297k39663j16566
$$ -640664 -486062 -595044 -590699 -522409 -612637 -495848 -317831 -353128 -592791 -709357
10153g09357Q2147m0436K3327J06720o5271m7727R6174J19140m1395j53071r9519
$$ -709357 -627210 -667646 -644319 -537599 -602870 -650597 -554423 -435283 -476678 -629749 -729268
10142g29268N1870K30561N22016K47950j09630j66465P949L2813L304m5311N1202
$$ -729268 -677398 -446837 75179 323129 213499 47034 54983 87796 91100 45789 96991
10131I6991K15298J84602L62724N23956N50430Q44774P91394M82196P24463J206565
$$ 96991 312289 496891 859615 1383571 1934001 2778775 3570169 4052365 4776828 5983393
10121E983393J813371K325386K867581L269262K061172q59808k811691l010881
$$ 5983393 7796764 10122150 12989731 16258993 18320165 17460357 14648666 11637785
10113A1637785k797534k191680j267401p76936n92620l95307m17395o19545m25242
$$ 11637785 8840251 6648571 5381170 4604234 4011614 3616307 3198912 2579367 2154125
10104B154125j69748j23167K0853n0182k32156m50273l39902n4254o4395p6077
$$ 2154125 1984377 1861210 1882063 1831881 1599725 1149452 809550 755296 690901 614824
10094F14824p4257k36703r3723k10001j96716K40428K95766K21097L4907J09093
$$ 614824 540567 303864 210141 140 -196576 43852 339618 560715 595622 704715
10084G04715J12230o941r0151j30828K8370o4276k43674j64884N395K66090L19352
$$ 704715 816945 810004 719853 589025 617395 553119 309445 144561 149956 416046 735398
10073G35398O7331j13589k12067O9751P5774k09324k76308l04691j59874Q939
$$ 735398 802729 689140 477073 546824 622598 413274 136966 -167725 -327599 -318660
10063c18660J62732m1176q962N5998N3070P3691N7045L9268J9065J05461M6327
$$ -318660 -155928 -197104 -206066 -150068 -96998 -23307 33738 73006 92071 197532 243859
10052B43859l9696L4811j32205j05777N0208J36300L8375j4496j78250m1278K70416
$$ 243859 204163 238974 106769 992 51200 187500 225875 211379 33129 -8149 262267
10041B62267J74485P3089L1535k12597l21497K0522J20720j59426j17946O9786
$$ 262267 436752 509841 541376 328779 7282 27804 148524 -10902 -128848 -59062
10031e9062j49185j64308p9057l1083Q2121N5004j0579k9082r35j3438N7538P3297
$$ -59062 -208247 -372555 -451612 -482695 -400574 -345570 -356149 -385231 -386166 -399604 -342066 -268769
10019b68769j57794k71569k40853j18232J31516L76461L63420J65562q3207n5349
$$ -268769 -426563 -698132 -938985 -1057217 -925701 -549240 -185820 -20258 -103465 -158814
10009a58814R2951n8618k83479l7341K27369K32341J50554K72j99780k30094o4210
$$ -158814 -65863 -124481 -407960 -445301 -217932 14409 164963 165235 -34545 -264639 -328849
9998c28849J68379J05858M1571P2466k8659n2610l4212o0642J15610J84831K2118
$$ -328849 -160470 -54612 -13041 59425 30766 -21844 -56056 -116698 -1088 183743 205861
9987B05861r3183q3937n6760j10369m4676J01719j04548j45827J37030P5693p3529
$$ 205861 112678 28741 -28019 -138388 -183064 -81345 -185893 -331720 -194690 -118997 -192526
9976a92526j31762l3595N2614J93568M5761j75386k22781J9806J97173q872o1289
$$ -192526 -324288 -357883 -305269 -111701 -65940 -241326 -464107 -444301 -247128 -256000 -317289
$$ [...]
##END NTUPLES=NMR SPECTRUM
##END=
