##TITLE=C13_SL-84-Dau(f9-f2)
 CDCL3, sc
 3.6.2021
##JCAMPDX= 6.0         $$ Bruker NMR JCAMP-DX V2.0
##DATA TYPE= NMR SPECTRUM
##DATA CLASS= NTUPLES
##ORIGIN= UXNMR, Bruker Analytische Messtechnik GmbH
##OWNER= root
$$ XWIN-NMR		Version 3.5
$$ Fri Jun  4 09:38:42 2021 Russian Standard Time (UT+4h)  she@DPX200
##.OBSERVE FREQUENCY= 50.3277607988526
##.OBSERVE NUCLEUS= ^13C
##.ACQUISITION MODE= SIMULTANEOUS
##.ACQUISITION SCHEME= undefined
##.AVERAGES= 15615
##.DIGITISER RES= 17
##SPECTROMETER/DATA SYSTEM= spect
##.PULSE SEQUENCE= zgpg30
##.SOLVENT NAME= CDCl3
##.SHIFT REFERENCE= (INTERNAL, CDCl3, 0, 219.126)
##AUDIT TRAIL= $$ (NUMBER, WHEN, WHO, WHERE, WHAT)
$$ ##TITLE= Audit trail, XWIN-NMR		Version 3.5
$$ ##JCAMPDX= 5.01
$$ ##ORIGIN= Bruker BioSpin GmbH
$$ ##OWNER= she
$$ F:/spectra/data/she/nmr/C13cpd-SL-67-Dau(f5)/1/pdata/1/auditp.txt
$$ ##AUDIT TRAIL=  $$ (NUMBER, WHEN, WHO, WHERE, WHAT)
(   1,<2021-06-04 09:24:21.70 +0400>,<she>,<DPX200>,
      <created by zg, POWCHK disabled, PULCHK disabled
       configuration hash MD5:
       00 E9 B6 7A A2 85 ED C7 34 08 36 98 17 FE 4E 26
       data hash MD5: 32K
       B0 FD 62 B0 99 FE 09 F3 A9 E8 33 FE DF B3 A5 06>)
(   2,<2021-06-04 09:32:13.06 +0400>,<she>,<DPX200>,
      <Start of raw data processing
       efp BC_mod = 2 LB = 1 FT_mod = 6 PKNL = 1 STSR = 0 STSI = 32K PHC0 = -216.224 PHC1 = 34.50854 SI = 32K 
       data hash MD5: 32K
       40 F1 E8 47 A1 91 CF 1B 1C 1C B9 A6 8D CF 85 88>)
(   3,<2021-06-04 09:32:46.42 +0400>,<she>,<DPX200>,
      <abs ABSG = 5 
       data hash MD5: 32K
       0F D1 C6 DD 50 DA AC 7A 1E 3B AB 16 12 66 E4 B2>)
(   4,<2021-06-04 09:33:23.06 +0400>,<she>,<DPX200>,
      <abs ABSG = 5 
       data hash MD5: 32K
       82 A3 0C 7C E7 7B F9 87 F6 6E 63 BD 11 8A 86 BA>)
(   5,<2021-06-04 09:33:36.34 +0400>,<she>,<DPX200>,
      <pk PHC0 = -5.046936 PHC1 = 0 
       data hash MD5: 32K
       C7 9A CE 26 60 32 35 D9 C3 BA 51 E4 91 FE 72 3A>)
(   6,<2021-06-04 09:34:43.48 +0400>,<she>,<DPX200>,
      <pk PHC0 = 17.40145 PHC1 = -21 
       data hash MD5: 32K
       C0 99 37 15 FF 01 8E 10 06 9A 7B 13 0F 97 BE 10>)
(   7,<2021-06-04 09:35:37.00 +0400>,<she>,<DPX200>,
      <abs ABSG = 5 
       data hash MD5: 32K
       A5 5D 77 AB 1E 53 03 02 AE 2A 1D FA 42 BB 46 16>)
$$ ##END=
$$ 
$$ hash MD5
$$ 32 8C 7B F3 7A CB 21 BF CF 71 30 1A 6A 17 4F 2B
##$RELAX= 
##$RELAX= 
##$RELAX= 
##$RELAX= 
##$RELAX= 
##$RELAX= 
##$RELAX= 
##$RELAX= 
$$ Bruker specific parameters
$$ --------------------------
##$DU= <F:/spectra>
##$EXPNO= 1
##$NAME= <C13cpd-SL-67-Dau(f5)>
##$PROCNO= 1
##$TYPE= <nmr>
##$USER= <she>
##$AMP= (0..31)
100 100 100 100 100 100 100 100 100 100 100 100 100 100 100 100 100 100 
100 100 100 100 100 100 100 100 100 100 100 100 100 100 
##$AQSEQ= 0
##$AQ_mod= 1
##$AUNM= <au_zg>
##$AUTOPOS= <>
##$BF1= 50.322729
##$BF2= 200.13
##$BF3= 50.322729
##$BF4= 50.322729
##$BF5= 500.13
##$BF6= 500.13
##$BF7= 500.13
##$BF8= 500.13
##$BYTORDA= 1
##$CFDGTYP= 0
##$CFRGTYP= 5
$$ [...]
##$SUBNAM3= <"">
##$SUBNAM4= <"">
##$SUBNAM5= <"">
##$SUBNAM6= <"">
##$SUBNAM7= <"">
##$SUBNAM8= <"">
##$SUBNAM9= <"">
##$SW= 238.246396889851
##$SWIBOX= (0..15)
0 1 3 0 0 0 0 0 0 0 0 0 0 0 0 0 
##$SW_h= 11990.4076738609
##$TD= 32768
##$TD0= 1
##$TE= 0
##$TE2= 300
##$TE3= 300
##$TEG= 300
##$TL= (0..7)
0 120 120 120 120 120 120 120 
##$TP= (0..7)
150 150 150 150 150 150 150 150 
##$TP07= 0
##$TPNAME0= <>
##$TPNAME1= <>
##$TPNAME2= <>
##$TPNAME3= <>
##$TPNAME4= <>
##$TPNAME5= <>
##$TPNAME6= <>
##$TPNAME7= <>
##$TPOAL= (0..7)
0.5 0.5 0.5 0.5 0.5 0.5 0.5 0.5 
##$TPOFFS= (0..7)
0 0 0 0 0 0 0 0 
##$TUNHIN= 0
##$TUNHOUT= 0
##$TUNXOUT= 0
##$USERA1= <user>
##$USERA2= <user>
##$USERA3= <user>
##$USERA4= <user>
##$USERA5= <user>
##$V9= 5
##$VALIST= <valist>
##$VCLIST= <CCCCCCCCCCCCCCC>
##$VD= 0
##$VDLIST= <DDDDDDDDDDDDDDD>
##$VPLIST= <PPPPPPPPPPPPPPP>
##$VTLIST= <TTTTTTTTTTTTTTT>
##$WBST= 1024
##$WBSW= 20
##$XGAIN= (0..3)
0 0 0 0 
##$XL= 0
##$YL= 0
##$YMAX_a= 61026846
##$YMIN_a= -148821507
##$ZGOPTNS= <>
##$ZL1= 120
##$ZL2= 120
##$ZL3= 120
##$ZL4= 120
##$ABSF1= 219.1257
##$ABSF2= -19.14452
##$ABSG= 5
##$ABSL= 3
##$ALPHA= 0
##$AQORDER= 0
##$ASSFAC= 0
##$ASSFACI= 0
##$ASSFACX= 0
##$ASSWID= 0
##$AUNMP= <proc_1d>
##$AZFE= 0.1
##$AZFW= 0.5
##$BCFW= 0
##$BC_mod= 2
##$BYTORDP= 0
##$COROFFS= 0
##$CY= 12.5
##$DATMOD= 1
##$DC= 0
##$DFILT= <>
##$DTYPP= 0
##$F1P= 99.9999945759776
##$F2P= -179.999992907048
##$FCOR= 0.5
##$FTSIZE= 32768
##$FT_mod= 6
##$GAMMA= 0
##$GB= 0
##$INTBC= 1
##$INTSCL= 0
##$ISEN= 30
##$LB= 1
##$LEV0= 0
##$LPBIN= 0
##$MAXI= 10000
##$MC2= 0
##$MEAN= 0
##$ME_mod= 0
##$MI= 0
##$NCOEF= 0
##$NC_proc= 4
##$NLEV= 6
##$NOISF1= 0
##$NOISF2= 0
##$NSP= 0
##$NTH_PI= 0
##$NZP= 0
##$OFFSET= 219.1257
##$PC= 1.4
##$PHC0= -203.8695
##$PHC1= 13.50854
##$PH_mod= 1
##$PKNL= yes
##$PPARMOD= 0
##$PSCAL= 4
##$PSIGN= 0
##$REVERSE= no
##$SF= 50.322729
##$SI= 32768
##$SIGF1= 0
##$SIGF2= 0
##$SINO= 80
##$SIOLD= 32768
##$SREGLST= <13C.CDCl3>
##$SSB= 0
##$STSI= 32768
##$STSR= 0
##$SW_p= 11990.4076738609
##$SYMM= 0
##$S_DEV= 0
##$TDeff= 32768
##$TDoff= 0
##$TI= <>
##$TILT= no
##$TM1= 0
##$TM2= 0
##$TOPLEV= 0
##$USERP1= <user>
##$USERP2= <user>
##$USERP3= <user>
##$USERP4= <user>
##$USERP5= <user>
##$WDW= 1
##$XDIM= 32768
##$YMAX_p= 487947256
##$YMIN_p= -3121178
$$ End of Bruker specific parameters
$$ ---------------------------------
##NTUPLES= NMR SPECTRUM
##VAR_NAME=  FREQUENCY,     SPECTRUM/REAL,   SPECTRUM/IMAG
##SYMBOL=    X,             R,               I
##VAR_TYPE=  INDEPENDENT,   DEPENDENT,       DEPENDENT
##VAR_FORM=  AFFN,          ASDF,            ASDF
##VAR_DIM=   32768,         32768,           32768
##UNITS=     HZ,            ARBITRARY UNITS, ARBITRARY UNITS
##FACTOR=    0.365929370215793, 1,           1
##FIRST=     11027.0033138647, 0,            0
##LAST=      -963.404359996184, 0,           0
##MIN=       -963.404359996184, -3121178,    0
##MAX=       11027.0033138647, 487947256,    0
$$ Real data points
##PAGE= N=1
##DATA TABLE= (X++(R..R)), XYDATA
$$ [...]
16248a232059N13108O13002k12173m85308N9742J89580K84785K6784n79238k85748
16238a107525K97547K52366J41819l78997o0529M82910j89215k12970j73403k7862
16228i75859J95612N21857L15984p8751k66968j94028j98543k33123n12368o7479
16218a493666L51420J42185K10313j13743q4493K8526k30062j10317N21904M89741
16208b88192O6256M54249N1588l08818m63641k79784r230K36362J4994Q0302q2054
16197e27968l52141k63476J14804K04167Q73445R79337k23216j012893o93095
16188i01036O4153L06032k24697K74721P37568J35513J13065J84189k36616o71987
16178b19095k57481Q9614p1178n31968k63811K46686K0408P7604K72448J67297
$$ plain form
16248 -1232059 -718951 -105949 -318122 -803430 -743688 -554108 -269323 -242539 -821777 -1107525
16238 -1107525 -809978 -557612 -415793 -794790 -855319 -372409 -561624 -774594 -947997 -975859
16228 -975859 -780247 -258390 57594 -21157 -288125 -482153 -680696 -913819 -1426187 -1493666
16218 -1493666 -1142246 -1000061 -789748 -903491 -987984 -959458 -1189520 -1299837 -777933 -288192
16208 -288192 -221936 232313 283901 -24917 -488558 -768342 -777572 -541210 -526216 -445914 -527968
16197 -527968 -880109 -1143585 -1028781 -824614 48831 1028168 804952 -207941 -901036
16188 -901036 -836883 -530851 -755548 -480827 256741 392254 505319 689508 452892 -219095
16178 -219095 -476576 -386962 -458140 -990108 -1253919 -1007233 -986825 -909221 -636773 -469476
16168d69476n88473m49060J43743M85022L12769L93819M61499R0693l63790m21606
16158d04860R9464O5864M67351L1957k24333K96300K62621o7236j42065m61975
16148g6912l29297J52180O23790N6006o5668J47449k12161n36217p2044K82524
16138c0350K49016p3351J96057J54384m1195m0286n36640m79582k83978l36806
16128a222731M68670O91763P4560k79315m37016M5038K96980Q04583Q14911M27327
16118A684770K2372n91196p26696j53943m91723m83207J08333L53257N2641J52830
16108g2562K9246N5818J43777k35383L92019N78243J14857j69903j75899R4694
16098G54907N8900j95355k83311P2542j5753m61112m76111j51801K33257k05497
$$ plain form
16168 -469476 -1057949 -1507009 -1363266 -878244 -565475 -171656 289843 380536 16746 -404860
16158 -404860 -305396 -239532 227819 259776 35443 331743 594364 527128 385063 -76912
16148 -76912 -406209 -254029 369761 425767 360099 507548 295387 -240830 -312874 -30350
16138 -30350 218666 145315 341372 495756 454561 414275 -122365 -601947 -885925 -1222731
16128 -1222731 -754061 -62298 12262 -267053 -704069 -659031 -362051 442532 1257443 1684770
16118 1684770 1707142 1115946 389250 235307 -256416 -739623 -631290 -278033 -225392 -72562
16108 -72562 -43316 12502 156279 -79104 312915 891158 1006015 836112 660213 754907
16098 754907 813807 618452 335141 407683 391930 -69182 -545293 -697094 -463837 -669334
16088f69334J35058L10378k65597k19327L7623O8394K53808P30869J77733m80926
16078G8679m11288O8676j99836p72186n37242N16357P94864q1487m610O01527
16068E3454L49129K67913o37k9329M11833K85999O7427n58149k95545l37916l79897
16057a65718M05639P59172O45337K85106J13500J01404m45677p33346l24560J56564
16047G97421J0003p35228q35656k32928P7840l476Q5996K43009K42393K45530
16037a05096N30663r5656k53602K14748K82267J15095j44264l82063p12663n41497
16027a092068k84682J39639L62630o7130M2517M72093J89827o187K61116J28592
16017A46347L4033J02896J79164j62210j70539K21926M38503k86066l29953M0925
$$ plain form
16088 -669334 -534276 -223898 -489495 -708822 -671199 -602805 -348997 381872 559605 78679
16078 78679 -332609 -263933 -463769 -1235955 -1773197 -1256840 -461976 -543463 -548073 53454
16068 53454 402583 670496 669859 640530 1052363 1338362 1405789 847640 552095 214179 -165718
16057 -165718 239921 999093 1644430 1929536 2043036 2144440 1698763 965417 640857 797421
16047 797421 807424 72196 -763460 -996388 -918548 -922024 -836028 -593019 -350626 -105096
16037 -105096 425567 329911 76309 291057 573324 688419 544155 162092 -550571 -1092068
16027 -1092068 -1376750 -1237111 -874481 -941611 -899094 -427001 -237174 -243361 17755 146347
16017 146347 180380 283276 462440 300230 129691 351617 790120 504054 174101 215026
16007B15026j64151k78207j83203l08615l96060M60389O36191j44361n9679M36788
15997B14118o9727o15726m16798L54303R02526L79844J15023k999l57177o69370
15987a65983k6486j76639l16736L14042J40111J13600o11136n71523l72866L30939
15977a342677J53384k28650k50835l71350j55669K83604K11459m9082J80368K28722
15967a340726J88066K77746J38606j52160j24762O4909L302J19825M13785L63025
15957d8384l97404l61088j14074K54443K02696q688P3715J39755K34302O63905
15947F39178J10859j30132J48264k12484m5078L00443K33671r2908l3211J47525
15937A066127k717l6900o91248l98082J36129M7318j67111k58039j81622J02228
$$ plain form
16007 215026 50875 -227332 -410535 -719150 -1115210 -654821 -18630 -162991 -222670 214118
15997 214118 144391 -471335 -888133 -533830 368696 748540 863563 860564 503387 -165983
15987 -165983 -192469 -369108 -685844 -371802 -231691 -118091 -729227 -1300750 -1673616 -1342677
15977 -1342677 -1189293 -1417943 -1668778 -2040128 -2195797 -1912193 -1700734 -1749816 -1569448 -1340726
15967 -1340726 -1152660 -874914 -736308 -888468 -1013230 -948321 -945019 -825194 -411409 -48384
15957 -48384 -445788 -806876 -920950 -666507 -463811 -472499 -398784 -259029 -24727 639178
15947 639178 750037 619905 768169 555685 510607 811050 1044721 951813 918602 1066127
15937 1066127 1063410 1026510 335262 -62820 73309 120627 -46484 -304523 -486145 -383917
15927c83917J69732l77203m0059N12556P4392l17189k86602n36815j00652L88459
15917h97298J21425k55613K41716J67580J15922K7425J18953m63713j98851N34706
15907d87748K53994J02287j60393J277N28997K41099M68606K45084J43022M31464
15897A767689j98508k13987k16089m25110m04144j93530L9478m24025j73589N53498
15887A11683J82797K871k42089n12023N35802N26300k04371p87666M1316Q33084
15877D87704K46053K21122Q0310l21559j54201k53790q8306K61444k43817m60759
15867b25799l41625k49801J48441N37124J61478K63324Q0053l53163n07677j11446
15857e99091J12582j0593r310k35648l72768k29036j12509K10110K73684j2943
$$ plain form
15927 -383917 -214185 -591388 -631447 -118891 -44499 -361688 -648290 -1185105 -1285757 -897298
15917 -897298 -775873 -1031486 -789770 -622190 -506268 -478843 -359890 -823603 -1022454 -487748
15907 -487748 -233754 -131467 -291860 -290583 238414 479513 948119 1193203 1336225 1767689
15897 1767689 1569181 1355194 1139105 713995 309851 116321 155799 -268226 -441815 111683
15887 111683 294480 297351 55262 -456761 79041 605341 400970 -386696 -345380 487704
15877 487704 733757 954879 1035189 713630 559429 305639 217333 478777 234960 -225799
15867 -225799 -567424 -817225 -668784 -131660 29818 293142 373195 20032 -487645 -599091
15857 -599091 -486509 -497102 -506412 -742060 -1114828 -1343864 -1456373 -1246263 -972579 -985522
15847i85522M64930O4572p887j56967j65091O30719P43066n2983j27808J31657
15837E38686J73957l42205p65070j43539O13851L00286J30659j91170O2529J80718
15827E58702q0352J66010n5701m05151n59402n29379j90819L02179Q2045R6814
15817f15054J54908J75087K50185j31142m78947m84320k90651M36878M53693O3047
15807d66316K21702L38454k26673j38890l8910n52873m53834l47638q7382L93796
15797a358564O93079K25306o51630m16151K07316L44404K78122K50120Q9423k2838
15787c61413J03805K37889M45482J28728j1206k9512j43525k5647K38651q887
15777E74365j25852j87004J04083K03079n55067l10203M3701k41852o961N71311
$$ plain form
15847 -985522 -520592 -456020 -463907 -620874 -785965 -155246 587820 534837 407029 538686
15837 538686 712643 370438 -394632 -538171 75680 375966 506625 315455 377984 558702
15827 558702 478350 644360 588659 183508 -375894 -905273 -1096092 -793913 -711868 -615054
15817 -615054 -460146 -285059 -34874 -166016 -644963 -1129283 -1419934 -983056 -529363 -466316
15807 -466316 -244614 93840 -132833 -271723 -310633 -863506 -1317340 -1664978 -1752360 -1358564
15797 -1358564 -665485 -440179 -1091809 -1507960 -1300644 -956240 -678118 -427998 -338575 -361413
15787 -361413 -257608 -19719 425763 554491 543285 513773 370248 344601 583252 574365
15777 574365 448513 261509 365592 568671 13604 -296599 -252898 -494750 -501711 69600
15767F9600L08512J04229p4244j32926p8968K50899j9153m5715L766r5682l97030
15756a06712j44726J2375k40983J15816L98335J80921k49159l0116J67052L29126
15746D31929L39909k41252n93675m71866j45548M70251M15031q2752n9954O73889
15736G35962P76865l8551n27529p16381m08333k79708J47979P45364R3296k59763
15726B69201k36655j45578l71704o95281l50905J14668J94600j64035j08176M39051
15716a054814O30766M16475Q9395l29441o67286k68787m2582l1733K31483L09051
15706g17473M40992K82861L01274L89921L32103K58683m15482l26350P0424k65298
15696C51655n18349j12130L93654k0361J53949K64641l81627n14604K8039J68740
$$ plain form
15767 69600 378112 482341 408097 275171 196203 447102 427949 382234 386000 290318 -106712
15756 -106712 -251438 -239063 -480046 -364230 34105 215026 -34133 -64249 102803 431929
15746 431929 771838 530586 -63089 -534955 -680503 -210252 204779 122027 62073 735962
15736 735962 1512827 1474276 946747 230366 -177967 -457675 -309696 435668 528964 269201
15726 269201 32546 -113032 -484736 -1180017 -1530922 -1416254 -1221654 -1385689 -1493865 -1054814
15716 -1054814 -424048 -7573 81822 -247619 -914905 -1183692 -1226274 -1258007 -1026524 -717473
15706 -717473 -276481 6380 307654 697575 1029678 1288361 872879 546529 616953 351655
15696 351655 -166694 -278824 114830 94469 248418 513059 131432 -383172 -355133 -186393
15686a86393J04277K29363O30878k24149n57072J25214l9325j06908l08813l9967
15676c72895L04369L91748J81379l75991m52018k55158J5045J82829J84567L9476
15666a56649J4984O8556k89163m12554O4278N04818L97832k10761j09796p17973
15656h46428r44873K24952O07878M99309L92852m1799J8303j17742N0806q0853
15646b37595l73827l04876n20456M924P42154K91479m2347P1541K99625K57100
15636A87722J61852N2480J69057J11497j03401o66404p34009n34168m75534q5033
15626a915941L08470J08415K16677O02073L43132j32160m31399j38281O38170
15617d00844K33927l08385m22510k38509K10862K90451N58380N26404P00160K08049
$$ plain form
15686 -186393 -82116 147247 778125 553976 -3096 122118 82793 -24115 -332928 -372895
15676 -372895 -68526 323222 504601 128610 -323408 -578566 -563521 -380692 -196125 -156649
15666 -156649 -141665 -73109 -362272 -774826 -710548 -205730 192102 -18659 -128455 -846428
15656 -846428 -1791301 -1566349 -958471 -459162 -66310 -108109 -89806 -207548 -156742 -237595
15646 -237595 -611422 -916298 -1436754 -1431830 -689676 -398197 -440544 -369003 -69378 187722
15636 187722 349574 402054 571111 682608 579207 -87197 -821206 -1355374 -1830908 -1915941
15626 -1915941 -1607471 -1499056 -1282379 -680306 -337174 -469334 -900733 -1039014 -400844
15617 -400844 -166917 -475302 -897812 -1136321 -925459 -635008 -76628 449776 1149936 1357985
15607A357985j43869m04629p13628K31013M25581o5139j2898n8246J87569P953
15597H11692k61882l42759p46845k55926r1826J8460K16059K94530J49183K23564
15587A4250J59039j93644r0030l72613j80562o3910L72655N44300M16324N37298
15577A143107R6946n74678p32655l06175k53239k16196J58642K18654o3941m20391
15567i49926K13715M69438K31931n0258l19401k10306K35532K02540M4814M5809
15557h6112K26494L99531Q4250o92699o72568j09679N42398L502j01732K76321
15547a30294j31491k68112m991J76323L30597L9999j26959j35030O537L18526
15537G5105J7358O920M5935J77164J56073l0470l74734n86518o07400R0601j01532
$$ plain form
15607 1357985 1214116 809487 95859 326872 752453 687314 674416 616170 803739 811692
15597 811692 549810 207051 -539794 -795720 -887546 -869086 -653027 -358497 -209314 14250
15587 14250 173289 -20355 -110385 -482998 -663560 -727470 -354815 189485 605809 1143107
15577 1143107 1240053 665375 -67280 -373455 -626694 -842890 -684248 -465594 -529535 -949926
15567 -949926 -736211 -266773 -34842 -85100 -404501 -614807 -379275 -176735 -131921 -86112
15557 -86112 140382 539913 624163 -68536 -741104 -850783 -308385 -304883 -406615 -130294
15547 -130294 -261785 -529897 -534888 -358565 -27968 12031 -114928 -249958 -243421 75105
15537 75105 92463 99383 145318 322482 478555 448085 73351 -513167 -1120567 -1029966 -1131498
15526a131498j86843K69269o0536k00803j84345M87873K37611j63660k31453l03541
15516a467926m92780J09869Q25111N04174J1854M70282L68639j83196l58583m51277
15506f63833j95423r5704J96158P35000K61814J04923M76427L15590l7939l33428
15496G63585j95367j75330n47768l30890L09017M53359l85655m41223J7092p2627
15486f05807k19659R6736J77421J0278o6558J98309L03218K91016M7259l14556
15476h2343m19741p02153j53184M71863J19099p7473j57961K57640N58404j3141
15466a98990n5691J93888M27212L1092o14321j91256J74014p9736r6982j08561
15456e19331k27147r3478J31266n0318j01555j22572R4373N84479M49141J7987
$$ plain form
15526 -1131498 -1318341 -1049072 -1109608 -1310411 -1494756 -1006883 -769272 -932932 -1164385 -1467926
15516 -1467926 -1960706 -1850837 -1025726 -521552 -509698 -39416 329223 146027 -212556 -663833
15506 -663833 -859256 -954960 -758802 -23802 238012 342935 819362 1134952 1097013 763585
15496 763585 568218 392888 -154880 -485770 -176753 276606 -109049 -550272 -533180 -605807
15486 -605807 -825466 -728730 -551309 -541031 -607589 -409280 -106062 184954 232213 -82343
15476 -82343 -502084 -1204237 -1357421 -885558 -766459 -843932 -1001893 -744253 -185849 -198990
15466 -198990 -254681 -60793 366419 397511 -216810 -408066 -234052 -313788 -410770 -519331
15456 -519331 -746478 -839956 -708690 -759008 -860563 -983135 -888762 -304283 144858 162845
15446A62845J95165J0924n37175l28707p3562K34917L8907o32458n92831K66178
15436a255797L29987M11922N52746K62272L72157k37535n61822k57860J37657
15427b46273J94236L0302k44554j46627j78618j93449N82817P41148j37823k39885
15417A61274j31948j99176m81101o69700j41574N46498O59887K54763j34990m92632
15407f28699l15499K89579j11780j06963O0126m35182P96K09737M05741M22048
15397b10096J75057K42930J5766r0438J49290J60220J5025J293O7670m3615j98889
15386B84213l92179o46198n96481k45169P1214N04248j01454l46826l41210O09927
15376a199915J344703L7151m30098o28297l89258L81381M35599J83428J16444
$$ plain form
15446 162845 358010 368934 -168241 -496948 -570510 -335593 -296686 -929144 -1521975 -1255797
15436 -1255797 -925810 -513888 38858 301130 673287 435752 -126070 -383930 -246273
15427 -246273 -52037 -21735 -266289 -412916 -591534 -784983 -202166 538982 401159 161274
15417 161274 29326 -169850 -650951 -1320651 -1462225 -915727 -255840 -1077 -136067 -628699
15407 -628699 -944198 -654619 -766399 -873362 -813236 -1248418 -1247622 -1037885 -632144 -210096
15397 -210096 -35039 207891 223657 133219 282509 442729 457754 459047 526717 483102 284213
15386 284213 -107966 -754164 -1350645 -1595814 -1524600 -1020352 -1121806 -1468632 -1809842 -1199915
15376 -1199915 144788 181939 -248159 -876456 -1265714 -884333 -448734 -265306 -148862
15367a48862j99516J99395N14630O79876M90180k82333L0757k6509k38275k76197
15357G43146l87456k55121j7440p894l31255o33047j7176M86665L42290K7248
15347e0040j94267k73846K08203J59578l99517k29113O0004L31332j35161n3338
15337e76165M94738L67620l23260l17821k00667J2246K75783J16260l01740j56542
15327f09548J62054n8883l4648K68235J6433J13526M48533k77492o35612n21923
15317a129325k32984L06428L43451K54174l32099M0913K42696O56956N23618k96914
15307C76914n13581n1294p2076J34882L39924M33740r5829j93596K2128J72865
15297E54077J98269m32738m14224l57815K535M12891K40418J15867L06935M25616
$$ plain form
15367 -148862 -348378 -148983 365647 1045523 1535703 1253370 1284127 1257618 1019343 743146
15357 743146 355690 100569 83129 75235 -256020 -889067 -906243 -419578 -77288 -50040
15347 -50040 -244307 -518153 -309950 -150372 -549889 -779002 -718998 -387666 -522827 -576165
15337 -576165 -81427 286193 -37067 -354888 -555555 -543309 -267526 -151266 -453006 -609548
15327 -609548 -447494 -506377 -541025 -272790 -256357 -142831 305702 28210 -607402 -1129325
15317 -1129325 -1362309 -1055881 -712430 -458256 -790355 -749442 -506746 150210 673828 376914
15307 376914 -136667 -187961 -260037 -125155 214769 648509 552680 359084 381212 554077
15297 554077 752346 319608 -94616 -452431 -449896 -37005 203413 319280 626215 1051831
15287A051831k13688p63489M1961R0871K55074N29918J52112o35251l85219k88288
15277a64168J14222L4327l52141L46651J177837L82042o4239j53514m09320P3736
15267I85433J16418k24030m79975l15426n5596o8183n34451k57725K80572J88395
15257c64568j2439J72892K65009J33866l72988m67296j52990K38168p053K20894
15247c46505P51444K50987k27207l82576l23149j020552p31678l53579O88360
15238a694455R03331N00423O38045L13157j37842o86164p26163j99153J80291
15229i08530j85626l11098j5718P90008M96432J00844L78579N18846P1142l67965
15219E66914l30271m34609p68025j3420R36487O56993k77028o27134p44231p46242
$$ plain form
15287 1051831 838143 74654 116615 207486 462560 992478 1144590 509339 124120 -164168
15277 -164168 -49946 -15619 -367760 -21109 1156728 1538770 1474531 1321017 911697 985433
15267 985433 1101851 877821 397846 82420 26824 -41359 -575810 -833535 -552963 -364568
15257 -364568 -377007 -204115 60894 194760 -178228 -645524 -798514 -560346 -567399 -346505
15247 -346505 404939 655926 428719 46143 -277006 -1297558 -2029236 -2382815 -1694455
15238 -1694455 -791124 -290701 347344 660501 522659 -163505 -889668 -1088821 -908530
15229 -908530 -1094156 -1405254 -1420972 -630964 -134532 -33688 344891 863737 934879 566914
15219 566914 236643 -197966 -965991 -979411 -42924 614069 337041 -290093 -1034324 -1780566
15209a780566j29486M90411N38972N13662R4609j13609k35103l19753J41507N0662
15199g48694m10656J00574J79254p2581l1046n0363J34341M04806R1547K6769
15189c76049r6221l64380o37789o72301m51488J025706J492031P43589J02218
15180G65316o56109o64987l67809l4043J04644R776j43649L33427P53382O01552
15170G01500M43665K40547j46598o52618m89631k33113j08602n14098j63866N88555
15160c34259q2473p60030k3635L34006Q7459J51680N60049K53581J60639J60907
15150E07924j98130O0496j78351j61241j92738K1614O4985n13591j55145M64421
15140b79756N3030j76271K16433j47739j4612p6278n54677k42967L44142K43562
$$ plain form
15209 -1780566 -1910052 -1419641 -880669 -367007 -272398 -386007 -621110 -940863 -799356 -748694
15199 -748694 -1159350 -1058776 -879522 -952103 -983149 -1033512 -899171 -494365 -402818 -376049
15189 -376049 -472270 -836650 -1474439 -2146740 -2598228 -1572522 -80491 663098 765316
15180 765316 109207 -555780 -923589 -957632 -852988 -843212 -986861 -653434 99948 701500
15170 701500 1145165 1385712 1239114 586496 96865 -136248 -244850 -758948 -922814 -334259
15160 -334259 -416732 -1176762 -1200397 -866391 -778932 -627252 -67203 186378 347017 507924
15150 507924 309794 370290 191939 30698 -162040 -140426 -75441 -589032 -744177 -279756
15140 -279756 -226726 -402997 -186564 -334303 -348915 -425193 -979870 -1222837 -878695 -635133
15130f35133L7857J71465O44188k5896q67681o56534l82348j36717N748K43724
15120a601327K89764K00538n1818M66010P91247N08744L2671J91523j24455n31156
15110A71741o99798n31059n0109J07939K4793K4897j61706j83604O7614M49231
15100g80061O84310O95501p8005Q8969M29024K52352q2340k49458o2419j19459
15090G78414J82774P8388p37852q24189m93420r5585j61553M45291P66824M00745
15080C39837l3126L12690j1049k70813n20533q59066k46266N51114K99379L03878
15070a33955N11463k7087p2351J87152j72413n10944K48380L84210M26469j57491
15060F83433j33797K81657J69526M80345M76462m82959j117847q43984l28592
$$ plain form
15130 -635133 -597276 -425811 218377 192481 -675200 -1331734 -1714082 -1850799 -1845051 -1601327
15120 -1601327 -1311563 -1111025 -1162843 -696833 94414 603158 635829 827352 702897 171741
15110 171741 -528057 -1059116 -1109225 -1001286 -976493 -951596 -1113302 -1296906 -1229292 -780061
15100 -780061 -95751 599750 521745 610714 1039738 1292090 1209750 960292 897873 778414
15090 778414 961188 1039576 301724 -522465 -1015885 -1111470 -1273023 -827732 -60908 339837
15080 339837 306711 619401 608352 337539 -182994 -1042060 -1288326 -737212 -437833 -133955
15070 -133955 377508 350421 278070 465222 292809 -218135 30245 414455 840924 683433
15060 683433 549636 831293 1000819 1481164 1957626 1474667 356820 -487164 -815756
15051h15756j45282k06418M6070J29117K2160O33512N28193l47440n97341k13588
15041i66773P15713P29564r288j87401n0889n7649r930K97449L41893J69605K7156
15030I99450j92597m08817p3546j75944n2152K0994K97481L44469o07163k84420
15020a32245N32320M14232L4187J89937l31662m17714m5795J31655j84559j70632
15010A9724o26965m14199N99861O17434J05128M89568K0312o97601l55841k37963
15000d80542j27896N9485K79907K37268N2450k54933k85800l2435K97142M42627
14990A87273j9338l72295k43086K37509M68336j23363k90690l05497l17820n40202
14980a319173k61211J89763M11545N35635J19053J72690L09375j0618m0515K48840
$$ plain form
15051 -815756 -961038 -1167456 -1121386 -992269 -970109 -336597 191596 -155844 -753185 -966773
15041 -966773 -251060 478504 469216 281815 230926 173277 163347 460796 802689 972294 999450
15030 999450 806853 398036 324490 148546 96394 117388 414869 759338 152175 -132245
15020 -132245 400075 814307 848494 1038431 706769 289055 243260 374915 190356 19724
15010 19724 -607241 -1021440 -421579 195855 300983 790551 810863 113262 -242579 -480542
15000 -480542 -608438 -548953 -269046 -31778 20672 -234261 -520061 -552496 -255354 187273
14990 187273 167935 -204360 -447446 -209937 258399 135036 -155654 -461151 -778971 -1319173
14980 -1319173 -1580384 -1390621 -979076 -443441 -324388 -151698 157677 147059 106544 355384
14970C55384N20010M38384K05637j17785o85491o27864m74366r8250l12586k18244
14960a015171P7851P7772K9773K53728M0611p19443p08578k80466J64685L76132
14950a703106K61030K20034K83351j53448k7304K36847Q4751j94492n83911k7805
14940a604053J77385M30617O15143J85118k8420p5426j94371o2142Q2144m47784
14930i21789J80804K86862j4598J392Q7105O75904M56255j98776j48842l61890
14920D2427m07272j02736L89391M32742J24803L4357n9303m38979n65744N909
14910e44405J66673j02903r2372Q6912N18935O81348N26014J10070J62423j60167
14900A352528K32068O85204N6245o10475k73694j99936n84840q31614n22121N24577
$$ plain form
14970 355384 875394 1313778 1519415 1401630 716139 88275 -386091 -484341 -796927 -1015171
14960 -1015171 -937320 -859548 -829775 -576047 -535436 -1254879 -1963457 -2243923 -2079238 -1703106
14950 -1703106 -1442076 -1222042 -938691 -1092139 -1119443 -882596 -797845 -992337 -1576248 -1604053
14940 -1604053 -1426668 -996051 -380908 -195790 -224210 -299636 -494007 -556149 -474005 -921789
14930 -921789 -740985 -454123 -468721 -467329 -380224 295680 751935 553159 404317 42427
14920 42427 -364845 -467581 -78190 354552 479355 513712 454409 15430 -550314 -544405
14910 -544405 -377732 -480635 -573007 -486095 32840 714188 1240202 1350272 1512695 1352528
14900 1352528 1584596 2269800 2326045 1715570 1441876 1241940 657100 -174514 -696635 -172058
14890a72058N43437L78454J86179l16477m46186p06037o01730o7904j21950k829
14880a327101P751K49444J31288L40727j1844j34599K44098M70018L10253K21002
14870E01037Q9411j28329n44191l89384K7835n0547k58885j10959Q93410Q17384
14860H46782k6264p66820l27005L19286j7028J00774J24741K70614K24094K64891
14850A014065j39784k35921n11242m29825p5756k37660l66234j2459K37629R0731
14840f66456J8079L11213J93198j58784M8463N6054q1911k44896j33507k07958
14830h66505O9380M90392M24065j90063l31950j25959Q000j311j87789j23700
14820h35440J55002J35512K54199K29916K32275j34087k15074n75932j41859K68665
$$ plain form
14890 -172058 371379 749833 936012 619535 173349 -532688 -1134418 -1202322 -1324272 -1327101
14880 -1327101 -1319350 -1069906 -938618 -597891 -609735 -744334 -500236 -30218 280035 501037
14870 501037 590448 462119 -82072 -471456 -443621 -494168 -753053 -864012 29398 846782
14860 846782 820518 53698 -273307 45979 28951 129725 254466 525080 749174 1014065
14850 1014065 874281 638360 127118 -302707 -378463 -616123 -982357 -994816 -757187 -666456
14840 -666456 -648377 -337164 -143966 -302750 -254287 -198233 -280144 -525040 -658547 -866505
14830 -866505 -797125 -306733 117332 -72731 -404681 -530640 -522640 -523951 -711740 -835440
14820 -835440 -680438 -544926 -290727 -60811 171464 37377 -177697 -753629 -895488 -626823
14810f26823J19067R4850L82639K66526r3297k7139J83040K30974J85014k01489
14800E13362l44707n21136j52466j85284k31379r7966K62052M43941O69389j06808
14790B48998m63992l23919n95912k49911M01889O73499j16830l81619j35713J1902
14780i31608K32479L40916j07499j64662l3294K3532O7121J77640M11830K48011
14770B64466O7899l87045k81929m96250q19429m80832O26226R86743P79857N15097
14760G74803M61470k54897m38519o14667m34143k04426n34876J7043O68412N49531
14750a0269j22271j91344k80328K67564K8912J81106M72049K50502j73261J51030
14740E73690J08783j45968J72913m44955k32789l02665q19889p3145O69651N85859
$$ plain form
14810 -626823 -507756 -412906 -30267 236259 142962 115823 298863 529837 714851 513362
14800 513362 168655 -352481 -504947 -690231 -921610 -1019576 -757524 -313583 355806 248998
14790 248998 -214994 -538913 -1134825 -1384736 -982847 -309348 -426178 -807797 -943510 -931608
14780 -931608 -699129 -358213 -465712 -630374 -663668 -640136 -573015 -395375 16455 264466
14770 264466 332365 -54680 -336609 -832859 -1652288 -2133120 -1506894 -520151 259706 774803
14760 774803 1236273 981376 542857 -71810 -505953 -710379 -1245255 -1228212 -559800 -10269
14750 -10269 -132540 -323884 -604212 -336648 -307736 -126630 345419 595921 422660 573690
14740 573690 682473 536505 709418 264463 31674 -270991 -1090880 -1164025 -494374 91485
14730I1485M0204o5179m0417l77193k79860k05645J58385M00344J81995K4265
14720g1616j97256k13294k7954L83910K16244J05014o5070k07997k76758k4238
14710c79015m2824m2647K5731K79419J98126L38133p8289m66311j37542j31213
14700d36432r4252J87365m9536l21114J61202L64159K11698R24q2416k29349k38500
14689e26251k45430m29684n80675k04665M92944M04700j18187k21479P9982j21066
14679a469811k4905L80925J20730K89654K21410N9247K97732M92564L95277P2041
14669H34864j18928j04015l10580J63059M11818l00879l94139K42985K47242q8334
14659E83093o55605k88809K3157M6981l30250p31806k69859L7902K74212R2128
$$ plain form
14730 91485 131689 66510 26093 -351100 -630960 -836605 -678220 -277876 -95881 -71616
14720 -71616 -268872 -482166 -510120 -126210 90034 195048 129978 -78019 -354777 -379015
14710 -379015 -421839 -464486 -438755 -159336 38790 376923 298634 -167677 -305219 -436432
14700 -436432 -530684 -343319 -392855 -713969 -552767 -188608 23090 24014 -58402 -287751 -526251
14689 -526251 -771681 -1201365 -1782040 -1986705 -1493761 -1089061 -1207248 -1428727 -1348745 -1469811
14679 -1469811 -1494716 -1113791 -993061 -703407 -481997 -422750 -125018 367546 762823 834864
14669 834864 715936 611921 301341 464400 876218 575339 181200 424185 671427 583093
14659 583093 -72512 -361321 -338164 -291183 -621433 -1353239 -1623098 -1585196 -1310984 -1218856
14649a218856L41533k31384l54641P46865Q47080M38914n2542l02376m85949k62206
14639e33562j57037K8547J80683n8955j75315Q6204K9754m72855l47889j0360
14629a430785K71753K83573O5958L87006N80282n5934j08634J23850l5006l84528
14619c02465J02885K34777P6471M77361M46913r0978J54003M33436O14633j6059
14609B130977j107774q41822l34719m74854k40456M93925P72141K02794L67567
14600I67779O07610K71344J91224r1921n82542l78300J04350l6746R8594L9846
14590A191238m4346r3391j13210O0103j32550j34708j43578M31490K89246m28474
14580H81820j091344m11970J13178l23578N51305O06416j34631k37429l22795
$$ plain form
14649 -1218856 -877323 -1108707 -1463348 -716483 130597 569511 516969 214593 -271356 -533562
14639 -533562 -690599 -662052 -481369 -540324 -715639 -629435 -599681 -1072536 -1420425 -1430785
14629 -1430785 -1159032 -875459 -809501 -422495 157787 101853 -6781 117069 82063 -302465
14619 -302465 -199580 35197 111668 589029 1035942 944964 1098967 1532403 2147036 2130977
14609 2130977 1023203 181381 -153338 -628192 -868648 -374723 397418 600212 967779
14600 967779 1575389 1846733 2037957 1946036 1363494 985194 1089544 1052798 1151392 1191238
14590 1191238 1146892 1053501 940291 1000394 867844 733136 589558 1021048 1310294 881820
14580 881820 -209524 -621494 -508316 -831894 -280589 325827 191196 -46233 -369028
14571c69028Q696P4949k3169O631N6426n35740p58605J06027J15526N25042L85586
14560d07659k72709N7527l36190l44684J30332J97040P13742J057342Q43578J27001
14550A765320K82978L95785l97337n85980m47449o68391L0184Q33271n2542o53599
14540E02240o17889p38238m80698J94491J94929N8831K4241n0862j67048j30125
14530a210128m0689N70852l3622j20928O76620O33590L89642m38827p11001j42591
14520d27082M87422M57807M78317j29166n74451j98444k8417J48981M6492m12933
14510a51474k39202N6415K08773j64297m49657M98966M48658j57534l98213l78951
14500g26516l1710J18927K24661L03106K52392J46548K0134L32514N44023m6453
$$ plain form
14571 -369028 -360332 -285383 -308552 -301921 -245495 -781235 -1539840 -1433813 -1318287 -793245 -407659
14560 -407659 -680368 -622841 -959031 -1303715 -1173383 -976343 -262601 794741 1638319 1765320
14550 1765320 2048298 2444083 2046746 1460766 1013317 344926 375110 1208381 1155839 502240
14540 502240 -115649 -853887 -1334585 -1140094 -945165 -886334 -862093 -912955 -1080003 -1210128
14530 -1210128 -1250817 -679965 -713587 -834515 -157895 475695 865337 426510 -284491 -427082
14520 -427082 60340 518147 996464 867298 292847 94403 65986 214967 261459 -151474
14510 -151474 -390676 -334261 -125488 -289785 -739442 -240476 208182 50648 -347565 -726516
14500 -726516 -758226 -639299 -414638 -111532 140860 287408 307542 640056 1184079 1137626
14490A137626p29890p17578o42053j83880P71634N89261l63906k67514O8723K85400
14480e2177L27880J80692M1156j201K24648J03231N0333J68317j14790l2700j24963
14469G70426m29460n87089j41659L90133L41733r9640L18011r8894q06985k66733
14459f10157l74399n06212k87339J85341M94653P90890N14883K09650J28913J68982
14449G15205o1667j5563J49405J96227K09833n38567o97928K70858L82622L59768
14439I70193J98343o3241k67788Q4499J91973J81993j44881j051514j202679J6597
14429a086505O45582l7435k73686o28198m46739j3784K02895M14708K96350K15892
14419g10920M61753L76153L25468m9811m846J49246m3871k29567l01410K09642
$$ plain form
14490 1137626 407736 -309842 -951895 -1135775 -364141 225120 -138786 -406300 -337577 -52177
14480 -52177 275703 456395 497551 496350 720998 824229 874562 1042879 928089 895389 770426
14469 770426 340966 -246123 -387782 2351 344084 244444 562455 463561 -343424 -610157
14459 -610157 -984556 -1490768 -1778107 -1592766 -1098113 -307223 207660 417310 546223 715205
14449 715205 653538 637975 787380 983607 1193440 654873 -43055 227803 610425 970193
14439 970193 1168536 1105295 837507 922006 1113979 1295972 1151091 99577 -1103102 -1086505
14429 -1086505 -440923 -478358 -752044 -1380242 -1826981 -1840765 -1637870 -1223162 -926812 -710920
14419 -710920 -249167 126986 452454 402643 397797 547043 503172 273605 -27805 181837
14409A81837J27633k61948Q3511L03102l04101m40958L5087K24494K20883K08716
14399C78256P1839j09264L4668m3612j9715m66597o51649l00130m03626N17760
14389i92070R56041O1976j73128R037j08563k48023J35534K54533j38109j09666
14379c52438p3691K62798J98627j21107l06743m58710J67206Q11540L82892k02850
14369C07524k09753L7867R3118M656J06583J30838J26634O0331q9616K83977O7421
14358I19580o3309j17087k30197m94749j39692L65867L04876J26777m28686N2726
14348B96106L16883K53898K56781m71773k00958L54089J99601J70417L1776j75022
14338A031798l97235p78016l07063k61697l12241Q8398M67084M55721M71181J97770
$$ plain form
14409 181837 309470 47522 131033 434135 130034 -310924 -275837 -51343 169540 378256
14399 378256 450095 340831 375499 331887 312172 -154425 -806074 -1106204 -1509830 -992070
14389 -992070 -36029 25947 -147181 -138144 -246707 -494730 -359196 -104663 -242772 -352438
14379 -352438 -426129 -163331 35296 -85811 -392554 -851264 -684058 127482 510374 307524
14369 307524 97771 135638 228756 233412 339995 470833 597467 657798 568182 852159 919580
14358 919580 856271 739184 508987 14238 -125454 240413 545289 672066 243380 296106
14348 296106 612989 866887 1123668 651895 450937 805026 1004627 1175044 1206820 1031798
14338 1031798 634563 -143453 -450516 -712213 -1024454 -936056 -468972 -13251 457930 655700
14328F55700j72574l56994k60831j06710K43405n0509k75471m7539j42039m7562
14318e61124o72272k4590M77326j14021k64542P645j0938J39572N95129R02361
14308D74546O17426O73005L06894p20657j577303j151876J34220M18759K18253
14299f06733M45261R0876j13784J92144L22798K35851j27414m44267l08057k56051
14289e69376j54984L93698K94694J14322M9220J58134j79459l01273l84895l40998
14279i20917J01711O5697k6881L10600M75491j5785j06815M27455J84895l14131
14269A81320n74572k38962L16910M24906K28753J74190p2439l0230L5888O1579
14259E07343M71614O51168J94972r349n53835k74268N49204L65332k92919n98001
$$ plain form
14328 655700 483126 126132 -134699 -241409 1996 -48513 -323984 -371523 -513562 -561124
14318 -561124 -1233396 -1257986 -780660 -894681 -1159223 -1151578 -1162516 -1022944 -427815 474546
14308 474546 1091972 1764977 2071871 1351214 -226089 -1377965 -1243745 -824986 -606733
14299 -606733 -161472 -70596 -184380 7764 330562 566413 438999 -5268 -313325 -569376
14289 -569376 -724360 -330662 -35968 78354 127574 285708 106249 -195024 -579919 -920917
14279 -920917 -819206 -753509 -780390 -469790 5701 -10084 -116899 310556 495451 181320
14269 181320 -393252 -632214 -315304 109602 338355 512545 440106 409876 445764 507343
14259 507343 978957 1630125 1825097 1815748 1261913 987645 1536849 1902181 1609262 1011261
14249A011261k13194m1242o62536r63253l63545L57607K69545l15269o36079j33231
14239a689936N06339O20644M08847Q3458j4592m0232j99163J63369O56016O85030
14229A179780j16346p54298m56348j98553P0521J48165m0444j0057J46851M34046
14219D03317K75897J93388k01331l33284J05421L05621p33408j074285m37710
14210a496374j54775j28846m34928M36138J091777P08480L1217k76433m75886
14201f99630j54318M90244J68987j94766p0526M26718L85019o11880j88628M43051
14191e729Q6320j25290N12335N25609K71531p3844m01741k69664l85987l99482
14181b65942P8463K52241K55291J47022K0387J57805r1161M1516L15287p4232
$$ plain form
14249 1011261 798067 756825 94289 -868964 -1232509 -874902 -605357 -920626 -1556705 -1689936
14239 -1689936 -1183597 -562953 -154106 -70648 -85240 -125472 -324635 -161266 494750 1179780
14229 1179780 1063434 309136 -147212 -345765 -275244 -127079 -167523 -177580 -30729 403317
14219 403317 679214 872602 671271 337987 443408 749029 15621 -1058664 -1496374
14210 -1496374 -1651149 -1779995 -2214923 -1778785 -687008 21472 52689 -223744 -699630
14201 -699630 -853948 -363704 -194717 -389483 -460009 -33291 351728 -260152 -448780 -5729
14191 -5729 80591 -44699 467636 993245 1264776 1190932 789191 519527 133540 -265942
14181 -265942 -187479 64762 320053 467075 487462 645267 554106 595622 910909 836677
14171H36677l92810K44290J93935n56407p44627k99304J71768Q0859k11758n09958
14161a187335N5415M24566K67255q2521M5775j8402J5535J50727j67163j36837
14151f32985M77304M25078J17319m07875J20769J33646O8870M69345N8615p57440
14141G2646k57810M17259O77677J67872l82828r40700q24526P5271M66099M28089
14131a00951J13982J4906j83746j58323Q4581L6988l451k60203p04903L5161K29456
14120h96503K89389K38877M07634L79524j06231J71732J2340k0877M5245j64357
14110C56773o9672k36029r9719J08537L18421K45905M32043O39178K85651p382
14100A973706r39344r16609j13686J92460L6322K03593j72593k47241n195L860
$$ plain form
14171 836677 443867 688157 882092 325685 -418942 -718246 -546478 -465619 -677377 -1187335
14161 -1187335 -1131920 -707354 -440099 -522620 -476845 -495247 -479712 -328985 -496148 -632985
14151 -632985 -155681 269397 386716 -21159 99610 233256 302126 771471 830086 72646
14141 72646 -185164 232095 909772 1077644 694816 -245884 -1070410 -995139 -529040 -100951
14131 -100951 13031 27937 -155809 -314132 -229551 -192563 -196014 -456217 -1161120 -1125959 -896503
14120 -896503 -607114 -368237 39397 418921 312690 484422 496762 475885 521130 356773
14110 356773 287101 51072 -48647 59890 378311 624216 1056259 1695437 1981088 1973706
14100 1973706 1034362 117753 4067 196527 232849 436442 263849 16608 11413 15273
14090A5273k8790m43750m97983J15477O83654K40273l34606j87981J03142J2215
14080c23076L41292M28100j66994l65699J23993K12334P7391J70790j79792k64093
14070E4246m86428q8603P68570O48737M14797k7731K8233m5j92185l3883J28621
14059A214329n8942k62204J4330n2274l946k1047k38272J2973r6788j18325n11092
14048a21258p62468q43043m65500K33573M64188O23677Q2517l05078N5933R90405
14038d7054J267259N99684m6849p09685r68210l74206k41239m75840P7140J67104
14028g51896j98738J48564O54528R39708O83292J74824l33388j62780J44282j33579
14018A164817j99136r4076m0487J23638j1888O0886l35600o39426P1959N2665
$$ plain form
14090 15273 -13517 -457267 -955250 -839773 -156119 84154 -250452 -438433 -335291 -323076
14080 -323076 18216 446316 279322 -86377 37616 249950 327341 498131 318339 54246
14070 54246 -432182 -520785 247785 896522 1311319 1283588 1311821 1311776 1119591 1085708 1214329
14059 1214329 1155387 893183 907513 855239 851293 830246 591974 604947 508159 389834 -121258
14048 -121258 -883726 -1726769 -2192269 -1958696 -1494508 -870831 -788314 -1093392 -1037459 -47054
14038 -47054 1220205 1819889 1773040 1063355 95145 -279061 -520300 -996140 -919000 -751896
14028 -751896 -950634 -802070 -147542 792166 1475458 1650282 1316894 1154114 1298396 1164817
14018 1164817 965681 871605 831118 954756 942868 1003754 668154 28728 100687 153352
14008A53352j02691k31146L37420L78539j14699j47722l8293n1364n16844l58384
13998f91832K46046J1869K13449M51737K05163r9237J29535l0269k75577n0370
13988A10514M48593M01675j92833p68464k81440P6682N0445r4855l68101j29642
13978g47426j1688l30045Q1589o3351k8357j84153n70291n02663o714L30905N45028
13967a487166J028625O15222K28596j22958N9605L23901p9514K3070q3948o66403
13957a60970k95682L50568P48063L71450l50629n77385o49357k73801J78431L44946
13947c14366j2199n2043j88476L21798K42275J93235K63590l7400M03917J16450
13937I36781n00074j60347m51015o09576o11141m44445J98699L34503J83330J88977
$$ plain form
14008 153352 50661 -180485 156935 535474 420775 273053 234760 183396 -333448 -691832
13998 -691832 -445786 -433917 -220468 231269 436432 337195 466730 436461 160884 110514
13988 110514 559107 960782 767949 -515 -281955 -205273 -154828 -249683 -617784 -747426
13978 -747426 -759114 -1089159 -1007570 -1070921 -1099278 -1283431 -1853722 -2356385 -2363099 -2032194 -1487166
13967 -1487166 -458541 156681 385277 262319 321924 645825 566311 589381 505433 -160970
13957 -160970 -456652 -106084 641979 1013429 662800 85415 -563942 -837743 -659312 -314366
13947 -314366 -326565 -378608 -567084 -245286 -3011 190224 453814 416414 820331 936781
13937 936781 436707 276360 -174655 -784231 -1395372 -1839817 -1641118 -1306615 -1123285 -934308
13927i34308N32285L11211j90619O7926O13753K36089j73972k77148j42454r02691
13917h59928j004276l04145K66372K54935J27717n4542N50842L88730J37212r5694
13907e92777p7548K72606j18533j29768K51062K32079J32488K72713Q28493M99808
13897A570623m12913o31581n70177n84338m70763L4166O74169M68998j0832j74488
13887a07136L47798L28766k34859r2453P9941l14855j29315J39036N33014M54536
13877A004473o3749p30507k0867P76240P34096m1612o84932o71693k78818J26219
13867A48850J65227l0842K98893K92524j96983l00968L21040J32415m57397l99615
13857b6856J76727N66950L63891l16129p64925m04360N4229Q1048J64308p3199
$$ plain form
13927 -934308 -402023 -90812 -281431 -213505 400248 636337 462365 185217 42763 -859928
13917 -859928 -1864204 -2168349 -1901977 -1647042 -1519325 -1573867 -1023025 -634295 -497083 -592777
13907 -592777 -670325 -397719 -516252 -646020 -394958 -162879 -30391 242322 1070815 1570623
13897 1570623 1157710 526129 -44048 -628386 -1099149 -1064983 -390814 78184 67352 -107136
13887 -107136 240662 569428 334569 242116 322057 7202 -122113 16923 549937 1004473
13877 1004473 940724 210217 189350 965590 1699686 1658074 973142 301449 22631 148850
13867 148850 314077 283235 582128 874652 677669 376701 697741 830156 372759 -26856
13857 -26856 149871 716821 1080712 764583 -342 -404702 -350473 -269425 -105117 -178316
13847a78316l29789J54462L62668J34901K273k6468O8713L81906P96895J80481
13837A547726q25646p99889p98211m88624J36147M78060M91855O4237p36755J07260
13827h23840M93815J1850K3761j03419k21185k39651K43202P22391L36873Q4302
13817E28099q853R4870l36176n66668l4084N24331L58625n6560j79249p3253m11722
13806a60640p77264l16492M82046O49366N24859J52419J31792K25110j18957k89110
13796E03129k78024l11422N8023j83091k83368k9424k19557l94966k54920N42380
13786h51240N70535N426j41561J64452q9400j09554K66000M68975R5062o0949
13776C17746l73662k03250O4296q213K9203L01461O8434M4626M66516K11308M3920
$$ plain form
13847 -178316 -508105 -353643 9025 143926 146199 119731 188444 570350 1367245 1547726
13837 1547726 722080 -77809 -876020 -1364644 -1228497 -750437 -258582 -194345 -931100 -823840
13827 -823840 -330025 -318175 -294414 -397833 -619018 -858669 -615467 106924 443797 528099
13817 528099 519246 614116 277940 -288728 -322812 201519 560144 503584 324335 251082 -160640
13806 -160640 -937904 -1254396 -772350 -122984 401875 554294 686086 911196 792239 503129
13796 503129 225105 -86317 -28294 -211385 -494753 -524177 -743734 -1138700 -1393620 -851240
13786 -851240 -280705 -275279 -416840 -252388 -341788 -451342 -185342 283633 378695 317746
13776 317746 -55916 -259166 -194870 -203083 -173880 127581 196015 240641 707157 918465 962385
13765I62385l15741N458K30304J29699q4908o95759r50293k93081M91762P34010
13755B13836J37335o262L35818M46850K9966k04435O226J91525l34698k58453
13745E57708L67969K50476l29715m06384j55476R1810J92286j6162j58966j52902
13735B40644L4528j16215k31463l8471J56677K04451n7519O4410L66544P88577
13725A412163k68423n75494k74805l8665j3836K24239K09409l40999k47232L2575
13715A18932j1709j07919q6722L0134O6223N07919K92918J19987p5520M1134J35276
13704A030653l8623k44142o4214J9116j97113k21091o84595o55122p6851M29317
13694g02665J97884k16470P1735K26829L87018J09525j26465K59405J16268n02722
$$ plain form
13765 962385 646644 652102 882406 1012105 927197 231438 -718855 -1011936 -520174 213836
13755 213836 351171 344909 680727 1127577 1157543 953108 959334 1150859 816161 557708
13745 557708 925677 1176153 846438 440054 284578 376388 568674 552512 393546 240644
13735 240644 275172 158957 -72506 -110977 45700 250151 192632 257042 623586 1412163
13725 1412163 1143740 568246 293441 254776 240940 465179 674588 333589 86357 118932
13715 118932 107223 -696 -87418 -57284 8939 516858 809776 929763 854243 895377 1030653
13704 1030653 992030 747888 683674 702790 505677 284586 -400009 -1055131 -1131982 -702665
13694 -702665 -504781 -721251 -649516 -422687 -35669 73856 -52609 206796 323064 -179658
13684a79658j19722N01674N18943M33686N0066k0365K92638k6642m58886m46879
13674E44855o63969k03416J16460M31882J1367m95825l36200L36719O78335K68667
13664F88875P3749J69504n32652j024216k54844J14691P6218L86798O35011J20295
13654D53429k397p4755l96056k56865j46367L70983P41544N30662k11351j17124
13644H91703K74222j95756l72797N27381P62576J09638k20119k3914m6133k5668
13634A681133j23730r46337o09534j11131k31792j63345J94173Q29170Q82703
13625A401310m15820p80205K0468j09168Q0595K44546n652O2425N61994Q08489
13615A868982J32176n51623j87646j71754k90325j93653J21828L81084Q7357K31763
$$ plain form
13684 -179658 -299380 202294 721237 1154923 1204989 1184624 1477262 1450620 991734 544855
13674 544855 -119114 -322530 -206070 225812 237179 -258646 -594846 -258127 420208 688875
13664 688875 762624 932128 399476 -624740 -879584 -764893 -688675 -301877 333134 453429
13654 453429 451032 376277 -19779 -276644 -423011 -52028 689516 1220178 1008827 891703
13644 891703 1165925 970169 597372 1124753 1887329 1996967 1776848 1752934 1706801 1681133
13634 1681133 1557403 611066 1532 -109599 -341391 -504736 -310563 518607 1401310
13625 1401310 985490 205285 225753 116585 197180 441726 436074 498499 1060493 1868982
13615 1868982 2001158 1449535 1261889 1090135 799810 606157 727985 1109069 1196426 1428189
13605A428189j96159n30871p2265K35257N61274L11311l08363o25163k01314R7809
13595F99705K13278L81050J86014r0081l86732j21040J82028K36795j09944q16022
13585C75051p27141o57974k1975J75833j22716M47511N26336J7426m4200J66743
13575A34894M26747N48539L22361j77164J36019n4582n45091o62351J79926O51441
13565I60739K96943j76270k34882l83444j15866M00262L08329M8451m16835o73782
13555A3645m70429J54883N10540M81144j32830m52505k79073K08441L72788n9066
13545C47538k63243m01837m06419k23590L8595L30241K01445r3363J32996O03668
13535B66031N3467k36134L30290M04552j68045k95622k95143K00730Q67677L46140
$$ plain form
13605 1428189 1232030 701159 628894 864151 1425425 1736736 1428373 803210 601896 699705
13595 699705 912983 1294033 1480047 1389966 1003234 882194 1064222 1301017 1191073 375051
13585 375051 -352090 -1010064 -1032039 -856206 -978922 -531411 -5075 12351 -31849 134894
13575 134894 561641 1110180 1432541 1255377 1391396 1336814 791723 129372 309298 960739
13565 960739 1257682 1081412 846530 463086 347220 747482 1055811 1104262 687427 13645
13555 13645 -456784 -301901 208639 689783 556953 104448 -174625 33816 406604 347538
13545 347538 84295 -317542 -723961 -947551 -908956 -578715 -377270 -470633 -337637 266031
13535 266031 319498 83364 413654 818206 650161 354539 59396 260126 1127803 1473943
13525A473943n8991L50555K17635j93493l63083m70670k08390k73570m79283k33574
13515b38921K44959J21378J98302L14279j36445j15291j26433N71445K71524m1427
13505A063370j27643k37298M84946N41210J43286K17256L04650K49954J57948
13496B797679o34635o22967l20833j97627M59197q0809j78083M27375j20714n11752
13486A016831r9058j976j8196M39618M58530m2440o00919n20128k84612K51127
13476E98777O7401o073P89270P96661l9341k97598k97676l58623K9878Q82804
13466B165480O86431m19969l17072K0189m64971m89521J54623J02604K65721M7652
13456A751167N3247N04853L00286j43287l43565P6125O0973n85887n57126J1179
$$ plain form
13525 1473943 1414952 1765507 1983142 1789649 1426566 955896 747506 473936 -5347 -238921
13515 -238921 6038 127416 325718 639997 503552 388261 261828 833273 1104797 1063370
13505 1063370 935727 698429 1183375 1724585 1867871 2085127 2389777 2639731 2797679
13496 2797679 2163044 1540077 1219244 1021617 1480814 1400005 1221922 1649297 1528583 1016831
13486 1016831 917773 915797 897601 1337219 1795749 1753309 1152390 632262 347650 598777
13476 598777 666178 660105 1449375 2246036 2206695 1909097 1611421 1252798 1282676 2165480
13466 2165480 2851911 2431942 2114870 2135059 1670088 1180567 1335190 1437794 1703515 1751167
13456 1751167 1804414 2309267 2609553 2466266 2122701 2198826 2259799 1673912 1116786 1127965
13446A127965L19672K35095j93073J57953r0807L2212M03242J6535Q8923j30023
13436A967694j81962P9641m39949k79921r4218K54004k33296O8686L03610j07266
13426A337023l27788L146K71024N24411P17555M36953J90285j31611l30797q5242
13416B604959M09162M06036k39677k57801o03598l50214J99372O5683K2801K17807
13406B474530J93041J38582N67168M0035j74607J20621k92818n163O56374J20545
13396C838308J56327k670j80671P2506K01903N11377K63276o95818r4902P93105
13386D862741L77338j60570j46762K21976K57608j3670R3490P2137J70219L573
13376E738080o14315n05122m99668M25977Q68790M46496N43411J174171J067941
$$ plain form
13446 1127965 1447637 1682732 1489659 1647612 1556805 1589017 1992259 2008794 2097717 1967694
13436 1967694 1785732 1865373 1425424 1145503 1051285 1305289 1071993 1140679 1444289 1337023
13426 1337023 1009235 1012381 1283405 1807816 2525371 2962324 3152609 3020998 2690201 2604959
13416 2604959 3014121 3420157 3180480 2922679 2319081 1968867 2168239 2233922 2256723 2474530
13406 2474530 2667571 2806153 3373321 3413356 3238749 3359370 3066552 3061389 3717763 3838308
13396 3838308 3994635 3991965 3811294 3883800 4085703 4597080 4860356 4164538 4069636 4862741
13386 4862741 5240079 5079509 4932747 5154723 5412331 5398661 5492151 5564288 5734507 5738080
13376 5738080 5123765 4618643 4118975 4544952 5413742 5860238 6403649 7577820 8645761
13367H645761O53231Q98079J044225J322257J601059J919401R88199k7329o91227
13358A6353656j241385j318514r13678p67111m80456p12696r8058L81153j68175
13349A1034736n9211M79804N17375m7693K03119Q11545Q84086R21441R26459J485294
13339A7156955J904114J479472J285387J773886J997999K249954L110915L972843
13331C4931525N035633O500398P787096J0471285J3956220J8085880K4127814
13324A20895851L2176612M3557998N9107165P3540724P8308900N7960489J2969868
13317D78517607l1719334n5875195o1741514n7234879m8218666l8701030l0596114
13310A54430875k4605074j9062152j4987810j2282838j0340824q759900p744962
$$ plain form
13367 8645761 9298992 10197071 11241296 12563553 14164612 16084013 17072212 17044883 16353656
13358 16353656 15112271 13793757 12880079 12112968 11632512 10919816 10821758 11202911 11034736
13349 11034736 10975525 11455329 11972704 11925011 12128130 12939675 13823761 14745202 15671661 17156955
13339 17156955 19061069 20540541 21825928 23599814 25597813 27847767 30958682 34931525
13331 34931525 39967158 46467556 54254652 64725937 78682157 96768037 120895851
13324 120895851 153072463 196630461 255737626 329278350 407587250 465547739 478517607
13317 478517607 446798273 390923078 329181564 271946685 223728019 185026989 154430875
13310 154430875 129825801 110763649 95775839 83493001 73152177 64392277 56647315
13303E6647315p118307o060213m704359l486910k961669k658849k690962k594754
13295B4371292j835218j623416j763544j270573r39910j048288j171379o55154
13287A4063810k39036l19226k47419P5991j84352o45865q78594q39531q55322
13278I930456P8461N64753L49917M55333K40385m6989l62606l31223K48358L88630
13268A1515475P2988P10818J311784J260181J332162J674368K293847K406873
13260B2578496K711770J862733k07853j547154j654627r50428n34674q7019O16576
13251B2787820R32929R94743J196746J343265K113682K998098M047466M907854
13243D1322603O185142P451165R077654J1697958J5632021K1256596K9279097
$$ plain form
13303 56647315 49529008 43468795 38764436 35277526 32315857 29657008 26966046 24371292
13295 24371292 22536074 20912658 19149114 17878541 16938631 15890343 14718964 14063810
13287 14063810 13824774 13505548 13258129 13334120 13149768 12503903 11625309 10785778 9930456
13278 9930456 10008917 10573670 10923587 11378920 11619305 11572316 11209710 10878487 11126845 11515475
13268 11515475 11588463 12299281 13611065 14871246 16203408 17877776 20171623 22578496
13260 22578496 25290266 27152999 26945146 25397992 23743365 22792937 22258263 22171244 22787820
13251 22787820 23720749 24715492 25912238 27255503 29369185 32367283 36414749 41322603
13243 41322603 47507745 54958910 64036564 75734522 91366543 112623139 141902236
13236A41902236L9763674N3097010O9506233Q0921467P1440122L1316514j9229545
13229D68717711n1948402o2946916o0908032n2343272m2551629l3789865k6515556
13222A37714039k1382858j6499656j3027379j0722206r006069q028987o776948
13215E2269936m968645m615573l720329j459417K24022R74042J858088K665931
13207D3228055m01810l756645l891392m039809l731325k674191k263863k233768
13199B0235252j731710j430570j040986q97333n16678o20878j100420m93145j62135
13190A2241397m00251o40698n04135m30589n23449k12038L93838P54816L83548
13181A1062439L13288j4362k26926l35557j88487K03403K39516N39642O79010
$$ plain form
13236 141902236 181665910 234762920 304269153 385190620 456630742 487947256 468717711
13229 468717711 416769309 353822393 292914361 240571089 198019460 164229595 137714039
13222 137714039 116331181 99831525 86804146 76081940 67075871 59046884 52269936
13215 52269936 47301291 42685718 38965389 37505972 37729994 38704036 40562124 43228055
13207 43228055 42826245 39069600 35178208 31138399 27407074 24732883 22469020 20235252
13199 20235252 18503542 17072972 16031986 15134653 14617975 13997097 12896677 12403532 12241397
13190 12241397 11841146 11200448 10696313 10265724 9742275 9530237 9924075 10678891 11062439
13181 11062439 11375727 11361365 11134439 10798882 10610395 10813798 11053314 11592956 12271966
13172A2271966P66007P99915M41205M97034O11405R49039J483686J928061J245627
13163B0993945R23745J521857K767712L389363L077808L176771L654201M863747
13155D4369149O620392Q697730J1539833J4317380J8637088K5893883L5062841
13148A65138296M7528731O3218219P6379376P4939601M6626238j607939m1667159
13141D30555363n9351462o1263165n5289324m6059045l6460996k8276915k2456914
13134A21397542j8470557j4699636j1652367r772257q585116p375980o828983
13127D4012646n875923m653281l903294l433367k942356k615819k117214j451403
13119A7019989j449422j385279j414475j117476k24105l28213j220768j137291
$$ plain form
13172 12271966 13037973 13837888 14279093 14776127 15387532 16336571 17820257 19748318 20993945
13163 20993945 21917690 23439547 26207259 29596622 32674430 35851201 39505402 44369149
13155 44369149 50989541 59687271 71227104 85544484 104181572 130075455 165138296
13148 165138296 212667027 275885246 352264622 427204223 473830461 472222522 430555363
13141 430555363 371203901 309940736 254651412 208592367 172131371 143854456 121397542
13134 121397542 102926985 88227349 76574982 66802725 58217609 50841629 44012646
13127 44012646 38136723 33483442 29580148 26146781 23204425 20588606 18471392 17019989
13119 17019989 15570567 14185288 12770813 11653337 11429232 11101019 9880251 8742960
13111H742960j04518l48819o33069j43774J80488P8501j51746m50947n47664k64979
13101F356433l45831l80303m68072j38829j55204J18479k45781p70939k53594
13092C716359m80030p07366k86894l40004m61818l49796J44014O82821O17836
13083B535122M92128K25632m60567o31838P5159N58730j96386m08433M2384L62466
13073B594397j66678m83105k53913j97390j03726J03483m73995n50542n0696L29440
13063G47275N90122N83121k62951m47276r5452K46619O4388j2810n0726l47924
13053A014386m29484J4347J2473J67724K7462k03252j86666J18400M54278O64791
13043A654459n78l32883o67501j281076m46954K03722K23020k02409O452R00525
$$ plain form
13111 8742960 8638442 8289623 7656554 7512780 7693268 7771769 7620023 7169076 6621412 6356433
13101 6356433 6010602 5630299 5162227 5023398 4868194 4986673 4740892 3969953 3716359
13092 3716359 3236329 2528963 2242069 1902065 1440247 1090451 1234465 1917286 2535122
13083 2535122 3027250 3252882 2792315 2160477 2235636 2794366 2597980 2189547 2231931 2594397
13073 2594397 2427719 1944614 1690701 1493311 1389585 1493068 1019073 468531 417835 747275
13063 747275 1337397 1920518 1657567 1210291 1114839 1361458 1425846 1413036 1362310 1014386
13053 1014386 584902 599249 611722 779446 806908 603656 416990 535390 989668 1654459
13043 1654459 1653881 1320998 653497 -627579 -1074533 -870811 -647791 -850200 -843748 56777
13033E6777R68238J84035l03564j81838J71393m51483l88681K73518J77148K47043
13023G52586J217j12097K64324Q5671Q4631Q5914k58869k55378l27443j64257
13013A56299r6709M4768L55049L29765L37712j83686k33968m7206j22401j4194
13003E25429N84089L11954k29789k83324K78402J04491m77428K35849L44353K42452
12993A636478r2882k20981J12287L2018o49727j205659n12565K72317P44462M00033
12983E15781O22574M59297l07828l97759j50011p067l57723j30135o666j26941
12973A13522l40760j90402Q4020Q651k52149P8265p1989l23869M48526M78448
12963C2263j82172j87307K44395N48773N78564J25718o5049j02402l69429n37319
$$ plain form
13033 56777 1025015 1209050 905486 723648 895041 443558 54877 328395 505543 752586
13023 752586 753803 641706 906030 991701 1076332 1162246 903377 647999 320556 156299
13013 156299 59590 104358 459407 789172 1126884 943198 709230 662024 539623 525429
13003 525429 1109518 1421472 1191683 908359 1186761 1291252 813824 1049673 1394026 1636478
12993 1636478 1543596 1322615 1434902 1466920 817193 -388466 -901031 -628714 115748 515781
12983 515781 1138355 1597652 1289824 892065 742054 734987 377264 247129 240463 113522
12973 113522 -227238 -417640 -333620 -324969 -577118 -498853 -570842 -894711 -446185 32263
12963 32263 -149909 -337216 -92821 455952 1034516 1160234 1095185 992783 623354 86035
12953H6035N9071K32229J86985L63791J10836j3152K58137l67313n65191M0314
12943C91742K75950L37650Q00052j3127m89782l83454q82950o65629R6116N32731
12933g01P65137L26193L06093R1185o09300Q9824k6919p51076n45937l13534l44904
12922a013939n38732J06486L81254P7448R2062K65815N90441j19606m69551n1143
12912f79465p4372k48204m45723L2825L06710j69526J14952M70789J12373k6906
12902f06547R1450K01194k25592J42351P1069j50913K27214K56918q5971j01568
12892a80395K38766J44807j60369k90445j52004j68132k07524l42814j46713P3787
12882a191036J35932m4926k30111J97597O05786P30247L14311Q3438j38689j82652
$$ plain form
12953 86035 145106 377335 564320 928111 1038947 1025795 1283932 916619 351428 391742
12943 391742 667692 1005342 1805394 1792267 1302485 919031 36081 -629548 -533432 -701
12933 -701 764436 1090629 1396722 1487907 878607 968431 941512 190436 -355501 -669035 -1013939
12922 -1013939 -1552671 -1446185 -1064931 -987483 -895421 -629606 -39165 -158771 -628322 -679465
12912 -679465 -753837 -1002041 -1447764 -1414939 -1108229 -1277755 -1162803 -692014 -579641 -606547
12902 -606547 -515097 -313903 -539495 -397144 -326075 -476988 -249774 7144 -78827 -180395
12892 -180395 58371 203178 42809 -247636 -399640 -567772 -775296 -1118110 -1264823 -1191036
12882 -1191036 -1055104 -1100030 -1330141 -1132544 -526758 203489 517800 601238 462549 279897
12872B79897J20901N3103n59430l87412O4903L88975L40057j50021o9301o600
12862G5072k33200r4018l2798k3065j97658n8466n0848k30957k65791q09365j011013
12851b932107j89071Q82161Q30576K12223O13640R08203L47376k13542m59374
12842H5l35446K45366N68468R9913k71618l2310m1362m11303l57316m11028N1745
12831h94806L45475O79207P40900P93490J390709J374203J023485k95013j375600
12822C782050j192935o26158m19203n01331n90600k26930L07289K99971J90810
12813A022963k47803l63613j56476p0811m49322K2556K77251J0845N7753K47529
12803C50872L6782q4671j54043k02344k91488j33195l4876J9195l34431o68203
$$ plain form
12872 279897 400798 453901 -105529 -492941 -428038 -39063 300994 150973 81672 75072
12862 75072 -158128 -252146 -284944 -308009 -505667 -564133 -614981 -845938 -1111729 -1921094 -2932107
12851 -2932107 -3121178 -2239017 -1408441 -1196218 -582578 325625 673001 459459 85
12842 85 -335361 -89995 478473 578386 306768 274458 233096 -178207 -535523 -946551 -894806
12831 -894806 -549331 129876 870776 1664266 3054975 4429178 5452663 5157650 3782050
12822 3782050 2589115 1962957 1543754 1042423 451823 224893 532182 832153 1022963
12813 1022963 775160 411547 255071 184260 -265062 -242506 34745 45590 103343 350872
12803 350872 387654 302983 148940 -53404 -344892 -478087 -512963 -493768 -828199 -1496402
12793a496402n98566K96913N77372l9159L47364N64839K39590L4427l17153m04259
12783g95034j85284j73022K93856K98301R0923j5181k92989j81310l37721L70978
12773i26483O61293M54892J67814m30474k4225J91246J80546P6991j39409M6773
12763B58964p2199k88497N2557L78165m9530k18101k72143k94459n52166j62088
12753a219497L96004j19089k34668M66694J027213L22829m20250M05227J13510
12744G37973m83440l68792J59430Q01907O11464n00152o48763j41506J34470K36738
12734E39329N26360L46948k63013q2467j05512N2235L200n91367k61261j9017
12724A45435n80240k34233J6105Q033N9760M1184L97464l5277l96138o5010K46754
$$ plain form
12793 -1496402 -2094968 -1798055 -1220683 -1259842 -912478 -347639 -108049 -73622 -390775 -795034
12783 -795034 -980318 -1153340 -859484 -561183 -470260 -485441 -778430 -959740 -1297461 -926483
12773 -926483 -265190 189702 357516 -72958 -97183 94063 274609 351600 212191 258964
12763 258964 186765 -101732 -49175 328990 279460 61359 -210784 -505243 -1057409 -1219497
12753 -1219497 -823493 -942582 -1177250 -710556 316657 639486 219236 624463 737973
12744 737973 254533 -114259 45171 847078 1458542 958390 309627 168121 302591 539329
12734 539329 1065689 1412637 1149624 1067157 961645 1013880 1017080 425713 164452 145435
12724 145435 -434805 -669038 -652933 -644900 -585140 -543956 -146492 -181769 -577907 -642917 -396163
12713c96163j80686Q8789L28792J65091M67756M41149L15862p08231r87541m06028
12703h71210j04460M04159M59745N10821p9225m42614r5075R3896K16175j43519
12693e1307l23072m2676K9121k67172l36413L005J91655j93091j74799J35791
12683a028958M31563L89686M90811K52122q7957k80153j10525Q0049l5339l26605
12673b25306P4538m826o36538k90580R4870l47199J6287o1577n9923J06108P97233
12662e36913Q28745L0808k6703j80365k0428J24596l91638j95144P11252P52101
12652A096311l0944p00187m54510p27176n46859j18160J90853J83582K50484J12732
12642g43874m4813j83359K89986M51556J87903L62844P0150m38742O530O4132
$$ plain form
12713 -396163 -576849 -488060 -159268 5823 473579 914728 1230590 522359 -465182 -871210
12703 -871210 -975670 -571511 -111766 399055 319830 -122784 -217859 -123963 92212 -51307
12693 -51307 -374379 -417055 -387934 -655106 -991519 -988514 -796859 -989950 -1164749 -1028958
12683 -1028958 -597395 -207709 283102 535224 447267 167114 56589 136638 101299 -225306
12673 -225306 -150768 -155594 -792132 -1082712 -987842 -1335041 -1318754 -1380331 -1440254 -1334146 -536913
12662 -536913 291832 322640 295937 115572 95144 219740 -171898 -367042 344210 1096311
12652 1096311 1065367 365180 -89330 -816506 -1363365 -1481525 -1290672 -1107090 -856606 -743874
12642 -743874 -788687 -972046 -682060 -230504 -42601 320243 390393 -48349 -41819 22313
12632B2313j50825k14645K26417N56405m1044N5736K29152j68425p15551m01063
12622f01530p2942N52600P98459J89261L487l02268l86130m8491K84868n5420
12612C61894l02193m38384l0783L1149n78220k05306m2923j60316K45924M01474
12602g17684J397l49232l57647o5724J59849M19503L62888L63403L9804j86938
12592c30381N100J22220J85899L77384K12172n0142r1917m55875l68356k40203
12582f34099J15471L23135L89166L91153j10520J00390M02622k50502m92691l35727
12572a01602n51674K32947P16207k6486k17698n43412m00729P8046P89305J097836
12562A072740M92680m87656p30121j57838K39846L95060K68177k03737o07257
$$ plain form
12632 22313 -128512 -343157 -116740 439665 398621 454357 683509 515084 -200467 -601530
12622 -601530 -674472 -121872 676587 865848 869335 567067 180937 132446 417314 361894
12612 361894 59701 -378683 -409466 -378317 -956537 -1161843 -1204766 -1365082 -1119158 -717684
12602 -717684 -716287 -1065519 -1423166 -1488890 -1329041 -909538 -546650 -183247 -143443 -330381
12592 -330381 -325281 -203061 -17162 360222 572394 522252 430335 -25540 -393896 -634099
12582 -634099 -518628 -195493 193673 584826 474306 574696 977318 726816 234125 -101602
12572 -101602 -653276 -420329 295878 269392 51694 -491718 -892447 -814401 -25096 1072740
12562 1072740 1565420 1077764 347643 189805 429651 824711 1092888 889151 281894
12553B81894j40861j71348j94809j80149L71651K07670k80031J23280L27424J65851
12543E10572l7485j37375J76690L09806L32038N2950N6325k6477K56826K89448
12533A783318k61309l01967P18189J482082K064752K836689K964924M16786j579643
12524A0123821j456294j572779j441240j118126j421092o89014p1005l16976k2442
12515B014853l00058n43946n72205k19762Q6401K07960n9221N2693L52225j13879
12505I05061n17496m0921J78742j15575k49726J92888L44974j42265n16160p4051
12495c4529J19145L73458K2804J04352N17535K11877R2959l06397q83560o64186
12485d46542N07808P55255J87778j20631n96437p03044m17754P4245L76302L46408
$$ plain form
12553 281894 141033 -30315 -225124 -405273 -33622 174048 -105983 17297 344721 510572
12543 510572 473087 335712 512402 822208 1154246 1207196 1263521 1237044 1493870 1783318
12533 1783318 1522009 1220042 1938231 3420313 5485065 8321754 11286678 11703464 10123821
12524 10123821 8667527 7094748 5653508 4535382 3114290 2425276 2354271 2037295 2014853
12515 2014853 1714795 1170849 598644 378882 465283 673243 614022 666715 1018940 905061
12505 905061 387565 346644 525386 409811 160085 352973 697947 555682 39522 -34529
12495 -34529 84616 458074 480878 585230 1102765 1314642 1407601 1101204 217644 -446542
12485 -446542 61266 816521 1004299 883668 287231 -415813 -833567 -759322 -383020 -36612
12475c6612K08776j78683P0011K51725j65989n64927l42229K64051q5359J13686
12465d65550M06322r2270l31451K1531K73018M25724L64182m8597k80863l22090
12455e0044k57202n4231L56583N36350j35454n57171k5455k1223j90538L3841
12445c64544K57009K91196o8232l51909j23355M9662j0659k99239r143j1479J57949
12434d82744l6794m17354J7853M18927N92831J16476m954j4332j88900Q6060J4934
12423A02003k06309j74764j71446j35099o1543l42227l80868L17411N11221J25567
12413d16054J35273K38624J89576L31142M55726L2759n8848k54608q9099L1389
12403E95880L59404m6683m10790n74274J90850N54359j69849n91426n29093R7196
$$ plain form
12475 -36612 172164 -6519 63492 315217 149228 -415699 -757928 -493877 -579236 -465550
12465 -465550 -59228 -151498 -482949 -461418 -188400 237324 601506 552909 272046 -50044
12455 -50044 -307246 -361477 -4894 531456 396002 -161169 -186624 -207847 -398385 -364544
12445 -364544 -107535 183661 115429 -236480 -359835 -310173 -320832 -620071 -629214 -640693 -482744
12434 -482744 -519538 -936892 -919039 -500112 92719 209195 204241 189909 1009 87069 102003
12423 102003 -104306 -279070 -450516 -585615 -647158 -989385 -1370253 -1052842 -541621 -416054
12413 -416054 -280781 -42157 147419 478561 934287 967046 908198 653590 564491 595880
12403 595880 955284 908601 497811 -76463 114387 668746 498897 -92529 -621622 -524426
12393e24426K16595j68397J57409N44693N6390n35137n28439j77843L74756J40353
12383d44046O19863O82818j21305J6362M43980J82252q9456O00040P904m74344
12373A424068l02464j92863j48318m35775m75558l01710p8923K89859K2548k65162
12363d64298L09028L11677L0733q8665l28922P0213K35026l1336k3699n66789
12353e47032n43932J43178O59193P9977m29187m47928o3724N72034J110653R01791
12343A435023K1903p75159l87713m95683o12826J65865O209q432P9175L5389k48186
12332g84435j47438j99804M11507J057780O47525k11728o41982p26933j66107
12323g61615P0752L01953O20920N45473K75442M01105N63743j91257j282181j038216
$$ plain form
12393 -524426 -307831 -476228 -318819 225874 282264 -252873 -781312 -959155 -584399 -444046
12383 -444046 175817 858635 737330 753692 1197672 1379924 1290468 1890508 1898412 1424068
12373 1424068 1121604 928741 780423 344648 -130910 -432620 -511543 -221684 -199136 -464298
12363 -464298 -155270 156407 187140 98475 -230447 -160234 74792 43456 19757 -547032
12353 -547032 -1090964 -947786 -288593 -208616 -637803 -1085731 -1149455 -577421 533232 1435023
12343 1435023 1456926 681767 294054 -201629 -814455 -648590 -642381 -650813 -571638 -536249 -784435
12332 -784435 -931873 -1131677 -720170 337610 985135 773407 131425 -595508 -761615
12323 -761615 -690863 -388910 232010 777483 1052925 1454030 2017773 1826516 544335 -493881
12313d93881k98310L78357L35465L84763K72999j67484L6700j33251m29256m86929
12303f00827l63247J68641M62128J0200J47320P6277o35805k90019M22557N59802
12293d2973M29789L13245k42331q08016k02320P14481j78323r88510l62810N46535
12283h21233M35332j48274m0189M11597R1283M29888j38977l73921K06963R16202
12273I68671O85764j26761j78938j59672l56621N8660K62909J26617J2400L3360
12263A326389m37379p48475l79035K06855K66141m26137n68905J1546L23859N84439
12253A59298N84980P98008M58743k1710J88361l4294j23933O795j86567k31835
12243A597846J98690K9888l82850m95302l51144o863O01931M52916l8264m0151
$$ plain form
12313 -493881 -792191 -413834 -78369 306394 579393 411909 448609 315358 -113898 -600827
12303 -600827 -964074 -795433 -333305 -323105 -175785 -99508 -735313 -1025332 -602775 -42973
12293 -42973 386816 700061 457730 -350286 -552606 161875 -16448 -1004958 -1367768 -821233
12283 -821233 -385901 -534175 -574364 -162767 -71484 358404 219427 -154494 52469 968671
12273 968671 1654435 1527674 1348736 1189064 832443 891103 1154012 1280629 1293029 1326389
12263 1326389 889010 140535 -238500 -31645 234496 -191641 -760546 -749000 -425141 159298
12253 159298 744278 1542286 2001029 1979319 2167680 2133386 2009453 2016248 1829681 1597846
12243 1597846 1796536 1826424 1443574 948272 597128 590265 1192196 1645112 1606848 1566697
12233A566697M54329N76331l60167o15475l20394J27341O9511R2406J67263K14156
12223A971998L56781O52409Q38386M23887O03660P54526R23716J718051J663074
12214I906488Q61788o63674j286669j016443r07916p69855j112668r38848m05392
12205C666811Q6904O57871P11867O52761R50567J462593K156913P07005j925986
12196I127306k344060j287349p91784n68647l45952m80202q73695n74401M9366
12187A910582k87182p74735l32202O40717M92557Q4987j49542m24910m54366N1273
12177G57179n5310l28479Q9477K35766J30043r0305R1261P8010j48885k10192
12167E48565M62570M50501l1152m14986N8080P9118L20030N21251N7498j49383
$$ plain form
12233 1566697 2021026 2597357 2237190 1621715 1301321 1428662 1498173 1590579 1757842 1971998
12223 1971998 2328779 2981188 3819574 4243461 4847121 5601647 6525363 8243414 9906488
12214 9906488 10768276 10104602 8817933 7801490 6893574 6123719 5011051 4072203 3666811
12205 3666811 3753715 4411586 5123453 5776214 6726781 8189374 10346287 11053292 9127306
12196 9127306 6783246 5495897 4704113 4135466 3789514 3309312 2435617 1861216 1910582
12187 1910582 1623400 848665 516463 1157180 1649737 1734724 1585182 1160272 705906 757179
12177 757179 701869 373390 462867 698633 828676 738371 829632 907642 758757 548565
12167 548565 1011135 1461636 1430484 1015498 1073578 1152696 1472726 1993977 2051475 1902092
12157A902092j09513k98872j93202M9140l17067o63034k53998L15519J89876K6359
12147F47300K35063K16154J25124o73419p63745p6823O27418L73765m80223p92336
12137e61722j37129J09536K78731J13160k1042N59452M81881k30004l82118n4924
12127A55821K55701j98863Q8384K34940m47890m10540K07398J64268j35968k83423
12117c70172k4872K89331K6423k31818j33237K25744p0448k80199k5696N09859
12107h5085M81932J46074m2067p1468j93492m59484n16421l05462j32255K86907
12097h90821M61239o5974k884O94033O25359P47803L66019R6375j071899j627479
12087f68229k89681M29144J13449j03932o602j700k52651l24993j74152L7801
$$ plain form
12157 1902092 1792579 1493707 1300505 1349645 1032578 369544 115546 431065 620941 647300
12147 647300 882363 1098517 1223641 550222 -213523 -290346 337072 710837 230614 -561722
12137 -561722 -698851 -589315 -310584 -197424 -218466 340986 822867 592863 210745 155821
12127 155821 411522 212659 301043 535983 88093 -322447 -115049 49219 -86749 -370172
12117 -370172 -395044 -105713 -79290 -311108 -444345 -218601 -289049 -569248 -594944 -85085
12107 -85085 396847 542921 500854 429386 235894 -223590 -740011 -1045473 -1177728 -890821
12097 -890821 -429582 -495556 -498440 195593 820952 1568755 1934774 2031149 959250 -668229
12087 -668229 -957910 -528766 -415317 -519249 -525851 -527551 -780202 -1105195 -1279347 -1241546
12077a241546O01875O40404N48018J89897j6823J7966k63751l02405l20011r9085
12067b45461J55975j88561L8361J98331m34442q70508k35477m571j26110J83253
12057a529210M97711K02224k87259j33655J04842K96323j41665k48821J81662
12048a057848K57875K89611L43911J52455k89646l14529k28964N8526J05055N00766
12038a82788N72756l16224r64206l53059N25567O03909O14179K30072J19326J3824
12028H63356k00534Q0997J71052p3404k6615j75317m58620o03209q68750l15638
12018a606682O90650P93157J94014k97367j08155N49943M95581J66277p33123
12009A44295p93152K03974N7806k25842k38618k56316l50878M30964K21265m70961
$$ plain form
12077 -1241546 -639671 733 548751 738648 721825 739791 476040 173635 -146376 -245461
12067 -245461 -89486 -278047 -239686 -41355 -475797 -1346305 -1581782 -1586353 -1712463 -1529210
12057 -1529210 -1031499 -829275 -1116534 -1250189 -1145347 -849024 -990689 -1239510 -1057848
12048 -1057848 -799973 -510362 -166451 -13996 -303642 -618171 -847135 -788609 -683554 -182788
12038 -182788 389968 73744 -890462 -1243521 -717954 -114045 500134 730206 849532 863356
12028 863356 662822 743819 914871 841467 814852 639535 180915 -422294 -1291044 -1606682
12018 -1606682 -916032 -122875 71139 -226228 -334383 215560 711141 877418 144295
12009 144295 -648857 -444883 -387077 -612919 -851537 -1107853 -1458731 -1027767 -806502 -1277463
11999a277463l785j82464p4201O87127O69501J69499K34778J99985J41327L83110
11989I47414O5787r60950p68729J64443K20368l28285m61001J39489Q27040P58182
11979F03758J32214K26615N49212L8133j43724K1143l45854l76875j48841j88761
11969C67020J28283j52253j31829J06052l92585l93546l40247l42756J35695M29692
11959e86474P6931k65873l96197j20715M65041O45827J60003n71403L21928O99552
11949D28620J26373j28242k52991j37557j69076L65380M31120J38968j47816m57193
11939A97586n30726q7039N12586K14225l91610J506M5527K21911L79794N075r2040
11928D76795m9771K55981m64103k20044K26866J56935L50914L50618L43405k35338
$$ plain form
11999 -1277463 -1281248 -1463712 -1537913 -850786 -181285 -11786 222992 422977 564304 947414
11989 947414 1013201 52251 -716478 -552035 -331667 -659952 -1120953 -981464 -154424 603758
11979 603758 735972 962587 1511799 1549932 1406208 1427351 1081497 704622 555781 367020
11969 367020 495303 343050 211221 317273 -75312 -468858 -809105 -1151861 -1016166 -586474
11959 -586474 -509543 -775416 -1171613 -1292328 -827287 -181460 -21457 -592860 -270932 428620
11949 428620 554993 426751 173760 36203 -132873 232507 663627 802595 654779 197586
11939 197586 -333140 -420179 92407 306632 -84978 -83472 -37945 183966 563760 568835 476795
11928 476795 427024 683005 218902 -1142 225724 382659 733573 1084191 1427596 1192258
11918A192258o65124l45824j60468P8857K91825J54366k35454l53174q8179L93715
11908B62798L72042j48091l26383J6441O34571M03432K68008Q31915J062175R17738
11898D294646O30642M26774N85186R21920J231298N45867P6243k16253j107702
11889G388621j758403j278083q74252n31420K07138l52417p02106k68616k71089
11880A559373k25428K75347K45564j44286n66384L7694j51816o77635k12488O18141
11870G58082O29742n4224l74186l85471l12631R9254L11614N24762P18696l16797
11860A598841p97259l69825K35489R0797p1769L02739K43608K5020N40558J25376
11850A923575M2465M63526Q42581L76493J13436K37950K15341N23476R75407J119838
$$ plain form
11918 1192258 527134 181310 20842 99699 391524 545890 310436 -42738 -130917 262798
11908 262798 634840 486749 160366 176807 811378 1214810 1482818 2314733 3376908 4294646
11898 4294646 4925288 5352062 5937248 6859168 8090466 8636333 8712576 8496323 7388621
11889 7388621 5630218 4352135 3477883 2946463 3153601 2801184 2099078 1830462 1559373
11880 1559373 1333945 1609292 1854856 1710570 1144186 1181880 1030064 352429 139941 758082
11870 758082 1387824 1333600 959414 573943 261312 360566 672180 1196942 1915638 1598841
11860 1598841 801582 431757 667246 758043 686274 989013 1232621 1257641 1798199 1923575
11850 1923575 1966040 2429566 3272147 3648640 3762076 4000026 4215367 4738843 5714250 6834088
11840F834088J580148J615840N30629j158050j573337j802233j291926j84190
11832D550969j74107l07312k28986j71723J34726M02651P27545R86577L75555
11823F295895j68907l24461l66291m65151j7054M33752l04035p60536q35457p39426
11813B748329n79586M8942j31931o77297m58354J12541N62332k28695m52993k24797
11803G18491l5184P06452L15816o32796k63951N71410O16246Q38729O77966J67707
11793C680886M0542K05295L37091j26261o95789p76206o59150k73708P4863M57259
11783B264822J20854l71768l00768q0468k94997n70830n02145o35273L8197L84556
11773E2180q6319j26326L74342K36813k75354j67659K83616L83401j3627l80416
$$ plain form
11840 6834088 8414236 10030076 10560705 9402655 7829318 6027085 4735159 4550969
11832 4550969 4376862 4069550 3840564 3668841 3803567 4206218 4933763 5920340 6295895
11823 6295895 6126988 5802527 5436236 4971085 4954031 5387783 5083748 4323212 3487755 2748329
11813 2748329 2168743 2217685 2085754 1408457 950103 1062644 1624976 1396281 943288 718491
11803 718491 683307 1389759 1705575 1072779 808828 1380238 1996484 2835213 3513179 3680886
11793 3680886 3721428 3926723 4263814 4137553 3441764 2665558 2006408 1732700 1807563 2264822
11783 2264822 2385676 2013908 1713140 1632672 1337675 766845 264700 -370573 -332376 52180
11773 52180 -34139 -160465 213877 450690 175336 7677 291293 674694 661067 280651
11763B80651l33482K71134K14738k5826k84943l25217K64304N51681Q8727K6090
11753G27857r8737J03009j67674l78948m0872N1637P1273l1508p8503l99746k86676
11742e28888R2697K45386K85190N90381N27513J29690k60227l00585k27104n9978
11732D94075j31687n13782p2615J26376j2702m5919L3799L60299K14166P3394
11722E25404Q0372K1719n8443J58617K71612K95626M7171k92440l6808o12878
11712C99952o20705j05117N2032J48586M1285q4646L28577K80776o4003N3608
11702D30345K77613O66108M67304j14398n02155p0376m5898K5821Q83462J157047
11692C174873j41610n46480j118327j066662r0286N46829q4228j113683j072424
$$ plain form
11763 280651 -52831 218303 433041 407215 122272 -202945 61359 613040 701767 727857
11753 727857 629120 732129 564455 185507 144635 196272 267545 236037 157534 -242212 -528888
11742 -528888 -436191 -190805 94385 684766 1212279 1341969 1081742 781157 554053 494075
11732 494075 362388 -151394 -224009 -97633 -110335 -156254 -122455 237844 452010 525404
11722 525404 605776 627495 569052 727669 999281 1294907 1342078 1049638 1012830 399952
11712 399952 -220753 -325870 -273838 -125252 -83967 -168613 159964 440740 376737 430345
11702 430345 707958 1374066 1841370 1726972 1224817 1154441 1108543 1134364 2017826 3174873
11692 3174873 3033263 2486783 1368456 301794 211508 758337 674109 -439574 -1511998
11683a511998R4864M91538M42746k09753r7474P82286P55249J25708k04680J22054
11673G90540K65603K87841M33934l05622r41573m81271k66563m47144O5616L5168
11663e63471N12885M03727l27547O3970J95038l41593j21269O9195k65882P1848
11653c03099L9912j33205j60130M5444J0568k57102P8935K74006k11444k63337
11643h79452K38822J07102J93126K06936J29372j44387O4151K13386O883K39526
11633C75465N20240K36321m35196q60605l76378M99192L68792K76486J87364j17839
11623F73842r56155o01857L38484L75308N17012L31651k08803k4572N14466L55280
11613A314656j7190m95875M0850K42353l38045l37240m0014k67424n2761J90278
$$ plain form
11683 -1511998 -1417134 -925596 -482850 -692603 -790077 -7791 747458 873166 668486 790540
11673 790540 1056143 1343984 1777918 1472296 530723 49452 -217111 -664255 -598639 -563471
11663 -563471 -50586 353141 25594 89564 284602 -56991 -178260 -109065 -374947 -303099
11653 -303099 -263187 -396392 -556522 -511078 -500510 -757612 -678677 -404671 -616115 -879452
11643 -879452 -640630 -533528 -340402 -133466 -4094 -148481 -84330 129056 135939 375465
11633 375465 895705 1132026 696830 -163775 -540153 -40961 327831 604317 791681 673842
11623 673842 -282313 -884170 -545686 -170378 346634 678285 469482 444910 959376 1314656
11613 1314656 1297466 801591 842441 1084794 746749 409509 369495 102071 49310 239588
11603B39588k67854K28822K57411k57314p029K96488L56473l28533n38740j90823
11593b11511l20538q6259l02998j60395L59463J87651L98758L95668l60916l06771
11583d07848j60504q0941M65405J42176n85244l83821m717m8243r3800M14225
11573g43312M32009j94375k21753K55868K0383k0925L72393O50462K77228j32393
11563F95585o0123k76201p92355m45119M21699L19378K12583J68712J2404J18229
11553C74792Q1214j73490j59308J36664q4784m01753K17559P90722k94983n67325
11543h0692j62158k11479J08506k9629j0133j25279J37862J69205K82412j17424
11533c8809J30249K95181M542m18498n38662k00265K17040j71147l40956k10452
$$ plain form
11603 239588 -28266 200556 457967 200653 193624 490112 846585 518052 -20688 -211511
11593 -211511 -532049 -618308 -921306 -1081701 -722238 -534587 -135829 259839 -101077 -407848
11583 -407848 -568352 -649293 -183888 -41712 -626956 -1010777 -1015494 -1063737 -1157537 -743312
11573 -743312 -311303 -505678 -727431 -471563 -451180 -472105 -99712 550750 827978 695585
11563 695585 635462 359261 -433094 -878213 -456514 -137136 75447 244159 256563 374792
11553 374792 456006 282516 123208 259872 175088 -226665 -9106 781616 486633 -80692
11543 -80692 -242850 -454329 -345823 -375452 -385585 -510864 -373002 -203797 78615 -38809
11533 -38809 91440 386621 391163 -27335 -565997 -766262 -549222 -720369 -1061325 -1271777
11523a271777m19004J24796P44117P63408O03957J96441p74949l19042K02846
11514a49207P5809j48879l6464J68320L32091M8793J1083j19517Q6944M45088
11504G14061k892m18055k60700K58856R6237J5976o4227l93513J83055O50412
11494G79210P82535J10228l30530l48375o44030k57607n1095J4971N7924q3617
11484B9614l07193j32659L76100N37430M72082k07295j12767n1333k70129m14868
11474h1018k33359P1796J17233L0805J12722P4968j04364n00159q9060j23604
11464g24040J5288l3535l21320k15591j04751q3315J83413R40682R20552M10234
11454I87617k6098o43807m73076Q004j38960j68759j70207q38258q72855k29683
$$ plain form
11523 -1271777 -1690781 -1565985 -821868 -58460 545497 741938 -33011 -352053 -149207
11514 -149207 -73398 -222277 -258741 -90421 241670 290463 301546 182029 268973 714061
11504 714061 711169 293114 32414 291270 387507 403483 339256 -54257 128798 779210
11494 779210 1561745 1671973 1341443 993068 349038 91431 40336 55307 113231 29614
11484 29614 -277579 -410238 -34138 503292 975374 768079 655312 603979 333850 -81018
11474 -81018 -314377 -242581 -125348 -94543 18179 93147 -11217 -511376 -600436 -724040
11464 -724040 -708752 -742287 -1063607 -1279198 -1383949 -1467264 -1283851 -343169 577383 987617
11454 987617 961519 317712 -155364 -147360 -286320 -455079 -625286 -1463544 -2336399 -2566082
11444b566082O91394Q80950N2829l8943k06412m29325m9203L1069J31314O53394
11434h49015M57912J66757j21684j50529O9747r8671J62391K15692k24582j52688
11424e24670k28792l38749j03670j67666m60168J02502K21606M8052P43246R61039
11414B52730J8530k52436r8420j696L10164k01048k84580q207K92618K24152p5282
11403A76525k21945K39110M57791K3992J46276n04830j56700O76086K69554m05368
11393G00491m34090l60506k28184N5681k14218j26937J87006J22935L1199L06680
11383D0057K74261J77035N2389j21075l88111p93310p59986n72744l94219P14995
11373a770708P76766K53896L39721O08260K75777q9823K82608M88691n2605j55433
$$ plain form
11444 -2566082 -1874688 -993738 -940909 -979852 -1186264 -1615589 -1664792 -1633723 -1502409 -849015
11434 -849015 -391103 -224346 -346030 -496559 -426812 -525483 -363092 -147400 -371982 -524670
11424 -524670 -753462 -1092211 -1195881 -1363547 -1823715 -1721213 -1499607 -1451555 -708309 252730
11414 252730 271260 18824 -79596 -81292 228872 27824 -256756 -264963 27655 251807 176525
11403 176525 -45420 193690 651481 675473 821749 316919 160219 836305 1105859 700491
11393 700491 266401 -94105 -322289 -266608 -480826 -607763 -420757 -297822 -266623 40057
11383 40057 314318 491353 543742 422667 34556 -758754 -1518740 -2091484 -2485703 -1770708
11373 -1770708 -993942 -740046 -400325 207935 483712 393889 676497 1165188 1112583 957150
11363I57150j2253K69970R5705p33873p22133l73241p4976J51782j77208j78197
11353g97274P0219K61741M18384L07185L44675K51629j04105r00400k02568L00635
11343d9879l4413j70821J76489M56112q8574j94885K6356K1395k59509L6185L63521
11332B81977J11170q4098m76924r4404K23452m3227r9866M0759q3136Q1269L51705
11321B08677k76504o77110o19493J07323P65335Q30030P32383L84370J50824l30220
11311A275615n11693j10127N50498J07479m43651k89268j34581k17566o87043
11302d60337j32756M10837r2117o13080q21993l6832R06572M11544J33415N92694
11292B97947J74547N1046L45050l67511m44687r9861l2144K81221N69518O24629
$$ plain form
11363 957150 944897 1214867 1310572 576699 -145434 -518675 -593651 -441869 -619077 -797274
11353 -797274 -727055 -465314 -46930 260255 604930 856559 752454 -147946 -350514 -49879
11343 -49879 -84292 -255113 -78624 377488 288914 94029 120385 141780 -117729 -81544 281977
11332 281977 393147 309049 -167875 -262279 -38827 -82054 -181920 -141161 -224297 -143028 208677
11321 208677 -67827 -744937 -1364430 -1257107 -491772 338258 1070641 1455011 1605835 1275615
11311 1275615 763922 653795 1204293 1311772 868121 578853 444272 226706 -460337
11302 -460337 -593093 -182256 -274373 -887453 -1709446 -1746278 -839706 -428162 -294747 297947
11292 297947 472494 523540 868590 501079 56392 -43469 -75613 205608 775126 1399755
11282A399755N36059K35104l90888l97503j09536m75866r60543n41909j3437L15242
11272d03522Q7475R390L40929K69501r5549m18595n58954n64140L02999J020858
11262i608O76830N17649J84897o17569m32254O2594j24604l33885n8965J88078
11252E3163j40699k00134K10187P03098J14893p56468o84253m77772k14191j8855
11242a411031J16547M58826N295q2134L32743N02222O06790L39887J08674p3388
11232I04431n5702Q679m38877l29655k39868l53129o72880j48733J86580L81466
11222g57688L78551j70753l63708J16005J89934N50435L54142o51200l53909O0022
11212f48169j75084J18335M72145J49771k38556J50289O33258L14635l9306n5052
$$ plain form
11282 1399755 1935814 2170918 1780030 1382527 1272991 797125 -163418 -705327 -718764 -403522
11272 -403522 -316047 -306657 34272 303773 208224 -210371 -769325 -1333465 -1030466 -9608
11262 -9608 667222 1184871 1369768 752199 319945 382539 257935 -75950 -134915 53163
11252 53163 -87536 -287670 -77483 625615 740508 -15960 -700213 -1177985 -1392176 -1411031
11242 -1411031 -1294484 -835658 -830363 -912497 -579754 -77532 529258 869145 977819 904431
11232 904431 848729 857408 418531 88876 -150992 -504121 -1177001 -1325734 -1139154 -757688
11222 -757688 -379137 -549890 -913598 -797593 -607659 -57224 296918 -354282 -708191 -648169
11212 -648169 -823253 -704918 -232773 -83002 -321558 -171269 461989 776624 737318 682266
11202F82266j96342l60183l26828n1342K64042K44678L24173j14308p65729m21156
11192g20729k95278l27791K74288j08174l31449j51454N71202L03970k70101j31942
11182a187458J48756L72613O15826L84902m9110L87092L11218p36041k53909J1203
11172E092j32378k80753P783K77032l70617m58101k21559K45066M44237K67997
11162b16201j97331m24991P4898L1506j50252k47582n49505j78969M70730P65375
11152f22322K17661L7795j48376p3103k24455J07718O05849O03597K99137q3957
11142G19544p17602p24810j97853O06464N86248m07139m21126l49883j57069Q5509
11132i77717L83000R3051m06550j53642N5976J77582K3482k38641j14780k93179
$$ plain form
11202 682266 485924 125741 -201087 -252429 11613 256291 580464 466156 -299573 -720729
11192 -720729 -1016007 -1343798 -1069510 -1177684 -1509133 -1660587 -1089385 -785415 -1055516 -1187458
11182 -1187458 -1038702 -666089 -50263 334639 285529 672621 983839 247798 -6111 5092
11172 5092 -127286 -408039 -400256 -123224 -493841 -951942 -1173501 -928435 -484198 -216201
11162 -216201 -413532 -838523 -763625 -732119 -882371 -1129953 -1679458 -1858427 -1387697 -622322
11152 -622322 -404661 -366866 -515242 -588345 -812800 -705082 -99233 504364 803501 719544
11142 719544 1942 -722868 -920721 -314257 271991 -135148 -556274 -906157 -1063226 -977717
11132 -977717 -594717 -501666 -908216 -1061858 -1005882 -828300 -804818 -1043459 -1158239 -1451418
11122a451418o68751K05214N55104L41688l7749j29880K8280J39230L8346k32230
11112a212166q7109L09179N18604K82652k52933n99752j20802o9813o6893k12742
11102a511775k1603K46719J02409k83757l81334K27406N37466K03150j16038j76906
11092a174263l67173K57265O51632K72412L17984k0903j81893m27373n43874K4634
11082a191552O47975M67197j28584j12055P0277j68065L84557N47918M40956n880
11072I52744l59344m92270K75250M66895r1652K46377l45556p89773l97569j89231
11062g24129j02058O45384J019753K48608m74795l99647o84211o39069k67206
11053a377370P6243j56801Q6452K93918M19329n6071o07632k30120P6427K34754
$$ plain form
11122 -1451418 -2120169 -1914955 -1359851 -1018163 -1055912 -1185792 -1157512 -1018282 -979936 -1212166
11112 -1212166 -1299275 -990096 -471492 -188840 -441773 -1041525 -1162327 -1232140 -1299033 -1511775
11102 -1511775 -1533378 -1286659 -1184250 -1468007 -1849341 -1621935 -1084469 -881319 -997357 -1174263
11092 -1174263 -1541436 -1284171 -632539 -360127 -42143 -63046 -244939 -672312 -1216186 -1191552
11082 -1191552 -543577 -76380 -204964 -317019 -246742 -414807 -30250 517668 958624 952744
11072 952744 593400 101130 376380 843275 751623 998000 652444 -137329 -534898 -724129
11062 -724129 -826187 -180803 838950 1087558 612763 213116 -471095 -1110164 -1377370
11053 -1377370 -1301127 -1457928 -1371476 -1077558 -658229 -714300 -1321932 -1552052 -1475625 -1240871
11043a240871J1871o6967K43224K29744o22465j96397M13671N70335N13524m13320
11033e57651q23111j42280O42092L50541m29448J28815O43750M03747L87066L10243
11023I13764J4238P7656j84714j45810n6401n04194o73689m87567J69099L72072
11013e05546p8061M4896L40747O77136K9032l84937j036077r10303k68108k14625
11003b305846R10726R90809J05829l4072k32449j37989R9371J37010j00382l00529
10993h67522K15479M56168L02593J09726J69997M30202N71829K92829k96759m93556
10983H90986N019j93702l05005l59905n02849m24668r5473K69430M86766K13892
10973a5509j83839j50648j4800j06060j55447L42696Q40323P77171M08379m04689
$$ plain form
11043 -1240871 -1229000 -1295967 -1052743 -822999 -1445464 -1641861 -1228190 -657855 -144331 -557651
11033 -557651 -1380762 -1523042 -880950 -530409 -959857 -831042 -187292 216455 603521 913764
11023 913764 928002 1005658 820944 675134 618733 114539 -559150 -1046717 -877618 -505546
11013 -505546 -583607 -538711 -197964 479172 508204 123267 -912810 -1823113 -2091221 -2305846
11003 -2305846 -1395120 -404311 -298482 -332554 -565003 -702992 -603621 -466611 -566993 -867522
10993 -867522 -652043 -195875 106718 216444 386441 816643 1388472 1681301 1384542 890986
10983 890986 896005 702303 397298 37393 -465456 -890124 -985597 -716167 -229401 -15509
10973 -15509 -199348 -349996 -364796 -470856 -626303 -283607 556716 1333887 1742266 1337577
10963A337577n21294o83196o23617k85491j7431L64650j01964l29170O2963L13809
10953d83164L09137O61952k047p18416n89815l36014M85753N47753K82516M85742
10943F43397N50536J87434j72995k91375p06901m79367J53237K77099m3316j40359
10933b2610j44468N030M3886k90533n68379k96702o30698j71739l6K35550M49853
10922a390846L12251Q7240L59209L69497k40030k01726j65568L91360P41280L5418
10912B98085k71973k46665j50049l32248M0879l863q9011L35084N37405o38n35551
10901d18545j45458N71728J56156p4991J04621k58614j57695k30668p7056L27743
10891b02779O63094M04962K51281j0712m7402K22181O5089k04863l14270k1857
$$ plain form
10963 1337577 816283 133087 -490530 -776021 -793452 -428802 -530766 -859936 -796973 -483164
10953 -483164 -174027 487925 485878 -232538 -822353 -1158367 -672614 -124861 157655 643397
10943 643397 1193933 1381367 1208372 916997 210096 -269271 -116034 161065 117749 -22610
10933 -22610 -167078 -162048 -118162 -408695 -977074 -1273776 -1904474 -2076213 -2076249 -1840699 -1390846
10922 -1390846 -1078595 -991355 -632146 -262649 -502679 -704405 -869973 -478613 262667 298085
10912 298085 26112 -220553 -370602 -702850 -661971 -665834 -754845 -419761 117644 117006 -418545
10901 -418545 -564003 7725 163881 88890 193511 -65103 -222798 -453466 -530522 -202779
10891 -202779 460315 865277 1116558 1105846 1058444 1280625 1345714 1140851 826581 804724
10881H04724J12457J04553L27880J99173k29838l26852p56142j051875o2506j37506
10871a015932k09687J12665K77206J14129M36159M08371l2983p2395p5583k58284
10861c16334j31197p1174M734L42364K15518j72632j25451m2202L1866J14844
10851a49664L90800L97750K55082k06943k92978p850j7909l33524j010729m60900
10841a436865L63440M92411L28191m58078n31494o5560K65515K51202L29807M05144
10831e6287M30121K4376o44283m30609k96576o4241M47423L26393L92224K7952
10821A56493j22363N1290K14879L53469K09253M4760K30520K88786p4419n32823
10811H19845k27126K00385j89845l41734p91996o56133l10239M2680J70687j9945
$$ plain form
10881 804724 917181 1021734 1349614 1548787 1318949 992097 235955 -815920 -878426 -1015932
10871 -1015932 -1225619 -1112954 -835748 -721619 -285460 122911 89928 17533 -58050 -316334
10861 -316334 -447531 -518705 -513971 -171607 43911 -128721 -254172 -296374 -264508 -149664
10851 -149664 241136 638886 893968 687025 394047 386197 368288 34764 -975965 -1436865
10841 -1436865 -1073425 -581014 -252823 -710901 -1242395 -1307955 -1042440 -791238 -461431 -56287
10831 -56287 373834 398210 -246073 -676682 -973258 -1037499 -590076 -263683 128541 156493
10821 156493 34130 85420 300299 653768 863021 907781 1138301 1427087 1352668 819845
10811 819845 592719 793104 603259 261525 -530471 -1186604 -1496843 -1454163 -1283476 -1303421
10801a303421k75911k65939O39780J045556M24389J57758R5741K8016J56992J95589
10791H98550l1013m37939k37183k63603n44746k16416M32363O32352k937o34240
10781d04812n38936J29956L34135M31049M22252j06228m51201n9244m058j89172
10771d36259j6367J7407R734K51283L6209l63472m5522K43755k22971k89008j19737
10760i34948K02882k72521l01139m8755j18569K93565L33948N3346k54794j3973
10750a060958J18904J700J55679P46024P0845r7810j7861J00810P53321L35968
10740A106622p17904p55628j91107P495k81431n87372n12295j1647P04121N93528
10730f45618L35737j08981n14743o1302M70411J05011K6915N5242j79430r3869
$$ plain form
10801 -1303421 -1579332 -1845271 -1205491 -159935 264454 422212 517953 545969 702961 898550
10791 898550 867537 429598 192415 -71188 -615934 -832350 -399987 232365 229428 -404812
10781 -404812 -943748 -813792 -479657 -48608 373644 267416 -183785 -243029 -247087 -436259
10771 -436259 -452626 -435219 -425485 -174202 -137993 -501465 -546987 -303232 -526203 -815211 -934948
10760 -934948 -732066 -1004587 -1305726 -1354481 -1473050 -1179485 -845537 -792191 -1046985 -1060958
10750 -1060958 -942054 -940354 -784675 -38651 32194 -65616 -83477 17333 770654 1106622
10740 1106622 388718 -366910 -558017 -550522 -831953 -1419325 -1931620 -1943267 -1239146 -645618
10730 -645618 -309881 -418862 -933605 -994907 -524496 -419485 -392570 -337328 -516758 -610627
10720f10627K04230K36028R4408k28780l33746k3768O26020N62965r0290k01825
10710B34615j69426J90365m80742o77136j98758j19021l7269J43341J58509M10865
10700e44657J78238M4204J3792o6262k92906J79418P2445l10882m11573k1283
10690a159466K57923O9419k30188p4182M80622P62854L52019K55854j41048l31296
10680B42511j8382K83159J13017l99038l43802L9625N24416L71184K3222j44522
10670F91390k78949k21977j15399m07398l02380L70138N3380J31055O56541K57652
10660H34053j61917o61913j037726o31890M16087M74194l13631l21399L42463
10651a061679J41476j03645J84329K4l45719l31276k17367M26319J47492n24350
$$ plain form
10720 -610627 -406397 -170369 -75961 -304741 -638487 -662255 -36235 526730 436440 234615
10710 234615 65189 255554 -225188 -902324 -1101082 -1220103 -1257372 -1114031 -955522 -544657
10700 -544657 -366419 -322215 -308423 -374685 -667591 -488173 -415728 -726610 -1138183 -1159466
10690 -1159466 -901543 -832124 -1062312 -1136494 -655872 106982 459001 714855 573807 242511
10680 242511 224129 507288 620305 221267 -122535 -82910 441506 812690 835912 691390
10670 691390 412441 190464 75065 -332333 -634713 -264575 -211195 -80140 576401 834053
10660 834053 672136 10223 -1027503 -1659393 -1243306 -769112 -1082743 -1404142 -1061679
10651 -1061679 -920203 -1023848 -839519 -839495 -1185214 -1516490 -1733857 -1307538 -1160046 -1684396
10641a684396M7615M62278N03063N05019J23387l76155L72983P65495J34015n26006
10631C27298p09017m54671L34390O65045K04607M5987M71L08499J7929J27537
10621H68075J84114O839o51033m69920l1460q6687l70248L98792M74485l01999
10611B0958m00459J07055K91706l52245k1584J31766K29939L36913K08021K77941
10601H30011n2288n36668l10978J3915k88126k53939l87823k72577K6139j8346
10591a250680j76771M46079N30179J47080J18693K17480J05400J18740m02639
10582a46439o10254n00930j11758M78826L20238N2074k36766N6958K35150m21874
10572h84775m01595j73753P9584M5763L93771M35438M69698M12952k61169l84692
$$ plain form
10641 -1684396 -1636781 -1174503 -671440 -166421 -43034 -419189 -46206 719289 853304 327298
10631 327298 -381719 -836390 -502000 163045 367652 413639 414110 722609 740538 868075
10621 868075 1052189 1059028 407995 -61925 -93385 -180072 -550320 -151528 322957 20958
10611 20958 -379501 -272446 19260 -332985 -354569 -222803 7136 344049 552070 830011
10601 830011 777723 241055 -69923 -56008 -344134 -598073 -985896 -1258473 -1232334 -1250680
10591 -1250680 -1427451 -981372 -451193 -304113 -185420 32060 137460 256200 -146439
10582 -146439 -756693 -1257623 -1369381 -890555 -570317 -518243 -755009 -698051 -462901 -884775
10572 -884775 -1286370 -1460123 -1380539 -1334776 -941005 -505567 -35869 377083 115914 -268778
10562b68778k00601L51448r9412m87407j5562l1382K52724J66334j4848J23059
10552b24425K20732N20514K19528n13697k93776j4973K22500J54119p9841R1792
10542C02473j32772m1072M38086o3020m46361p6871J35585l5641N6686k47177
10532a10084K17384J73599n74093o33407O60684M83829k24161J29280L4771j79082
10522b1280j65461J00209n17582n77317l44968O549K98361N19457R78513K09646
10512D86127q8347j77555n08358p55683p74016l79669M91396M65915j14991j56370
10502a511551K18634O13834m4460k13047m88766l30620J70927Q33815K32168n64049
10492a083115l67417k71517k48487L76493P60430M48409l15383o5120N61400O33790
$$ plain form
10562 -268778 -469379 -117931 -217343 -704750 -720312 -751694 -498970 -332636 -347484 -224425
10552 -224425 -3693 516821 736349 222652 -71124 -86097 136403 290522 210681 302473
10542 302473 169701 128629 566715 503695 57334 -19537 116048 80407 137093 -110084
10532 -110084 107300 280899 -293194 -926601 -265917 217912 -6249 123031 157802 -21280
10522 -21280 -186741 -86532 -604114 -1181431 -1526399 -1519850 -1221489 -702032 276481 486127
10512 486127 397780 220225 -288133 -1043816 -1817832 -2197501 -1706105 -1240190 -1355181 -1511551
10502 -1511551 -1292917 -679083 -723543 -936590 -1425356 -1755976 -1585049 -751234 -519066 -1083115
10492 -1083115 -1450532 -1722049 -1970536 -1594043 -833613 -385204 -700587 -765707 -204307 429483
10482D29483L86127k20036l82878n93474n55105l76386q4713j98961j67371L12927
10472a450387M92678M56888J4363k57527n88841p28266j08926N76866O48511N19451
10462d25190M75654N75059J69408m07963l77867n26488p58675o28191j64654Q48577
10452a220330J103441L76917j2497K12974k0372j48586k59168J74418K14223l09053
10442A11967k12892M98970R59911J060893O39216O46644Q11202Q42970J261760
$$ plain form
10482 429483 815610 595574 212696 -380778 -935883 -1312269 -1396982 -1595943 -1763314 -1450387
10472 -1450387 -957709 -500821 -486458 -743985 -1332826 -2061092 -2170018 -1593152 -944641 -425190
10462 -425190 50464 625523 794931 386968 9101 -517387 -1276062 -1904253 -2068907 -1220330
10452 -1220330 -116889 260028 247531 460505 440133 291547 32379 206797 421020 111967
10442 111967 -100925 398045 1357956 2418849 3058065 3704709 4515911 5358881 6620641
$$ [...]
##END NTUPLES=NMR SPECTRUM
##END=
