##TITLE=C13_SL-67-Dau(f5)
 CDCL3, sc
 2.6.2021
##JCAMPDX= 6.0         $$ Bruker NMR JCAMP-DX V2.0
##DATA TYPE= NMR SPECTRUM
##DATA CLASS= NTUPLES
##ORIGIN= UXNMR, Bruker Analytische Messtechnik GmbH
##OWNER= root
$$ XWIN-NMR		Version 3.5
$$ Thu Jun  3 09:51:00 2021 Russian Standard Time (UT+4h)  she@DPX200
##.OBSERVE FREQUENCY= 50.3277607988526
##.OBSERVE NUCLEUS= ^13C
##.ACQUISITION MODE= SIMULTANEOUS
##.ACQUISITION SCHEME= undefined
##.AVERAGES= 15615
##.DIGITISER RES= 17
##SPECTROMETER/DATA SYSTEM= spect
##.PULSE SEQUENCE= zgpg30
##.SOLVENT NAME= DMSO
##.SHIFT REFERENCE= (INTERNAL, DMSO, 0, 219.126)
##AUDIT TRAIL= $$ (NUMBER, WHEN, WHO, WHERE, WHAT)
$$ ##TITLE= Audit trail, XWIN-NMR		Version 3.5
$$ ##JCAMPDX= 5.01
$$ ##ORIGIN= Bruker BioSpin GmbH
$$ ##OWNER= she
$$ F:/spectra/data/she/nmr/C13cpd-SL-67-Dau(f5)/1/pdata/1/auditp.txt
$$ ##AUDIT TRAIL=  $$ (NUMBER, WHEN, WHO, WHERE, WHAT)
(   1,<2021-06-03 09:33:34.87 +0400>,<servis>,<DPX200>,
      <created by zg, POWCHK disabled, PULCHK disabled
       terminated by command 'halt'
       configuration hash MD5:
       00 E9 B6 7A A2 85 ED C7 34 08 36 98 17 FE 4E 26
       data hash MD5: 32K
       88 AC 98 83 D1 15 0D 2E 10 E9 B4 EB 13 87 65 E1>)
(   2,<2021-06-03 09:33:45.15 +0400>,<servis>,<DPX200>,
      <Start of raw data processing
       efp BC_mod = 2 LB = 1 FT_mod = 6 PKNL = 1 PHC0 = -218.024 PHC1 = 34.50854 SI = 32K 
       data hash MD5: 32K
       74 62 F2 7F 47 96 0E 29 E4 93 4E BD D3 91 F9 E8>)
(   3,<2021-06-03 09:33:59.96 +0400>,<servis>,<DPX200>,
      <abs ABSG = 5 
       data hash MD5: 32K
       F3 5E 74 D3 0B DA 6A C3 4E 56 2C A7 33 84 B3 FA>)
(   4,<2021-06-03 09:34:10.50 +0400>,<servis>,<DPX200>,
      <pk PHC0 = 3.6 PHC1 = 0 
       data hash MD5: 32K
       95 59 7C 5C A2 DD 11 B6 F9 6E FA C1 5F C5 F2 63>)
(   5,<2021-06-03 09:44:12.64 +0400>,<she>,<DPX200>,
      <fromjdx created from
       c:\Documents and Settings\she\C13cpd-SL-67-Dau(f5).dx
       data hash MD5: 32K
       95 59 7C 5C A2 DD 11 B6 F9 6E FA C1 5F C5 F2 63>)
$$ ##END=
$$ 
$$ hash MD5
$$ 4F EE 12 A7 93 38 F4 48 0A E8 67 30 26 FF 76 DC
##$RELAX= 
##$RELAX= 
##$RELAX= 
##$RELAX= 
##$RELAX= 
##$RELAX= 
##$RELAX= 
##$RELAX= 
$$ Bruker specific parameters
$$ --------------------------
##$DU= <F:/spectra>
##$EXPNO= 1
##$NAME= <C13cpd-SL-67-Dau(f5)>
##$PROCNO= 1
##$TYPE= <nmr>
##$USER= <she>
##$AMP= (0..31)
100 100 100 100 100 100 100 100 100 100 100 100 100 100 100 100 100 100 
100 100 100 100 100 100 100 100 100 100 100 100 100 100 
##$AQSEQ= 0
##$AQ_mod= 1
##$AUNM= <au_zg>
##$AUTOPOS= <>
##$BF1= 50.322729
##$BF2= 200.13
##$BF3= 50.322729
##$BF4= 50.322729
##$BF5= 500.13
##$BF6= 500.13
##$BF7= 500.13
##$BF8= 500.13
##$BYTORDA= 0
##$CFDGTYP= 0
##$CFRGTYP= 5
##$CHEMSTR= <none>
##$CNST= (0..31)
1 1 145 1 1 1 1 1 1 1 1 1 1 1 1 1 1 1 1 1 1 1 1 1 1 1 1 1 1 1 1 1 
##$CPDPRG= <waltz16>
##$CPDPRG1= <>
##$CPDPRG2= <waltz16>
##$CPDPRG3= <>
##$CPDPRG4= <mlev>
##$CPDPRG5= <mlev>
##$CPDPRG6= <mlev>
##$CPDPRG7= <mlev>
$$ [...]
##$SUBNAM3= <"">
##$SUBNAM4= <"">
##$SUBNAM5= <"">
##$SUBNAM6= <"">
##$SUBNAM7= <"">
##$SUBNAM8= <"">
##$SUBNAM9= <"">
##$SW= 238.246396889851
##$SWIBOX= (0..15)
0 1 3 0 0 0 0 0 0 0 0 0 0 0 0 0 
##$SW_h= 11990.4076738609
##$TD= 32768
##$TD0= 1
##$TE= 0
##$TE2= 300
##$TE3= 300
##$TEG= 300
##$TL= (0..7)
0 120 120 120 120 120 120 120 
##$TP= (0..7)
150 150 150 150 150 150 150 150 
##$TP07= 0
##$TPNAME0= <>
##$TPNAME1= <>
##$TPNAME2= <>
##$TPNAME3= <>
##$TPNAME4= <>
##$TPNAME5= <>
##$TPNAME6= <>
##$TPNAME7= <>
##$TPOAL= (0..7)
0.5 0.5 0.5 0.5 0.5 0.5 0.5 0.5 
##$TPOFFS= (0..7)
0 0 0 0 0 0 0 0 
##$TUNHIN= 0
##$TUNHOUT= 0
##$TUNXOUT= 0
##$USERA1= <user>
##$USERA2= <user>
##$USERA3= <user>
##$USERA4= <user>
##$USERA5= <user>
##$V9= 5
##$VALIST= <valist>
##$VCLIST= <CCCCCCCCCCCCCCC>
##$VD= 0
##$VDLIST= <DDDDDDDDDDDDDDD>
##$VPLIST= <PPPPPPPPPPPPPPP>
##$VTLIST= <TTTTTTTTTTTTTTT>
##$WBST= 1024
##$WBSW= 20
##$XGAIN= (0..3)
0 0 0 0 
##$XL= 0
##$YL= 0
##$YMAX_a= 45151590
##$YMIN_a= -141033901
##$ZGOPTNS= <>
##$ZL1= 120
##$ZL2= 120
##$ZL3= 120
##$ZL4= 120
##$ABSF1= 219.1257
##$ABSF2= -19.14452
##$ABSG= 5
##$ABSL= 3
##$ALPHA= 0
##$AQORDER= 0
##$ASSFAC= 0
##$ASSFACI= 0
##$ASSFACX= 0
##$ASSWID= 0
##$AUNMP= <proc_1d>
##$AZFE= 0.1
##$AZFW= 0.5
##$BCFW= 0
##$BC_mod= 2
##$BYTORDP= 0
##$COROFFS= 0
##$CY= 12.5
##$DATMOD= 1
##$DC= 0
##$DFILT= <>
##$DTYPP= 0
##$F1P= 99.9999945759776
##$F2P= -179.999992907048
##$FCOR= 0.5
##$FTSIZE= 32768
##$FT_mod= 6
##$GAMMA= 0
##$GB= 0
##$INTBC= 1
##$INTSCL= 0
##$ISEN= 30
##$LB= 1
##$LEV0= 0
##$LPBIN= 0
##$MAXI= 10000
##$MC2= 0
##$MEAN= 0
##$ME_mod= 0
##$MI= 0
##$NCOEF= 0
##$NC_proc= 4
##$NLEV= 6
##$NOISF1= 0
##$NOISF2= 0
##$NSP= 0
##$NTH_PI= 0
##$NZP= 0
##$OFFSET= 219.1257
##$PC= 1.4
##$PHC0= -214.424
##$PHC1= 34.50854
##$PH_mod= 1
##$PKNL= yes
##$PPARMOD= 0
##$PSCAL= 4
##$PSIGN= 0
##$REVERSE= no
##$SF= 50.322729
##$SI= 32768
##$SIGF1= 0
##$SIGF2= 0
##$SINO= 80
##$SIOLD= 32768
##$SREGLST= <13C.CDCl3>
##$SSB= 0
##$STSI= 32768
##$STSR= 0
##$SW_p= 11990.4076738609
##$SYMM= 0
##$S_DEV= 0
##$TDeff= 32768
##$TDoff= 0
##$TI= <>
##$TILT= no
##$TM1= 0
##$TM2= 0
##$TOPLEV= 0
##$USERP1= <user>
##$USERP2= <user>
##$USERP3= <user>
##$USERP4= <user>
##$USERP5= <user>
##$WDW= 1
##$XDIM= 32768
##$YMAX_p= 525019436
##$YMIN_p= -3754833
$$ End of Bruker specific parameters
$$ ---------------------------------
##NTUPLES= NMR SPECTRUM
##VAR_NAME=  FREQUENCY,     SPECTRUM/REAL,   SPECTRUM/IMAG
##SYMBOL=    X,             R,               I
##VAR_TYPE=  INDEPENDENT,   DEPENDENT,       DEPENDENT
##VAR_FORM=  AFFN,          ASDF,            ASDF
##VAR_DIM=   32768,         32768,           32768
##UNITS=     HZ,            ARBITRARY UNITS, ARBITRARY UNITS
##FACTOR=    0.365929370215793, 1,           1
##FIRST=     11027.0033138647, 0,            0
##LAST=      -963.404359996184, 0,           0
##MIN=       -963.404359996184, -3754833,    0
##MAX=       11027.0033138647, 525019436,    0
$$ Real data points
##PAGE= N=1
##DATA TABLE= (X++(R..R)), XYDATA
$$ [...]
$$ plain form
16210 657476 287045 129523 -64950 -649724 -1488140 -1534977 -1278338 -1055552 -849972 -954914
16200 -954914 -1134962 -1519999 -1573760 -1120140 -677602 -595830 -166617 404651 509225 233992
16190 233992 -299930 -683425 -1342811 -1630544 -1587894 -1127476 -374487 -339671 -814394 -1171683
16180 -1171683 -1028246 -542692 -275289 -268501 -777687 -581884 -336140 -646020 -684498 -856573
16170 -856573 -959726 -851968 -635599 -272005 -82788 -423969 -913055 -1032270 -880343 -960382
16160 -960382 -1430217 -1693342 -1562830 -1381553 -764102 -342620 -227784 204918 -17595 -219033
16150 -219033 -182049 240398 424184 88354 -46381 -4751 -964151 -1895976 -2359568 -2152880
16140 -2152880 -1518032 -829637 -43784 409171 452606 477323 875501 1183464 496444 -346956
$$ packed form
16210F57476l70431j57522j94473n84774q38416m6837K56639K22786K05580j04942
16200i54914j80048l85037n3761M53620M42538Q1772M29213N71268J04574k75233
16190B33992n33922l83495o59386k87733M2650M60418P52989L4816m74723l57289
16180a171683J43437M85554K67403O788n09186J95803K45744l09880l8478j72075
16170h56573j03153J07758K16369L63594J89217l41181m89086j19215J51927q0039
16160i60382m69835k63125J30512J81277O17451M21482J14836M32702k22513k01438
16150b19033L6984M22447J83786l35830j34735M1630r59400r31825m63592K06688
16140b152880O34848O88395P85853M52955M3435K4717L98178L07963o87020q43400
$$ plain form
16130 -346956 -503138 -100952 52536 -254985 -1096570 -1561356 -1029247 -425101 110407 311062
16120 311062 -43750 -825852 -1039309 -498215 94623 253921 464640 804693 611670 312273
16110 312273 59955 -258958 -612659 -985696 -1087415 -607274 -168821 281888 394225 -355004
16100 -355004 -1008029 -1295443 -1593777 -1816744 -1138615 -706148 -578218 -407673 -544409 -1008677
16090 -1008677 -1101006 -961817 -719527 -347566 -519673 -594992 9900 -24506 -356662 -327481
16080 -327481 -280041 -150685 -382063 -735096 -748983 -753150 -883002 -1198499 -1497649 -1664981
16070 -1664981 -1987644 -2030789 -1493274 -881883 -631929 -654916 -43858 279844 479654 742301
16060 742301 284937 -89044 -271145 -151533 327154 220106 -618647 -733230 -45279 830146
$$ packed form
16130c46956j56182M02186J53488l07521q41585m64786N32109O04146N35508K00655
16120C11062l54812p82102k13457N41094N92838J59298K10719L40053j93023k99397
16110C12273k52318l18913l53701l73037j01719M80141M38453M50709J12337p49229
16100c55004o53025k87414k98334k22967O78129M32467J27930J70545j36736m64268
16090a008677r2329J39189K42290L71961j72107p5319O04892l4406l32156K9181
16080c27481M7440J29356k31378l53033j3887m167j29852l15497k99150j67332
16070a664981l22663m3145N37515O11391K49954k2987O11058L23702J99810K62647
16060G42301m57364l73981j82101J19612M78687j07048q38753j14583O87951Q75425
$$ plain form
16050 830146 1049747 505714 -33954 -367486 -437013 -726483 -1532391 -2375114 -2387187 -2039285
16040 -2039285 -1823965 -1879727 -2005774 -1868692 -1390053 -492929 -88426 293454 1000183 1150882
16030 1150882 850891 242627 -224597 -762351 -925190 -347953 325933 625335 278968
16021 278968 -308047 -485438 -562440 -406976 82706 338930 295008 414616 502782 -21437
16011 -21437 -707665 -1084054 -1294116 -759874 -734187 -984782 -999591 -606527 -734811 -1448645
16001 -1448645 -1449160 -591686 -51277 -732630 -1199622 -1268984 -1681248 -1478893 -941181 -833364
15991 -833364 -855523 -1311249 -1579276 -1268099 -795432 -619704 -932392 -1469786 -1266594 -705160
15981 -705160 -1009637 -1574890 -1900122 -1785828 -1519257 -1666912 -2127897 -1879326 -1031161 -899991
$$ packed form
16050H30146K19601n44033n39668l33532o9527k89470q05908q42723j2073L47902
16040b039285K15320n5762j26047J37082M78639Q97124M04503L81880P06729J50699
16030A150882k99991o08264m67224n37754j62839N77237O73886K99402l46367
16021B78968n87015j77391p7002J55464M89682K56224m3922J19608Q8166n24219
16011b1437o86228l76389k10062N34242K5687k50595j4809L93064j28284p13834
16001a448645n15Q57474N40409o81353m66992o9362m12264K02355N37712J07817
15991h33364k2159m55726k68027L11177M72667J75728l12688n37394K03192N61434
15981g05160l04477n65253l25232J14294K66571j47655m60985K48571Q48165J31170
$$ plain form
15971 -899991 -589232 -168560 -165157 -216497 -438633 -731200 -542088 110380 1061249 1328914
15961 1328914 1030993 545114 160426 179383 435000 759278 951688 465500 250128 337687
15951 337687 -313215 -520644 -58136 398677 359052 28839 -300976 -374617 -262161 -241450
15941 -241450 77109 294963 550360 1195489 1055926 704739 665883 821769 396886 -165742
15931 -165742 -520472 -295447 -32830 -456663 -903749 -977100 -499919 -17283 312152 233814
15921 233814 -315491 -864066 -1427806 -1548577 -1261186 -1430265 -1858226 -2159600 -1540021 -999614
15911 -999614 -1545957 -1801372 -1704960 -899353 -152332 -362190 -889098 -904281 -863372 -988991
15901 -988991 -753805 -650300 -551846 -723707 -760736 -481273 -154280 152919 312191 262412
$$ packed form
15971h99991L10759M20672L403n1340k22136k92567J89112O52468R50869K67665
15961A328914k97921m85879l84688J8957K55617L24278J92410m86188k15372Q7559
15951C37687o50902k07429M62508M56813l9625l30213l29815p3641J12456K0711
15941b41450L18559K17854K55397O45129j39563l51187l8856J55886m24883n62628
15931a65742l54730K25025K62617m23833m47086p3351M77181M82636L29435p8338
15921B33814n49305n48575n63740j20771K87391j69079m27961l01374O19579N40407
15911i99614n46343k55415R6412Q05607P47021k09858n26908j5183M0909j25619
15901i88991K35186J03505R8454j71861l7029K79463L26993L07199J59272m9779
$$ plain form
15891 262412 296116 47710 -382756 -189870 270941 276771 -84455 -171742 -223886 21542
15881 21542 717211 745564 315077 -102356 -885154 -1358322 -1337023 -1041031 -510994 -222723
15871 -222723 -259779 -415813 -511730 -484304 -599809 -800117 -1138848 -946985 -631922 -561173
15861 -561173 -664354 -1050215 -1447860 -1546269 -1123527 -796722 -964014 -1191949 -1155664 -438123
15851 -438123 -8764 51332 -39008 -253840 -668484 -730246 -793526 -1131224 -805106 -680520
15841 -680520 -734433 -677964 -420207 158462 875402 1560845 1720815 967070 226475 -68091
15831 -68091 -213352 116094 435490 234737 93918 107076 185814 664859 897708 703516
15821 703516 416111 126037 -408891 -1345605 -1252761 -1402987 -1967884 -1849274 -1515233 -1380959
$$ packed form
15891B62412L3704k48406m30466J92886M60811N830l61226q7287n2144K45428
15881B1542O95669K8353m30487m17433p82798m73168K1299K95992N30037K88271
15871b22723l7056j56034r5917K7426j15505k00308l38731J91863L15063P0749
15861e61173j03181l85861l97645r8409M22742L26805j67292k27935L6285P17541
15851d38123M29359O0096r0340k14832m14644o1762o3280l37698L26118J24586
15841f80520n3913N6469K57757N78669P16940O85443J59970p53745p40595k94566
15831f8091j45261L29446L19396k00753j40819J3158P8738M79045K32849j94192
15821G03516k87405k90074n34928r36714R2844j50226n64897J18610L34041J34274
$$ plain form
15811 -1380959 -1025739 -409626 -191723 -645100 -908518 -982484 -585521 -772346 -1661296 -2117966
15801 -2117966 -2279379 -1846588 -1291999 -945413 -429643 -99994 -294196 -316113 -119362 -314686
15791 -314686 -1104601 -1003588 -278394 -175798 -478055 -440624 -571068 -665749 -933360 -1102329
15781 -1102329 -1051948 -863509 -57570 555498 421506 165432 371485 460791 49340 -272628
15771 -272628 -612581 -772966 -308487 61761 67247 -322321 -548677 -70038 327188 420647
15761 420647 27192 -276280 191840 540170 323687 34538 146069 -26620 -133040 462737
15751 462737 766892 355795 -29325 -480231 -946467 -1698451 -2543176 -2712142 -1933332 -933667
15741 -933667 -500536 -255685 98444 -5152 176749 378033 408090 266672 -42139 -210249
$$ packed form
15811a380959L55220O16113K17903m53377k63418p3966L96963j86825q88950m56670
15801b117966j61413M32791N54589L46586N15770L29649j94202k1917J96751j95324
15791c14686p89915J01013P25194J02596l02257L7431j30444r4681k67611j68969
15781a102329N0381J88439Q05939O13068j33992k56074K06053Q9306m11451l21968
15771b72628l39953j60385M64479L70248N486l89568k26356M78639L97226R3459
15761D20647l93455l03472M68120L48330k16483k89149J11531j72689j06420N95777
15751D62737L04155m11097l85120m50906m66236p51984q44725j68966P78810R99665
15741i33667M33131K44851L54129j03596J81901K01284L0057j41418l08811j68110
$$ plain form
15731 -210249 -570748 -1046631 -1067364 -900762 -775019 -860242 -954663 -570731 -387697 -201397
15721 -201397 -165455 -564015 -663170 -611996 71542 486171 407580 523593 581747 437006
15711 437006 194919 -295894 -1067452 -1449182 -1299810 -806974 -11142 501514 748814 1245303
15701 1245303 1262229 728905 380441 445533 672085 674842 175886 -360907 -411343 -525419
15691 -525419 -901832 -471878 471512 590303 -24808 -674968 -614624 -591710 -742464 -922744
15681 -922744 -866744 -617343 -522319 -371393 -218039 -301876 -207359 -239462 -101992 -204424
15671 -204424 -691047 -761674 -797898 -777329 -938663 -1117329 -1622033 -1982953 -1556012 -1044703
15661 -1044703 -907413 -1319645 -2041750 -2279669 -1950371 -1597630 -1056472 -788366 -981891
$$ packed form
15731b10249l60499m75883k0733J66602J25743q5223r4421L83932J83034J86300
15721b01397L5942l98560r9155N1174O83538M14629p8591J16013N8154j44741
15711D37006k42087m90813p71558l81730J49372M92836P95832N12656K47300M96489
15701A245303J6926n33324l48464O5092K26552K757m98956n36793n0436j14076
15691e25419l76413M29954R43390J18791o15111o50160O0344K2914j50754j80280
15681i22744N6000K49401R5024J50926J53354q3837R4517l2103J37470j02432
15671b04424m86623p0627l6224K0569j61334j78666n04704l60920M26941N11309
15661a044703J37290m12232p22105k37919L29298L52741N41158K68106j93525
$$ plain form
15652 -981891 -1207846 -1262650 -925048 -1125350 -1574755 -1608916 -1291599 -780653 -700919 -949932
15642 -949932 -1431623 -1637550 -1654332 -1573774 -1202704 -1155902 -848257 -343398 14988 228574
15632 228574 129267 -513922 -1199237 -1264345 -997652 -433933 -573117 -984712 -612181 -423863
15622 -423863 -878038 -1053889 -374923 160362 185709 177214 665997 1307156 1678278 1408858
15612 1408858 492119 -91505 -446957 -858819 -961426 -609379 -367783 -578270 -717678
15603 -717678 -8271 876508 1248659 1247014 1035502 779418 425708 425178 -287234 -1113286
15593 -1113286 -1081937 -351365 -188049 -534620 -490091 -446242 -561370 -369807 -298822 -217287
15583 -217287 -315758 -461733 -463552 -350438 -240635 -33984 356157 339833 -37657 88019
$$ packed form
15652i81891k25955n4804L37602k00302m49405l4161L17317N10946P9734k49013
15642i49932m81691k05927j6782Q0558L71070M6802L07645N04859L58386K13586
15632B28574r9307o43189o85315o5108K66693N63719j39184m11595L72531J88318
15622d23863m54175j75851O78966N35285K5347q495M88783O41159L71122k69420
15612A408858r16739n83624l55452m11862j02607L52047K41596k10487j39408
15603g17678P09407Q84779L72151j645k11512k56084l53710n30p12412q26052
15593a113286L1349P30572J63316l46571M4529M3849j15128J91563P0985Q1535
15583b17287r8471j45975j819J13114J09803K06651L90141j6324l77490J25676
$$ plain form
15573 88019 309044 -54019 -450121 -658437 -842264 -710944 -348856 204338 381394 452185
15563 452185 214506 -486579 -1295558 -1460860 -1006947 -391912 -203435 -471612 -1160835 -1712151
15553 -1712151 -1826565 -1284140 -825671 -830815 -729931 -1030530 -1451889 -1258229 -904806 -741530
15543 -741530 -898841 -1079577 -1380798 -1748687 -1671695 -998177 -573368 -657598 -980136 -1243592
15533 -1243592 -971639 -765023 -411406 84326 480369 708822 797596 831374 972094 1124318
15523 1124318 1076494 432436 -173661 -632984 -398186 -139609 -312859 -470580 -556774 -523531
15513 -523531 -590473 -481352 -341394 -500984 -625637 -67444 616134 965717 768800 193706
15503 193706 34906 -393676 -590811 -518324 -554098 -764886 -858050 -1002136 -1203178 -957268
$$ packed form
15573H8019K21025l63063l96102k08316j83827J31320L62088N53194J77056P0791
15563D52185k37679p01085q08979j65302M53913O15035J88477k68177o89223n51316
15553a712151j14414N42425M58469n144J00884l00599m21359J93660L53423J63276
15543g41530j57311j80736l01221l67889P6992O73518M24809q4230l22538k63456
15533a243592K71953K06616L53617M95732L96043K28453Q8774L3778J40720J52224
15523A124318m7824o44058o06097m59323K34798K58577j73250j57721q6194L3243
15513e23531o6942J09121J39958j59590j24653N58193O83578L49583j96917n75094
15503A93706j58800m28582j97135P2487l5774k10788r3164j44086k01042K45910
$$ plain form
15493 -957268 -619993 -934379 -662127 -526421 -748615 -946742 -1035831 -770563 -394484 157641
15483 157641 757635 719423 148223 -354426 -133308 171847 -26827 -744258 -1160670 -1390778
15473 -1390778 -1344761 -1129447 -360745 317486 248980 -368431 -871581 -703524 -894810 -1356758
15463 -1356758 -1528923 -1495949 -968906 -405287 -654063 -1614809 -2016116 -1561424 -1202543 -758857
15453 -758857 -463317 30131 445429 517258 386099 -105559 -352456 -793691 -1447187 -1537615
15443 -1537615 -1035856 -152157 581786 849316 197041 -235364 -14712 284184 52362
15434 52362 -160471 -330182 -495428 -447508 -293254 -150802 -110530 -202598 -125493 464156
15424 464156 588161 393195 195547 294220 126822 -497078 -963294 -967656 -829557 -874543
$$ packed form
15493i57268L37275l14386K72252J35706k22194j98127q9089K65268L76079N52125
15483A57641N99994l8212n71200n02649K21118L05155j98674p17431m16412k30108
15473a390778M6017K15314P68702O78231o8506o17411n03150J68057j91286m61948
15463a356758j72165L2974N27043N63619k48776r60746m01307M54692L58881M43686
15453g58857K95540M93448M15298P1829j31159m91658k46897m41235o53496r0428
15443a537615N01759Q83699P33943K67530o52275m32405K20652K98896k31822
15434E2362k12833j69711j65246M7920J54254J42452M0272r2068P7105N89649
15424D64156J24005j94966j97648R8673j67398o23900m66216m362J38099m4986
$$ plain form
15414 -874543 -736724 -554707 -791131 -711226 -206167 -54207 -424278 -1081888 -1084498 -811856
15404 -811856 -250396 476974 824001 320396 -536291 -1394570 -1497418 -1031941 -594214 -199466
15394 -199466 -388300 -481906 -847431 -1229830 -1097840 -593006 -227922 87547 187418 133147
15384 133147 39476 -337942 -1262688 -2230169 -2568211 -2400051 -1758640 -738365 -166226 -89990
15374 -89990 -274366 -417272 -489508 -752756 -923587 -1042796 -934708 -929916 -1168038 -1095753
15364 -1095753 -853549 -708072 -735027 -826032 -518547 -607070 -726494 -953146 -948437 -554771
15354 -554771 -197064 -648265 -1192846 -1112259 -884428 -568611 -710198 -1129990 -1510864 -1032976
15344 -1032976 -600715 -324416 342502 1037010 818758 215408 209820 420508 460549 75043
$$ packed form
15414h74543J37819J82017k36424P9905N05059J51960l70071o57610k610K72642
15404h11856N61460P27370L47027n03605q56687q58279j02848M65477M37727L94748
15394a99466j88834r3606l65525l82399J31990N04834L65084L15469R9871n4271
15384A33147r3671l77418r24746r67481l38042J68160O41411J020275N72139P6236
15374h9990j84376j42906p2236k63248j70831j19209J08088M792k38122P2285
15364a095753K42204J45477k6955r1005L07485q8523j19424k26652M709L93666
15354e54771L57707m51201n44581Q0587K27831L15817j41587m19792l80874M77888
15344a032976M32261K76299O66918O94508k18252o03350n588K10688M0041l85506
$$ plain form
15334 75043 72220 -339800 -1194179 -1449352 -1036276 -944038 -1159916 -918868 -446691 -138984
15324 -138984 -117328 -212428 -498369 -843285 -1368010 -1368551 -1109145 -1050180 -829594 -623559 -554097
15313 -554097 -557671 -914384 -1059124 -719959 -667909 -897879 -1129437 -1507138 -1685606 -1621019
15303 -1621019 -1747632 -1783992 -1544537 -1658370 -1545959 -1596687 -2073608 -2072990 -1653377 -1632605
15293 -1632605 -1424714 -841449 -350129 -258885 -548619 -637925 -331763 -650560 -1039646 -940573
15283 -940573 -679038 -320993 -30943 42884 143788 207087 -340877 -799736 -1079944 -1264668
15273 -1264668 -1351864 -890165 -1093125 -1372611 -1732765 -2319154 -2233143 -1582190 -669540 -392803
15263 -392803 -702679 -727266 -651785 -768706 -1219705 -709736 197199 610025 -21380 -667275
$$ packed form
15334G5043k823m12020q54379k55173M13076R2238k15878K41048M72177L07707
15324a38984K1656r5100k85941l44916n24725n41K59406N8965K20586K06035O9462
15313e54097l574l56713j44740L39165N2050k29970k31558l77701j78468O4587
15303a621019j26613l6360K39455j13833J12411n0728m76921O18M19613K0772
15293a632605K07891N83265M91320R1244k89734q9306L06162l18797l89086R9073
15283i40573K61535L58045K90050P3827J00904O3299n47964m58859k80208j84724
15273a264668q7196M61699k02960k79486l60154n86389Q6011O50953R12650K76737
15263c92803l09876k4587P5481j16921m50999N09969R06935M12826o31405o45895
$$ plain form
15253 -667275 -778500 -511847 -236874 -133998 -501268 -917044 -1245859 -1149487 -1198158 -977686
15243 -977686 -850354 -908917 -872094 -1057493 -1346834 -1091393 -401675 356966 397548 -246279
15233 -246279 -662384 -319256 -201794 22368 520116 485253 224964 193854 316975 772141
15223 772141 616726 328715 339421 -39134 -508722 -899676 -1105557 -1274050 -1463238 -2021678
15213 -2021678 -2880775 -3332928 -3716506 -3754833 -3084188 -2436164 -1597361 -813995 -673162 -823230
15203 -823230 -1271678 -1259897 -492677 -220839 -188771 -446315 -601670 -429157 -71340 -51042
15193 -51042 -400942 -920770 -1264585 -1224454 -1153174 -926418 -308986 319482 686921 615456
15183 615456 763112 801123 800437 1227771 1721620 1574291 965929 -51987 -718516 -694553
$$ packed form
15253f67275j11225K66653K74973J02876l67270m15776l28815R6372m8671K20472
15243i77686J27332n8563L6823j85399k89341K55441O89718P58641M0582o43827
15233b46279m16105L43128J17462K24162M97748l4863k60289l1110J23121M55166
15223G72141j55415k88011J0706l78555m69588l90954k05881j68493j89188n58440
15213b021678q59097m52153l83578l8327O70645O48024Q38803P83366J40833j50068
15203h23230m48448J1781P67220K71838L2068k57544j55355J72513L57817K0298
15193e1042l49900n19828l43815M0131P1280K26756O17432O28468L67439p1465
15183F15456J47656L8011o86M27334M93849j47329o08362j017916o66529K3963
$$ plain form
15173 -694553 -548715 -141519 104894 177334 796259 1169144 776398 161186 -374365 -229115
15163 -229115 198794 187826 142254 18218 -439025 -685251 -720135 -83628 33830 -373374
15153 -373374 -360523 -344319 -124695 -115507 -491170 -914346 -1063622 -790742 -541285 -1211990
15143 -1211990 -1648888 -1623690 -1060919 -158492 -317779 -1203790 -1658631 -1676512 -1921220 -1645283
15133 -1645283 -1268716 -799227 -865382 -1754089 -1850494 -1815956 -2036868 -2318603 -1828936 -1480112
15123 -1480112 -1269041 -1441515 -1845525 -1841484 -1470688 -915689 -758987 -1081778 -1601723 -1927396
15113 -1927396 -1525116 -748012 -310108 -53242 76334 2764 -140909 49831 517039 349374
15103 349374 -93585 78324 286309 255389 196636 160111 485018 717915 934297 385043
$$ packed form
15173f94553J45838M07196K46413P2440O18925L72885l92746o15212n35551J45250
15163b29115M27909j0968m5572j24036m57243k46226l4884O36507J17458m07204
15153c73374J2851J6204K19624R188l75663m23176j49276K72880K49457o70705
15143a211990m36898K5198N62771R02427j59287q86011m54841j7881k44708K75937
15133a645283L76567M69489o6155q88707r6405L4538k20912k81735M89667L48824
15123a480112K11071j72474m04010M041L70796N54999J56702l22791n19945l25673
15113a927396M02280P77104M37904K56866J29576p3570j43673J90740M67208j67665
15103C49374m42959J71909K07985l0920n8753l6525L24907K32897K16382n49254
$$ plain form
15093 385043 -276942 -759424 -1091860 -1423120 -1129388 -727447 -490784 -252859 -385614 -174875
15083 -174875 -111733 -311439 -236633 123972 541248 937348 729600 454241 726972 633893
15073 633893 93333 -252709 -502880 -821326 -530681 -149737 -317555 -127422 377338 22019
15063 22019 -125970 -235699 -420359 89349 313767 762716 1089831 167048 -842524 -987917
15053 -987917 -885474 -1050600 -1045895 -972132 -1079494 -1288450 -1231767 -1128603 -1238727 -1210001
15043 -1210001 -815151 -447475 -572996 -1016404 -607806 169736 398633 175740 178506 -57339
15033 -57339 -193137 143554 466729 473390 530202 423385 181189 -231623 -267912 -578010
15023 -578010 -1301236 -1276838 -1109085 -914897 -1294636 -1792977 -2001464 -1648978 -1042866 -592997
$$ packed form
15093C85043o61985m82482l32436l31260K93732M01941K36663K37925j32755K10739
15083a74875O3142j99706P4806L60605M17276L96100k07748k75359K72731r3079
15073F33893n40560l46042k50171l18446K90645L80944j67818J90133N04760l55319
15063B2019j47989j09729j84660N09708K24418M48949L27115r22783j009572j45393
15053i87917J02443j65126M705P3763j07362k08956N6683J03164j10124K8726
15043a210001L94850L67676j25521m43408M08598P77542K28897k22893K766k35845
15033e7339j35798L36691L23175O661N6812j06817k42196m12812l6289l10098
15023e78010p23226K4398J67753J94188l79739m98341k08487L52486O06112M49869
$$ plain form
15013 -592997 -587520 -719838 -491765 2690 117907 320754 808917 950798 381313 -724653
15003 -724653 -1078454 -663967 -234194 -618836 -1144953 -1469646 -1517101 -1178563 -889526 -788136
14993 -788136 -1022281 -966857 -671791 -817105 -842711 -835177 -1050504 -1052171 -781619 -446352 368697
14982 368697 876394 498387 114688 -148011 -347907 -286055 -330814 -610345 -517852 -785143
14972 -785143 -1145369 -1193074 -1139167 -742234 -568766 -638469 -620543 -384416 -483630 -724166
14962 -724166 -842226 -805911 -550405 -475768 -141761 571428 1018826 939612 542207 164758
14952 164758 9149 -92070 189515 262603 -98778 -254281 -93114 91044 283187 236458
14942 236458 -295128 -229232 178885 -107750 -328188 -393533 -622975 -1071091 -1883277 -1784898
$$ packed form
15013e92997N477j32318K28073M94455J15217K02847M88163J41881n69485j105966
15003g24653l53801M14487M29773l84642n26117l24693m7455L38538K89037J01390
14993g88136k34145N5424K95066j45314k5606P534k15327j667K70552L35267Q15049
14982C68697N07697l78007l83699k62699j99896O1852m4759k79531R2493k67291
14972g85143l60226m7705N3907L96933J73468o9703J7926K36127r9214k40536
14962g24166j18060L6315K55506P4637L34007P13189M47398p9214l97405l77449
14952A64758j55609j01219K81585P3088l61381j55503J61167J84158J92143m6729
14942B36458n31586O5896M08117k86635k20438o5345k29442m48116q12186R8379
$$ plain form
14932 -1784898 -1005849 -348383 236479 371980 109782 80693 -236311 -1143436 -1768391 -1587906
14922 -1587906 -1125650 -1047518 -742220 -324802 -116023 327856 834605 882206 517974 -505768
14912 -505768 -1261348 -1567352 -1064426 -379515 14170 228338 249112 206682 383035 218736
14902 218736 -155246 -640645 -1183820 -1555703 -1224037 -805069 -158964 689353 720472 239412
14892 239412 12283 -102815 -186259 -261885 -711591 -865670 -644016 -582231 -574759 -644975 -600181
14881 -600181 -301205 225627 360403 226369 -758 133227 410212 281781 -423855 -1119228
14871 -1119228 -1179997 -693997 -384171 -322839 -128327 177496 182268 388627 410143 206128
14861 206128 28669 271844 588434 764468 904622 776063 524404 192287 61028 72410
$$ packed form
14932a784898P79049O57466N84862J35501k62198k9089l17004r07125o24955J80485
14922a587906M62256P8132L05298M17418K08779M43879N06749M7601l64232j023742
14912e05768p55580l06004N02926O84911L93685K14168K0774m2430J76353j64299
14902B18736l73982m85399n43175l71883L31666M18968O46105Q48317L1119m81060
14892B39412k27129j15098q3444p5626m49706j54079K21654O1785P472p0216M4794
14881f00181K98976N26832J34776j34034k27127J33985K76985j28431p05636o95373
14871a119228o0769M86000L09826O1332J94512L05823M772K06359K1516k04015
14861B06128j77459K43175L16590J76034J40154j28559k51659l32117j31259J1382
$$ plain form
14851 72410 -357126 -824248 -943757 -769456 -675100 -429581 -456727 -921232 -989818 -1315416
14841 -1315416 -2286646 -2648510 -2090762 -1430195 -1613767 -2134223 -1452294 -1061923 -1479206
14832 -1479206 -1454028 -734381 -222504 163855 686101 1054127 1054008 988953 870192 384854
14822 384854 -321921 -506890 -213724 181922 -98637 -304070 -267970 -754344 -878840 -469363
14812 -469363 -189888 341205 671319 584455 76784 -356519 -351983 -55815 159687 -29648
14802 -29648 227683 -80703 -172838 -335287 -573454 -344453 -38071 332256 578433 897332
14792 897332 854778 811169 1288772 938182 273857 -13750 33784 122424 96522 -238062
14782 -238062 -363997 -619013 -728450 -355538 365819 760408 463470 220605 529671 691566
$$ packed form
14851G2410m29536m67122j19509J74301R4356K45519k7146m64505o8586l25598
14841a315416r71230l61864N57748O60567j83572n20456O81929L90371m17283
14832a479206K5178P19647N11877L86359N22246L68026j19o5055j18761m85338
14822C84854p06775j84969K93166L95646k80559k05433L6100m86374j24496M09477
14812d69363K79475N31093L30114q6864n07671m33303M536K96168K15502j89335
14802b9648K57331l08386r2135j62449k38167K29001L06382L70327K46177L18899
14792H97332m2554m3609M77603l50590o64325k87607M7534Q8640k5902l34584
14782b38062j25935k55016j09437L72912P21357L94589k96938k42865L09066J61895
$$ plain form
14772 691566 357910 -282919 -793512 -785325 -266400 -154763 -201060 -120449 -260995 -529858
14762 -529858 -654864 -895911 -1104992 -656445 419 369539 158785 -251390 -776129 -1163392
14752 -1163392 -941366 -340437 -140868 -124926 -68409 69616 -102325 -580758 -937954 -716655
14742 -716655 -541818 -469521 -685930 -499798 -298660 -337219 131182 175070 -532449 -1199026
14732 -1199026 -745492 -120491 -480126 -1170781 -1598489 -1551690 -1278300 -1201796 -1523835 -1319340
14722 -1319340 -623045 -481699 -606406 -570248 -344673 78706 119039 -182446 -700347 -308697
14712 -308697 73025 275295 147396 -177141 -677045 -1061866 -722799 -551349 -826779 -761981
14702 -761981 -826252 -939491 -782133 -579812 -642881 -892395 -1187865 -1018257 -555526 -151113
$$ packed form
14772F91566l33656o40829n10593Q187N18925J11637m6297Q0611j40546k68863
14762e29858j25006k41047k09081M48547O56864L69120k10754m10175n24739l87263
14752a163392K22026O00929J99569J5942N6517J38025j71941m78433l57196K21299
14742g16655J74837P2297k16409J86132K01138l8559M68401M3888p07519o66577
14732a199026M53534O25001l59635o90655m27708M6799K73390P6504l22039K04495
14722a319340O96295J41346j24707L6158K25575M23379M0333l01485n17901L91650
14712c08697L81722K02270j27899l24537m99904l84821L39067J71450k75430O4798
14702g61981o4271j13239J57358K02321o3069k49514k95470J69608M62731M04413
$$ plain form
14692 -151113 -187075 -8917 143932 -136579 -505971 -627033 -880853 -917651 -516770 346629
14682 346629 1168930 1304708 902872 469429 653048 548715 45443 40557 466168 760742
14672 760742 396709 -270870 -135464 339812 490475 106713 -696824 -874768 -609167 -53400
14662 -53400 173947 43916 62980 223979 373340 64591 -497317 -858354 -540926 15340
14652 15340 502104 1143893 1473278 975544 371412 179338 125112 189945 -11658 -38270
14642 -38270 -61369 -185226 -27851 -51559 71185 278528 -69728 -502707 -885529 -832181
14632 -832181 -808574 -1588136 -1664766 -1093392 -882333 -1277600 -1306280 -771147 -549376 -952729
14622 -952729 -1319997 -1082177 -612751 -435303 -380495 226323 722281 764369 293859 -244541
$$ packed form
14692a51113l5962J78158J52849k80511l69392j21062k53820l6798M00881Q63399
14682C46629Q22301J35778m01836m33443J83619j04333n03272m886M25611K94574
14672G60742l64033o67579J35406M75276J50663l83762q03537j77944K65601N55767
14662e3400K27347j30031J9064J60999J49361l08749n61908l61037L17428N56266
14652A5340M86764O41789L29385m97734o04132j92074n4226O4833k01603k6612
14642c8270k3099j23857J57375k3708J22744K07343l48256m32979l82822N3348
14632h32181K3607p79562p6630N71374K11059l95267k8680N35133K21771m03353
14622i52729l67268K37820M69426J77448N4808O06818M95958M2088m70510n38400
$$ plain form
14612 -244541 -216133 -185174 -536484 -511809 -317749 -468868 -662288 -216431 279448 -129810
14602 -129810 -767705 -798925 -596004 -775491 -910239 -541300 -295748 168743 340731 -162363
14592 -162363 -534728 -500700 -577804 -604631 -553759 -665415 -760745 -546657 -54658 398528
14582 398528 656525 323629 184231 816969 1606494 1876932 1609569 865404 -120551 -1030014
14572 -1030014 -985887 -661167 -359375 -133401 145643 95444 -527960 -987530 -1484028 -2161158
14562 -2161158 -2731735 -2499684 -1832552 -1343758 -1546255 -2300715 -2058833 -1577141 -816308
14553 -816308 -190754 -554152 -823100 -928500 -1262081 -1349191 -658983 -284786 -485896 -748363
14543 -748363 -1225440 -1159710 -587951 68950 5562 -464078 -1028993 -1629831 -1859975 -1700421
$$ packed form
14612b44541K8408L0959l51310K4675J94060j51119j93420M45857M95879m09258
14602a29810o37895l1220K02921j79487j34748L68939K45552M64491J71988n03094
14592a62363l72365L4028p7104k6827N0872j11656r5330K14088M91999M53186
14582C98528K57997l32896j39398O32738P89525K70438k67363p44165r85955r09463
14572a030014M4127L24720L01792K25974K79044n0199o23404m59570m96498o77130
14562b161158n70577K32051O67132M88794k02497p54460K41882M81692P60833
14553h16308O25554l63398k68948j05400l33581q7110O90208L74197k01110k62467
14543g48363m77077O5730N71759O56901o3388m69640n64915o00838k30144J59554
$$ plain form
14533 -1700421 -1558520 -1140797 -477432 7226 19298 -568737 -863163 -746822 -498057 -293151
14523 -293151 -585280 -959441 -1346797 -1457859 -796050 -384454 -650250 -495514 -431244 -129546
14513 -129546 675795 1104702 1266523 870916 -139241 -797434 -802061 -238653 344593 319116
14503 319116 122256 401239 608243 597109 328608 -205167 -369763 -315473 -443176 -436800
14493 -436800 -526163 -275876 487437 668840 165067 -415881 -789197 -528123 -275915 -656577
14483 -656577 -872606 -504929 -305858 -80040 290633 170632 -23662 -162318 -404654 -425208
14473 -425208 -1198276 -2080811 -2065395 -1634965 -786555 43590 574622 376996 -80256 -152611
14463 -152611 -178612 -273638 -87592 -36878 -551563 -932031 -812577 -473903 -461961 -345127
$$ packed form
14533a700421J41901M17723O63365M84658J2072n88035k94426J16341K48765K04906
14523b93151k92129l74161l87356j11062O61809M11596k65796J54736O4270L01698
14513a29546Q05341M28907J61821l95607j010157o58193m627N63408N83246k5477
14503C19116j96860K78983K07004j1134k68501n33775j64596N4290j27703O376
14493d36800q9363K50287P63313J81403n03773n80948l73316K61074K52208l80662
14483f56577k16029L67677J99071K25818L70673j20001j94294j38656k42336k0554
14473d25208p73068q82535J5416M30430Q48410Q30145N31032j97626m57252p2355
14463a52611k6001r5026J86046N0714n14685l80468J19454L38674J1942J16834
$$ plain form
14453 -345127 141101 683114 820614 478447 -99332 -721370 -1072922 -864157 -966072 -994715
14443 -994715 -917213 -1199369 -726182 -126316 116461 -68331 -73161 416080 838480 1081681
14433 1081681 921448 756750 490993 287936 187482 -86265 -91330 -164597 -242654 -217092
14423 -217092 234939 683670 804133 776982 343631 152330 779231 1062260 945793 842850
14413 842850 261886 -473448 -589108 -623506 -609546 -637816 -459692 -473067 -804799 -864157
14403 -864157 -781693 -795323 -1008062 -1381249 -989562 -519821 -497119 -510628 -353771 -375199
14393 -375199 -476454 -786516 -726640 -354628 -295521 -273449 -480498 -826703 -1373910 -1776364
14383 -1776364 -1877705 -1605501 -1448367 -1209326 -860218 -644129 -553704 -213668 -312015 -601829
$$ packed form
14453c45127M86228N42013J37500l42167n77779o22038l51552K08765j01915k8643
14443i94715P7502k82156M73187N99866K42777j84792m830M89241M22400K43201
14433A081681j60233j64698k65757k03057j00454k73747n065p3267p8057K5562
14423b17092M52031M48731J20463k7151m33351j91301O26901K83029j16467j02943
14413H42850n80964p35334j15660l4398J3960k8270J78124j3375l31732n9358
14403h64157Q2464j3630k12739l73187L91687M69741K2702j3509J56857k1428
14393c75199j01255l10062N9876L72012N9107K2072k07049l46205n47207m02454
14383a776364j01341K72204J57134K39041L49108K16089R0425L40036r8347k89814
$$ plain form
14373 -601829 -726283 -723487 -657859 -728836 -664137 -642935 -601603 -640436 -782483 -537399 -281112
14362 -281112 -237292 362159 835297 693234 258043 207738 160480 -332571 -649923 -614353
14352 -614353 -713904 -1453968 -1856636 -1378023 -633628 -512085 -568016 -384926 -398123 -752122
14342 -752122 -1470595 -1654073 -1081153 -1112281 -1490468 -1005396 -427511 -233048 -486310 -615336
14332 -615336 -832269 -863653 -584299 -760244 -502597 -32303 -207569 -604617 -1061452 -1214884
14322 -1214884 -1188542 -923088 -579267 -703098 -887912 -1720122 -2422333 -2412144 -2568451 -2573275
14312 -2573275 -1909839 -1050296 -382636 -79007 -143667 -118228 38295 162651 -152458 -907313
14302 -907313 -1544636 -1738820 -1549898 -1146104 -900512 -903115 -1051365 -566316 221085 191530
$$ packed form
14373f01829j24454K796O5628p0977O4699K1202M1332l8833j42047K45084K56287
14362b81112M3820N99451M73138j42063m35191n0305m7258m93051l17352L5570
14352f14353r9551p40064m02668M78613P44395J21543n5931J83090j3197l53999
14342g52122p18473j83478N72920l1128l78187M85072N77885J94463k53262j29026
14332f15336k16933l1384K79354j75945K57647M70294j75266l97048m56835j53432
14322a214884K6342K65454L43821j23831j84814q32210p02211J0189j56307m824
14312b573275O63436Q59543O67660L03629o4660K5439J56523J24356l15109p54855
14302i07313o37323j94184J88922M03794K45592k603j48250M85049P87401k9555
$$ plain form
14292 191530 -243200 -480394 -890235 -935270 -378695 -38333 26461 72851 -20566 183347
14282 183347 232159 2530 194574 572115 193374 -38093 -310045 -828417 -1212496 -1768344
14272 -1768344 -1952197 -1705846 -1244565 -809455 -842962 -1317612 -1542137 -1547746 -1411281 -1143562
14262 -1143562 -706604 -317446 -100991 -84990 -65084 -255984 -478352 -515343 -492601 -1096015
14252 -1096015 -2006019 -2622478 -2272980 -1526329 -850237 -116074 -148004 -544689 -432646 -133974
14242 -133974 359185 1124649 1430292 839594 -29653 -251733 12555 77163 8350 -418894
14232 -418894 -414380 -251928 -580560 -1291520 -1115490 -484202 -352462 -4308 598022 858208
14222 858208 950809 1166429 1361078 1303183 1033540 774142 506327 775941 1217997 1178164
$$ packed form
14292A91530m34730k37194m09841m5035N56575L40362O4794M6390r3417K03913
14282A83347M8812k29629J92044L77541l78741k31467k71952n18372l84079n55848
14272a768344j83853K46351M61281M35110l3507m74650k24525n609J36465K67719
14262a143562M36958L89158K16455J6001J9906j90900k22368l6991K2742o03414
14252a096015r10004o16459L49498P46651O76092P34163l1930l96685J12043K98672
14242a33974M93159P65464L05643n90698q69247k22080K64288O4608o8813m27244
14232d18894M514J62452l28632p10960J76030O31288J31740L48154O02330K60186
14222H58208R2601K15620J94649n7895k69643k59398k67815K69614M42056l9833
$$ plain form
14212 1178164 456794 -449593 -502289 -156226 -116008 215872 391960 214690 -65720 -685354
14202 -685354 -1131270 -969563 -312520 -51377 -674236 -863117 -627540 -358637 -22406 -55484
14192 -55484 -133787 -692743 -996485 -1005373 -890174 -381081 273965 332008 209420 243753 -157787
14181 -157787 -956987 -1456674 -1476009 -864569 -981098 -1260243 -1352054 -1497704 -1296321 -1259560
14171 -1259560 -1074331 -564559 -187685 -240887 -871022 -1417846 -1490163 -1305270 -983842 -752894
14161 -752894 -525743 -583979 -866486 -544956 -288545 -535048 -715822 -1057012 -634705 85595
14151 85595 305725 -46977 -374565 -433050 -409880 -117119 199694 136306 -113735 -444001
14141 -444001 -287468 -134027 -578659 -534361 32796 591080 471188 -208005 -770153 -931013
$$ packed form
14212A178164p21370r06387n2696L46063M0218L31880J76088j77270k80410o19634
14202f85354m45916J61707O57043K61143o22859j88881K35577K68903L36231l3078
14192e5484p8303n58956l03742q888J15199N09093O55046N8043j22588L4333m01540
14181a57787p99200m99687j9335O11440j16529k79145r1811j45650K01383L6761
14171a259560J85229N09772L76874n3202o30135n46824p2317J84893L21428K30948
14161g52894K27151n8236k82507L21530K56411k46503j80774l41190M22307P20300
14151H5595K20130l52702l27588n8485K3170K92761L16813o3388k50041l30266
14141d44001J56533J53441m44632M4298N67157N58284j19892o79193n62148j60860
$$ plain form
14131 -931013 -1175162 -899176 -400691 -428949 -974263 -1222542 -742021 -365394 -183902 -723210
14121 -723210 -1034566 -944033 -642794 -662043 -1079659 -1444206 -1454438 -1137101 -1260451 -1160395
14111 -1160395 -711477 -720033 -1179881 -1067800 -836099 -1344434 -1715377 -1349659 -466848 -52362
14101 -52362 70581 -567321 -1144069 -1123487 -722730 -528664 -720027 -877174 -1395021 -1567510
14091 -1567510 -1349369 -1271692 -1619153 -1941125 -1494229 -1058403 -943707 -1267463 -1892609 -2532467
14081 -2532467 -2569740 -1646184 -472299 449869 717191 400649 -223427 -814312 -832822 -724322
14071 -724322 -597771 -713385 -833694 -852703 -1156229 -921192 -562253 -49952 88558 57675
14061 57675 -278925 -1003216 -1032785 -584102 -139503 -424781 -786521 -820321 -578333 -258741
$$ packed form
14131i31013k44149K75986M98485k8258n45314k48279M80521L76627J81492n39308
14121g23210l11356R0533L01239j9249m17616l64547j0232L17337j23350J00056
14111a160395M48918q556m59848J12081K31701n08335l70943L65718Q82811M14486
14101e2362J22943o37902n76748K0582M00757J94066j91363j57147n17847j72489
14091a567510K18141P7677l47461l21972M46896M35826J14696l23756o25146o39858
14081b532467l7273R23556J173885R22168K67322l16542o24076n90885j8510J08500
14071g24322J26551j15614j20309j9009l03526K35037L58939N12301J38510l0883
14061E7675l36600p24291k9569M48683M44599k85278l61740l3800K41988L19592
$$ plain form
14051 -258741 152503 439599 460565 476521 751300 423046 160474 248905 155301 -319405
14041 -319405 -491358 -431326 -742041 -845746 -800242 -1171438 -1529002 -1665555 -1284509 -739118
14031 -739118 -536397 -496764 -642775 -800174 -418217 -182222 -182916 -302051 -607597 -852287
14021 -852287 -568876 -25334 51354 -70630 181171 167864 72793 -2469 -247709 -402542
14011 -402542 118926 856487 1205878 1163564 760259 869598 1163376 903461 710630 508297
14001 508297 337600 264304 280605 505998 771909 860505 1068807 1360897 1253140 1507697
13991 1507697 2148857 3004510 4132255 5641356 6607612 6686946 5562276 4667640 4104366
13982 4104366 3168284 2653560 2179116 1714977 1901989 1643163 1382089 1278823 1511065
$$ packed form
14051b58741M11244K87096K0966J5956K74779l28254k62572Q8431r3604m74706
14041c19405j71953O0032l10715j03705M5504l71196l57564j36553L81046N45391
14031g39118K02721L9633j46011j57399L81957K35995o94j19135l05546k44690
14021h52287K83411N43542P6688j21984K51801j3307r5071p5262k45240j54833
14011d02542N21468P37561L49391m2314m03305J09339K93778k59915j92831k02333
14001E08297j70697p3296J6301K25393K65911Q8596K08302K92090j07757K54557
13991A507697O41160Q55653J127745J509101R66256P9334j124670q94636n63274
13982D104366r36082n14724m74444m64139J87012k58826k61074j03266K32242
$$ plain form
13973 1511065 1214933 482663 46203 8326 365049 125059 -28895 63815 -308727 -770070
13963 -770070 -525377 -418761 -440563 -860702 -1244105 -983659 -524629 -80064 332513 356529
13953 356529 430830 187184 -386074 -380616 -218705 -214708 -103469 58899 53634 -231145 -412244
13942 -412244 -611139 -802342 -887122 -610892 -132050 38888 2497 -367407 -893186 -659751
13932 -659751 98325 663653 549071 143108 292667 674601 234300 -541221 -176802 245435
13922 245435 44212 175952 672717 583441 411100 548363 564930 508947 174559 108154
13912 108154 119399 -128431 235456 601723 409632 39635 -545871 -1192994 -1398202 -1006219
13902 -1006219 -367433 -43368 -123701 323213 697135 754882 762232 -92434 -648694 -442627
$$ packed form
13973A511065k96132p32270m36460l7877L56723k39990j53954R2710l72542m61343
13963g70070K44693J06616k1802m20139l83403K60446M59030M44565M12577K4016
13953C56529P4301k43646n73258N458J61911L997J11239J62368n265k84779j81099
13942d12244j98895j91203q4780K76230M78842J70938l6391l69904n25779K33435
13932f59751P58076N65328j14582m05963J49559L81934m40301p75521L64419M22237
13922B45435k01223J31740M96765q9276j72341J37263J6567n5983l34388o6405
13912A08154J1245k47830L63887L66267j92091l69997n85506o47123k05208L91983
13902a006219O38786L24065q0333M46914L73922N7747P350q54666n56260K06067
$$ plain form
13892 -442627 10525 467579 638680 845904 1335417 1209384 708563 381860 750853 1113268
13882 1113268 897287 449015 30543 -307099 -157192 -209363 -205139 -277913 -419109 -581179
13872 -581179 -226212 -488124 -1149898 -1661224 -1881228 -1869691 -1758479 -1502814 -1346630 -1346751
13862 -1346751 -1635216 -1747464 -1451553 -890519 -773637 -1167159 -1638293 -1908390 -2151221
13853 -2151221 -1829148 -1322897 -1123467 -942709 -508891 -509564 -356746 -65917 76054 29500
13843 29500 -221802 -32289 -415564 -1093985 -691967 -344577 -398219 -90997 565353 1155334
13833 1155334 1341292 1204324 1348723 1535666 1289181 823507 365086 9941 27422 16588
13823 16588 443624 1231630 1504615 1271291 609434 123790 533130 1019741 868986 384960
$$ packed form
13892d42627M53152M57054J71101K07224M89513j26033n00821l26703L68993L62415
13882A113268k15981m48272m18472l37642J49907n2171M224p2774j41196j62070
13872e81179L54967k61912o61774n11326k20004J1537J11212K55665J56184j21
13862a346751k88465j12248K95911N61034J16882l93522m71134k70097k42831
13853b151221L22073N06251J99430J80758M33818o73J52818K90829J41971m6554
13843B9500k51302J89513l83275o78421M02018L47390n3642L07222O56350N89981
13833A155334J85958j36968J44399J86943k46485m65674m58421l55145J7481j0834
13823A6588M27036P88006K72985k33324o61857m85644M09340M86611j50755m84026
$$ plain form
13813 384960 -478224 -826798 -597841 -245352 -645791 -818848 -622752 -605075 -686558 -845930
13803 -845930 -732980 -702704 -925766 -781567 -676891 -757759 -1127454 -1979039 -2678408 -3113565
13793 -3113565 -2942982 -2117902 -946739 -143361 -48286 119166 -33573 -251675 -368063
13784 -368063 -548322 -470407 -197820 -623213 -1047147 -784788 -1008296 -1004958 -284094 22055
13774 22055 -304472 -594333 -457626 -612024 -707079 -384900 -150969 -353097 -1155994 -1206033
13764 -1206033 -810211 -694287 -952990 -1179859 -792843 -280580 -58688 -605714 -892484
13755 -892484 -1005438 -1327060 -1499991 -934776 -244387 406722 100397 -317524 -368452 -214653
13745 -214653 -235067 -423910 306390 806652 688396 190004 -163988 -556367 -874826 -908360
$$ packed form
13813C84960q63184l48574K28957L52489m00439j73057J96096J7677q1483j59372
13803h45930J12950L0276k23062J44199J04676q0868l69695q51585o99369m35157
13793c113565J70583Q25080J171163Q03378R5075J67452j52739k18102j16388
13784c68063j80259P7915K72587m25393m23934K62359k23508L338P20864L06149
13774B2055l26527k89861J36707j54398r5055L22179K33931k02128q02897n0039
13764a206033L95822J15924k58703k26869L87016N12263K21892n47026k86770
13755h92484j12954l21622j72931N65215O90389O51109l06325m17921n0928J53799
13745b14653k0414j88843P30300N00262j18256m98392l53992l92379l18459l3534
$$ plain form
13735 -908360 -485453 -30245 -21945 -479948 -604556 -195524 -23849 -586116 -870002 -614853
13725 -614853 -396618 -200649 -114356 -679103 -1070418 -673049 -10363 262509 -112401 -566367
13715 -566367 -808827 -729454 -439665 -525230 -713897 -822487 -946890 -1477319 -1459207 -520627
13705 -520627 194441 520734 308686 -38645 205408 717552 334684 81751 316152 331803
13695 331803 324029 -147123 -371366 -954334 -1418355 -1388325 -1299144 -1300584 -932590 -399735 -653419
13684 -653419 -982672 -936991 -556859 -74972 92658 -184223 -361596 -283483 -254244 -11023
13674 -11023 42237 -1010 119659 509203 724560 42913 -515820 -687417 -471539 18828
13664 18828 205957 148400 -170931 -409331 -387788 -187186 31387 297103 120401 -72144
$$ packed form
13735i08360M22907M55208Q300m58003j24608M09032J71675n62267k83886K55149
13725f14853K18235J95969Q6293n64747l91315L97369O62686K72872l74910m53966
13715e66367k42460P9373K89789q5565j88667j08590j24403n30429J8112R38580
13705e20627P15068L26293k12048l47331K44053N12144l82868k52933K34401J5651
13695C31803p774m71152k24243n82968m64021L0030Q9181j440L67994N32855k53684
13684f53419l29253M5681L80132M81887J67630k76881j77373P8113K9239K43221
13674a1023N3260m3247J20669L89544K15357o81647n58733j71597K15878M90367
13664A8828J87129n7557l19331k38400K1543K00602K18573K65716j76702j92545
$$ plain form
13654 -72144 -390338 -874544 -1113192 -1235489 -1213747 -585081 232058 1003178 1439117 1001819
13644 1001819 -102974 -564703 -819466 -1028485 -339687 121510 -123719 -89127 -459803
13635 -459803 -778234 -403342 256213 978265 1323847 1227182 1036150 574095 -297521 -552497
13625 -552497 -496016 -850156 -1110746 -746659 -231419 441138 531203 164916 -366339 -686370
13615 -686370 -847348 -775373 -500384 -204749 8158 -66419 -235439 -215545 -161387 35193
13605 35193 422212 638687 884949 983615 408989 -295716 -874833 -838085 -931014 -994283
13595 -994283 -460653 142546 814319 650607 184469 428 -165122 -310828 -550409 -807089
13585 -807089 -801743 -243525 -210996 -447344 -240362 537415 1056530 1346521 1272880 729126
$$ packed form
13654g2144l18194m84206k38648j22297K1742O28666Q17139P71120M35939m37298
13644A001819j104793m61729k54763k09019O88798M61197k45229L4592l70676
13635d59803l18431L74892O59555P22052L45582r6665j91032m62055q71616k54976
13625e52497N6481l54140k60590L64087N15240O72557R0065l66287n31255l20031
13615f86370j60978P1975K74989K95635K12907p4577j69020J9894N4158J96580
13605C5193L87019K16475K46262R8666n74626p04705n79117L6748r2929o3269
13595i94283N33630O03199O71773j63712m66138j84041j65550j45706k39581k56680
13585h07089N346N58218L2529k36348K06982P77777N19115K89991p3641n43754
$$ plain form
13575 729126 426950 145710 -224131 -623011 -645565 -459059 -534567 -326410 412642 961340
13565 961340 924230 635463 661315 770108 1192668 1516121 1260493 565368 105422 -53897
13555 -53897 -224268 -338558 25854 429727 698214 625264 391292 146952 382621 667497
13545 667497 1008908 1101978 791097 617124 868495 923171 532323 255809 399965 605235
13535 605235 679603 868335 1422257 1662891 1039233 469081 53256 -109248 -205195 -486602
13525 -486602 -460793 -142522 -420285 -710507 -823887 -897166 -987843 -1246308 -1222148 -955327
13515 -955327 -1149859 -1004410 -280846 153189 -75324 -62189 -5448 -66626 7047 231614
13505 231614 189358 -150993 125508 76964 -87286 -167440 20865 118635 -38984 436793
$$ packed form
13575G29126l02176k81240l69841l98880k2554J86506p5508K08157P39052N48698
13565I61340l7110k88767K5852J08793M22560L23453k55628o95125m59946j59319
13555e3897j70371j14290L64412M03873K68487p2950k33972k44340K35669K84876
13545F67497L41411R3070l10881j73973K51371N4676l90848k76514J44156K05270
13535F05235P4368J88732N53922K40634o23658n70152m15825j62504r5947k81407
13525d86602K5809L18271k77763k90222j13380p3279r0677k58465K4160K66821
13515i55327j94532J45449P23564M34035k28513J3135N6741o1178P3673K24567
13505B31614m2256l40351K76501m8544j64250q0154J88305R7770j57619M75777
$$ plain form
13495 436793 872311 764474 732891 830318 1014790 1110194 811721 551209 843104 1082861
13485 1082861 979373 636549 540202 19691 -500489 -289909 -175430 -44523 180326 274073
13475 274073 526351 520528 454896 316193 225971 371565 184690 -155563 -127643 -239969
13465 -239969 -848040 -611913 88069 746647 968871 833544 699705 519971 235594 26387
13455 26387 241454 911852 1972314 2919989 2918827 2346941 1752187 1285449 1023700 592830
13445 592830 251025 730199 1026020 674424 626440 826640 890141 943183 1375738 2110112
13435 2110112 2287960 1612134 1377967 1891372 2222439 2091632 1679790 1344062 1347235 1165472
13425 1165472 1090392 911420 471197 342928 142326 -57481 -249718 81711 564665 559746
$$ packed form
13495D36793M35518j07837l1583R7427J84472R5404k98473k60512K91895K39757
13485A082861j03488l42824r6347n20511n20180K10580J14479J30907K24849R3747
13475B74073K52278n823o5632j38703r0222J45594j86875l40253K7920j12326
13465b39969o08071K36127O99982O58578K22224j35327j33839j79734k84377k09207
13455B6387K15067O70398J060462R47675j162n71886n94754m66738k61749m30870
13445E92830l41805M79174K95821l51596m7984K00200O3501N3042M32555P34374
13435B110112J77848o75826k34167N13405L31067j30807m11842l35728L173j81763
13425A165472p5080j78972m40223j28269k00602j99807j92237L31429M82954m919
$$ plain form
13415 559746 444396 639389 520741 489648 853291 1481551 2480604 2526875 2029588 1893165
13405 1893165 1898576 1415273 1234356 1845212 2281179 2435810 2308295 1957421 1745507 1840590
13395 1840590 1999894 2171263 2729996 2811961 2439498 1995964 1630319 1728812 1945082 1756856
13385 1756856 1568330 2045291 3064053 3580165 3604813 3683289 3675798 3938272 4391832 4394000
13375 4394000 4026260 3688673 3423533 3607742 4196288 4030272 3661088 3335568 3670241
13366 3670241 4226749 4752585 5076417 4982977 4459043 3705266 3736543 3860524 4232840 5438217
13356 5438217 7130857 8100586 8448076 8645124 8995073 9257520 9328831 9048909 9032336 9048466
13346 9048466 8659332 8791414 9887487 11308287 12465555 13580439 14468186 15539004 17041730
$$ packed form
13415E59746j15350J94993j18648l1093L63643O28260R99053M6271m97287j36423
13405A893165N411m83303j80917O10856M35967J54631j27515l50874k11914R5083
13395A840590J59304J71369N58733Q1965l72463m43534l65645R8493K16270j88226
13385A756856j88526M76961J018762N16112K4648P8476p491K62474M53560K168
13375D394000l67740l37587k65140J84209N88546j66016l69184l25520L34673
13366C670241N56508N25836L23832r3440n23934p53777L1277J23981L72316J205377
13356E438217J692640R69729L47490J97048L49949K62447P1311k79922j6573J6130
13346I048466l89134J32082J096073J420800J157268J114884Q87747J070818J502726
$$ plain form
13337 17041730 18592055 20416659 22915349 25880266 28890970 32268251 36433608 41686036
13329 41686036 47880599 55474164 65260087 77701992 93313707 112940901 137953120
13322 137953120 169808802 211083598 264724608 332977263 412676839 485078045 515768331
13315 515768331 484976815 413221633 334303156 266273919 213612345 173630930 142774987
13308 142774987 119315582 101078976 86571650 74672668 65156691 56900155 49757968
13301 49757968 44243897 40410699 36875939 33196685 30135949 27918304 25850578 24260544
13293 24260544 22985976 21016448 19144580 18160811 17355418 16766012 16050690 15502433 15000372
13284 15000372 14270798 13563465 13047395 12209220 11645148 11597485 11656133 11505690 11370882 11355052
$$ packed form
13337A7041730J550325J824604K498690K964917L010704L377281M165357N252428
13329D1686036O194563P593565R785923J2441905J5611715J9627194K5012219
13322A37953120L1855682M1274796N3641010O8252655P9699576P2401206L0690286
13315E15768331l0791516p1755182p8918477o8029237n2661574l9981415l0855943
13308A42774987k3459405j8236606j4507326j1898982r515977q256536p142187
13301D9757968n514071l833198l534760l679254l060736k217645k067726j590034
13293B4260544j274568j969528j871868r83769q05393n89406p15322n48257n02061
13284A5000372p29574p07333n16070q38175n64072m7663N8648j50443j34808j5830
$$ plain form
13274 11355052 11323396 11071829 11099533 11269032 11246160 10921025 10913655 11702086 12175353 12493092
13264 12493092 12817940 13471267 14741944 16369884 18415711 20799711 23283681 24833120
13256 24833120 24902547 23791056 22570094 21817275 21866177 22794325 23757511 24642297 26204485
13247 26204485 28359392 30764073 34069637 38409973 43467347 49548089 57188093 66465522
13239 66465522 77293946 90482129 107866489 130606165 160392445 198860765 248763113
13232 248763113 313659714 393586761 475119605 525019436 512201570 445598379 362418950
13225 362418950 288433744 230597358 187201884 154183832 128520247 108327922 92515114
13218 92515114 80548162 70698189 62735213 57158550 54077693 51092312 45036011 38723456
$$ packed form
13274A1355052l1656k51567K7704J69499k2872l25135p370P88431M73267L17739
13264A2493092L24848O53327J270677J627940K045827K384000K483970J549439
13256B4833120O9427j111491j220962p52819M8902R28148R63186Q84786J562188
13247B6204485K154907K404681L305564M340336N057374O080742P640004R277429
13239F6465522J0828424J3188183J7384360K2739676K9786280L8468320M9902348
13232B48763113O4896601P9927047Q1532844M9899831j2817866o6603191q3179429
13225C62418950p3985206n7836386m3395474l3018052k5663585k0192325j5812808
13218I2515114j1966952r849973p962976n576663l080857k985381o056301o312555
$$ plain form
13210 38723456 34649347 31477267 28774898 26436714 23956117 22009299 20329479 19105324
13202 19105324 18134463 17215994 16124520 14675026 13969803 13904032 13828457 13374768 12778606
13193 12778606 12453036 12621138 13156320 13194073 12704968 12072784 12071075 12328083 12244769 11883876
13183 11883876 11528321 10829990 10505289 11038217 11144572 10763077 10898503 11413356 11696698
13174 11696698 11748284 11765729 11542911 11576189 12253674 13341477 14491392 15976057 17293935
13165 17293935 18254861 19278288 20521857 22600335 24604377 25971129 28136164 31058486
13157 31058486 35178237 39832271 44981932 51670703 60566309 72216851 86166750 102373058
13149 102373058 122898188 149517786 183832253 228591093 286995763 360755519 441852231
$$ packed form
13210C8723456m074109l172080k702369k338184k480597j946818j679820j224155
13202A9105324r70861r18469j091474j449494p05223o5771p5575m53689n96162
13193A2778606l25570J68102N35182L7753m89105o32184j709K57008q3314l60893
13183A1883876l55555o98331l24701N32928J06355l81495J35426N14853K83342
13174A1696698N1586J7445k22818L3278O77485J087803J149915J484665J317878
13165A7293935R60926J023427J243569K078478K004042J366752K165035K922322
13157C1058486M119751M654034N149661O688771Q895606J1650542J3949899J6206308
13149A02373058K0525130K6619598L4314467M4758840N8404670P3759756Q1096712
$$ plain form
13142 441852231 503908960 512877764 462837430 384958866 309213402 247078564 199133530
13135 199133530 162195190 134083151 112279029 94454900 80207916 69084229 60191527
13128 60191527 53105303 46954033 41277807 36556490 32946503 29559075 26698901 24678689
13120 24678689 22993810 21066773 19211183 18000657 16632808 14708184 13271130 12459919
13112 12459919 12099842 11769018 11477035 11224147 10597811 10277738 9367480 8401707 7876625
13103 7876625 7123608 6443885 6042938 6039877 6222305 6294817 6069353 5469307 4956494 5072521
13093 5072521 5313810 5056495 4792359 4626227 4504891 4216116 3797501 3666656 3960238
13084 3960238 4151947 4291132 4105519 3830977 3894632 4165746 4427816 4648661 4788632 4797395
$$ packed form
13142D41852231O2056729Q968804n0040334p7878564p5745464o2134838m7945034
13135A99133530l6938340k8112039k1804122j7824129j4246984j1123687q892702
13128F0191527p086224o151270n676226m721317l609987l387428k860174k020212
13120B4678689j684879j927037j855590j210526j367849j924624j437054q11211
13112A2459919l60077l30824k91983k52888o26336l20073r10258r65773n25082
13103G876625p53017o79723m00947l061J82428P2512k25464o00046n12813J16027
13093E072521K41289k57315k64136j66132j21336k88775m18615j30845K93582
13084C960238J91709J39185j85613k74542O3655K71114K62070K20845J39971Q763
$$ plain form
13074 4797395 4597622 4284676 4391567 4074118 3635975 3546724 2888642 2305230 1546026 1173642
13064 1173642 1640486 1703686 1194382 246971 74920 583812 903652 1077142 927261 1026220
13054 1026220 1243174 1026407 924616 930292 1089865 1469996 1877985 1997323 1987666 1887929
13044 1887929 2252458 2268797 1739297 1116649 860216 1002608 812883 834867 1753625 2444947
13034 2444947 2215114 2024041 1858497 1684664 1601527 1317561 972610 784429 27646 -573170
13024 -573170 -952865 -1419875 -1493275 -881118 15639 675088 1063589 1062810 565434 -25656
13014 -25656 -328177 -216361 96215 590824 1002866 794957 620623 535177 630011 650487
13004 650487 716599 383555 -278627 -674107 -514361 152045 400576 587099 1053634 1345457
$$ packed form
13074D797395j99773l12946J06891l17449m38143q9251o58082n83412p59204l72384
13064A173642M66844O3200n09304r47411j72051N08892L19840J73490j49881R8959
13054A026220K16954k16767j01791N676J59573L80131M07989J19338r657r9737
13044A887929L64529J6339n29500o22648k56433J42392j89725K1984R18758O91322
13034B444947k29833j91073j65544j73833q3137k83966l44951j88181p56783o00816
13024e73170l79695m67010p3400O12157Q96757O59449L88501p79m97376n91090
13014b5656l02521J11816L12576M94609M12042k07909j74334q5446R4834K0476
13004F50487O6112l33044o62182l95480J59746O66406K48531J86523M66535K91823
$$ plain form
12994 1345457 1383206 1198846 726099 376859 270687 -96044 59414 901854 1328699 835978
12984 835978 394033 131353 -170974 -10849 559712 674546 286541 -185154 -370926 -54552
12974 -54552 647777 735348 381589 214815 643833 1184341 1467138 1149013 997107 1321828
12964 1321828 921667 438220 691616 902706 753508 669403 713701 429379 -152106 -120148
12954 -120148 -19856 -164736 -451547 -601601 -394659 -312231 -79120 261290 553755 512810
12944 512810 328048 -31781 -197487 -49016 -103320 -187057 -237000 72940 1110586 1609041
12934 1609041 1121421 1004813 1320830 1284908 754261 321449 190234 60974 -229923 -555470
12924 -555470 -317520 -319852 -23438 1087031 1456217 742596 97070 67850 142889 232084
$$ packed form
12994A345457L7749j84360m72747l49240j06172l66731J55458Q42440M26845m92721
12984H35978m41945k62680l02327J60125N70561J14834l88005m71695j85772L16374
12974e4552P02329Q7571l53759j66774M29018N40508K82797l18125j51906L24721
12964A321828m00161m83447K53396K11090j49198q4105M4298k84322n81485L1958
12954a20148J00292j44880k86811j50054K06942Q2428K33111L40410K92465m0945
12944E12810j84762l59829j65706J48471n4304q3737m9943L09940J037646M98455
12934A609041m87620j16608L16017l5922n30647m32812j31215j29260k90897l25547
12924e55470K37950k332K96414J110469L69186p13621o45526k9220P5039Q9195
$$ plain form
12914 232084 138614 422250 1020294 1117292 807329 645230 516902 914736 1129661 969710
12904 969710 1081724 903199 890325 886179 874562 712133 895480 947393 870708 834413 720432
12893 720432 890801 962900 501534 24521 96557 213688 136018 -26203 -231349 -25661
12883 -25661 629663 1055688 1281054 885403 858396 1097389 1334859 1207825 817776 340915
12873 340915 -156520 -212023 436748 1085726 1242299 932089 820374 1264432 1603443 1721601
12863 1721601 1737266 1744747 1853854 1324460 371350 -47458 -53745 -104103 521819 1023164
12853 1023164 636874 128903 267231 217931 367539 856449 869804 634848 413689 23638
12843 23638 -501265 -679294 -471524 -75180 -447975 -878324 -1081101 -1081039 -945224 -600314
$$ packed form
12914B32084r3470K83636N98044R6998l09963j62099j28328L97834K14925j59951
12904I69710J12014j78525j2874m146j1617j62429J83347N1913p6685l6295j13981
12893G20432J70369P2099m61366m77013P2036J17131p7670j62221k05146K05688
12883b5661O55324M26025K25366l95651k7007K38993K37470j27034l90049m76861
12873C40915m97435n5503O48771O48978J56573l10210j11715M44058L39011J18158
12863A721601J5665P481J09107n29394r53110m18808o287n0358O25922N01345
12853A023164l86290n07971J38328m9300J49608M88910J3355k34956k21159l90051
12843B3638n24903j78029K07770L96344l72795m30349k02777O2J35815L44910
$$ plain form
12833 -600314 -224258 -78228 -33122 41276 -159679 -492375 -127095 -72004 -232232 -304475
12823 -304475 -306990 268481 770589 1101987 1207735 1222972 1408988 1305264 561630 85350
12813 85350 551242 890794 1028299 936476 259282 295891 369532 277673 275443 220928 343299
12802 343299 381312 528471 174805 -16254 480860 453082 161224 242292 978796 1099509
12792 1099509 539257 -76091 -305020 -250485 245727 716047 756170 897275 1202058 1336115
12782 1336115 988981 457337 38051 60730 340609 637898 940053 1144871 1224652 1349869
12772 1349869 1461802 1416596 1549982 1969211 1899339 1558395 1622010 1255528 635465 383724
12762 383724 -147219 -144450 198360 348657 706091 1246857 1360026 1128915 1138910 932268
$$ packed form
12833f00314L76056J46030M5106P4398k00955l32696L65280N5091j60228p2243
12823c04475k515N75471N02108L31398J05748J5237J86016j03724p43634m76280
12813H5350M65892L39552J37505r1823o77194L6609P3641r1859k230n4515J22371
12802C43299L8013J47159l53666j91059M97114k7778k91858Q1068P36504J20713
12792A099509n60252o15348k28929N4535M96212M70320M0123J41105L04783J34057
12782A336115l47134n31644m19286K2679K79879K97289L02155K04818P9781J25217
12772A349869J11933m5206J33386M19229o9872l40944O3615l66482o20063k51741
12762C83724n30943K769L42810J50297L57434N40766J13169k31111R995k06642
$$ plain form
12752 932268 873281 787742 597693 421062 351169 346263 448015 222214 115464 367599
12742 367599 43935 -426727 -274210 -249493 202752 1018533 1542095 1360752 869267 412519
12732 412519 12775 326178 650419 652273 325896 284662 332997 237839 179137 57177 256568
12721 256568 805352 1052398 943109 686976 405618 976837 1578878 1097097 710016 376620
12711 376620 -132855 -432517 -324489 -366588 -579979 -868635 -731834 -341001 186579 605046
12701 605046 941058 1024057 363800 -351796 -1005250 -958070 -467045 48737 47963 -61805
12691 -61805 -349065 -1043999 -1629123 -1728684 -1385101 -1150945 -778933 -734290 -860597 -872776
12681 -872776 -944043 -1099851 -1164100 -704739 -159009 184237 194172 45787 -1824 -223422
$$ packed form
12752I32268n8987q5539j90049j76631o9893m906J01752k25801j06750K52135
12742C67599l23664m70662J52517K4717M52245Q15781N23562j81343m91485m56748
12732D12519l99744L13403L24241J854l26377m1234M8335r5158n8702j21960J99391
12721B56568N48784K47046j09289k56133k81358N71219O02041m81781l87081l33396
12711C76620n09475k99662J08028m2099k13391k88656J36801L90833N27580M18467
12701F05046L36012Q2999o60257p15596o53454M7180M91025N15782p74j09768
12691f1805k87260o94934n85124r9561L43583K34156L72012M4643j26307j2179
12681h72776p1267j55808o4249M59361N45730L43246R935j48385m7611k21598
$$ plain form
12671 -223422 -378321 -324122 266945 306856 61974 55308 -20825 -102514 -78814 169966 130750
12660 130750 -206836 -700510 -642773 -36640 240004 651301 908349 638678 976212 1544981
12650 1544981 1569296 1157282 227428 -287172 -617103 -981675 -1096520 -528926 -468345 -152584
12640 -152584 544761 353333 -209982 -575273 -387884 289050 274568 194077 579907 833127
12630 833127 1018040 1125137 909001 585097 311449 415670 522855 544039 304356 -108195
12620 -108195 -219827 -200168 -202027 289623 906560 1497775 1609444 1197575 1252311 1202596
12610 1202596 789056 563287 466570 427212 108265 -304741 201302 1011213 978458 -120337
12600 -120337 -444567 -437069 -158498 297283 618755 479864 217272 -20945 47381 384170
$$ packed form
12671b23422j54899N4199N91067L9911k44882o666p6133q1689K3700K48780l9216
12660A30750l37586m93674N7737O06133K76644M11297K57048k69671L37534N68769
12650A544981K4315m12014r29854n14600l29931l64572j14845N67594O0581L15761
12640a52584O97345j91428n63315l65291J87389O76934j4482q0491L85830K53220
12630H33127J84913J07097k16136l23904k73648J04221J07185K1184k39683m12551
12620a08195j11632J9659j859M91650O16937N91215J11669m11869N4736m9715
12610A202596m13540k25769r6717l9358l18947m13006N06043Q09911l2755j098795
12600a20337l24230P498K78571M55781L21472j38891k62592k38217O8326L36789
$$ plain form
12590 384170 571494 205072 -295076 -286876 -168792 -239778 -169946 -82507 58066 -271947
12580 -271947 -332830 567639 1405518 1297924 560078 -201305 -586266 -179924 797966 1145143
12570 1145143 1212539 762429 142451 -64761 125898 438153 302524 165422 -51157 -343992
12560 -343992 -454999 -641512 -973172 -1061855 -1024768 -915688 -686257 -250055 279998 388964
12550 388964 -372123 -755449 -365574 -458087 -901812 -1168846 -839433 -462998 176350 829224
12540 829224 666755 556179 470605 139255 -431995 -1021894 -1145595 -601142 -70990 257039
12530 257039 -10242 -944406 -1614681 -1946712 -1904086 -1460860 -933834 -538923 -305571 -102005
12520 -102005 -365410 -887293 -974411 -245021 653411 779937 460241 205890 -29687 -66369
$$ packed form
12590C84170J87324l66422n00148Q200J18084p0986O9832Q7439J40573l30013
12580b71947o0883R00469Q37879j07594p37846p61383l84961M06342R77890L47177
12570A145143O7396m50110o19978k07212J90659L12255j35629j37102k16579k92835
12560c43992j11007j86513l31660q8683L7087J09080K29431M36202N30053J08966
12550C88964p61087l83326L89875r2513m43725k67034L29413L76435O39348O52874
12540H29224j62469j10576q5574l31350n71250n89899j23701N44453N30152L28029
12530B57039k67281r34164o70275l32031M2626M43226N27026L94911K33352K03566
12520a02005k63405n21883q7118P29390Q98432J26526l19696k54351k35577l6682
$$ plain form
12510 -66369 -367101 -764404 -766081 -622975 -678127 -777896 -711641 -350657 519720 367196 -127783
12499 -127783 102214 -18134 -659885 -583024 -77099 -64258 32181 44345 44589 322099 295848
12488 295848 35885 -275061 -727925 -694419 -343095 -417272 -544320 -537362 -698552 -893510
12478 -893510 -586376 -374547 -300592 -142614 -298547 -197901 -333011 -619306 -630115 -729920
12468 -729920 -827276 -489857 -986882 -1368111 -794420 -403805 -221952 -170583 -92625 134941
12458 134941 529984 624717 457236 731149 1138969 1032470 872163 1104870 1032513 1192783
12448 1192783 1297063 1287339 987671 792602 667507 710613 532177 125602 185927 1135651
12438 1135651 1614044 1659952 1395554 1005857 538665 -267013 -878140 -1477345 -1985857 -2104644
$$ packed form
12510f6369l00732l97303j677J43106n5152r9769O6255L60984Q70377j52524m94979
12499a27783K29997j20348o41751P6861N05925J2841R6439J2164K44K77510k6251
12488B95848k59963l10946m52864L3506L51324p4177j27048O958j61190j94958
12478h93510L07134K11829P3955J57978j55933J00646j35110k86295j0809r9805
12468g29920r7356L37419m97025l81229N73691L90615J81853N1369P7958K27566
12458A34941L95043R4733j67481K73913M07820j06499j60307K32707p2357J60270
12448A192783J04280r724k99668j95069j25095M3106j78436m06575O0325R49724
12438A135651M78393M5908k64398l89697m67192q05678o11127n99205n08512j18787
$$ plain form
12428 -2104644 -1498670 -547443 338931 1211703 1285149 803012 800122 626517 -202347 -873420
12418 -873420 -1120376 -1766042 -1973165 -1379566 -834553 -871918 -697885 -1027094 -1333269 -937617
12408 -937617 -605876 -415107 -667663 -1166904 -1333659 -1195205 -1472376 -1838263 -1578817 -1158278
12398 -1158278 -639589 -520906 -841256 -867630 -792588 -401395 41453 26926 184910 486747
12388 486747 648337 297987 388127 894388 1289804 1538203 1078875 547453 -79406 -533170
12378 -533170 -671714 -1163137 -1386649 -1066942 -649180 -784463 -880378 -963297 -805673 -65567
12368 -65567 782903 1161372 669984 23361 -99643 134482 87301 215217 244409 84898
12358 84898 122652 305914 284287 -288416 -329029 172776 204722 33917 143765 183665 -280737
$$ packed form
12428b104644O05974R51227Q86374Q72772P3446m82137k890j73605q28864o71073
12418h73420k46956o45666k07123N93599N45013l7365J74033l29209l06175L95652
12408i37617L31741J90769k52556m99241j66755J38454k77171l65887K59446M20539
12398a158278N18689J18683l20350k6374P5042L91193M42848j4527J57984L01837
12388D86747J61590l50350R0140N06261L95416K48399m59328n31422o26859m53764
12378e33170j38544m91423k23512L19707M17762j35283r5915q2919J57624P40106
12368f5567Q48470L78469m91388o46623j23004K34125m7181J27916K9192j59511
12358H4898L7754J83262k1627n72703m0613N01805L1946j70805J09848L9900m64402
$$ plain form
12347 -280737 -192772 -130343 -638003 -503408 -337334 200064 701908 430197 239659 609605
12337 609605 1299497 1127560 163464 -579740 -926744 -928390 -448558 27242 113371 394340
12327 394340 661230 867456 1001750 911853 570698 299073 228387 578988 679642 592448
12317 592448 637074 447686 575838 791043 856373 527180 -52357 -594262 -1006114 -750764
12307 -750764 -424772 -387781 -599744 -656822 -730127 -594149 36068 505931 583062 391373
12297 391373 428178 689400 224578 -721914 -1179285 -665881 -123375 220313 811477 1258954
12287 1258954 1065435 619266 485735 494396 221218 603165 1211258 1534081 1455514 847458
12277 847458 231510 -305047 -765672 -956582 -998446 -969348 -819507 -474251 -383219 -406859
$$ packed form
12347b80737Q7965O2429n07660J34595J66074N37398N01844k71711j90538L69946
12337F09605O89892j71937r64096p43204l47004j646M79832M75800Q6129K80969
12327C94340K66890K06226J34294q9897l41155k71625p0686L50601J00654q7194
12317E92448M4626j89388J28152K15205O5330l29193n79537n41905m11852K55350
12307g50764L25992L6991k11963n7078p3305J35978O30217M69863P7131j91689
12297C91373L6805K61222m64822r46492m57371N13404N42506L43688N91164M47477
12287A258954j93519m46169j33531Q661k73178L81947O08093L22823p8567o08056
12277H47458o15948n36557m60625j90910m1864K9098J49841L45256R1032k3640
$$ plain form
12267 -406859 -398714 -457793 191431 904817 1167782 1164062 1034355 754857 706304 904872 2076891
12256 2076891 3483693 4551143 5709385 6216212 5978808 5360802 4517984 4399187 4356803
12247 4356803 3827832 3263354 2359217 1568744 1090780 1046524 1131292 1682354 2041462 1632737
12237 1632737 918014 581877 555768 413344 -76786 -582994 -720689 -701194 -544743 -448624
12227 -448624 -668519 -595767 -305857 -422631 -956423 -1660123 -2120030 -2378562 -2405113 -2227015
12217 -2227015 -1372343 -746869 -86624 564558 472642 -215849 -348588 -404205 -409197 -198258
12207 -198258 41681 -45075 -214144 -125203 -259463 -845871 -1443186 -1710437 -1395738 -1247495
12197 -1247495 -1025266 -531634 8030 30133 -145032 -219013 -232629 41748 97815 -87471
$$ packed form
12267d06859Q145n9079O49224P13386K62965l720j29707k79498m8553J98568J172019
12256B076891J406802J067450J158242N06827k37404o18006q42818j18797m2384
12247D356803n28971n64478r04137p90473m77964m4256Q4768N51062L59108m08725
12237A632737p14723l36137k6109j42424m90130n06208j37695J9495J56451R6119
12227d48624k19895P2752K89910j16774n33792p03700m59907k58532k6551J78098
12217b227015Q54672O25474O60245O51182r1916o88491j32739n5617m992K10939
12207a98258K39939q6756j69069Q8941j34260n86408n97315k67251L14699J48243
12197a247495K22229M93632N39664K2103j75165p3981j3616K74377N6067j85286
$$ plain form
12187 -87471 81725 -34860 -401049 68483 345524 27971 -429149 -786357 -1006431 -1282310
12177 -1282310 -1364633 -1022915 -779920 -655825 -398042 -188242 -284632 -344238 -679643 -1008909
12167 -1008909 -750783 -287372 186451 386005 215201 66845 -777306 -1727361 -2288911
12158 -2288911 -2090917 -1359804 -1014113 -1291868 -1198806 -844585 -791087 -849542 -872964 -1336849
12148 -1336849 -1555624 -1310482 -1119620 -1081185 -704681 -211375 -458788 -840018 -747384 -756711
12138 -756711 -1109432 -1159633 -865628 -777310 -285264 -27964 -551488 -1321376 -1556563 -982287
12128 -982287 -510308 -247260 73479 183588 -333337 -764067 -737765 -258297 42949 -239313
12118 -239313 -730047 -1116636 -1150042 -867988 -73672 361027 227208 -63930 -180240 8013
$$ packed form
12187h7471J69196j16585l66189M69532K77041l17553m57120l57208k20074k75879
12177a282310q2323L41718K42995J24095K57783K09800r6390n9606l35405l29266
12167a008909K58126M63411M73823J99554j70804j48356q44151r50055n61550
12158b288911J97994P31113L45691k77755R3062L54221N3498n8455k3422m63885
12148a336849k18775K45142J90862L8435L76504M93306k47413l81230R2634r327
12138g56711l52721n0201K94005Q8318M92046K57300n23524p69888k35187N74276
12128i82287M71979K63048L20739J10109n16925m30730K6302M79468L01246k82262
12118b39313m90734l86589l3406K82054P94316M34699j33819k91138j16310J88253
$$ plain form
12108 8013 -189799 -167593 64427 -184685 -369871 -330548 -671760 -869855 -861461 -638455 -257209
12097 -257209 199268 364854 205731 -194081 -745740 -964570 -1130517 -1189164 -725613 -82880
12087 -82880 122952 -238276 -1060737 -1483045 -767137 -203560 -167143 -268039 -529644 -672373
12077 -672373 -617915 -502946 -440652 -211444 -215711 -315408 -69051 -172770 -230638 -295063 -557966
12066 -557966 -744757 -576227 -492301 -594947 -932208 -1421412 -1430551 -959651 194366 1396939
12056 1396939 1558122 1401379 786388 -110167 -409263 198779 836107 850993 300980 -42946
12046 -42946 19057 107015 -118667 122461 314022 131565 89547 -91152 338755 679781
12036 679781 485625 -67528 -894375 -1786529 -2162414 -2262051 -2278798 -2445590 -2551067 -2396754
$$ packed form
12108H013j97812K2206K32020k49112j85186L9323l41212j98095Q394K23006L81246
12097b57209M56477J65586j59123l99812n51659k18830j65947n8647M63551O42733
12087h2880K05832l61228q22461m22308P15908N63577L6417j00896k61605j42729
12077f72373N4458J14969O2294K29208m267r9697K46357j03719n7868o4425k62903
12066e57966j86791J68530Q3926j02646l37261m89204r139M70900J154017J202573
12056A396939J61183j56743o14991q96555k99096O08042O37328J4886n50013l43926
12046d2946O2003Q7958k25682K41128J91561j82457m2018j80699M29907L41026
12036F79781j94156n53153q26847q92154l75885r9637j6747j66792j05477J54313
$$ plain form
12026 -2396754 -2337518 -2285368 -2125805 -2226718 -1915378 -1195484 -891261 -716094 -126513 450320
12016 450320 991395 1773603 1956448 1815854 1523760 1130615 945278 836650 1177309 1512221
12006 1512221 1608676 1565498 1264675 965572 594878 215300 79087 255642 97424 47470
11996 47470 440315 683725 509064 494782 775136 657411 156651 -208958 -191171 38312
11986 38312 237551 -78716 -162967 -38432 -351603 -1051013 -1255706 -540128 -89311 221677
11976 221677 396452 -188254 -672997 -547797 -183945 -437533 -553721 -252067 -333469 -781539
11966 -781539 -1261065 -1397535 -1104526 -745518 -639484 -660550 -504410 -500593 -566974 -302555
11956 -302555 -2868 120270 -225386 -500777 -151147 -180776 -734633 -1012820 -905255 -501044
$$ packed form
12026b396754N9236N2150J59563j00913L11340P19894L04223J75167N89581N76833
12016D50320N41075P82208J82845j40594k92094l93145j85337j08628L40659L34912
12006A512221R6455m3178l00823k99103l70694l79578j36213J76555j58218m9954
11996D7470L92845K43410j74661j4282K80354j17725n00760l65609J7787K29483
11986C8312J99239l16267q4251J24535l13171o99410k04693P15578M50817L10988
11976B21677J74775n84706m84743J25200L63852k53588j16188L01654q1402m48070
11966g81539m79526j36470K93009L59008J06034k1066J56140L817o6381K64419
11956c02555K99687J23138l45656k75391L49630k9629n53857k78187J07565M04211
$$ plain form
11946 -501044 -120529 406064 554003 -29566 -485060 -149079 178884 -19806 -177886 203868
11936 203868 -53955 -689244 -1118171 -1307738 -1455267 -1234994 -786904 -580749 -640630 -860772
11926 -860772 -851875 -240910 129293 -17496 -403170 -1277017 -1338680 -876918 -684740 -642738
11916 -642738 -790943 -994493 -761800 -931837 -1355094 -1320233 -1571415 -1579388 -943093 89809
11906 89809 453379 130272 301182 102012 -693681 -1275240 -1478574 -1530780 -1691734 -1560108
11896 -1560108 -781096 -246759 -271911 -258534 -277165 -480112 -1158278 -1500608 -1095664 -538635
11886 -538635 25130 691393 694360 119799 210378 417232 425996 530398 211464 -192753
11876 -192753 -37177 456019 695620 836625 895184 815956 667391 305179 333622 255535
$$ packed form
11946e01044L80515N26593J47939n83569m55494L35981L27963j98690j58080L81754
11936B03868k57823o35289m28927j89567j47529K20273M48090K06155n9881k20142
11926h60772Q897O10965L70203j46789l85674q73847o1663M61762J92178M2002
11916f42738j48205k03550K32693j70037m23257L4861k51182p973O36295J032902
11906H9809L63570l23107J70910j99170p95693n81559k03334n2206j60954J31626
11896a560108P79012N34337k5152J3377j8631k02947o78166l42330M04944N57029
11886e38635N63765O66263K967n74561R0579K06854Q764J04402l18934m04217
11876a92753J55576M93196K39601J41005N8559p9228j48565l62212K8443p8087
$$ plain form
11866 255535 -100858 -197106 -498153 -588021 -761061 -1237777 -1371316 -941828 -630573 -723271
11856 -723271 -882429 -1321443 -1868358 -1535209 -713567 -108741 88497 534665 1222290 1418966
11846 1418966 1745459 1903140 1690853 1346508 1444295 2068273 3020802 3732264 4465701 5499826
11836 5499826 6606428 7286473 7240218 6356720 5458892 4321715 3200790 2976362 2912110
11827 2912110 2201919 1693968 1617341 1297168 1069886 1065855 1029500 1050210 1136129 1536724
11817 1536724 1846723 1994583 2115977 1990859 1935415 2356978 2665730 3487199 4660077
11808 4660077 5968462 7364885 8080994 6995685 5299278 4118715 3460469 3084938 3001963
11799 3001963 3102921 2346987 1208854 599236 402033 380394 591575 850719 892941 865665
$$ packed form
11866B55535l56393r6248l01047q9868j73040m76716j33539M29488L11255r2698
11856g23271j59158m39014n46915L33149Q21642O04826J97238M46168O87625J96676
11846A418966L26493J57681k12287l44345R7787O23978R52529P11462P33437J034125
11836E499826J106602O80045m6255q83498q97828j137177j120925k24428o4252
11827B912110p10191n07951p6627l20173k27282m031l6355K0710Q5919M00595
11817A536724L09999J47860J21394j25118n5444M21563L08752Q21469J172878
11808D660077J308385J396423P16109j085309j696407j180563o58246l75531q2975
11799C001963J00958p55934j138133o09618j97203k1639K11181K59144M2222k7276
$$ plain form
11789 865665 1084192 1289324 1278363 1119981 609024 544474 580437 698683 998599 1612796
11779 1612796 1886316 1219620 882606 172273 -508264 -297786 -297715 -462081 -493210 156035
11769 156035 607201 623586 833467 1072687 1108764 962945 653881 407507 129546 306
11759 306 108478 662838 1330704 2230279 3709433 5106230 6293785 6975225 7861988 8354322
11749 8354322 7312162 5622626 4211603 3566103 3538990 3172825 2453865 1774773 1391695
11740 1391695 1432505 1740716 1813020 1349833 966751 711688 208992 -366284 -456630 -201395
11730 -201395 -309054 -633812 -561030 -210172 -303291 -433702 -719870 -1066334 -1718762 -1913011
11720 -1913011 -1240077 -800010 -584288 -502780 -236006 -95729 -309326 -331732 -875688 -1514799
$$ packed form
11789H65665K18527K05132j0961j58382n10957o4550L5963J18246K99916O14197
11779A612796K73520o66696l37014p10333o80537K10478P1j64366l1129O49245
11769A56035M51166J6385K09881K39220L6077j45819l09064k46374k77961j29240
11759C06J08172N54360O67866Q99575J479154J396797J187555O81440Q86763M92334
11749H354322j042160j689536j411023o45500k7113l66165p18960o79092l83078
11740A391695M0810L08211P2304m63187l83082k55063n02696n75276r0346K55235
11730b01395j07659l24758P2782L50858r3119j30411k86168l46464o52428j94249
11720a913011O72934M40067K15722Q1508K66774J40277k13597k2406n43956o39111
$$ plain form
11710 -1514799 -1455249 -1417058 -1612171 -1308772 -1087854 -677987 -547462 -460428 -226107 -258795
11700 -258795 -641760 -1121105 -1448104 -1562698 -1280904 -1057566 -597076 -100346 -321955 -1050648
11690 -1050648 -987175 -423778 -218679 -303586 -559788 -713800 -545470 -698175 -515091 -617867
11680 -617867 -1048899 -686015 -498452 7243 9564 -459240 -989495 -1329774 -1273233 -482027
11670 -482027 -406539 -785037 -1522973 -2103567 -1518745 -273288 12553 -854939 -1448190 -1187222
11660 -1187222 -821263 -396951 202190 670777 998969 1129086 581782 -235176 -913952
11651 -913952 -1025694 -531447 40939 345005 222882 -99116 -7757 307108 190542 79231
11641 79231 -172456 -387326 -138426 122107 222559 587296 722477 845196 838134 401203
$$ packed form
11710a514799N9550L8191j95113L03399K20918M09867J30525Q7034K34321l2688
11700b58795l82965m79345l26999j14594K81794K23338M60490M96730k21609p28693
11690a050648O3473N63397K05099q4907k56202j54012J68330j52705J83084j02776
11680f17867m31032L62884J87563N05695K321m68804n30255l40279N6541P91206
11670d82027P5488l78498p37936n80594N84822J245457K85841q67492n93251K60968
11660a187222L65959M24312N99141M68587L28192J30117n47304q16958o78776
11651i13952j11742M94247N72386L04066j22123l21998R1359L14865j16566j11311
11641G9231k51687k14870K48900K60533J00452L64737J35181J22719p062m36931
$$ plain form
11631 401203 52167 -35474 20782 -46056 -53638 249154 244521 -106299 -478163 -985430 -1258871
11620 -1258871 -1271644 -1006077 -719584 -219279 411568 833786 902048 673322 324699 212250
11610 212250 204469 54910 67169 309758 552341 785577 1085618 1047729 752700 444376
11600 444376 410016 563523 220719 335235 947791 1516406 1839371 1661938 901703 290897
11590 290897 934528 1599578 971378 133981 28516 33646 -158053 -391748 -461452 -666141
11580 -666141 -1034333 -1130260 -950705 -1077289 -1285536 -1281582 -1049828 -619625 261673 530090
11570 530090 434535 -17942 -376311 -360037 -64394 302872 289336 463591 727073 437520
11560 437520 -66268 -276406 -352259 -678505 -857248 -1005585 -990056 -313279 572405 1034077
$$ packed form
11631D01203l49036q7641N6256o6838p582L02792m633l50820l71864n07267k73441
11620a258871j2773K65567K86493N00305O30847M22218O8262k28726l48623j12449
11610B12250p781j49559J2259K42589K42583K33236L00041l7889k95029l08324
11600D44376l4360J53507l42804J14516O12556N68615L22965j77433p60235o10806
11590B90897O43631O65050o28200q37397j05465N130j91699k33695o9704k04689
11580f66141l68192r5927J79555j26584k08247L954K31754M30203Q81298K68417
11570E30090r5555m52477l58369J6274K95643L67266j3536J74255K63482k89553
11560D37520n03788k10138p5853l26246j78743j48337J5529O76777Q85684M61672
$$ plain form
11550 1034077 1058921 979202 1017783 603603 42491 -388195 -838364 -1104042 -916475 -883711
11540 -883711 -1337062 -1682091 -1408733 -1036050 -761278 -469493 -460814 -579040 -676661 -921449
11530 -921449 -884745 -878583 -1051794 -1195254 -604381 23820 74568 348138 273318 390687
11520 390687 640091 793169 650375 144346 -15300 294929 533875 310268 -334008 -920061
11510 -920061 -956936 -382371 -153643 223837 608705 721205 1053661 1357007 1530448 1460390
11500 1460390 1094476 811705 469232 -14054 -178655 -228160 -691315 -1114751 -830504 165812
11490 165812 532277 442901 259730 -29381 -223137 -44993 399565 616944 1165881 972366
11480 972366 1095655 1214044 786041 202448 -263664 -287880 -159094 -670270 -921340 -1141714
$$ packed form
11550A034077K4844p9719L8581m14180n61112m30686m50169k65678J87567L2764
11540h83711m53351l45029K73358L72683K74772K91785Q679j18226r7621k44788
11530i21449L6704O162j73211j43460N90873O28201N0748K73570p4820J17369
11520C90687K49404J53078j42794n06029j59646L10229K38946k23607o44276n86053
11510i20061l6875N74565K28728L77480L84868J12500L32456L03346J73441p0058
11500A460390l65914k82771l42473m83286j64601m9505m63155m23436K84247R96316
11490A65812L66465q9376j83171k89111j93756J78144M44558K17379N48937j93515
11480I72366J23289J18389m28003n83593m66112k4216J28786n11176k51070k20374
$$ plain form
11470 -1141714 -1163902 -595217 -318276 -266850 -593996 -945755 -187015 684594 1007829 1070801
11460 1070801 748189 373361 -195216 -729657 -550915 -744705 -1213681 -1636036 -1524228
11451 -1524228 -853387 -502910 -383899 -771317 -1292706 -1297151 -1171585 -1176817 -1103542 -798765
11441 -798765 -1033321 -1485023 -1222104 -1048156 -996845 -1017565 -763608 -306373 -190791 -62837
11431 -62837 186206 -60768 -286275 -351956 -679904 -1040005 -1093144 -879891 -1012561 -1666918
11421 -1666918 -2300691 -2235249 -1830569 -1842319 -1572098 -1218191 -794101 -89434 442963 906988
11411 906988 1340358 1023260 726781 163021 -151038 336173 688369 820697 957200 634597
11401 634597 43401 -409468 -576624 -408358 -7848 221738 345607 40300 -651632 -463531
$$ packed form
11470a141714k2188N68685K76941N1426l27146l51759P58740Q71609L23235O2972
11460A070801l22612l74828n68577n34441J78742j93790m68976m22355J11808
11451a524228O70841L50477J19011l87418n21389m445J25566n232P3275L04777
11441g98765k34556m51702K62919J73948N1311k0720K53957M57235J15582J27954
11431f2837K49043k46974k25507o5681l27948l60101n3139K13253j32670o54357
11421a666918o33773O5442M04680j1750K70221L53907M24090P04667N32397M64025
11411I06988M33370l17098k96479n63760l14059M87211L52196J32328J36503l22603
11401F34597n91196m52869j67156J68266M00510K29586J23869l05307o91932J88101
$$ plain form
11391 -463531 -229505 -615579 -916883 -822722 -662571 -591590 -654762 -721291 -831662 -597016
11381 -597016 -232735 127128 293954 -62741 -254621 -225398 178110 759076 1041845 488129
11371 488129 106164 -291987 -1076784 -1237577 -725355 -379257 -225626 190677 334622 282498
11361 282498 -180624 -521740 -687504 -922578 -441079 -28378 -88871 -195481 -377853 -682100
11351 -682100 -585785 -262401 -95309 -285888 -125029 -147291 -253085 -281539 -477280 -291220
11341 -291220 -230096 -695874 -1245522 -1340122 -1251094 -1184146 -1526944 -1750008 -1589309 -1010948
11331 -1010948 -362529 105663 398630 711569 1269317 1700687 1633992 1792985 1651409 1158616
11321 1158616 1029750 564880 -9657 -428093 -516111 -579074 -611918 -805268 -716080 -390741
$$ packed form
11391d63531K34026l86074l01304R4161J60151P0981o3172o6529j10371K34646
11381e97016L64281L59863J66826l56695j91880K9223M03508N80966K82769n53716
11371D88129l81965l98151p84797j60793N12222L46098J53631M16303J43945n2124
11361B82498m63122l41116j65764k35074M81499M12701o0493j06610j82372l04247
11351f82100R6315L23384J67092j90579J60859k2262j05794k8454j95741J86060
11341b91220O1124m65778n49648r4600Q9028O6948l42798k23064J60699N78361
11331a010948O48419M68192K92967L12939N57748M31370o6695J58993j41576m92793
11321A158616j28866m64870n74537m18436q8018o2963l2844j93350Q9188L25339
$$ plain form
11311 -390741 -559952 -794034 -879228 -1112084 -1131618 -1086238 -1031695 -656468 -374002 -396261
11301 -396261 -750069 -1052896 -1319146 -1434663 -1388957 -1443248 -1619679 -2007752 -2474091 -2304179
11291 -2304179 -1345455 -588075 -1047854 -1424883 -975931 -491407 -413665 -415082 67641 497372
11281 497372 778955 1210584 977122 340088 25100 -686935 -1665490 -2162248 -1858893 -1329339
11271 -1329339 -1116005 -1145927 -1260944 -1245779 -1015688 -974679 -1031709 -647304 100787 215567
11261 215567 -44948 -445950 -868531 -1241126 -1312864 -1333359 -1149371 -118015 366196 192684
11251 192684 248095 405601 178443 -129668 -254804 -626759 -954406 -741832 -275593 -136924
11241 -136924 140011 406854 577646 526720 452070 414445 337466 170844 52844 141273
$$ packed form
11311c90741j69211k34082q5194k32856j9534M5380N4543L75227K82466k2259
11301c96261l53808l02827k66250j15517M5706n4291j76431l88073m66339J69912
11291b304179R58724P57380m59779l77029M48952M84524P7742j417M82723M29731
11281D97372K81583M31629k33462o37034l14988p12035r78555m96758L03355N29554
11271a329339K13334k9922j15017J5165K30091M1009n7030L84405P48091J14780
11261B15567k60515m01002m22581l72595p1738k0495J83988J031356M84211j73512
11251A92684N5411J57506k27158l08111j25136l71955l27647K12574M66239J38669
11241a36924K76935K66843J70792n0926p4650l7625p6979j66622j18000Q8429
$$ plain form
11231 141273 296987 293908 -386141 -1179865 -1126795 -453415 -105076 154733 226400 272565
11221 272565 77125 -142351 -305543 -646678 -338325 746434 1225174 988207 769506
11212 769506 742046 519564 48412 -70408 -48074 -305322 -486254 -90732 367564 346334
11202 346334 371125 66799 -184121 -112428 -78389 -71887 275432 270223 -41213 74920 292797
11191 292797 617128 790253 606267 474909 -2100 -492217 -608246 -566223 -1033008 -1358640
11181 -1358640 -1231544 -1053251 -860868 -906893 -758584 -540787 -262184 163212 457998 698041
11171 698041 621889 610953 817744 774790 1009316 1306326 1509022 1472452 1511950 941350
11161 941350 614168 901374 1138650 1479778 1647801 1438506 1013581 341182 -295487 -782026
$$ packed form
11231A41273J55714l079o80049p93724N3070O73380L48339K59809P1667M6165
11221B72565j95440k19476j63192l41135L08353J084759M78740k36967k18701
11212G69506k7460k22482m71152j18820K2334k57248j80932L95522M58296k1230
11202C46334K4791l04326k50920P1693L4039O502L47319n209l11436J16133K17877
11191B92797L24331J73125j83986j31358m77009m90117j16029M2023m66785l25632
11181a358640J27096J78293J92383m6025J48309K17797K78603M25396K94786K40043
11171F98041p6152j0936K06791m2954K34526K97010K02696l6570L9498n70600
11161I41350l27182K87206K37276L41128J68023k09295m24925o72399o36669m86539
$$ plain form
11151 -782026 -732051 99878 803449 987177 917637 493476 267701 346426 179012 385120
11141 385120 105663 -745739 -854076 -332243 51571 248705 165872 -445375 -627753 -423949
11131 -423949 -298152 -90513 -42810 45335 682275 983257 525281 137871 -222697 -720184
11121 -720184 -799430 -113581 182349 302235 57542 -190165 -275677 -209778 41984 299344
11111 299344 652468 1445796 2717183 3980606 6001394 8030400 8025213 5844366 3953907
11102 3953907 2564379 1496623 790779 67321 -163327 -515602 -1105398 -1147688 -887542
11093 -887542 -701246 -397357 -277330 -145558 -192884 -43525 180489 298983 519431 632685
11083 632685 652118 324752 476170 723202 909539 954780 362756 -250733 -582880 -692713
$$ packed form
11151g82026M9975Q31929P03571J83728o9540m24161k25775P8725j67414K06108
11141C85120k79457q51402j08337N21833L83814J97134q2833o11247j82378K03804
11131d23949J25797K07639M7703Q8145O36940L00982m57976l87410l60568m97487
11121g20184p9246O85849K95930J19886k44693k47707q5512O5899K51762K57360
11111B99344L53124P93328J271387J263423K020788K029006n187k180847j890459
11102C953907j389528j067756p05844p23458k30648l52275n89796m2290K60146
11093h87542J86296L03889J20027J31772m7326J49359K24014J18494K20448J13254
11083F32685J9433l27366J51418K47032J86337M5241n92024o13489l32147j09833
$$ plain form
11073 -692713 -703065 -313613 246648 -200991 -728706 -765588 -403725 -40202 -105329 30865
11063 30865 118407 -98254 -450198 -391590 27616 352924 207414 42608 117137 -243198
11053 -243198 -279363 -211974 -417608 -391553 -287072 -630551 -847141 -800428 -1013819 -829651
11043 -829651 -160517 -203504 -526222 -617209 -255741 215351 101719 -67510 -36647 48512
11033 48512 -202397 -498662 -808860 -408075 -156169 -245349 -525469 -911930 -783837 -333232
11023 -333232 108099 296457 -41422 -566640 -772646 -725095 -335806 78456 309406 -39910
11013 -39910 -340898 -215269 -28995 -131655 -148146 -683019 -1460317 -1637788 -1616514 -1400256
11003 -1400256 -1432323 -1589445 -1531560 -1073253 -465426 -518145 -508085 -152778 69967 25807
$$ packed form
11073f92713j0352L89452N60261m47639n27715l6882L61863L63523o5127J36194
11063C0865Q7542k16661l51944N8608M19206L25308j45510j64806P4529l60335
11053b43198l6165O7389k05634K6055J04481l43479k16590M6713k13391J84168
11043h29651O69134m2987l22718r0987L61468M71092j13632j69229L0863Q5159
11033D8512k50909k96265l10198M00785K51906q9180k80120l86461J28093M50605
11023c33232M41331J88358l37879n25218k06006M7551L89289M14262K30950l49316
11013c9910l00988J25629J86274j02660j6491n34873p77298j77471K1274K16258
11003a400256l2067j57122N7885M58307O07827n2719J0060L55307K22745m4160
$$ plain form
10993 25807 -184984 -490007 -741912 -712662 -755554 -1038248 -637948 -64149 -313447 -657230
10983 -657230 -835675 -777236 -1069613 -1775087 -1989970 -1590619 -977159 -901483 -1466326 -1543825
10973 -1543825 -964470 103961 149669 -176534 149172 505035 243254 30091 33820 -240626
10963 -240626 123917 727717 904951 489876 168612 414370 321649 -236397 -324344 -225535
10953 -225535 -322280 -292688 283604 890514 640783 -52625 -594889 -1108318 -1493785 -1127701
10943 -1127701 -643750 -505978 -778767 -642023 -349157 210673 1008145 1209581 992017
10934 992017 265597 -382569 -421665 -353647 -444476 -717504 -873943 -869775 -436977 43243
10924 43243 42496 217837 494181 478379 20970 -396068 -361935 -320725 -365500 -548345 -571238
$$ packed form
10993B5807k10791l05023k51905K9250m2892k82694M00300N73799k49298l43783
10983f57230j78445N8439k92377p05474k14883L99351O13460P5676n64843p7499
10973a543825N79355J068431M5708l26203L25706L55863k61781k13163L729k74446
10963b40626L64543O03800J77234m15075l21264K45758r2721n58046q7947R8809
10953b25535r6745K9592N76292O06910k49731o93408n42264n13429l85467L66084
10943a127701M83951J37772k72789J36744K92866N59830P97472K01436k17564
10934I92017p26420o48166l9096O8018r0829k73028j56439M168M32798M80220
10924D3243p47J75341K76344j5802m57409m17038L4133M1210m4775j82845k2893
$$ plain form
10913 -571238 217538 509639 417441 546422 144601 -299564 -279134 -54875 -564607 -824886
10903 -824886 -466864 -438395 -377651 -372425 -748527 -969265 -711028 -178362 327217 180812
10893 180812 -92064 -271761 -578403 -624466 -490097 -380615 -281173 -133083 -324860 -539079
10883 -539079 -391567 -383538 -501984 -384985 -285846 26349 20103 -198103 -265966 -302711 -693586
10872 -693586 -1197780 -1109774 -310626 359 -580508 -803678 -980015 -1184672 -1558744 -1971668
10862 -1971668 -1998046 -1542413 -1224779 -1126220 -812957 -798308 -1258661 -1295780 -945131 -811010
10852 -811010 -1248465 -1469633 -1790609 -2006742 -2258732 -1866568 -902272 -334236 -129929 -150055
10842 -150055 22309 339216 737253 1034240 668980 339728 317913 254228 77776 60560
$$ packed form
10913e71238P88776K92101r2198J28981m01821m44165K0430K24259n09732k60279
10903h24886L58022K8469O0744N226l76102k20738K58237N32666N05579j46405
10893A80812k72876j79697l06642m6063J34369J09482R9442J48090j91777k14219
10883e39079J47512Q029j18446J16999R9139L12195o246k18206o7863l6745l90875
10872f93586n04194Q8006P99148L10985n80867k23170j76337k04657l74072m12924
10862a971668k6378M55633L17634R8559L13263J4649m60353l7119L50649J34121
10852h11010m37455k21168l20976k16133k51990L92164R64296N68036K04307k0126
10842a50055J72364L16907L98037K96987l65260l29252k1815o3685j76452j7216
$$ plain form
10832 60560 -277906 -467822 -860988 -1160504 -1611381 -2133434 -1898721 -1269180 -820358 -202316
10822 -202316 146342 235222 107905 -333807 -818928 -1225897 -998164 -560899 -413627 -704945
10812 -704945 -794904 -909269 -961361 -752872 -732549 -695976 -553353 -446474 -627850 -794472
10802 -794472 -955547 -1151547 -1630087 -1830908 -1506146 -1109544 -854073 -413749 -18042 229083
10792 229083 291914 -58188 -361416 -756715 -1015870 -780528 -345884 -481703 -770555 -871319
10782 -871319 -294459 249480 666976 765519 731613 753523 469521 492818 503450 8600
10772 8600 -626321 -928487 -554483 -66171 -91799 -601163 -1417629 -1860986 -2114002 -1783207
10762 -1783207 -1167483 -749945 -404070 -975326 -1362945 -1268783 -983846 -737791 -244782 446298
$$ packed form
10832F0560l38466j89916l93166k99516m50877n22053K34713O29541M48822O18042
10822b02316L48658Q8880j27317m41712m85121m06969K27733M37265J47272k91318
10812g04945q9959j14365n2092K08489K0323L6573J42623J06879j81376j66622
10802g94472j61075j96000m78540k00821L24762L96602K55471M40324L95707K47125
10792B29083O2831l50102l03228l95299k59155K35342M34644j35819k88852j00764
10782h71319N76860N43939M17496R8543l3906K1910k84002K3297J0632m94850
10772H600o34921l02166L74004M88312k5628n09364q16466m43357k53016L30795
10762a783207O15724M17538L45875n71256l87619R4162K84937K46055M93009O91080
$$ plain form
10752 446298 616059 185799 -68788 -43319 -25847 -107561 -355065 -1157569 -1808959 -1622568
10742 -1622568 -985266 -745666 -392733 293048 363768 323854 416522 -42712 -395997 -398243
10732 -398243 -131150 -74679 -103589 136893 425727 557250 -197240 -724862 -677445 -499775
10722 -499775 -812256 -1231932 -970811 -731379 -789231 -601369 -215128 -175617 -347707 -484937
10712 -484937 -310160 29693 -223691 -727953 -925865 -676785 100866 344531 147653 112266
10702 112266 27560 42817 311648 562890 488973 403744 -182685 -520993 -441625 86380
10692 86380 474970 126643 278263 126351 -545875 -1041092 -878694 -692514 -363008 194868
10682 194868 667485 963492 896723 171028 -602622 -1196413 -1131575 -747332 -243706 -73882
$$ packed form
10752D46298J69761m30260k54587K5469J7472q1714k47504q02504o51390J86391
10742a622568O37302K39600L52933O85781P0720l9914R2668m59234l53285k246
10732c98243K67093N6471k8910K40482K88834J31523p54490n27622M7417J77670
10722d99775l12481m19676K61121K39432n7852J87862L86241L9511j72090j37230
10712d84937J74777L39853k53384n04262j97912K49080P77651K43665j96878l5387
10702A12266q4706J5257K68831K51242p3917q5229n86429l38308P9368N28005
10692H6380L88590l48327J51620j51912o72226m95217J62398J86180L29506N57876
10682A94868M72617K96007o6769p25695p73650n93791O4838L84243N03626J69824
$$ plain form
10672 -73882 -68446 395468 556631 511717 451741 219384 -386404 -644321 -763893 -953999
10662 -953999 -1202421 -1181718 -1020085 -851500 -927639 -751016 -101134 723677 1357469 1211844
10652 1211844 910723 892409 538917 -181175 -507274 -644355 -467109 -244204 -240525 -233506
10642 -233506 -306406 -466803 -407338 -109906 -29066 49726 414065 666874 708750 958478
10632 958478 1073626 514722 166134 -290495 -229134 298100 631901 572342 459622 623107
10622 623107 860027 795208 648096 796834 806277 520593 366032 448714 482395 652987
10612 652987 659869 914061 716701 758964 1079898 1376255 1465808 949647 281556 -458783
10602 -458783 -642284 127929 859751 930954 470382 3112 -174025 -245056 -273570 -35439
$$ packed form
10672g3882N436M63914J61163m4914n9976k32357o05788k57917j19572j90106
10662i53999k48422K0703J61633J68585p6139J76623O49882Q24811O33792j45625
10652A211844l01121j8314l53492p20092l26099j37081J77246K22905L679P019
10642b33506p2900j60397N9465K97432Q0840P8792L64339K52809M1876K49728
10632I58478J15148n58904l48588m56629O1361N27234L33801n9559j12720J63485
10622F23107K36920o4819j47112J48738R443k85684j54561Q2682L3681J70592
10612F52987O882K54192j97360M2263L20934K96357Q9553n16161o68091p40339
10602d58783j83501P70213P31822P1203m60572m67270j77137p1031k8514K38131
$$ plain form
10592 -35439 386717 599731 353632 -42379 -221295 -498178 -870648 -885816 -619114 -214491
10582 -214491 301153 630833 242364 -637571 -961174 -1250465 -1526057 -1380742 -1040732 -800607
10572 -800607 -712952 -564600 -122432 347699 280558 106974 -69579 -174117 41485 67324
10562 67324 147615 296895 344757 145386 46316 449878 339632 74105 138288 247735
10552 247735 -250319 -613684 -421875 -203731 -269199 -249066 -340660 -432100 -819020 -1197642
10542 -1197642 -853513 -986142 -1445510 -1791048 -2177922 -2176482 -1528447 -802469 -28153 506827
10532 506827 526717 -71192 -390927 277351 783545 522353 -88595 -474562 -36571 490774
10522 490774 300485 179351 335843 358651 622098 1199858 1319858 1144562 1031674 703343
$$ packed form
10592c5439M22156K13014k46099l96011j78916k76883l72470j5168K66702M04623
10582b14491N15644L29680l88469q79935l23603k89291k75592J45315L40010K40125
10572h00607Q7655J48352M42168M70131o7141j73584j76553j04538K15602K5839
10562F7324Q0291J49280M7862j99371r9070M03562j10246k65527O4183J09447
10552B47735m98054l63365J91809K18144o5468K0133r1594r1440l86920l78622
10542a197642L44129j32629m59368l45538l86874J440O48035P25978P74316N34980
10532E06827J9890n97909l19735O68278N06194k61192o10948l85967M37991N27345
10522D90774j90289j21134J56492K2808K63447N77760J20000j75296j12888l28331
$$ plain form
10512 703343 702038 1138433 1202909 939370 642818 572052 569766 528382 363746 -262130 -850880
10501 -850880 -1276232 -1465295 -1941196 -2157093 -2143706 -2254572 -2396302 -2407153 -1757973 -1191127
10491 -1191127 -1177166 -1168735 -1335572 -1109079 -795592 -323794 216282 -16904 -708849 -581271
10481 -581271 191535 713958 741728 971384 1647049 1941728 1617053 1137471 656063 465686
10471 465686 200115 -201105 6202 90170 -58244 -197857 -214217 -259038 -83463 -75341
10461 -75341 -482658 -946262 -713017 -44026 -69243 70472 268906 -29081 -86127 -196726
10451 -196726 -81909 23612 120401 326061 641605 579435 181948 732715 1477746 1487589
10441 1487589 1492364 1997102 3224253 4084669 5264047 7380914 9292503 9010096 7100094
$$ packed form
10512G03343j305M36395O4476k63539k96552p0766k286m1384j64636o25876n88750
10501h50880m25352j89063m75901k15897J3387j10866j41730j0851O49180N66846
10491a191127J3961Q431j66837K26493L13487M71798N40076k33186o91945J27578
10481e81271P72806N22423K7770K29656O75665K94679l24675m79582m81408j90377
10471D65686k65571m01220K07307Q3968j48414j39613j6360m4821J75575Q122
10461g5341m07317m63604K33245O68991k5217J39715J98434k97987n7046j10599
10451a96726J14817J05521R6789K05660L15544o2170l97487N50767P45031R843
10441A487589M775N04738J227151Q60416J179378K116867J911589k82407j910002
$$ [...]
##END NTUPLES=NMR SPECTRUM
##END=
