##TITLE=C13_SL-65-SPh(new)
 CDCl3, 23000 sc

 23.3.2020
##JCAMPDX= 6.0         $$ Bruker NMR JCAMP-DX V2.0
##DATA TYPE= NMR SPECTRUM
##DATA CLASS= NTUPLES
##ORIGIN= UXNMR, Bruker Analytische Messtechnik GmbH
##OWNER= root
$$ XWIN-NMR		Version 3.5
$$ Tue Mar 24 13:41:01 2020 Russian Standard Time (UT+4h)  she@DPX200
##.OBSERVE FREQUENCY= 50.327896
##.OBSERVE NUCLEUS= ^13C
##.ACQUISITION MODE= SIMULTANEOUS
##.ACQUISITION SCHEME= undefined
##.AVERAGES= 15812
##.DIGITISER RES= 17
##SPECTROMETER/DATA SYSTEM= spect
##.PULSE SEQUENCE= zgpg30
##.SOLVENT NAME= D2O
##.SHIFT REFERENCE= (INTERNAL, D2O, 0, 222.624)
##AUDIT TRAIL= $$ (NUMBER, WHEN, WHO, WHERE, WHAT)
$$ ##TITLE= Audit trail, XWIN-NMR		Version 3.5
$$ ##JCAMPDX= 5.01
$$ ##ORIGIN= Bruker BioSpin GmbH
$$ ##OWNER= she
$$ F:/spectra/data/she/nmr/c13/1/pdata/1/auditp.txt
$$ ##AUDIT TRAIL=  $$ (NUMBER, WHEN, WHO, WHERE, WHAT)
(   1,<2020-03-24 07:33:45.62 +0400>,<she>,<DPX200>,
      <created by zg, POWCHK disabled, PULCHK disabled
       terminated by command 'halt'
       configuration hash MD5:
       00 E9 B6 7A A2 85 ED C7 34 08 36 98 17 FE 4E 26
       data hash MD5: 32K
       73 B9 03 B7 99 52 73 38 19 AE A1 3C F2 DB C6 66>)
(   2,<2020-03-24 13:39:06.43 +0400>,<she>,<DPX200>,
      <Start of raw data processing
       efp BC_mod = 2 LB = 1 FT_mod = 6 PKNL = 1 PHC0 = -226.5546 PHC1 = 35.20638 SI = 32K 
       data hash MD5: 32K
       C6 9E 4E 95 46 97 A5 17 E2 C4 54 24 BD AB A4 34>)
(   3,<2020-03-24 13:39:33.54 +0400>,<she>,<DPX200>,
      <pk PHC0 = 0.3946854 PHC1 = 11.4 
       data hash MD5: 32K
       CB F0 45 81 73 E3 D6 A2 B9 EF 72 E5 C9 3E 5A AB>)
(   4,<2020-03-24 13:39:37.10 +0400>,<she>,<DPX200>,
      <abs ABSG = 5 
       data hash MD5: 32K
       0A C4 55 AE D6 35 00 C0 E5 4C 4F 35 0F 56 CD A8>)
(   5,<2020-03-24 13:40:14.15 +0400>,<she>,<DPX200>,
      <pk PHC0 = 7.724914 PHC1 = -12.8 
       data hash MD5: 32K
       AC A5 A4 87 4D E2 0B FE 84 BC EA 50 F0 52 89 1B>)
(   6,<2020-03-24 13:40:18.07 +0400>,<she>,<DPX200>,
      <abs ABSG = 5 
       data hash MD5: 32K
       5C 1C B2 67 9D 3B 3E 97 BD 21 71 FB DA FF 38 4B>)
$$ ##END=
$$ 
$$ hash MD5
$$ 88 EB 54 56 8D 36 FA 33 8F AB DA 6C 2A 94 A3 70
##$RELAX= 
##$RELAX= 
##$RELAX= 
##$RELAX= 
##$RELAX= 
##$RELAX= 
##$RELAX= 
##$RELAX= 
$$ Bruker specific parameters
$$ --------------------------
##$DU= <F:/spectra>
##$EXPNO= 1
##$NAME= <c13>
##$PROCNO= 1
##$TYPE= <nmr>
##$USER= <she>
##$AMP= (0..31)
100 100 100 100 100 100 100 100 100 100 100 100 100 100 100 100 100 100 
100 100 100 100 100 100 100 100 100 100 100 100 100 100 
##$AQSEQ= 0
##$AQ_mod= 1
##$AUNM= <au_zg>
##$AUTOPOS= <>
##$BF1= 50.322709
##$BF2= 200.13
##$BF3= 50.322709
##$BF4= 500.13
##$BF5= 500.13
##$BF6= 500.13
##$BF7= 500.13
##$BF8= 500.13
##$BYTORDA= 1
##$CFDGTYP= 0
##$CFRGTYP= 5
##$CHEMSTR= <none>
##$CNST= (0..31)
1 1 145 1 1 1 1 1 1 1 1 1 1 1 1 1 1 1 1 1 1 1 1 1 1 1 1 1 1 1 1 1 
##$CPDPRG= <waltz16>
##$CPDPRG1= <>
##$CPDPRG2= <waltz16>
##$CPDPRG3= <>
$$ [...]
##$SUBNAM4= <"">
##$SUBNAM5= <"">
##$SUBNAM6= <"">
##$SUBNAM7= <"">
##$SUBNAM8= <"">
##$SUBNAM9= <"">
##$SW= 239.972175391363
##$SWIBOX= (0..15)
0 1 3 0 0 0 0 0 0 0 0 0 0 0 0 0 
##$SW_h= 12077.2946859903
##$TD= 32768
##$TD0= 1
##$TE= 0
##$TE2= 300
##$TE3= 300
##$TEG= 300
##$TL= (0..7)
120 120 120 120 120 120 120 120 
##$TP= (0..7)
150 150 150 150 150 150 150 150 
##$TP07= 0
##$TPNAME0= <>
##$TPNAME1= <>
##$TPNAME2= <>
##$TPNAME3= <>
##$TPNAME4= <>
##$TPNAME5= <>
##$TPNAME6= <>
##$TPNAME7= <>
##$TPOAL= (0..7)
0.5 0.5 0.5 0.5 0.5 0.5 0.5 0.5 
##$TPOFFS= (0..7)
0 0 0 0 0 0 0 0 
##$TUNHIN= 0
##$TUNHOUT= 0
##$TUNXOUT= 0
##$USERA1= <user>
##$USERA2= <user>
##$USERA3= <user>
##$USERA4= <user>
##$USERA5= <user>
##$V9= 5
##$VALIST= <valist>
##$VCLIST= <CCCCCCCCCCCCCCC>
##$VD= 0
##$VDLIST= <DDDDDDDDDDDDDDD>
##$VPLIST= <PPPPPPPPPPPPPPP>
##$VTLIST= <TTTTTTTTTTTTTTT>
##$WBST= 1024
##$WBSW= 4
##$XGAIN= (0..3)
0 0 0 0 
##$XL= 0
##$YL= 0
##$YMAX_a= 24128648
##$YMIN_a= -98345064
##$ZGOPTNS= <>
##$ZL1= 120
##$ZL2= 120
##$ZL3= 120
##$ZL4= 120
##$ABSF1= 222.624
##$ABSF2= -17.3728
##$ABSG= 5
##$ABSL= 3
##$ALPHA= 0
##$AQORDER= 0
##$ASSFAC= 0
##$ASSFACI= 0
##$ASSFACX= 0
##$ASSWID= 0
##$AUNMP= <proc_1d>
##$AZFE= 0.1
##$AZFW= 0.5
##$BCFW= 0
##$BC_mod= 2
##$BYTORDP= 0
##$COROFFS= 0
##$CY= -3
##$DATMOD= 1
##$DC= 0
##$DFILT= <>
##$DTYPP= 0
##$F1P= 0
##$F2P= 0
##$FCOR= 0.5
##$FTSIZE= 32768
##$FT_mod= 6
##$GAMMA= 0
##$GB= 0
##$INTBC= 1
##$INTSCL= 4.134877e-10
##$ISEN= 128
##$LB= 1
##$LEV0= 0
##$LPBIN= 0
##$MAXI= 10000
##$MC2= 0
##$MEAN= 0
##$ME_mod= 0
##$MI= 0.1934396
##$NCOEF= 0
##$NC_proc= 2
##$NLEV= 6
##$NOISF1= 120.0001
##$NOISF2= 80.00006
##$NSP= 0
##$NTH_PI= 0
##$NZP= 0
##$OFFSET= 222.624
##$PC= 1.4
##$PHC0= -218.435
##$PHC1= 33.80638
##$PH_mod= 1
##$PKNL= yes
##$PPARMOD= 0
##$PSCAL= 0
##$PSIGN= 0
##$REVERSE= no
##$SF= 50.3227315989248
##$SI= 32768
##$SIGF1= 140
##$SIGF2= 120
##$SINO= 11.81781
##$SIOLD= 32768
##$SREGLST= <13C.CDCl3>
##$SSB= 0
##$STSI= 32768
##$STSR= 0
##$SW_p= 12077.2946859903
##$SYMM= 0
##$S_DEV= 0
##$TDeff= 32768
##$TDoff= 0
##$TI= <>
##$TILT= no
##$TM1= 0
##$TM2= 0
##$TOPLEV= 0
##$USERP1= <user>
##$USERP2= <user>
##$USERP3= <user>
##$USERP4= <user>
##$USERP5= <user>
##$WDW= 1
##$XDIM= 32768
##$YMAX_p= 383544270
##$YMIN_p= -8185587
$$ End of Bruker specific parameters
$$ ---------------------------------
##NTUPLES= NMR SPECTRUM
##VAR_NAME=  FREQUENCY,     SPECTRUM/REAL,   SPECTRUM/IMAG
##SYMBOL=    X,             R,               I
##VAR_TYPE=  INDEPENDENT,   DEPENDENT,       DEPENDENT
##VAR_FORM=  AFFN,          ASDF,            ASDF
##VAR_DIM=   32768,         32768,           32768
##UNITS=     HZ,            ARBITRARY UNITS, ARBITRARY UNITS
##FACTOR=    0.368581032318806, 1,           1
##FIRST=     11203.0474431902, 0,            0
##LAST=      -874.247242800138, 0,           0
##MIN=       -874.247242800138, -8185587,    0
##MAX=       11203.0474431902, 383544270,    0
$$ Real data points
##PAGE= N=1
##DATA TABLE= (X++(R..R)), XYDATA
$$ [...]
15876d05706j81588k92728N7040N15754N66931J62758L97197L8826n78436m42231
$$ -405706 -587294 -880022 -822982 -307228 259703 422461 819658 858484 280048 -162183
15866a62183J62405L18966o885j14466L3872j13631L16975K60245l20659o39088
$$ -162183 222 319188 312303 197837 231709 118078 435053 695298 374639 -264449
15856b64449m28451p3929K61502o0397j77171M92725M06027K03505n2161j94014
$$ -264449 -692900 -766829 -505327 -565724 -742895 -250170 155857 359362 307201 113187
15846A13187n4011J55779K92815J27012k35219l47221k57986J25695L8578k09762
$$ 113187 59176 214955 507770 634782 399563 52342 -205644 -79949 -41371 -251133
15836b51133j14936L62858P22051M33039k07125k91038m55940n00376j04649J3096
$$ -251133 -366069 -3211 718840 1151879 944754 653716 197776 -302600 -407249 -394153
15826c94153j12048J3637J32728m315N8237j72121N0720M01615K52243R461k54055
$$ -394153 -506201 -492564 -359836 -364151 -305914 -478035 -427315 -25700 226543 236004 -18051
15815a8051J2307N81960K78270k33783o7470k01820l03683l08818k5754J12416
$$ -18051 -5744 576216 854486 620703 553233 351413 47730 -261088 -286842 -174426
15805a74426K47732J81168p0160n06756j53431K62161K22241J12753j72756j14197
$$ -174426 73306 254474 184314 -322442 -475873 -213712 8529 121282 -51474 -165671
15795a65671j26460m21159k48173j55188J44433M70341j18865n21756k82116L26779
$$ -165671 -292131 -713290 -961463 -1116651 -972218 -501877 -620742 -1142498 -1424614 -1097835
15785a097835M80007M16767M04632m6323m00038l46025J64463O6238k23643Q8159
$$ -1097835 -617828 -201061 203571 157248 -242790 -588815 -424352 -358114 -581757 -493598
15775d93598p407k70641j48361N30327M31996L48007R921o26877l30504M7882
$$ -493598 -501005 -771646 -920007 -389680 42316 390323 400244 -226633 -557137 -509255
15765e09255j27139j82742J87661J58356K15737J42251k29801j91481n1724j52252
$$ -509255 -636394 -819136 -631475 -473119 -257382 -115131 -344932 -536413 -588137 -740389
15755g40389k8680K81043p9984p0570R2024k98897r5081K70130J10624j51194
$$ -740389 -769069 -488026 -568010 -638580 -546556 -845453 -940534 -670404 -559780 -710974
15745g10974j36089J61474K07958K59770Q5154J16521J38050P1467j41999l58735
$$ -710974 -847063 -685589 -477631 -217861 -132707 -16186 121864 193331 51332 -307403
15735c07403k8169J16446j54416j97738M4309L76327K75787P1945j78661K4796
$$ -307403 -335572 -219126 -373542 -571280 -526971 -150644 125143 197088 18427 43223
15725D3223K85857m48925n77746j78252J84907K53100J46054J51208J11165L54873
$$ 43223 329080 -119845 -697591 -875843 -690936 -437836 -291782 -140574 -29409 325464
15715C25464K21026L97241L7109m33243m36728p2731J40023J80721N7589o4939
$$ 325464 546490 943731 980840 547597 110869 38138 178161 358882 416471 351532
15705C51532m42456k7865M53608j31271m85428l65517Q314j8155j81295K6388
$$ 351532 -90924 -118789 334819 203548 -281880 -647397 -639083 -657238 -838533 -812145
15695h12145K11404L69600N30470J52846R8178j51185l93615j0616J65168j48495
$$ -812145 -600741 -231141 299329 452175 550353 399168 5553 -5063 160105 11610
15685A1610l65316m19928l932L48627M35069L35913L09016p5815l70256l71782
$$ 11610 -353706 -773634 -777566 -428939 6130 342043 651059 575244 204988 -166794
15675a66794k34335J39L98287M47238K70680j87405n41607l75400k18509P453
$$ -166794 -401129 -400990 -2703 444535 715215 527810 -13797 -389197 -607706 -600253
15665f00253J4063Q1135P6128N7142L7968J55489J31134n2628j3634k599k91896
$$ -600253 -586190 -505055 -428927 -371785 -333817 -178328 -47194 -99822 -113456 -116055 -407951
15654d07951k23566j16364L40940L45132L4386j29936j27205L30956M8394j68690
$$ -407951 -631517 -747881 -406941 -61809 -27423 -157359 -284564 46392 94786 -73904
15644g3904K15543L87948J43924j51874l48716k07842j69279m14388M3032J80842
$$ -73904 141639 529587 673511 521637 172921 -34921 -204200 -618588 -575556 -394714
15634c94714J20037K24094J17885j67720j14394l9316P1708j1130j56078l0849
$$ -394714 -274677 -50583 67302 -100418 -214812 -254128 -182420 -193550 -349628 -380477
15624c80477P3318P9673J8118J41003K46433K74419m51195k05149J68620O1455
$$ -380477 -307159 -227486 -209368 -68365 178068 452487 1292 -203857 -35237 26218
15614B6218l30388j67037k7444M31194L59825r384j36575j56558M54193N45104
$$ 26218 -304170 -471207 -498651 -67457 292368 282984 146409 -10149 444044 989148
15604I89148P1932l29011j85693k24625q0901j45805j60290K42161K72928j28024
$$ 989148 1061080 732069 546376 321751 240850 95045 -65245 176916 449844 321820
15594C21820p1377j93611k28271K86036R4327j33442m848j56447n3706n8036J28508
$$ 321820 250443 56832 -171439 114597 208924 75482 70634 -85813 -139519 -197555 -69047
15583f9047M27280J75300j94660l61640j83212k2396j47953M8386J9333p8520
$$ -69047 358233 533533 338873 -22767 -205979 -228375 -376328 -327942 -308609 -387129
15573c87129M0784K43495Q9737r4459P3186O6713j84309j56881l19599n0933R9143
$$ -387129 -346345 -102850 -13113 -107572 -34386 32327 -151982 -308863 -628462 -679395 -580252
15562e80252O3444K59599K77740K69231J49820j6639K72974L01977m4555J50318
$$ -580252 -516808 -257209 20531 289762 439582 422943 695917 997894 953339 1103657
15552A103657p824n01511m02907j74445k06374J89297K94364L06128N454j76787
$$ 1103657 1095833 594322 191415 16970 -189404 -107 294257 600385 605839 429052
15542D29052j38696o7744R49j04427m25500k80766K45696L55587M88802N01308
$$ 429052 290356 222612 223561 119134 -306366 -587132 -341436 14151 502953 1004261
15532A004261J9391k40259k48186q8938L734q6450j54321l49569k67444l73846
$$ 1004261 1023652 783393 535207 446269 450003 363553 209232 -140337 -407781 -781627
15522g81627l18911j27299J1300L15328K47041N04745P05500L56793l79960o16928
$$ -781627 -1100538 -1227837 -1216537 -901209 -654168 -149423 556077 912870 532910 -84018
15512h4018l33228J05490m056j35050O0489J33724R6057j349l3594j35472j66828
$$ -84018 -417246 -311756 -315812 -450862 -390373 -256649 -160592 -161941 -195535 -331007 -497835
15501d97835O6887J88553O7910j01856q0386j30494l33433m78751k81986L08329
$$ -497835 -430948 -242395 -174485 -276341 -356727 -487221 -820654 -1299405 -1581391 -1273062
15491a273062O52949L46640J72426j188l48173k49916j35164N83153O38729J45869
$$ -1273062 -620113 -273473 -101047 -102235 -450408 -700324 -835488 -252335 386394 532263
15481E32263j05049l66178j99313k1397L52500L99004j52825p17300q64725k55878
$$ 532263 427214 61036 -138277 -159674 192826 591830 439005 -278295 -1143020 -1398898
15471a398898N60053O83074K58421J42062K13842K48035J13806n128k38509k78636
$$ -1398898 -838845 -155771 102650 244712 458554 706589 820395 815267 576758 298122
15461B98122K47474p0468l93801j56054m66192l99799j8326J74189N51769M02485
$$ 298122 545596 475128 81327 -74727 -540919 -940718 -959044 -784855 -233086 169399
15451A69399j32340m2032J43552n6231n5919K0803j89115m30889l60270J36597
$$ 169399 37059 -4973 138579 82348 26429 47232 -141883 -572772 -933042 -796445
15441g96445K34925p4444K95441N53736K74599k86k76725m16515q4759K73818
$$ -796445 -561520 -635964 -340523 213213 487812 487526 210801 -205714 -290473 -16655
15431a6655L09727q6133l10207R844J667K53538M42626o4248m04398j15241L7968
$$ -16655 293072 206939 -103268 -93424 -91757 161781 604407 540159 135761 20520 58488
15420E8488J97689J74814N4274J87177l19896n42680k9670O7998k57522K25291
$$ 58488 256177 430991 485265 672442 352546 -190134 -219804 -151806 -409328 -184037
15410a84037K04193K90490J19626l41462l76817J99824K83716j82684k4454n0983
$$ -184037 20156 310646 430272 88810 -288007 -88183 195533 12849 -11605 -62588
15400f2588m09602j84405l60708N8675O96866N50603L46238N838j50434k9738
$$ -62588 -472190 -656595 -1017303 -958628 -261762 288841 635079 640917 490483 460745
15390D60745k2784o3441j07226r5839P9564J27155l9140k94574M6004K67307L2975
$$ 460745 437961 374520 267294 171455 251019 378174 339034 44460 90464 357771 390746
15379C90746j93067k23870j71562k45002k16991M678J27778q787j15730K7914
$$ 390746 197679 -26191 -197753 -442755 -659746 -655068 -527290 -536077 -651807 -623893
15369f23893K3077P8360R7455j13459l31203M14j48753J77551L79795J49900J34314
$$ -623893 -600816 -522456 -425001 -538460 -869663 -869249 -1018002 -840451 -460656 -310756 -176442
15358a76442K52979J41445N970J7294p8712O1166J40246Q3795K0754r3861Q6856
$$ -176442 76537 217982 223952 241246 162534 223700 363946 447741 468495 374634 461490
15347D61490J69065j61256j04672l7829l11044m1426k88546k20619K13611J16083
$$ 461490 630555 469299 364627 326798 15754 -25672 -314218 -534837 -321226 -205143
15337b05143M4682j57919J94691N35313L25201j17839m66250k91409P0928J97167
$$ -205143 -160461 -318380 -123689 411624 736825 618986 152736 -138673 -67745 129422
15327A29422r0325J3618N7919L33375K87431L2957K88795N9966j06865k30346
$$ 129422 39097 52715 110634 444009 731440 764397 1053192 1113158 1006293 775947
15317G75947J0525P4909M8897m2754l27550k43339J73013K50616j2375k31236
$$ 775947 786472 861381 910278 867524 539974 296635 469648 720264 707889 476653
15307D76653n44113k9978M52649L16496J34021r1482j95571j78474r1554K1069
$$ 476653 -67460 -97438 355211 671707 805728 714246 518675 340201 248647 269716
15297B69716k1773l09795n2625R8699k05480j37005j27316j81283j08156K30957
$$ 269716 247943 -61852 -114477 -15778 -221258 -358263 -485579 -666862 -775018 -544061
15287e44061J43559J36048M44023N51807l15m57864m58316p6717J44285N0077
$$ -544061 -400502 -264454 179569 731376 731061 273197 -185119 -261836 -117551 -67474
15277f7474r3498R0156p2602k23911j12090K02676P29297K74831m66556o35264
$$ -67474 -160972 -70816 -143418 -367329 -479419 -276743 452554 727385 260829 -374435
15267c74435n67084j64081M74001M71715j38553j68073L36021P2577m11435k09115
$$ -374435 -941519 -1105600 -631599 -159884 -298437 -466510 -130489 -57912 -469347 -678462
15257f78462K44774L80506K21861P8477k5126l5844j13502j31729l99326j51973
$$ -678462 -433688 -53182 168679 247156 222030 186186 72684 -59045 -458371 -610344
15247f10344L59569Q9964l21791J44884P31448K83134l86627m04129j44518K3378
$$ -610344 -250775 -160811 -482602 -337718 393730 676864 290237 -113892 -258410 -235032
15237b35032J49260j49234j75665j17593J39617L22996q6559J3948K12914o8025
$$ -235032 -85772 -235006 -410671 -528264 -388647 -65651 -152210 -138262 74652 6627
15227F627m04647l10718P1883L00102K1083k17864m6104R2801K99829l2795l65091
$$ 6627 -398020 -708738 -636855 -336753 -315670 -533534 -579638 -486837 -187008 -219803 -584894
15216e84894k51595J7525K49413J35465q8457J9769J54152j08976j77713L60256
$$ -584894 -836489 -818964 -569551 -434086 -522543 -502774 -348622 -457598 -635311 -275055
15206b75055L94620K50400J16432O1315l71857m87625k20661l84666l4507K57779
$$ -275055 119565 369965 486397 547712 175855 -311770 -532431 -917097 -951604 -693825
15196f93825N1022k3886J09089j92568m06270l4079M69935L09856L8319l0385
$$ -693825 -642803 -666689 -557600 -750168 -1156438 -1190517 -720582 -410726 -372407 -402792
15186d02792j74546J31836L77292P1203r1744P0J54299L30522j96332n19735l2110
$$ -402792 -577338 -445502 -68210 2993 -88751 -88681 65618 396140 199808 -319927 -352037
15175c52037K14031l16332j56897K05658J17455K85361L40411j13237k08726l5941
$$ -352037 -138006 -454338 -611235 -405577 -288122 -2761 337650 224413 15687 -20254
15165b0254k27779k32154Q9530J17357l4197J74937M35294K19782k49510o4064
$$ -20254 -248033 -480187 -390657 -273300 -307497 -132560 302734 522516 273006 208942
15155B08942J56100Q511q8118j09518k53788o27036k44930m449j89215K14336
$$ 208942 365042 373553 285435 175917 -77871 -704907 -949837 -954286 -1143501 -929165
15145i29165J37525m801K80573L34131l5379j13302k5073k5475k61666O0p3176
$$ -929165 -791640 -796441 -515868 -181737 -217116 -330418 -355491 -380966 -642632 -642572 -715748
15134g15748o3465L32212J52550j06496l09222R9374J79646L7797K32385J80365
$$ -715748 -779213 -447001 -294451 -400947 -710169 -610795 -431149 -393352 -160967 19398
15124A9398L64249K20397m11354l06870J64903J86289k11961j02459J93678J67733
$$ 19398 383647 604044 192690 -114180 50723 237012 25051 -77408 116270 284003
15114B84003r6392L5173J46867l1656m35053l04701M4963j0853K6661K73675K00752
$$ 284003 187611 222784 369651 337995 -97058 -401759 -356796 -367649 -340988 -67313 133439
15103A33439j39390j24174k75340l88442k46749j70135Q5361M78463L49625j485
$$ 133439 -5951 -130125 -405465 -793907 -1040656 -1210791 -1125430 -646967 -297342 -298827
15093b98827j19204j18760j6917q8994R533J20400J18409K94383K47912k61273
$$ -298827 -418031 -536791 -553708 -642702 -633169 -512769 -394360 -99977 147935 -113338
15083a13338l38082p1751J83139N00583N86660j17812m11805O206J08615M4376
$$ -113338 -451420 -523171 -340032 160551 747211 629399 217594 223800 332415 376791
15073C76791K25596R6539J23289J25490m3357l35902l76914P5844J05579k84255
$$ 376791 602387 698926 822215 947705 904348 568446 191532 267376 372955 88700
15063H8700l05766j51669K79670O19803L84986j87192j03455M8275l88318m87740
$$ 88700 -217066 -368735 -89065 530738 915724 728532 625077 673352 285034 -202706
15053b02706k89552J52705K37709M05317K77551K57746R4670l4181k07943o73043
$$ -202706 -492258 -339553 -101844 303473 581024 838770 933440 899259 691316 18273
15043A8273o26155J91203K18242k03149l37959k6868n9559J98063K70131k74803
$$ 18273 -607882 -416679 -198437 -401586 -739545 -766413 -825972 -627909 -357778 -632581
15033f32581M7524L14739J5411J92747N7085r4129j14987M5631N90201k4537l81274
$$ -632581 -585057 -270318 -254907 -62160 -5075 -99204 -214191 -168560 421641 397104 15830
15022A5830j22270k7316Q8356L02522M89917K98246l27673o21064l46998J4496
$$ 15830 -106440 -133756 -45400 257122 747039 1045285 717612 96548 -250450 -235954
15012b35954K70528L8120o6602K40096K01767j31840l26454l62447k38074L672
$$ -235954 34574 72694 6092 246188 447955 316115 -10339 -372786 -610860 -607188
15002f07188J7950M07540P30069L64887p1255p675k40297k26396J43753L59069
$$ -607188 -589238 -181698 548371 913258 842003 834328 594031 367635 511388 870457
14992H70457K08072j34982j84345j63756k27077K2373K83033j24620l94610l87978
$$ 870457 1078529 943547 759202 595446 368369 390742 673775 549155 154545 -233433
14982b33433q8915J62423L8487L08916L08642N2572R2994R7706k26773m16385
$$ -233433 -322348 -159925 -121438 187478 496120 548692 641686 739392 512619 96234
14972I6234k14160n6282j53403N1427l1891m2909j4442j28685m5490K59341M09931
$$ 96234 -117926 -174208 -327611 -276184 -308075 -350984 -365426 -494111 -539601 -280260 129671
14961A29671J31763j56642L9882O0035j7963O9509j52527k59852J45305K46166
$$ 129671 261434 104792 144674 204709 186746 256255 103728 -156124 -10819 235347
14951B35347j95046r5525P4759J6916k07595j3264O2403J25251K8074K9061Q2750
$$ 235347 40301 -55224 19535 36451 -171144 -184408 -122005 3246 31320 60381 143131
14940A43131Q0536k2580J154P2594j44951l84516k41667j31794q2699J12800L12996
$$ 143131 223667 201087 202241 274835 129884 -254632 -496299 -628093 -710792 -597992 -284996
14929b84996M87490L82859J49275j43974k31039k62115L1357K74184N2700j63943
$$ -284996 202494 585353 734628 590654 359615 97500 128857 403041 455741 291798
14919B91798o1180j06834R7569j10865k43230k78369k45442J52785K11254J50357
$$ 291798 230618 123784 221353 110488 -132742 -411111 -656553 -503768 -292514 -142157
14909a42157m3486k32945m16112j66663K43202N25996K80300j10074M8120J43582
$$ -142157 -185643 -418588 -834700 -1001363 -758161 -232165 48135 -61939 -13819 129763
14899A29763l36172n41707j78985P9702M090j66024K5381l3678l01546k37745
$$ 129763 -206409 -748116 -927101 -847399 -843309 -1009333 -983952 -1017630 -1319176 -1556921
14889a556921M7060K84676K60684j97588j10338r7633K60476P622k27p044j85527
$$ -1556921 -1509861 -1225185 -964501 -1162089 -1272427 -1370060 -1109584 -1101962 -1102189 -1109233 -1294760
14878a294760o0591O3862M17716N01130q6709k75480J33270j18768M41377L30940
$$ -1294760 -1355351 -1291489 -873773 -372643 -459352 -734832 -601562 -720330 -278953 51987
14868E1987l06673q9467L69113K90183K27825J98865j38472n37423k68016j81154
$$ 51987 -254686 -344153 24960 315143 542968 741833 603361 65938 -202078 -383232
14858c83232J10581L30487K74988J52015k72657J99029K44199k99683m81359j20111
$$ -383232 -272651 57836 332824 484839 212182 411211 655410 355727 -125632 -245743
14848b45743J66629L6815K2335J00571j5776k79293j4642K48024M216k36373k04958
$$ -245743 -79114 -42299 -19964 80607 64831 -214462 -229104 18920 23136 -213237 -418195
14837d18195J34982J14897j72024j47877j25539j3266l10599k00274O3757J33171
$$ -418195 -283213 -168316 -340340 -488217 -613756 -627022 -937621 -1137895 -1074138 -940967
14827i40967K30342L55568L33203K09362j99007k06361J07769K16178j25042l63019
$$ -940967 -710625 -355057 -21854 187508 -11499 -217860 -110091 106087 -18955 -381974
14817c81974r4504o4464O3623K18777m1735K03197N29645J83964j54512j75961
$$ -381974 -476478 -540942 -477319 -258542 -300277 -97080 432565 616529 462017 286056
14807B86056l6530J88219k75927l60986K04999L86528j32330l27102L33375K58538
$$ 286056 249526 437745 161818 -199168 5831 392359 260029 -67073 266302 524840
14797E24840k22850j09777j24189l61589k71973N4562K95707J19272j02324m2862
$$ 524840 301990 192213 68024 -293565 -565538 -510976 -215269 -95997 -198321 -241183
14787b41183Q5859K2470k27808j14243O8355J03406L4460o7869J13075K938l26011
$$ -241183 -155324 -132854 -360662 -474905 -406550 -303144 -268684 -336553 -223478 -220540 -546551
14776e46551J08355K13487K22010J38743L63356M44687P2141n4001j58778J54865
$$ -546551 -438196 -224709 -2699 136044 499400 944087 1016228 962227 803449 958314
14766I58314j51955n39831m22434l68313j61961r7413r9841K551o463L16513L90397
$$ 958314 806359 266528 -155906 -524219 -686180 -783593 -883434 -880883 -887346 -570833 -180436
14755a80436L04890O1276k24855j5278k1118J5498m444Q397k51652o26867j23716
$$ -180436 124454 185730 -39125 -54403 -75521 -60023 -64467 -56070 -307722 -934589 -1058305
14744a058305L98574K94772J3185n5984j3065j06190P073J88670N83850M19844
$$ -1058305 -659731 -364959 -351774 -407758 -420823 -527013 -519940 -331270 252580 672424
14734F72424k31620l85748q5664K05475M41055J24013q2854r459j92834l5399
$$ 672424 440804 55056 -30608 174867 615922 739935 657081 647622 454788 419389
14724D19389L92027M89251o8931k21733r7382j26833l98174k15705j24660O1829
$$ 419389 811416 1300667 1231736 1010003 912621 785788 387614 171909 47249 109078
14714A09078p3165n0479k30373j48755j84383k98068K76248N48646K79975L03307
$$ 109078 35913 -14566 -244939 -393694 -578077 -876145 -599897 -51251 228724 532031
14704E32031L61502L0915l49276k32988j60669l09331p9202j05970p4853J04466
$$ 532031 893533 924448 575172 342184 181515 -127816 -207018 -312988 -387841 -283375
14694b83375L5299J54922K05169K0618j5368M3639J22291k50664J5638j25392
$$ -283375 -248076 -93154 112015 132633 117265 160904 283195 32531 48169 -77223
14684g7223p47296l41330L75143L67916K88375K4682j57923j67618j02811O7791
$$ -77223 -824519 -1165849 -790706 -422790 -134415 -109733 -267656 -435274 -538085 -470294
14674d70294k4346j39985m0444J6651K93772M51948N03645l0525m38853k29689
$$ -470294 -494640 -634625 -675069 -658418 -364646 87302 590947 560422 121569 -108120
14664a08120k04755r1426j1108n2062q850O9788l8939k10L89266K83889n0916
$$ -108120 -312875 -404301 -415409 -467471 -476321 -406533 -445472 -445682 -56416 227473 176557
14653A76557j5825m59932k65089J42933J32021q4717P9124O707k05220j40680
$$ 176557 160732 -299200 -564289 -421356 -289335 -374052 -294928 -288221 -493441 -634121
14643f34121k35893p4857K5007o3409P4908K05376L21716J83135m8698j34087
$$ -634121 -870014 -944871 -919864 -983273 -908365 -702989 -381273 -198138 -246836 -380923
14633c80923K2612r2378o8308l0288K7416j21513J66454K59772M6906m39925m08827
$$ -380923 -358311 -450689 -518997 -549285 -521869 -643382 -476928 -217156 -170250 -610175 -1019002
14622a019002K99538P5992j29313K57207j18955l0655J58293o8821J58454K57147
$$ -1019002 -719464 -643472 -772785 -515578 -634533 -665188 -506895 -575716 -417262 -160115
14612a60115M07293L91117K73312M82o15141p92311l82247M2727J6526K952K93993
$$ -160115 247178 638295 911607 912089 296948 -495363 -877610 -834883 -818357 -815405 -521412
14601e21412M02999K82417J77049J15677M0475k02989k09401l5966l207k4295
$$ -521412 -118413 164004 341053 456730 497205 294216 84815 48849 45642 21347
14591B1347M6058l16947m37059L24860L72552P8480O5691j28283j91876L6982
$$ 21347 67405 -249542 -686601 -361741 10811 89291 154982 26699 -165177 -128195
14581a28195L06700L51847n5848k73713k30276k95783N7692L09333K70290l3029
$$ -128195 178505 530352 474504 200791 -29485 -325268 -267576 41757 312047 279018
14571B79018k15134j28962j82578j40538O164J65806K57379K59563p3422l38556
$$ 279018 63884 -65078 -247656 -388194 -382030 -216224 41155 300718 227296 -111260
14561a11260j97605J20650L04346P7649M2851n8313l30401m59564j55293L67198
$$ -111260 -308865 -188215 116131 193780 236631 178318 -152083 -611647 -766940 -399742
14551c99742L71633K39788L0687k26079J28936J76980J12107J85372l46830p27224
$$ -399742 -28109 211679 242366 16287 145223 322203 434310 619682 272852 -454372
14541d54372k93535j40774k47552n0965L64705O53027L4634m66571J6066J96642
$$ -454372 -747907 -888681 -1136233 -1187198 -822493 -169466 -134832 -601403 -585337 -388695
14531c88695k29631m89635l09168J19975j17839l97102R5269P36986M35405k17207
$$ -388695 -618326 -1107961 -1417129 -1297154 -1414993 -1812095 -1716826 -979840 -544435 -761642
14521g61642K3608O04375O22532K70451l38062j69214Q4435l26226n97775j19017
$$ -761642 -738034 -133659 488873 759324 421262 252048 336483 10257 -587518 -706535
14511g06535K42671K65828K21033J12009j82478k48811k73915l8025L4218O5790
$$ -706535 -463864 -198036 22997 135006 -47472 -296283 -570198 -608223 -574005 -508215
14501e08215q4965L454L88015J81366j20361L8130J68495N876k95705K7389K69897
$$ -508215 -593180 -589726 -201711 -20345 -140706 -102576 65919 71795 -223910 -196521 73376
14490G3376p2980l23405l39332j62692l0584J41907J85159J01166K4272J06964
$$ 73376 396 -323009 -662341 -825033 -855617 -713710 -528551 -427385 -403113 -296149
14480b96149N6332M747J56729K40025j49008k41817L3528P0350q228o9702j03296
$$ -296149 -239817 -235070 -78341 161684 12676 -229141 -195613 -125263 -133491 -203193 -306489
14469c06489m5013O1755K03855l7137l09653j53005L8251P6630K8829J85146K26858
$$ -306489 -351502 -289747 -85892 -123029 -432682 -585687 -547436 -470806 -441977 -256831 -29973
14458b9973K31163j1646O3941q4261J78278K46700m7312k4855j28743l83052m44723
$$ -29973 201190 189544 253485 169224 347502 594202 546890 522035 393292 10240 -434483
14447d34483k28788K95555N00029N7438l10948k79818j93123J44846J90881J00140
$$ -434483 -663271 -367716 132313 189751 -121197 -401015 -594138 -449292 -258411 -158271
14437a58271n814k37427k05568L96855N04237q1095j66446l7986j81714j87024
$$ -158271 -164085 -401512 -607080 -210225 294012 212917 46471 8485 -173229 -360253
14427c60253J55985L26662J05571j58959j47866j19875l23762k21205k1067j6614
$$ -360253 -204268 122394 227965 69006 -78860 -198735 -522497 -743702 -764769 -781383
14417g81383J10719K51951J18307j4738J04586N8456l8479K09363J53847K2404
$$ -781383 -670664 -418713 -300406 -315144 -210558 -152102 -190581 18782 172629 195033
14407A95033P3946q9521J97512K70832j7966k43877l62093m13470O1498M49022
$$ 195033 268979 179458 376970 647802 629836 385959 23866 -389604 -328106 120916
14397A20916J55039j98269k07959j18186K19757J80807J67937j84916o9766J68229
$$ 120916 275955 77686 -130273 -248459 -28702 152105 320042 135126 65360 233589
14387B33589l7877j19721k19177j66623k32129j07111K55945R9238k1560J77362
$$ 233589 195712 75991 -143186 -309809 -541938 -649049 -393104 -293866 -315426 -138064
14377a38064J70769j28274k34681j71912J39260M6326k93927j78649j87328Q4033
$$ -138064 32705 -95569 -330250 -502162 -362902 -316576 -610503 -789152 -976480 -892447
14367h92447M75378M8319j03267L3839l09373J48743M11950j63746j20746R2366
$$ -892447 -417069 -368750 -472017 -438178 -747551 -598808 -186858 -350604 -471350 -378984
14357c78984P0700K42219K28059L4084l51727K6236M34569N7168k24459l34197
$$ -378984 -308284 -66065 161994 196078 -155649 -129413 305156 362324 137865 -196332
14347a96332j21426L68250j11498n65164j7866O74467L73395J81828N7813K75893
$$ -196332 -317758 50492 -61006 -626170 -644036 30431 403826 585654 643467 919360
14337I19360K30491l60494m05386k7099k92595l76912K63839K62078J42786r4508
$$ 919360 1149851 789357 383971 356872 64277 -312635 -48796 213282 356068 261560
14327B61560j62188n5653j37211k8823j93590m13728l34028J04434M10170K26844
$$ 261560 99372 43719 -93492 -122315 -315905 -729633 -1063661 -959227 -549057 -322213
14317c22213J20117j21797m9631L7607M26k36218l73570J09073M16657J01048
$$ -322213 -202096 -323893 -373524 -335917 -335491 -571709 -945279 -836206 -419549 -318501
14307c18501Q5795j17822l82301j95797N2418M90583N69380j742k69707k27356
$$ -318501 -232706 -350528 -732829 -928626 -876208 -385625 183755 182013 -87694 -315050
14297c15050O8070P7317J88128Q9237O8223k8989J59596K29310J04554K04219
$$ -315050 -246980 -169663 18465 107702 175925 146936 306532 535842 640396 844615
14287H44615K82539l3793n10382o56189m49148k04576q4323L70570L25774P264
$$ 844615 1127154 1093361 582979 -73210 -522358 -726934 -811257 -440687 -114913 -107649
14277a07649J35880R7798Q304j31177l35586l88663m2197J15215k3752K52744
$$ -107649 28231 126029 134333 3156 -332430 -721093 -763290 -648075 -671827 -419083
14267d19083K12496M9570J14303L63389L83777J80085J00701N7263j96277k75916
$$ -419083 -206587 -157017 -42714 320675 704452 884537 985238 1042501 846224 570308
14257E70308K94426J41947k59265l68171n51076l63488k14195n9077o1541j2035
$$ 570308 864734 1006681 747416 379245 -171831 -535319 -749514 -808591 -870132 -882167
14247h82167m8141K50100L75545J78680J07280o5674k63981O670M5783r8J63375
$$ -882167 -930308 -680208 -304663 -125983 -18703 -84377 -348358 -341688 -295905 -296003 -132628
14236a32628k14855k12216K49793M65392J26615P0005K3320J24011j8699j78738
$$ -132628 -347483 -559699 -309906 155486 282101 352106 375426 499437 480738 302000
14226C02000L6745M49250j1955m16493j24641J86806R8909n08795m37857J79701
$$ 302000 338745 787995 776040 359547 234906 421712 520621 11826 -426031 -246330
14216b46330J35651N9491O5248j74422K36382K50522K15478K38337k07285j74508
$$ -246330 -110679 -51188 14060 -160362 76020 326542 542020 780357 573072 398564
14206C98564j2656m1392l07503l32217J83996j03493k68886R084L04425J74679
$$ 398564 385908 344516 37013 -295204 -111208 -214701 -483587 -474503 -170078 4601
14196D601p0170K71615J88971j13292q662M17588J41196j49722j57256m86863
$$ 4601 -65569 206046 395017 281725 273063 690651 831847 682125 524869 38006
14186C8006l53283k11172j58815j11531L20385K13873K59848L5433J72303L03237
$$ 38006 -315277 -526449 -685264 -796795 -476410 -262537 -2689 32744 205047 508284
14176E08284p3893r4885K08508J46066j82804j75099L7424J2013k62052m3120
$$ 508284 434391 339506 548014 694080 511276 336177 373601 385614 123562 80442
14166H0442R4400l64036m18623k7728J96093K94600j68608l15809R0035K77364
$$ 80442 174842 -189194 -607817 -635545 -439452 -144852 -313460 -629269 -539234 -261870
14156b61870J59400j2256l98113k50526J25410L92900m4785m14256l5687K60669
$$ -261870 -102470 -114726 -512839 -763365 -637955 -245055 -289840 -704096 -739783 -479114
14146d79114J21407J281K05046K17623L5018j71238l32297l27492r4332J23405
$$ -479114 -357707 -356426 -151380 66243 101261 -69977 -402274 -729766 -824098 -700693
14136g00693Q3694L22130K09705J74757L9276k38569J79774K80184J89438J13093
$$ -700693 -616999 -294869 -85164 89593 128869 -109700 70074 350258 539696 652789
14126F52789j8433k60170j87808L8224P4335r4282j89377k91883p0652N20597
$$ 652789 634356 374186 186378 224602 298937 204655 15278 -276605 -347257 173340
14116A73340M01197k50815k42713Q3864j16935k19314p3769J70682J51495r1034
$$ 173340 574537 323722 81009 164873 47938 -171376 -245145 -74463 77032 -14002
14106a4002j96407q5002j61545l900J37826L56608K08812O8248j18271l25710
$$ -14002 -210409 -295411 -456956 -460856 -323030 33578 242390 310638 192367 -133343
14096a33343k36858j11411l9588J72613L91105J71765l03888m86822j53928J22576
$$ -133343 -370201 -481612 -521200 -348587 42518 214283 -89605 -576427 -730355 -607779
14086f07779L3610j9004L26088J32381P5927K81812J53265k74382l54834k38150
$$ -607779 -574169 -593173 -267085 -134704 -58777 223035 376300 101918 -252916 -491066
14076d91066j36590K00969N14933L92322j27168n59356J5120J87407k77683n61446
$$ -491066 -627656 -426687 88246 480568 353400 -205956 -190836 -3429 -281112 -842558
14066h42558K01396O73740N1768j28482j61490j15255J066m9764k25900J49994
$$ -842558 -641162 32578 84346 -44136 -205626 -320881 -319815 -369579 -595479 -445485
14056d45485l7418k40113q5125M58968N37357P1195M8595J57197j60372m02897
$$ -445485 -482903 -723016 -808141 -349173 188184 259379 307974 465171 304799 -98098
14046i8098m25319n6351K20777Q5697j94749l03695L68830L75042p5849j56886
$$ -98098 -523417 -579768 -358991 -273294 -468043 -771738 -402908 -27866 -103715 -260601
14036b60601j82441j10588Q3569M02730L67852m2151k5177j19871K1824K67981
$$ -260601 -443042 -553630 -470061 -67331 300521 258370 233193 113322 135146 403127
14026D03127K63395q5797k181M4690j01466K9892m8078j05716j5935j80239j26091
$$ 403127 666522 580725 578544 623234 521768 551660 503582 397866 381931 201692 75601
14015G5601m9559J85700L65937J12874j87573l61676j52484J69040k925k19925
$$ 75601 26042 211742 577679 690553 502980 141304 -11180 157860 154935 -64990
14005f4990k06765J0194J72066L844j26663P0202J18900L16384L28051J41043
$$ -64990 -271755 -261561 -89495 -85651 -212314 -142112 -23212 293172 621223 762266
13995G62266j09091k60861l08451k0967K2006j14101K28261J51512K9080K6056
$$ 762266 653175 392314 83863 62896 84902 -29199 199062 350574 379654 405710
13985D05710j7315J12787J24067p6016j38790l9237K37698J02772p580J04362
$$ 405710 388395 501182 625249 549233 410443 371206 608904 711676 704096 808458
13975H08458k48787k80755k41504k48458j32793p5812J24234L09855L36596J33186
$$ 808458 559671 278916 37412 -211046 -343839 -419651 -295417 14438 351034 484220
13965D84220J82054K33457L2396l58054k8939L96475P68598R38807J202108J444955
$$ 484220 666274 899731 932127 574073 545134 941609 1710207 2649014 3851122 5296077
13955E296077J961721K698747L810734N912371P976853K303690o402279o904471
$$ 5296077 7257798 9956545 13767279 19679650 27656503 29960193 23557914 16653443
13947A6653443m751682l183459k493712j788147j069127o18363o50280o88101
$$ 16653443 11901761 8718302 6224590 4436443 3367316 2748953 2098673 1410572
13939A410572p81265o53612k20283o6265L28142L54832J79189k83422k09207J06364
$$ 1410572 629307 -24305 -244588 -310853 17289 372121 551310 267888 58681 165045
13929A65045L2694k06138j76192m6430m6751M9410J13852r9236k9601K3490K37645
$$ 165045 197739 -8399 -184591 -231021 -277772 -228362 -114510 -213746 -243347 -219857 17788
13918A7788L00886j1747j32559j28299o51o9063q54J56138j85513p7875m432K41218
$$ 17788 318674 306927 174368 46069 45418 -23645 -24499 131639 -53874 -131749 -136181 105037
13906A05037J01331k59128K99206L60138K52604J319k56960j43607j65875J0740
$$ 105037 206368 -52760 246446 606584 859188 860507 603547 459940 294065 304805
13896C04805M0129M3414j32461m85493l59788R0796K04979J1336N6262Q1724k53666
$$ 304805 344934 388348 255887 -229606 -589394 -498598 -293619 -282283 -226021 -144297 -397963
13885c97963j55697L06438J76901k7305J75641J18501Q7820j13846k57655o2146
$$ -397963 -553660 -247222 -70321 -97626 78015 196516 284336 170490 -87165 -149311
13875a49311n9978k29509o6950N15893N38935k2481m04364l4507L27040k3317
$$ -149311 -209289 -438798 -505748 10145 549080 526599 122235 87728 414768 391451
13865C91451k60302l47742r6864K96422K88100K40416K38415J98709J7185m34499
$$ 391451 131149 -216593 -313457 -17035 271065 511481 749896 948605 965790 531291
13855E31291k22417O9367m699j98875k60875j99215J3827L66271J27326K69150
$$ 531291 308874 378241 373542 174667 -86208 -285423 -271596 94675 222001 491151
13845D91151L08570q34q7984Q7429K48864o83j84995l71417k17029N1957J6689
$$ 491151 799721 798887 710903 798332 1047196 1046513 861518 490101 273072 325029 341718
13834C41718o2402l0577J32277K49656M86197O3730l97346k56638J89091K80744
$$ 341718 279316 248739 381016 630672 1116869 1180599 783253 526615 715706 996450
13824I96450P9663n4856k99442k25778n07006m87849J21857l611k19806m23270
$$ 996450 1076113 1021257 721815 496037 -10969 -498818 -376961 -380572 -600378 -1023648
13814a023648k91513J69592M64368J5385k76416j79986J94159L37263Q46591Q40406
$$ -1023648 -1315161 -1145569 -681201 -665816 -942232 -1122218 -928059 -590796 255795 1096201
13804A096201J26039l96727m61383l75387j1806L43372L7045l903J19151j46655
$$ 1096201 1222240 825513 364130 -11257 -23063 320309 357354 353451 472602 325947
13794C25947j60523l26847k87710P3325J32613K26239P3696J17113L1321j67023
$$ 325947 165424 -161423 -449133 -375808 -243195 -16956 56740 173853 205174 38151
13784C8151j93578o5955j87944k83175m8892J1004J01227K45100N4076N0946l0156
$$ 38151 -155427 -221382 -409326 -692501 -741393 -730389 -629162 -384062 -329986 -279040 -309196
13773c09196J67336K22055j60269j14768K53068R9809m9133K5334q8625j28556
$$ -309196 -141860 80195 -80074 -194842 58226 158035 108902 134236 45611 -82945
13763h2945j25317J47341L10967R6582k23244j51602J5222J85198J60657l51357
$$ -82945 -208262 -60921 250046 346628 123384 -28218 -12996 172202 332859 -18498
13753a8498o8712R3418j53286L4544J30611J46806J48060L7028j75837K8590J73745
$$ -18498 -87210 6208 -147078 -112534 18077 164883 312943 349971 174134 202724 376469
13742C76469K91104m5109k56529k05298L84650M37091l68323n87878p41857k07428
$$ 376469 667573 622464 365935 160637 545287 982378 614055 26177 -715680 -923108
13732i23108M90434J23997k55865m09660j76194J22367J94546o2801K59550M94410
$$ -923108 -432674 -308677 -564542 -974202 -1150396 -1028029 -833483 -896284 -636734 -142324
13722a42324K0278r4565l16128k3024N8277J5241j95962j59169P7046J64902R7560
$$ -142324 -122046 -216611 -532739 -555763 -497486 -482245 -678207 -837376 -760330 -595428 -497868
13711d97868K60629J66701J76782K85009J02429k54694l59747o3151j26984l63197
$$ -497868 -237239 -70538 106244 391253 493682 238988 -120759 -183910 -310894 -674091
13701f74091m87827k94430L26571L82438O6114q0457J2549N8691K41594M59953
$$ -674091 -1161918 -1456348 -1129777 -747339 -681225 -761682 -749133 -690442 -448848 11105
13691A1105M20860J08109k2960q7519M5126K27950K4539j03922j8442o7033L7433
$$ 11105 431965 540074 517114 429595 474721 702671 727210 623288 604846 537813 575246
13680E75246K9669L5337J41562j11976L9399K52487J08847J67627j80053n01297
$$ 575246 604915 640252 781814 669838 709237 961724 1070571 1238198 1058145 556848
13670E56848k57040r2844K02636L13309N0765J45047K42545j87660m16052m08770
$$ 556848 299808 206964 409600 722909 773674 918721 1161266 973606 557554 148784
13660A48784j58131k38236j27488J23972m4693P589J96045K59192N0950p1189
$$ 148784 -9347 -247583 -375071 -251099 -295792 -288203 -92158 167034 217984 146795
13650A46795l92324l80848k73014j05445K58393O03409M47871L73867n8029m17053
$$ 146795 -245529 -626377 -899391 -1004836 -746443 -143034 304837 678704 620675 203622
13640B03622r8730n2323l16415J17367N92306M05534j07384k61400j73459k88482
$$ 203622 104892 52569 -263846 -146479 445827 851361 743977 482577 309118 20636
13630B0636n4330Q3897L44658L0177l57439k24313R3619k47792l77074o1964J73297
$$ 20636 -33694 50203 394861 425038 67599 -156714 -63095 -310887 -687961 -749925 -576628
13619e76628N05534L70433J70730N2508q4343j88781k11992J23421K91665m9380
$$ -576628 -71094 299339 470069 522577 438234 249453 37461 160882 452547 403167
13609D03167m54222k57722j4193l20130j39617K56197J97964L49519N79022K33463
$$ 403167 -51055 -308777 -322970 -643100 -782717 -526520 -328556 20963 599985 833448
13599H33448k0490N8210n1567k40044M0899J36592l43037j31240J68958P6469
$$ 833448 812958 871168 819601 579557 620456 757048 414011 282771 451729 528198
13589E28198k20649j56117P936j5042J10810J88510p6634l69798n57725j39146
$$ 528198 307549 151432 159368 144326 255136 443646 367012 -2786 -560511 -699657
13579f99657L12671k50957k67232O5116J74843L77243K05947K65846M65973J56815
$$ -699657 -386986 -637943 -905175 -840059 -665216 -287973 -82026 183820 649793 806608
13569H06608k75798l35895j38030q7678j9534J03871J02987L07143M12315L69348
$$ 806608 530810 194915 56885 -30793 -50327 53544 156531 463674 875989 1245337
13559A245337j20427m68017l37520l9728J33576m7719R9784j71375l60073j35646
$$ 1245337 1124910 656893 319373 279645 413221 365502 465286 293911 -66162 -201808
13549b01808k6081K1360J61602N9173L01402K51701J97518K61359L18888o1733
$$ -201808 -227889 -206529 -44927 14246 315648 567349 764867 1026226 1345114 1283381
13539A283381l88846k02730l28025l51218k30952k5205L4650r9133J15608Q9916
$$ 1283381 894535 691805 363780 12562 -218390 -243595 -208945 -308078 -192470 -102554
13529a02554n9518K48607J14088j67321j48404L10738J84000j18300o9395J20291
$$ -102554 -162072 86535 200623 33302 -115102 195636 379636 261336 191941 312232
13519C12232P5922p0236K4806j9371p1108m3025q3103m2257k37228j07602J35273
$$ 312232 388154 317918 342724 323353 252245 209220 126117 83860 -153368 -260970 -125697
13508a25697L57329K01314J3270M5390K01156r4916l93272k14777o414J75416
$$ -125697 231632 432946 446216 491606 692762 597846 204574 -10203 -16617 158799
13498A58799J22142m1643q1515P1691j3714M1798Q7500j03713j35061n3591M3404
$$ 158799 280941 239298 157783 229474 215760 257558 345058 241345 106284 52693 96097
13487I6097k02133o0171J40128L71092J50291k58865m5988J32191O588j31916
$$ 96097 -106036 -166207 -26079 345013 495304 236439 190451 322642 329230 197314
13477A97314J91391J79215n2412j41829m14616m28838j3821R4887q3739J34312
$$ 197314 388705 567920 515508 373679 -40937 -469775 -483596 -388709 -472448 -338136
13467c38136P40023K81094j94570j71004o037n509m03848n73977l7070K64225
$$ -338136 401887 682981 488411 317407 311370 305861 -97987 -671964 -709034 -444809
13457d44809K56484K41526K76207J63460m44714m34120n9156o1778k88965K73539
$$ -444809 -188325 53201 329408 492868 48154 -385966 -445122 -506900 -795865 -522326
13447e22326N08669M9604O2378J84118j03511m34510m43619N2210J30886j77039
$$ -522326 -13657 35947 98325 282443 178932 -255578 -699197 -646987 -516101 -693140
13437f93140j51839L92756Q5633k1411L83660J29897k41165k33902J2066K41637
$$ -693140 -844979 -452223 -366590 -388001 -4341 125556 -115609 -349511 -337445 -95808
13427i5808L49010j8911k95506l18684j89440j34479K72435K19870j55325l37867
$$ -95808 253202 234291 -61215 -379899 -569339 -703818 -431383 -211513 -366838 -704705
13417g04705k61930M15619L40353q5976m4703K41903L72961M35414J07014K6993
$$ -704705 -966635 -551016 -210663 -296639 -341342 -99439 273522 708936 815950 842943
13407H42943J24829K10542l156k13208k44419l90538n14904j21119K42076J56477
$$ 842943 967772 1178314 1175158 961950 717531 326993 -187911 -309030 -66954 89523
13397H9523K35302L09244P2506j41189j18936K7951N7902N9207Q4410o3961j78476
$$ 89523 324825 634069 706575 565386 446450 474401 532303 591510 675920 611959 433483
13386D33483j63877l5287j74902K85596J13983k06721J02775K41896N2260K4591
$$ 433483 269606 234319 59417 345013 458996 252275 355050 596946 649206 673797
13376F73797K98311J83158j34324l45260j62858n0233Q9719o0641k63519M0858
$$ 673797 972108 1155266 1020942 675682 512824 462591 552310 491669 228150 269008
13366B69008K38228L86312N2384k09095j80190Q2766K54117J46357j97402k67363
$$ 269008 507236 893548 945932 736837 556647 639413 893530 1039887 842485 575122
13356E75122j59140o5538k80557l951K41979J29882k9341J1093Q3053Q7059L7432
$$ 575122 415982 350444 69887 65936 307915 437797 408456 419549 502602 589661 627093
13345F27093K09620q262p7109L39130j77308m26288r6085J06652K29538J42460
$$ 627093 836713 828451 751342 1090472 913164 486876 390791 497443 726981 869441
13335H69441K37038J30855m09070k58463j16590q1863R0718J04906J18593j45098
$$ 869441 1106479 1237334 828264 569801 453211 371348 462066 566972 685565 540467
13325E40467m43089n89486n58561l07774k05666K78488Q39417O57811P8345j12996
$$ 540467 97378 -492108 -1050669 -1358443 -1564109 -1285621 -446204 211607 289952 176956
13315A76956L23878N53048R0886m74034m24379K19365M14272r2566n22249m84316
$$ 176956 500834 1053882 1144768 670734 246355 465720 879992 787426 265177 -219139
13305b19139l10281L8002K77648L93171K81839O7463j13355j39949J80952N12725
$$ -219139 -529420 -491418 -213770 179401 461240 528703 415348 275399 456351 969076
13295I69076J17422L5980R9719k16924j21462k95554k23826J79978J25339K11127
$$ 969076 1086498 1122478 1222197 1005273 883811 588257 364431 544409 669748 880875
13285H80875K85329J66544k35546k30240j89107J31478R4144r1291l8624m94252
$$ 880875 1166204 1332748 1097202 866962 677855 809333 903477 812186 773562 279310
13275B79310k53210P6890j05741l04309j23741K00805M05896N72468J82243l36450
$$ 279310 26100 102990 -2751 -307060 -430801 -229996 175900 748368 930611 594161
13265E94161j40697K97605K94386J71095o2042j39981q0695l75683J18065M4891
$$ 594161 453464 751069 1045455 1216550 1154508 1014527 933832 558149 676214 721105
13255G21105k21865J91373J75961j22215j48425n4208J8056J77075J14506J48773
$$ 721105 499240 690613 866574 744359 595934 541726 559782 736857 851363 1000136
13245A000136K39694K08560r1583k07258m51194l91148k9781K66537n154k34069
$$ 1000136 1239830 1448390 1356807 1149549 698355 307207 277426 543963 538809 304740
13235C04740L7898N2998K4561R006l6258L91961N77984K63826K4820j83622l23497
$$ 304740 342638 395636 420197 429203 392945 784906 1362890 1626716 1651536 1467914 1144417
13224A144417k53881k13467J8987K03978r1801K8851K96108J79940j98958q9323
$$ 1144417 890536 677069 696056 900034 808233 837084 1133192 1313132 1114174 1024851
13214A024851P8671k9566j04497j6620j02194m3553j01622R341L27091L87173
$$ 1024851 1103522 1073956 969459 952839 850645 807092 705470 714811 1041902 1429075
13204A429075j6980J4238K34411M7018j61215r9441N184j66983k36017j18429
$$ 1429075 1412095 1426333 1660744 1707762 1546547 1447106 1452290 1285307 1049290 930861
13194I30861m5229j6262k05054l79312l30200j87592J62359N77474L26745m8931
$$ 930861 885632 869370 664316 285004 -45196 -232788 -70429 507045 833790 784859
13184G84859L9680J839m41192l07779p9337J0366M09825M13829K37974p2544j009
$$ 784859 824539 826378 385186 77407 -1930 8436 418261 832090 1070064 997520 996511
13173I96511J0526k43339k14567R1881J10254K19570N12423J44347j9611l4626
$$ 996511 1007037 763698 549131 641012 751266 970836 1483259 1627606 1607995 1573369
13163A573369K1972q5306j40481J3272n4753q393J64018l04379m93123j84127
$$ 1573369 1595341 1510035 1369554 1382826 1328073 1319680 1483698 1179319 686196 502069
13153E02069l77914m14259J91986O68359M79683J94475J42450r5157l75687l4205
$$ 502069 124155 -290104 -98118 570241 1049924 1244399 1386849 1291692 916005 881800
13143H81800K29300n0615j99463j90051j42907L05312J25068l33071k47128L44570
$$ 881800 1111100 1060485 861022 670971 528064 833376 958444 625373 378245 722815
13133G22815R9886m87901k33605L09303N79924J61437j15831k38977k16381k43705
$$ 722815 822701 334800 101195 410498 990422 1151859 1036028 797051 580670 336965
13123C36965j20628j89177m7384M18682O29802J90144q7874l4326L4512K0066
$$ 336965 216337 27160 -20224 398458 1028260 1218404 1130530 1096204 1130716 1150782
13113A150782k43035k33843K0313J32308R5395m2395K2917J69580K4964k58253
$$ 1150782 907747 673904 694217 826525 921920 879525 902442 1072022 1096986 838733
13103H38733J04781p1813k2543k37547m3770L14998o0370j73496m0353L90381
$$ 838733 943514 871701 849158 611611 567841 882839 822469 648973 608620 999001
13093I99001K28886O5927R7854L16970O4653l05988m01612l01606j54909j57892
$$ 999001 1227887 1293814 1391668 1708638 1773291 1467303 1065691 764085 609176 451284
13083D51284j26216L27791N38083M01088K35560K07426J99410j64320K0104n798
$$ 451284 325068 652859 1190942 1592030 1827590 2035016 2234426 2070106 2090210 2084412
13073B084412k76058l33143K66246k1889j98872N0747M0079L00767M4424k10850
$$ 2084412 1808354 1475211 1741457 1719568 1520696 1571443 1611522 1912289 1956713 1745863
13063A745863m0734q1212J60835K54709l8061J85610J3185k33392k00226o9540
$$ 1745863 1705129 1623917 1784752 2039461 2001400 2187010 2200195 1966803 1766577 1697037
13053A697037m2731P460J94018K64711K3727J79168J98642k73505k63194K10252
$$ 1697037 1654306 1661766 1855784 2120495 2144222 2323390 2522032 2248527 1985333 2195585
13043B195585L21768j6253j4172o7277L06003N72907K82008K4319l67211N7345
$$ 2195585 2517353 2501100 2486928 2419651 2725654 3298561 3580569 3604888 3237677 3295022
13033C295022J04735J25033k337j9543J50742O2538r8081q5798q9089J34204j26559
$$ 3295022 3399757 3524790 3522453 3502910 3653652 3716190 3618109 3532311 3443222 3577426 3450867
13022C450867l40141O6615M40700K30971K78856J37173k17286j83953k054M09542
$$ 3450867 3110726 3177341 3618041 3849012 4127868 4265041 4047755 3863802 3861748 4271290
13012D271290L06470K34137K18940M72174L98689K82516L16937L68586K4853r5578
$$ 4271290 4577760 4811897 5030837 5503011 5901700 6184216 6501153 6869739 6894592 6799014
13002F799014N00970J02280K39351L64666K43686O49448O51921Q55736R05112
$$ 6799014 7299984 7402264 7641615 8006281 8249967 8899415 9551336 10407072 11312184
12993A1312184Q63774J302755J599153J736017J821279J737137J741762K492244
$$ 11312184 12175958 13478713 15077866 16813883 18635162 20372299 22114061 24606305
12985B4606305L712386M332592N454890P404341R459436J2244820J6546576K2581005
$$ 24606305 28318691 32651283 38106173 45510514 54969950 67214770 83761346 106342351
12977A06342351L0814410M2017109N6070608O7212611N9395199J9729995l2070142
$$ 106342351 137156761 179173870 235244478 302457089 361852288 381582283 349512141
12970C49512141o0493541o0819525m9482865l7691791k7700229k0068442j5440910
$$ 349512141 289018600 228199075 178716210 141024419 113324190 93255748 77814838
12963G7814838j2250692r841035p610552n979112n263026m397313l742212l024813
$$ 77814838 65564146 55723111 48112559 42133447 36870421 32473108 28730896 25706083
12955B5706083k493832k368630j967524j502562j239080j182759j037192p93249
$$ 25706083 23212251 20843621 18876097 17373535 16134455 14951696 13914504 13121255
12947A3121255o26585r40783r24167n40158n31077m04744k22570j26342j84491
$$ 13121255 12494670 11553887 10629720 10089562 9558485 9153741 8931171 8804829 8620338
12938H620338k24602l00356l45894j67775P5197k7222R2882j70663k00128j50921
$$ 8620338 8395736 8095380 7749486 7581711 7656908 7629686 7722568 7551905 7351777 7200856
12928G200856J30516r3707k87247M55769N76568L26404L56933L95501P72695R17670
$$ 7200856 7331372 7237665 6950418 7406187 7982755 8309159 8666092 9061593 9834288 10751958
12918A0751958P15674R79755J666064K294199K010477O38062m66957j213400j064099
$$ 10751958 11467632 12447387 14113451 16407650 18418127 19056189 18589232 17375832 16311733
12909A6311733o95800n19309k1909K29329M22110Q56511R12605J272501J681456
$$ 16311733 15615933 15096624 15074715 15304044 15726154 16582665 17495270 18767771 20449227
12900B0449227J995429K337505L656807M968926O060694P769281J0531088J3918873
$$ 20449227 22444656 24782161 28438968 33407894 39468588 47237869 57768957 71687830
12892G1687830J8539697K5196108L4130407M6443653O1476420P0145048N2760706
$$ 71687830 90227527 115423635 149554042 195997695 257474115 327619163 380379869
12885C80379869L164401m6647694o5605016n9856296m6615252l4309074k5226394
$$ 380379869 383544270 336896576 271291560 211435264 164820012 130510938 105284544
12878A05284544j8874388j4237618j1008479q415727o850520n842199m614906
$$ 105284544 86410156 72172538 61164059 52748332 45897812 40055613 35440707
12871C5440707l673891l274077k837015k483335k357373k191927j763784j243106
$$ 35440707 31766816 28492739 25655724 23172389 20815016 18623089 16859305 15616199
12863A5616199j024078j177162j103652p78624l49185l25924n80701o45890n64088
$$ 15616199 14592121 13414959 12311307 11532683 11183498 10857574 10276873 9630983 9066895
12854I066895n74336l51629k30988j81196k66538l05016r1530l4211j03787N9857
$$ 9066895 8492559 8140930 7909942 7728746 7462208 7157192 7065662 7031451 6927664 6987521
12844F987521K37494J27282Q5502K5845K3100R4078j1246J91218p5690n615J89827
$$ 6987521 7225015 7352297 7437799 7463644 7486744 7580822 7569576 7760794 7685104 7679489 7869316
12833G869316J03117R4286j35950k80075K35103N39672o961k92055J59454M55450
$$ 7869316 7972433 8066719 7930769 7650694 7885797 8425469 8418508 8126453 8285907 8741357
12823H741357L52973L85267M65270R43843J152785J092377J454610J691853J700611
$$ 8741357 9094330 9479597 9944867 10888710 12041495 13133872 14588482 16280335 17980946
12814A7980946K093857K712698L238130L719041M678125O745763Q953574J1635703
$$ 17980946 20074803 22787501 26025631 29744672 34422797 41168560 50122134 61757837
12806F1757837J5036560K0001395K7150961L6897155M9911819O3988698O6343206
$$ 61757837 76794397 96795792 123946753 160843908 210755727 274744425 341087631
12799C41087631L8913916j2991539n3529753o3871112n4965853m2013380l0956711
$$ 341087631 380001547 367010008 313480255 249609143 194643290 152629910 121673199
12792A21673199k2831661j7100869j2920232j0107477q554688p102200n960863
$$ 121673199 98841538 81740669 68820437 58712960 50158272 43056072 37095209
12785C7095209n117723m377652l704869k837168j796674j410398j611533j417890
$$ 37095209 31977486 27599834 23894965 21057797 19261123 17850725 16239192 14821302
12777A4821302j181848r43829j086739j147087p72642o56788m30512o7650m79491
$$ 14821302 13639454 12695625 11608886 10461799 9689157 9032369 8601857 8534207 8054716
12768H054716o39804n44362n57408o44203l80676j84216m29890k88327j20802
$$ 8054716 7414912 6870550 6313142 5668939 5288263 5104047 4674157 4385830 4265028
12759D265028J56587k47014n14758l57648p0257K89790O2027m3913O7074l22073
$$ 4265028 4421615 4174601 3659843 3302195 3231938 3521728 3583755 3539842 3606916 3284843
12749C284843n24082k89857L02334K82236j6426j79584m40185l01919j89705k48553
$$ 3284843 2760761 2470904 2773238 3055474 3039048 2859464 2419279 2117360 1927655 1679102
12739A679102l92426k72398K53107M29314K77506N6048K563K1948m83682q39233
$$ 1679102 1286676 1014278 1267385 1696699 1974205 2030253 2032816 2054764 1571082 731849
12729G31849l47779M19466M04963K39395K06530j51532l40133p0663J12987J03333
$$ 731849 384070 803536 1208499 1447894 1654424 1502892 1162759 1092096 1205083 1308416
12719A308416M4307k65746j07246r5445J73705O6959m45822n67301j40752M56296
$$ 1308416 1352723 1086977 979731 884286 1057991 1124950 679128 111827 -28925 427371
12709D27371J68097k62870j33074J72495K42492J71988l76269k44852J12955J49344
$$ 427371 595468 332598 199524 372019 614511 786499 410230 165378 278333 427677
12699D27677K80840J78826J40384M5743j66501q1846J98608J07439M9546k47426
$$ 427677 708517 887343 1027727 1073470 906969 825123 1023731 1131170 1180716 933290
12689I33290j85859J74993J16463L49692M89008P6110m28635j22482m64026j87995
$$ 933290 747431 922424 1038887 1388579 1877587 1953697 1525062 1402580 938554 750559
12679G50559l4201j38079K29886P7917k20101k75915j56062M2101M7230Q4421
$$ 750559 716358 578279 808165 886082 665981 390066 234004 276105 323335 407756
12669D07756L91294M31103J93672J35454J2594j41700j60739j08217j02719k81338
$$ 407756 799050 1230153 1423825 1559279 1571873 1430173 1269434 1161217 1058498 777160
12659G77160l71595k76746K11809N89997M4048l91498k17780o2745L2670Q0791
$$ 777160 405565 128819 340628 930625 974673 583175 365395 302650 335320 416111
12649D16111j40240q3599k23447R3622J45827P1172J72559J28705j53426j07924
$$ 416111 275871 192272 -31175 62447 208274 279446 452005 580710 427284 319360
12639C19360M2339J53781J74244P5580J93831k42449l12896k53417r1227O0477
$$ 319360 361699 515480 689724 765304 959135 716686 403790 150373 59146 119623
12629A19623L17412L35568J57092k44888k50215l11989j69371K6444j562K41172
$$ 119623 437035 772603 929695 684807 434592 122603 -46768 -20324 -21886 219286
12619B19286K87100O3830k48273p5027l57261l71707J49780O89678N83055J96015
$$ 219286 506386 570216 321943 246916 -110345 -482052 -332272 357406 940461 1136476
12609A136476J85383J61033j13973r4764l49482m00208m27948j98657J63507L67444
$$ 1136476 1321859 1482892 1368919 1274155 924673 524465 96517 -102140 61367 428811
12599D28811m02019n51277o3266J09507Q4356r1442M6562K88364L74394j02904
$$ 428811 26792 -524485 -587751 -478244 -393888 -485330 -438768 -150404 223990 121086
12589A21086l7225p0916q9189p0266J11654L3881P3496K23775J5829K81375M13829
$$ 121086 83861 12945 -76244 -146510 -34856 -975 72521 296296 312125 593500 1007329
12578A007329Q4585K55N9864p8304k99074m11332l32465K20365M45521J56685
$$ 1007329 1091914 1092169 1152033 1073729 774655 363323 30858 251223 696744 853429
12568H53429m713J43045n828l6527j25726k2761J12365k1030P298M7596J88829
$$ 853429 848716 991761 985933 949406 823680 800919 913284 892254 899552 947148 1135977
12557A135977K85484P9210K23663K77043J92076K57123O65695M50421J1124O45843
$$ 1135977 1421461 1500671 1724334 2001377 2193453 2450576 3116271 3566692 3577816 4223659
12547D223659J557571K323367M083284O569464Q637473L058229p024095p748750
$$ 4223659 5781230 8104597 12187881 18757345 27394818 30453047 23428952 15680202
12539A5680202m902326l027692k070178j507784q57400l12903m3202j96082j94097
$$ 15680202 10777876 7750184 5680006 4172222 3314822 3001919 2958717 2762635 2568538
12530B568538k60810m36794m44639k45125K49216K72822j83246n22475n08583
$$ 2568538 2307728 1870934 1426295 1181170 1430386 1703208 1519962 997487 488904
12521D88904R354L15484K35770K29892N6626k83624m70634m24152r6476K39811
$$ 488904 498258 813742 1049512 1279404 1336030 1052406 581772 157620 61144 300955
12511C00955M60836Q964j15127J5746j94215j05504k19035k99083K01501J19242
$$ 300955 761791 770755 655628 671374 477159 371655 152620 -146463 55038 174280
12501A74280k14152r0527L87448K83389j5601j16978J36042J41060o9006R4752
$$ 174280 -39872 -130399 257049 540438 524837 407859 543901 684961 615955 710707
12491G10707J81745l3715k55731l68463k02489K27043N47643M94912j01892m45062
$$ 710707 892452 858737 603006 234543 32054 259097 806740 1301652 1199760 754698
12481G54698j94616j08658k35845k90448J88592L27445L05752J48151l89635k62556
$$ 754698 560082 451424 215579 -74869 113723 441168 746920 895071 505436 242880
12471B42880j22489k1024k8069j67932J03675J67114J01874K65370M58570J00571
$$ 242880 120391 99367 71298 -96634 7041 174155 276029 541399 999969 1100540
12461A100540l9413J4685j76388k59028k22634m84318j31823K14802j1623O9039
$$ 1100540 1061127 1075812 899424 640396 417762 -66556 -198379 16423 4800 73839
12451G3839N5707K73752J33271M7348p1252j30690l8356K87016K19808Q1157J39682
$$ 73839 129546 403298 536569 583917 512665 381975 343619 630635 850443 931600 1071282
12440A071282k19548k93472r9381l28884l51690k79362j61865P2071K15627M37521
$$ 1071282 851734 558262 458881 129997 -221693 -501055 -662920 -590849 -375222 62299
12430F2299L78697L8143j60951j62120J09935L88961L00298m2511k34659j34067
$$ 62299 440996 479139 318188 156068 266003 654964 955262 912751 678092 544025
12420E44025J8483K4907m067K99712j8235n55036L2552K87705l10061n74672k12885
$$ 544025 562508 587415 583348 883060 864825 309789 342341 630046 319985 -254687 -467572
12409d67572L39059L27255j16778K5855j84183k52779J4238p8032m01307j87528
$$ -467572 -128513 198742 81964 107819 -76364 -329143 -314905 -392937 -794244 -981772
12399i81772K68377M85885J14088j83926J77281L94714J26547k82021o6031j41
$$ -981772 -713395 -227510 -113422 -297348 -120067 274647 401194 119173 53142 53001
12389E3001Q8690J88285m984k49261J03154l9365j76033l10849Q125j36275k68519
$$ 53001 141691 329976 324992 75731 178885 139520 -36513 -347362 -339237 -475512 -744031
12378g44031J20183J28354J8294J98878O5827J23917K66403K12251J33020r6335
$$ -744031 -623848 -495494 -477200 -278322 -212495 -88578 177825 390076 523096 426761
12368D26761k49218m65847l31118O3013L74658M85186K82281J66835O8779j96487
$$ 426761 177543 -288304 -619422 -556409 -181751 303435 585716 752551 821330 624843
12358F24843o13396l50642l1289J74996L80835J26944M1121M7752j7916m5530
$$ 624843 11447 -339195 -370484 -195488 185347 312291 353412 401164 383248 337718
12348C37718q7027k83006j57655j06461m12555j71337J70018p2954R5508K87140
$$ 337718 250691 -32315 -189970 -296431 -708986 -880323 -710305 -783259 -687751 -400611
12338d00611J01425L37332N20878l675r9282o1338n7781K89969J333l69078p5368
$$ -400611 -299186 38146 559024 555349 456067 394729 336948 626917 628250 259172 183804
12327A83804K14602J50017j53518m1884r9572j45840k8422K13546m9275l38182
$$ 183804 398406 548423 394905 353021 253449 107609 79187 292733 243458 -94724
12317i4724l91346n8377K45578K99550R6992j30076K4047k32519l52168K46450
$$ -94724 -486070 -544447 -298869 681 97673 -32403 -8356 -240875 -593043 -346593
12307c46593K59530K24220M42883J88951j16963k48244j93024j65445M8359j25521
$$ -346593 -87063 137157 580040 768991 652028 403784 210760 45315 93674 -31847
12297c1847k36188P9245P8969J64434k091o8592J41381J43828p0085k48451K18617
$$ -31847 -268035 -188790 -109821 54613 52522 -16070 125311 269139 199054 -49397 169220
12286A69220R0388J17550K90080J24207j10358k3380R3436k76185k22869m9622
$$ 169220 259608 377158 667238 791445 681087 657707 751143 474958 252089 202467
12276B02467k99469j29425L85734L48270R7472q9487o5680j8649l93901l38635
$$ 202467 -97002 -226427 159307 507577 605049 515562 449882 431233 37332 -301303
12266c01303l58544l50118J26791J91220r448j97968p4268M1076K91766M14765
$$ -301303 -659847 -1009965 -883174 -691954 -701402 -899370 -973638 -932562 -640796 -226031
12256b26031J06208P2207O8775J34065M8851k33613j57676J7521J10845K8679
$$ -226031 -119823 -47616 21159 155224 204075 -29538 -187214 -169693 -58848 -30169
12246c0169o6755N9003J52731K28924R9499L36492j4903k65602k7432o5896l24572
$$ -30169 -96924 -37921 114810 343734 443233 779725 764822 499220 471788 405892 81320
12235H1320m77696j89727K74326J57548o5894j10794N4668O7438r7136J28278
$$ 81320 -396376 -586103 -311777 -154229 -220123 -330917 -276249 -208811 -305947 -177669
12225a77669K90168j03596k8855L72194K0998m46841o09368l18242m3598j9559
$$ -177669 112499 8903 -19952 352242 373240 -73601 -682969 -1001211 -1044809 -1064368
12215a064368j46048j05202k62355P0157J84164L3025J51231J82994K77826M23836
$$ -1064368 -1210416 -1315618 -1577973 -1507816 -1323652 -1290627 -1139396 -956402 -678576 -254740
12205b54740J22003j04172J57985J47602l6846j84861M9972J44438K22189J39249
$$ -254740 -132737 -236909 -78924 68678 31832 -153029 -103057 41381 263570 402819
12195D02819k96717m53796k79704O8049J24096k0518J42278N23611K2869m12133
$$ 402819 106102 -347694 -627398 -559349 -435253 -455771 -313493 210118 232987 -179146
12185a79146r8954J34541J95878j05381k78204L4970J45456J37985J85499j07284
$$ -179146 -278100 -143559 52319 -53062 -331266 -296296 -150840 -12855 172644 65360
12175F5360j27163N2373K34804O4487n701J56688L01166k6074j59065K23282J43631
$$ 65360 -61803 -9430 225374 289861 284160 440848 742014 715940 556875 780157 923788
12164I23788K5740L20953K14651l14033l14179j21976l07393l45834j82401K91792
$$ 923788 949528 1270481 1485132 1171099 856920 734944 427551 81717 -100684 191108
12154A91108O86235j2684n18153R172K51551J94122r0456l7424r9234l49535n59926
$$ 191108 877343 864659 346506 355678 607229 801351 710895 673471 574237 224702 -335224
12143c35224l81869k30038p4454j58276k34581J63012L58852N55273N47976k8126
$$ -335224 -717093 -947131 -1021585 -1179861 -1414442 -1251430 -892578 -337305 210671 182545
12133A82545l77554j09623Q4699k4r8774p1395l7000j8582N9944j71093j39516
$$ 182545 -195009 -304632 -219933 -219957 -318731 -390126 -427126 -445708 -385764 -556857 -696373
12122f96373K01669K13451p3359n13988j36224Q4354L25119K56326j7658l04445
$$ -696373 -494704 -281253 -354612 -868600 -1004824 -920470 -595351 -339025 -356683 -661128
12112f61128l08352M4352M11387L50244J99356p2749j16659K63372M98363M8773
$$ -661128 -969480 -925128 -513741 -163497 35859 -36890 -153549 109823 608186 656959
12102F56959n75039n26232N4435L24503o0401k83672L7157M45853K19732q6030
$$ 656959 81920 -444312 -389877 -65374 -125775 -409447 -372290 73563 293295 207265
12092B07265r2306J03854L95038J5725k82426p0794k19674l34626L00485M9316
$$ 207265 114959 218813 613851 629576 347150 276356 56682 -277944 22541 71857
12082G1857j02539L20896L03469r661K01743K23667k92464n84731k78849j53913
$$ 71857 -30682 290214 593683 584022 785765 1009432 716968 132237 -146612 -300525
12072c00525j43812Q9462L18505J22085J08713n9011p5587o504K8462J21495J17224
$$ -300525 -444337 -354875 -36370 85715 194428 135417 59830 53326 81788 203283 320507
12061C20507k38805l02548J83870J59243m68964n18170j01401m5958K13624J43446
$$ 320507 81702 -220846 -36976 122267 -346697 -864867 -966268 -1012226 -798602 -655156
12051f55156J19564O1639p7408M3544J95556K14171n8132j38306J01464L01418
$$ -655156 -535592 -473953 -551361 -507817 -312261 -98090 -156222 -294528 -193064 108354
12041A08354M3388M6658J57774O6609o0156j65276J54836L92188J75002q3040
$$ 108354 151742 198400 356174 422783 362627 197351 352187 744375 919377 836337
12031H36337j69967o18193o02422k05648K5622o206j8936K37821J92994n5005
$$ 836337 666370 48177 -554245 -759893 -734271 -740477 -759413 -521592 -328598 -383603
12021c83603J55506P4468p0422l1820j83884l18653K20350M20366L1051q6067
$$ -383603 -228097 -153629 -224051 -255871 -439755 -758408 -538058 -117692 -86641 -172708
12011a72708R4488n1267l00382l10965K32874L12163k8250J0048K64832K61327
$$ -172708 -78220 -129487 -429869 -740834 -507960 -195797 -224047 -213999 50833 312160
12001C12160j51383p9795k30368m02293Q5853j16207K6063L60517K62392L97337
$$ 312160 160777 80982 -149386 -551679 -465826 -582033 -555970 -195453 66939 464276
11991D64276K53010J16904m31984n76180l56213j10499l02649J5574M91577K85943
$$ 464276 717286 834190 402206 -173974 -530187 -640686 -943335 -927761 -436184 -150241
11981a50241L11876J5855L04702J66569l55172j45408J48124m59038n32469j94463
$$ -150241 161635 177490 482192 648761 293589 148181 296305 -162733 -695202 -889665
11971h89665L70239P76606L90381j06765n0396j13889j50441P6648J99908j14049
$$ -889665 -519426 257180 647561 540796 490400 376511 226070 302718 502626 388577
11961C88577k26856L3922L18350j32365m28611j75690J69647K88868Q0356k17456
$$ 388577 161721 195643 513993 381628 -46983 -222673 -53026 235842 316198 98742
11951I8742P5392K10611j85920l16398j88057k6657l6250K52903K51917K05095
$$ 98742 174134 384745 198825 -117573 -305630 -332287 -368537 -115634 136283 341378
11941C41378K10630R4294k02221k10479r3434j04843m72856l4379L77806J42021
$$ 341378 552008 646302 444081 233602 140168 35325 -437531 -471910 -94104 47917
11931D7917K23061M00817L10423j024k12029J68866L53101R9917k44045j55723
$$ 47917 270978 671795 982218 981194 769165 938031 1291132 1391049 1147004 991281
11921I91281j86903k74970j23169j37793k22518j42093Q565J25506K65269j01254
$$ 991281 804378 529408 406239 268446 45928 -96165 -87600 37906 303175 201921
11911B01921l85584k13834O4496L93571K14113R318K578j3097L21346P9072k42454
$$ 201921 -183663 -397497 -333001 60570 274683 284001 286579 273482 594828 673900 431446
11900D31446m30900l85316p3917m928J77165J91605J5332k09052k84349j06506
$$ 431446 546 -384770 -458687 -463615 -286450 -94845 -79513 -288565 -572914 -679420
11890f79420K41455J26379K52652K11990j12119k55844P8972J46875K58214L84386
$$ -679420 -437965 -311586 -58934 153056 40937 -214907 -135935 10940 269154 653540
11880F53540L51033k1946m89530l95878l4694M8237j12666K66810L69956j6730
$$ 653540 1004573 982627 493097 97219 62525 110762 -1904 264906 634862 618132
11870F18132j13556j70916j93955j60234J49568P5649k11527k73817n02496J37831
$$ 618132 504576 333660 139705 -20529 129039 204688 -6839 -280656 -783152 -645321
11860f45321M75366O2855K31116J09994K49856J29423m43805p26412l00823p4628
$$ -645321 -169955 -107100 124016 234010 483866 613289 169484 -556928 -857751 -932379
11850i32379j15468j3253J35073L74260J88485K15740j6654r9923K33508M13951
$$ -932379 -1047847 -1061100 -926027 -551767 -363282 -147542 -164196 -264119 -30611 383340
11840C83340L38977M8765j18161J52871J00328j35764k65222k35233M9625J18286
$$ 383340 722317 771082 652921 805792 906120 770356 505134 269901 319526 437812
11830D37812j56690l6616Q5423J42645j37956q7340k06303j55843j08128o06L78666
$$ 437812 281122 244506 329929 472574 334618 247278 40975 -114868 -222996 -223602 155064
11819A55064L74139J6522l69060o17049o6994M13985Q2366K27979N73555M83547
$$ 155064 529203 545725 176665 -440384 -507378 -93393 -11027 216952 790507 1274054
11809A274054p1521m39672n24368k35192k78123l38880J51341N35028K80783j57266
$$ 1274054 1202533 762861 238493 3301 -274822 -613702 -462361 72667 353450 196184
11799A96184l49493K3570K50196n9971l61957j80611j18820k34466J98431L22962
$$ 196184 -153309 -129739 120457 60486 -301471 -482082 -600902 -835368 -636937 -313975
11789c13975k41920k12147R7652L3919k6151O4856J0737k36609j5814J94675J4031
$$ -313975 -555895 -768042 -670390 -636471 -662622 -597766 -587029 -823638 -839452 -644777 -630746
11778f30746K73227J04445K9180O2022l9118j06032k26418J36398K95590K49639
$$ -630746 -357519 -253074 -223894 -161872 -200990 -307022 -533440 -397042 -101452 148187
11768A48187R1089n2917j08722n7312j40393k92271P6569M15087J56859J64511
$$ 148187 239276 186359 77637 20325 -120068 -412339 -335770 79317 236176 400687
11758D00687K89792m0181j77255k44531j22330R0187j41253l30707j18887K26998
$$ 400687 690479 650298 473043 228512 106182 196369 55116 -275591 -394478 -167480
11748a67480K02179L21150J22214n9005k83687j98412J4984P9861K03824N0712
$$ -167480 34699 355849 478063 419058 135371 -63041 -48057 31804 235628 286340
11738B86340N4631P6807r49J20153J47067k09345m09123j66276J313j47342p8970
$$ 286340 340971 417778 416829 536982 684049 474704 65581 -100695 -99382 -246724 -325694
11727c25694k08295k70138j36871L77829M47925P4204j044K09375K14694Q4624
$$ -325694 -533989 -804127 -940998 -563169 -115244 -41040 -42084 167291 381985 466609
11717D66609M9493O0443j81779o22806j79061R5987l72873o22427K84589O26118
$$ 466609 516102 576545 394766 -228040 -407101 -311114 -683987 -1306414 -1021825 -395707
11707c95707N7023m88643j80743J10J36970J92762J53890J26746K5682J5970J27307
$$ -395707 -338684 -827327 -1008070 -1007960 -870990 -678228 -524338 -397592 -371910 -355940 -228633
11696b28633K24536L80609M44718p19l65648l5480j7982n8773n0376K7766K55740
$$ -228633 -4097 376512 821230 820511 454863 419383 401401 342628 292252 320018 575758
11685E75758R0735j70300k39857m1887l75534k63377j48630l2802L97698L91366
$$ 575758 666493 496193 256336 214449 -161085 -424462 -573092 -605894 -208196 183170
11675A83170l11018n90721j50037L46857Q15655K08553l60164r4748r2620l30997
$$ 183170 -127848 -718569 -868606 -521749 293906 502459 142295 47547 -45073 -376070
11665c76070j82324K74666L58929O2819l31035k31765O25919O71332O5270j52146
$$ -376070 -558394 -283728 75201 138020 -193015 -424780 201139 872471 937741 785595
11655G85595k29176l55509o35096l43104O9907J96375J67100l9842M4964K76442
$$ 785595 556419 200910 -434186 -777290 -707383 -511008 -343908 -383750 -338786 -62344
11645f2344N21331N48319r7053m29574r5918O2402Q825M5788R6169J30156J40311
$$ -62344 458987 1007306 910253 480679 384761 447163 455988 501776 597945 728101 868412
11634H68412l8987L2925j2290j41365L6704k03143k57756Q0193M28390K48960
$$ 868412 829425 862350 850060 708695 745399 542256 284500 364693 793083 1042043
11624A042043l46507n93014l63014o952n646J12165r1751j1084J38815r6791j92322
$$ 1042043 695536 102522 -260492 -267444 -273090 -160925 -252676 -263760 -124945 -221736 -414058
11613d14058N4223N6544M0943J94191M54671Q2715k4110K43946J6835m20464K4938
$$ -414058 -359835 -303291 -262348 -68157 386514 469229 445119 689065 705900 285436 310374
11602C10374n5494o6784K77482N31258Q8408l65315j05305m02062k56742j76909
$$ 310374 254880 188096 465578 996836 1085244 719929 614624 212562 -44180 -221089
11592b21089k44215J50754K50610O2768K04144k0529j98910l08849l1881L02629
$$ -221089 -465304 -314550 -63940 -1172 202972 182443 -16467 -325316 -357197 -54568
11582e4568K28823K15077M28843K22264j62652l45329k59023l33124l29128k91319
$$ -54568 174255 389332 818175 1040439 877787 532458 273435 -59689 -388817 -680136
11572f80136j087M4747n7301N14874M01426j60189n14576q3165N08735n7093k63481
$$ -680136 -681223 -636476 -693777 -178903 222523 62334 -452242 -535407 -26672 -83765 -347246
11561c47246K08374K00448J63828K40905K038o6627J03199k4801j37455k619l5147
$$ -347246 -138872 61576 225404 466309 468347 401720 504919 480118 342663 340044 304897
11550C04897Q323K50886N0818l44691j88461J83747K34376j60008k4276J05531
$$ 304897 313220 564106 614924 270233 81772 265519 499895 339887 315611 421142
11540D21142o9282m70546l97211m7566K16659k7961J2105j00185m02006P393K98469
$$ 421142 351860 -118686 -515897 -563463 -346804 -374765 -362660 -462845 -864851 -857458 -558989
11529e58989J65667o1077m8748L3641R1805k12921n3420J10929j0857J98983M4341
$$ -558989 -393322 -454399 -503147 -469506 -377701 -590622 -644042 -533113 -543970 -344987 -300646
11518c00646M2955j03802j48217J47232N05165K16857p2202k95460L0872r7416
$$ -300646 -257691 -361493 -509710 -362478 142687 359544 287342 -8118 22754 -74662
11508g4662j59892M65476O07619J96702j44509j78626j48472n2683k95302p1625
$$ -74662 -234554 230922 838541 1035243 890734 712108 563636 510953 215651 144026
11498A44026L75763J73759n1709k66840J04199K62916l10112k68798q5188P1063
$$ 144026 519789 693548 641839 374999 479198 742114 432002 163204 78016 149079
11488A49079K3437j51403J26878Q5785m90327n57793j0290L69180N0455K71702
$$ 149079 172516 21113 147991 233776 -256551 -814344 -824634 -455454 -404999 -133297
11478a33297N21493J79890M908P101J13770J94171l643K1735J42927l0655m78051
$$ -133297 388196 568086 572994 580095 693865 888036 884393 906128 1049055 1018400 540349
11467E40349p00643o1053J8141l79573k47523N2903K77911K36670l4481J99640
$$ 540349 -160294 -221347 -203206 -582779 -830302 -777399 -499488 -262818 -297299 -97659
11457i7659M21023J77452M3084N512k961j87437j18876j81582l29228k94622n28822
$$ -97659 323364 500816 543900 549412 546451 359014 240138 58556 -270672 -565294 -1094116
11446a094116l3146M45194N07381L32273L20083L52899J85661j87720j59773j78456
$$ -1094116 -1127262 -682068 -174687 157586 477669 830568 1016229 828509 668736 490280
11436D90280n1228q7886L94717M10877K4610n4075j41679j02017n3986k2504l38210
$$ 490280 439052 351166 745883 1156760 1181370 1127295 985616 883599 829613 807109 468899
11425D68899k92687Q9208P2991K71662N6232l40889k01471J63945K10725m20558
$$ 468899 176212 265420 338411 610073 666305 325416 123945 287890 498615 78057
11415G8057j10677J98151J1593j83899k8477L91562J0561l57295r7343O6216K82019
$$ 78057 -32620 165531 177124 -6775 -35252 356310 366871 9576 -87767 -21551 260468
11404B60468K38828K46739p3438k99739j77931P8941O7906q6487M9560j0475j90489
$$ 260468 499296 746035 672597 372858 194927 273868 341774 255287 304847 294372 103883
11393A03883k13439K96236K20817k21483q6640j52232l84984o26154j31038L40675
$$ 103883 -109556 186680 407497 186014 99374 -52858 -437842 -1063996 -1195034 -854359
11383h54359K80146o8410j22964R8429K43089N9007o7449K08910L13829K02515
$$ -854359 -574213 -642623 -765587 -667158 -424069 -365062 -432511 -223601 90228 292743
11373B92743J51829o6255k49255k87871j8331q7956L08046N14912M43988J72135
$$ 292743 444572 378317 129062 -158809 -177140 -265096 42950 557862 1001850 1173985
11363A173985j3248k97515m06080l32277J6831J48726l07841k21516J79280J48452
$$ 1173985 1160737 863222 457142 124865 141696 290422 -17419 -238935 -59655 88797
11353H8797p0890N5224q2912k85370j60098L00115M77956J57073k65604n4393
$$ 88797 17907 73131 -9781 -295151 -455249 -155134 322822 479895 214291 159898
11343A59898K16654M7430l46290o16477R7773K54868J4047L00516L51809J9662
$$ 159898 376552 423982 77692 -538785 -441012 -186144 -172097 128419 480228 499890
11333D99890k24594l24319L2759n628K53665J23350k71903q1591L07885J82463
$$ 499890 275296 -49023 -16264 -21892 231773 355123 83220 1629 309514 491977
11323D91977j15871k89766n23098j95075L29334L61807N0128j61284M8004K75284
$$ 491977 376106 86340 -436758 -631833 -302499 59308 109436 -51848 -3844 271440
11313B71440L3469k98804k66841k3263j13876l6712J44220N7760j07091J89046
$$ 271440 304909 6105 -260736 -283999 -397875 -434587 -290367 -232607 -339698 -150652
11303a50652L41498K68497r21J10843J91136P9400n084l46867k81473J83916K04802
$$ -150652 190846 459343 458422 569265 760401 839801 834717 487850 206377 390293 595095
11292E95095k70561l81911j20102k36490n6597J26682R9m0947o3250K50275L07437
$$ 595095 324534 -57377 -177479 -413969 -470566 -343884 -343785 -384732 -447982 -197707 109730
11281A09730K3239j64792j07793J00534J36745K40178j18726l09949N8412j72477
$$ 109730 132969 -31823 -139616 -39082 97663 337841 219115 -90834 -32422 -204899
11271b04899k44200k15613j00107J21939L59858K78820R3340O3577l4877k24833
$$ -204899 -449099 -664712 -764819 -642880 -283022 -4202 89138 152715 117838 -106995
11261a06995j49896Q2615M1590j39004Q4485M56098K82881K45890o2770l2408
$$ -106995 -256891 -174276 -132686 -271690 -187205 268893 551774 797664 734894 702486
11251G02486K17953M2530m08973l61671k19001K7248K3423k05195K12982L9022
$$ 702486 920439 962969 553996 192325 -26676 572 23995 -181200 31782 70804
11241G0804m02551k07775J18542L0837l7876j86816o9534L20422O51573N70091
$$ 70804 -331747 -539522 -420980 -390143 -428019 -614835 -684369 -363947 287626 857717
11231H57717K70478K341j62870n7758j45085j49609j34819j50516m41356p4519
$$ 857717 1128195 1130536 967666 909908 764823 615214 480395 329879 -111477 -185996
11221a85996J53696J67759K50460R3066j25515n7025L04840m8007n95214k17620
$$ -185996 -32300 135459 385919 478985 353470 296445 601285 553278 -41936 -259556
11211b59556J04366l0021j35947k23663L1391N09577O50555j6940k63928l24257
$$ -259556 -155190 -185211 -321158 -544821 -513430 -3853 646702 629762 365834 41577
11201D1577j9556J8376k53231l45896j89275p3512L5103K19066K56836J98033
$$ 41577 22021 40397 -212834 -558730 -748005 -821517 -786414 -567348 -310512 -112479
11191a12479k56365r2857L17628K97504J03316k94295m70785k55658j53194M9127
$$ -112479 -368844 -461701 -144073 153431 256747 -37548 -508333 -763991 -917185 -868058
11181h68058L11567K20585o8921j2135K64375m48442l22314M52867M65311J55090
$$ -868058 -556491 -335906 -404827 -416962 -152587 -601029 -923343 -470476 -5165 149925
11171A49925j15924k71191l35882k9172L63388K45097p5839m69715l68372L03290
$$ 149925 34001 -237190 -573072 -602244 -238856 6241 -69598 -539313 -907685 -604395
11161f04395N44928N9536k65684l7876Q5459K71242M3640k47728l56321k09966
$$ -604395 -59467 69 -265615 -303491 -218032 53210 96850 -150878 -507199 -717165
11151g17165k40487M2988M16135J54850J73462K08790J39173K90108N4906k14147
$$ -717165 -957652 -914664 -498529 -343679 -170217 38573 177746 467854 522760 308613
11141C08613m57759j12374J13494N854q9930k63862N6057N84743K94322m38790
$$ 308613 -149146 -261520 -148026 -142172 -232102 -495964 -439907 144836 439158 368
11131C68m33813R364J16807K48218j1162j32118l24707j30934m5343k31061j46970
$$ 368 -433445 -424081 -307274 -59056 -70218 -202336 -527043 -657977 -703320 -934381 -1081351
11120a081351J58489K82464M99177K89025O1017J70971J39479K17906P6617j08400
$$ -1081351 -922862 -640398 -141221 147804 208821 379792 519271 737177 813794 705394
11110G05394n4539j55767k09005o713j02695j27383J70025K35561J03914K06521
$$ 705394 650855 495088 286083 279370 176675 49292 219317 454878 558792 765313
11100G65313K18989P014j41497j79481l99605j51522L81866J32258k43497k46323
$$ 765313 984302 991316 849819 670338 270733 119211 501077 633335 389838 143515
11090A43515k95816k10673J5330L43726M82697R6879l02331k76999j89954j30974
$$ 143515 -152301 -362974 -347644 -3918 478779 575658 273327 -3672 -193626 -324600
11080c24600J42089K5063K74692O388k88762l29302r8512L35988L23305J75199
$$ -324600 -182511 -157448 117244 123632 -165130 -494432 -592944 -256956 66349 241548
11070B41548K3441O7774q5714l24086k45674R4337L87809J41897K18040L0845
$$ 241548 264989 332763 247049 -77037 -322711 -228374 159435 301332 519372 550217
11060E50217k78338j02446K09127m1755n28143k71261L47851K60613M1030P7161
$$ 550217 271879 169433 378560 336805 -191338 -462599 -114748 145865 186895 264056
11050B64056j76415l82856m09174k96860j96182K37744M95182L45208K08585J73419
$$ 264056 87641 -295215 -704389 -1001249 -1197431 -959687 -464505 -119297 89288 262707
11040B62707L21250L12929m82450n26173j66105K16406L93167J05046j52469K0623
$$ 262707 583957 896886 414436 -111737 -277842 -61436 331731 436777 284308 304931
11030C04931l2250k82848l6754M6075l44232K09683K52289n2636k6668l9987k19306
$$ 304931 272681 -10167 -46921 -846 -345078 -135395 116894 64258 37590 -2397 -221703
11019b21703k80103n4039o855j13544J16458O5191L70045M76166j59144n73361
$$ -221703 -501806 -555845 -562700 -676244 -559786 -494595 -124550 351616 192472 -380889
11009c80889l95043k77069k86457j54186J46157L88421L07806K44013L94511K97706
$$ -380889 -775932 -1053001 -1339458 -1493644 -1347487 -959066 -651260 -407247 -12736 284970
10999B84970l14454l65822j40410p0165J40948K49404J29811K41774K71210mM1393
$$ 284970 -29484 -395306 -535716 -605881 -464933 -215529 -85718 156056 427266 427262 468655
10988D68655j49831m39574n10569l0291J64896O2539J74206J55455K6522J3378
$$ 468655 318824 -120750 -631319 -661610 -496714 -434175 -259969 -104514 -77992 -64614
10978f4614J82474J7560l04182j16061m3802k89065j06291N39415M17322J39349
$$ -64614 117860 135420 -168762 -284823 -328625 -617690 -723981 -184566 232756 372105
10968C72105o220l91846r0534K15982k70529l29669K58715M48266K42495k85649
$$ 372105 365885 -25961 -116495 99487 -171042 -500711 -241996 206270 448765 163116
10958A63116j40617j87165j04294Q6403j5815R7775J76579L10182n266j06392
$$ 163116 22499 -164666 -268960 -182557 -198372 -100597 75982 386164 380898 274506
10948B74506k04453k98968r6477J18089J84512L82522j2794M181j07641l75131
$$ 274506 70053 -228915 -325392 -207303 -22791 359731 346937 351118 243477 -131654
10938a31654j56576k0734J73802J99477J0968k42287j4190M25305J53842j62751
$$ -131654 -288230 -308964 -135162 64315 75283 -167004 -181194 244111 397953 235202
10928B35202j47556K46001K51248m5991j74062l83554k89881J51143Q8494j44431
$$ 235202 87646 333647 584895 538904 364842 -18712 -308593 -157450 -68956 -213387
10918b13387J7703N1225K31340m1495k07126p1504j29731O4909J53790L14910
$$ -213387 -195684 -144459 86881 45386 -161740 -233244 -362975 -298066 -144276 170634
10908A70634O07811M90970K63296l57445r5786k18j32397k56164k41000j58904
$$ 170634 778445 1269415 1532711 1175266 1079480 1079262 946865 690701 449701 290797
10898B90797l13294k3995K41926J48404k7828l26059O1562O1536k66249r5523
$$ 290797 -22497 -46492 195434 343838 316010 -10049 51513 113049 -153200 -248723
10888b48723K25119K52466J38148L6956J74784J78688L3689n21914n41069j30106
$$ -248723 -23604 228862 367010 403966 578750 757438 791127 269213 -271856 -401962
10878d01962n2479k05087P8079J15994J28936J42827r2092L2863J02893L6233
$$ -401962 -454441 -659528 -581449 -465455 -336519 -193692 -285784 -252921 -150028 -113795
10868a13795P6880J30625m0529p6078k30439n4143L63297L84677p7108m51057
$$ -113795 -36915 93710 53181 -22897 -253336 -307479 55818 440495 363387 -87670
10858h7670j80245o7297l10654K02851N14209L12800m6687j91305k35696k16626
$$ -87670 -267915 -335212 -645866 -443015 71194 383994 337307 146002 -89694 -306320
10848c06320l5946Q9060L4605Q2088J05160k11527K20160M58756J94755r9791
$$ -306320 -342266 -253206 -218601 -136513 -31353 -242880 -22720 436036 630791 531000
10838E31000R7729K64374O190P5498j3904k43657n25512o21212j80559K42877
$$ 531000 628729 893103 899293 974791 960887 717230 191718 -429494 -610053 -367176
10828c67176L45434Q0826Q0034K06240j42595m02694l59386L2067K62845J69655
$$ -367176 -21742 59084 139118 345358 202763 -199931 -559317 -527250 -264405 -94750
10818i4750j70561l04327K41799N26790J62298k47803J1861L25692K32077J02903
$$ -94750 -265311 -569638 -327839 198951 361249 113446 125307 450999 683076 785979
10808G85979m42297j74908Q7163k8652K8880K3396j40473k35331j50088o2311
$$ 785979 343682 168774 255937 227285 256165 279561 139088 -96243 -246331 -308642
10798c08642r5511k80408j8236K89338M13980J80826j24611k12654m5273L71963
$$ -308642 -404153 -684561 -702797 -413459 521 181347 56736 -155918 -201191 170772
10788A70772M06290R9737j11437k15840q2740J7555R5278K92322Q9575n7116m2270
$$ 170772 577062 676799 565362 349522 266782 284337 379615 671937 761512 704396 662126
10777F62126L6322L4028J56842k53996n33594j74001J58954K41492J9691P2218
$$ 662126 698448 732476 889318 635322 101728 -72273 86681 328173 347864 420082
10767D20082K94351j5598m20410k63382L7976j804K29706J61746j10715k71213
$$ 420082 714433 698835 278425 15043 53019 51215 280921 442667 331952 60739
10757F0739l06893l58764k1307J35403J18357L73457J26259R8238L492j59834
$$ 60739 -246154 -604918 -626225 -490822 -372465 992 127251 225489 228981 69147
10747F9147k06860j8277K64555M32704K10563l18984k69540m3162K03526K39433
$$ 69147 -137713 -155990 108565 541269 751832 432848 163308 120146 323672 563105
10737E63105M6077j2781k1680j61747m68215L6837K82782P3783o0072j70329o4579
$$ 563105 609182 596401 574721 412974 -55241 -18404 264378 338161 278089 107760 43181
10726D3181J70223J68099K71662k07593k03467j07094l69488l25833k74808j26789
$$ 43181 213404 381503 653165 445572 242105 135011 -234477 -560310 -835118 -961907
10716i61907M87716O32958R6513l36436j21529J98777L04662P4701k28889k13623
$$ -961907 -474191 158767 255280 -81156 -202685 -3908 300754 375455 146566 -67057
10706f7057r1527J47892J00337M5888l83154m32736k60930J43710L64760L07436
$$ -67057 -158584 -10692 89645 135533 -247621 -680357 -941287 -797577 -432817 -125381
10696a25381J39351n427j98753j67793K49623M24661K71331j48620j60015o3694
$$ -125381 13970 8543 -190210 -358003 -108380 316281 587612 438992 278977 215283
10686B15283j65436r0377r782J6809K36013O6237j77759q9700k39550j71879N1160
$$ 215283 49847 -40530 -50312 -33503 202510 268747 90988 1288 -238262 -410141 -358981
10675c58981k16381j19964J29395J07074N6786k05119l25012r4369L75716J87333
$$ -358981 -575362 -695326 -565931 -458857 -402071 -607190 -932202 -1026571 -650855 -463522
10665d63522J916j0064L19843j65039l03957j31388k56361p5495J73481R6415
$$ -463522 -461606 -471670 -151827 -316866 -620823 -752211 -1008572 -1084067 -910586 -814171
10655h14171K40850M20074L37959K31359j18868k60710j13578J35942J02369k54659
$$ -814171 -573321 -153247 184712 416071 297203 36493 -77085 58857 161226 -93433
10645i3433j38356K00504l0675K23253K81032J9463k63786n41411k38201J39880
$$ -93433 -231789 -31285 -61960 161293 442325 461788 198002 -343409 -581610 -441730
10635d41730J25260k27984k07771R6824J93107N9639j85966j79316j6735Q4480
$$ -441730 -316470 -544454 -752225 -655401 -462294 -402655 -588621 -767937 -784672 -700192
10625g00192M6454K34882K56711J64610N36107N55314L13976O53817L26965q12665
$$ -700192 -653738 -418856 -162145 2465 538572 1093886 1407862 2061679 2388644 1575979
10615A575979j127573o70922n64855j93965K25010K19357J08701P5547J90096
$$ 1575979 448406 -222516 -787371 -981336 -756326 -536969 -428268 -352721 -162625
10606a62625K42390j36185k11536l70818l58386q9319L9155J92768M10669M41598
$$ -162625 79765 -56420 -267956 -638774 -997160 -1086479 -1047324 -854556 -443887 -2289
10596b289k24603p29716k94720M1479R6619M63335L28096K01395K92700P8059
$$ -2289 -226892 -956608 -1251328 -1209849 -1113230 -649895 -321799 -120404 172296 250355
10586B50355m24096l90212j39289K53714K97875j75448j76075K3612K66950N2814
$$ 250355 -173741 -563953 -703242 -449528 -151653 -327101 -503176 -479564 -212614 -159800
10576a59800l06134J61657N87718M13269K22136L06798l00044q62583m58042k75448
$$ -159800 -465934 -304277 283441 696710 918846 1225644 925600 63017 -395025 -670473
10566f70473m43310j43068J40863K33293K13952K47206Q5983J94004J93087m8033
$$ -670473 -1113783 -1256851 -1115988 -882695 -668743 -421537 -335554 -141550 51537 3504
10556C504j07435K21270J30430L2075j42349r4968J90447R6973j15587l80821
$$ 3504 -103931 117339 247769 279844 137495 42527 232974 329947 214360 -166461
10546a66461m30481m88660l95053O9246K18546K60292M69633J14819O3709K88287
$$ -166461 -596942 -1085602 -1480655 -1411409 -1192863 -932571 -462938 -348119 -284410 3877
10536C877J85908J1797r563j98270k77042n51102m00008J99953K56604j87132
$$ 3877 189785 201582 192019 -6251 -283293 -834395 -1234403 -1034450 -777846 -964978
10526i64978R4374M47676L67035L22254P8978l59661p0133J65621n4462K09071
$$ -964978 -870604 -422928 -55893 266361 345339 -14322 -84455 81166 26704 235775
10516B35775L95024N627j76512j08042j04429K964L08561L38961m9191l08068
$$ 235775 630799 636426 459914 351872 247443 250407 558968 897929 848738 540670
10506E40670l66274o1388K19481m70837k70133o895K5471L43990K75169n3868
$$ 540670 174396 113008 332489 -138348 -408481 -415376 -389905 -45915 229254 175386
10496A75386m6092k21880N8919L70852L56101o4558l72386k59229j78577J93106
$$ 175386 129294 -92586 -33667 337185 693286 628728 256342 -2887 -181464 11642
10486A1642K11718j43347k41589j44705m2074P3443K67600K51048j24704j01001
$$ 11642 223360 80013 -161576 -306281 -348355 -274912 -7312 243736 119032 18031
10476A8031M8638L68661L28844P8138M3063k29252m57140j41338l4414k56661
$$ 18031 66669 435330 764174 842312 885375 656123 198983 57645 23231 -233430
10466b33430n01361k40516m8478J6583K80386M64259J18161J61035J81524R4162
$$ -233430 -734791 -975307 -1023785 -1007202 -726816 -262557 -144396 16639 198163 292325
10456B92325K54777J57727j17953k03483l09956k55990L3821J13166j95493J88859
$$ 292325 547102 704829 586876 383393 73437 -182553 -148732 -35566 -231059 -42200
10446d2200M88553R3389k0577l00742m08642l17153J61756J38028K27003k00964
$$ -42200 446353 539742 519165 218423 -190219 -507372 -345616 -207588 19415 -181549
10436a81549n85909m42984o7114K99347K45315K59028o1073j88156J54757J63891
$$ -181549 -767458 -1210442 -1277556 -978209 -732894 -473866 -534939 -723095 -568338 -404447
10426d04447n5190l8459J4741m18137m19720J67054L99572L13216k3310l98797
$$ -404447 -459637 -498096 -483355 -901492 -1321212 -1154158 -754586 -441370 -464680 -863477
10416h63477l46247L39383O36491M13424j96109l16601K53691K84277J1945o2883
$$ -863477 -1209724 -870341 -233850 179574 -16535 -333136 -79445 204832 216777 153894
10406A53894J3400N936m8221m8251k43654j93741J34186J91389K55681J31940
$$ 153894 167294 173230 125009 76758 -166896 -360637 -226451 -35062 220619 352559
10396C52559j2555K62137K60044j43327n98823k66263J68698n9820k01785N5927
$$ 352559 340004 602141 862185 718858 120035 -146228 22470 -37350 -239135 -183208
10386a83208J31837J54788L15236J2190j16190J4819n2901L5250J03701j91930
$$ -183208 -51371 103417 418653 430843 314653 329472 276571 311821 415522 223592
10376B23592m20638j4823L10377J02848n55683q31992l91731j13590M75126M89246
$$ 223592 -197046 -211869 98508 201356 -354327 -1186319 -1578050 -1691640 -1216514 -727268
10366g27268J75541K29866p082j76084l08955J7622J0012J6280K21703j86097
$$ -727268 -551727 -321861 -328943 -505027 -813982 -796360 -786348 -770068 -548365 -734462
10356g34462q9391j1963j3060J90168q3139j69622Q7683O35124N04675L76126
$$ -734462 -823853 -835816 -848876 -658708 -741847 -911469 -823786 -188662 316013 692139
10346F92139J3880l99701k54431J39251L28140J40975J14058p5184k27436j92104
$$ 692139 706019 306318 51887 191138 519278 660253 774311 699127 471691 279587
10336B79587m0711J53971L72434p2686n01266n74634n90068l5919K00391J53181
$$ 279587 238876 392847 765281 692595 191329 -383305 -973373 -1009292 -808901 -655720
10326f55720L38699J93335j11555k70465m72555j5011N13987L78426J62526r6286
$$ -655720 -317021 -123686 -235241 -505706 -978261 -993272 -479285 -100859 61667 -34619
10316c4619k86960j6524j24783m96603k18185L80440K49106k03831j64252K52146
$$ -34619 -321579 -338103 -462886 -959489 -1177674 -797234 -548128 -751959 -916211 -664065
10306f64065o8774k20886L0370K1143L9225K34306J13978j33126j04623Q8741
$$ -664065 -732839 -953725 -923355 -902212 -862987 -628681 -514703 -647829 -752452 -663711
10296f63711N3797k80709n2867O4178K17191O9634M2166N9083m5344j54694J1687
$$ -663711 -609914 -890623 -943490 -879312 -662121 -592487 -550321 -491238 -536582 -691276 -679589
10285f79589K31082J02892O8076P3846j65188K12544J61378r8969k10469j19186
$$ -679589 -448507 -345615 -277539 -203693 -368881 -156337 5041 -93928 -304397 -423583
10275d23583K67588N36967K95196j24994k07701j40334r8624J6892K15856k42782
$$ -423583 -155995 380972 676168 551174 343473 203139 104515 121407 337263 94481
10265I4481k39241j34033j21615Q6405J29786k36787n57172l48553k0155J77028
$$ 94481 -144760 -278793 -400408 -314003 -184217 -421004 -978176 -1326729 -1346884 -1169856
10255a169856L23370K49787L95862K12894J04001j70786j58062M2500K12645J18722
$$ -1169856 -846486 -596699 -200837 12057 116058 -54728 -212790 -170290 42355 161077
10245A61077m11863l05161j98990j29632N4840J31438n910R9376J39795j59945
$$ 161077 -250786 -555947 -754937 -884569 -829729 -698291 -704201 -604825 -465030 -624975
10235f24975j43701J421q3251p8376j16117r4983l0476J39463L92405K03276r7909
$$ -624975 -768676 -767255 -850506 -928882 -1044999 -1139982 -1170458 -1030995 -638590 -435314 -533223
10224e33223N0717J29627M3953j81930k79354k66881O9083K30146J76373L31110
$$ -533223 -482506 -352879 -308926 -490856 -770210 -1037091 -968008 -737862 -561489 -230379
10214b30379M07754L70852J0823k72000J20607O8258n576L4766n0564J2265K0620
$$ -230379 177375 548227 559050 287050 407657 475915 470339 505105 454541 466806 487426
10203D87426j66772Q0607o8863m42137m70042J01564K24805L1312J03764k20277
$$ 487426 320654 401261 332398 -109739 -579781 -478217 -253412 -222100 -118336 -338613
10193c38613r4553J57841M4483j98516J49482j82584k22634N8887M33809M64299
$$ -338613 -433166 -275325 -230842 -429358 -279876 -462460 -685094 -626207 -192398 271901
10183B71901Q7948k82803k72599j93405J32759O23903J08429k56003q185j26317
$$ 271901 359849 77046 -195553 -388958 -256199 367704 476133 220130 211945 85628
10173H5628k60700J82729L16484J16543Q2067l38056k33018q5110l93353j94025
$$ 85628 -175072 7657 324141 440684 522751 184695 -48323 -133433 -526786 -720811
10163g20811m3252J62880K53511K5884M7827j40426k74800j12481J32593J31847
$$ -720811 -764063 -601183 -347672 -321788 -273961 -414387 -689187 -801668 -669075 -537228
10153e37228N3579K8503M32327N86985J87370k25465n03956k34429r6066r1756
$$ -537228 -483649 -455146 -22819 564166 751536 526071 22115 -212314 -308380 -400136
10143d00136m0269K39328J94293j94800k64791J02505J32123L68k42031l56786
$$ -400136 -440405 -201077 -6784 -201584 -466375 -363870 -231747 -231379 -473410 -830196
10133h30196P8928M28808J47716j1526J13633n8304j99389q7072n4314q7582J01881
$$ -830196 -751268 -322460 -174744 -186270 -72637 -130941 -330330 -417402 -471716 -559298 -457417
10122d57417J65108R8374J01627K26809K69749q2265r9492l83512o4485K25987
$$ -457417 -292309 -193935 -92308 134501 404250 321985 222493 -161019 -225504 483
10112D83j8649K5838K1616k65880q4784R8620l75582j55542K88496L12080Q7981
$$ 483 -18166 7672 29288 -236592 -321376 -222756 -598338 -753880 -465384 -153304 -65323
10101f5323M7068m8870k19145l80193l58714M7267L65790J86361K81769K75135
$$ -65323 -18255 -67125 -286270 -666463 -1025177 -977910 -612120 -425759 -143990 131145
10091A31145K67074L53395o62q5186K22288Q2210k07882k22028r1025j4560n9079
$$ 131145 398219 751614 750952 665766 888054 970264 762382 540354 449329 434769 375690
10080C75690j88400m14074k46109K16583J14844k16398J23322K20787j87765k95517
$$ 375690 187290 -226784 -472893 -256310 -141466 -357864 -234542 -13755 -201520 -497037
10070d97037p8745K51447M04834J94186M11170M39354k15805m63135j00657K31239
$$ -497037 -575782 -324335 80499 274685 685855 1125209 909404 446269 345612 576851
10060E76851q6969j24169J30868Q3087O0187O07791M10997l26941m85304j27434
$$ 576851 489882 365713 496581 579668 639855 1247646 1658643 1331702 846398 718964
10050G18964j5090p5970J51657J95644M4740o3390l16527p25384o00697j79804
$$ 718964 703874 627904 779561 975205 1019945 956555 640028 -85356 -686053 -865857
10040h65857j31513J79059O0717j53872j34598O3213J80160K36085K13704n8553
$$ -865857 -997370 -818311 -757594 -911466 -1046064 -982851 -802691 -566606 -352902 -411455
10030d11455q8561L876J59317L4355j4733K03517J83809l11620k87753k95213
$$ -411455 -500016 -496140 -336823 -302468 -317201 -113684 70125 -241495 -529248 -824461
10020h24461k76137j18520K32804J81981K80575L40084J51793j30843R1948K05502
$$ -824461 -1100598 -1219118 -986314 -804333 -523758 -183674 -31881 -162724 -70776 134726
10010A34726r2581j34738j67062m0347j5863Q8049J445k10740l29032j54265J56753
$$ 134726 42145 -92593 -259655 -300002 -315865 -227816 -226371 -437111 -766143 -920408 -763655
9999g63655K30770M50318K83588q7294q1096J36400K83339J29346p6714j2782
$$ -763655 -532885 -82567 201021 113727 32631 169031 452370 581716 505002 492220
9989D92220o4419l61064l09828j72361k04440J23762J09130K76490N26235M61063
$$ 492220 427801 66737 -243091 -415452 -619892 -496130 -387000 -110510 415725 876788
9979H76788l90711m12364j5158r8421j38916l72455k7842M32747L23351k2988
$$ 876788 486077 73713 58555 -39866 -178782 -551237 -579079 -146332 177019 154031
9969A54031J74957K5849k07975m33417m00001k11261J22290K61580M85546M34999
$$ 154031 328988 354837 146862 -286555 -686556 -897817 -775527 -513947 -28401 406598
9959D06598J65710R5909o543j41391m3957Q6022K3321j01757j91065n24402o14352
$$ 406598 572308 668217 661674 520283 476326 562348 585669 483912 292847 -231555 -845907
9948h45907k8851M51052L73587k4628J12715N18291N29972j64761m58273P3018
$$ -845907 -874758 -423706 -50119 -74747 37968 556259 1086231 921470 463197 536215
9938E36215J44550k51580j66305j2578l5208p9802j11291k25030J15402K51120
$$ 536215 680765 429185 262880 250302 215094 135292 24001 -201029 -85627 165493
9928A65493j63636j29824J80484M05643J32183o4685p3242k66846J75789M24351
$$ 165493 1857 -127967 52517 458160 590343 525658 452416 185570 361359 785710
9918G85710l4960k94207l23322k20554k02458L44716M69618K71070j80810m29720
$$ 785710 750750 456543 133221 -87333 -289791 54925 524543 795613 614803 185083
9908A85083m89528j61206J60315J0534P5358P7507k19363j91179L06258M50083
$$ 185083 -304445 -465651 -305336 -294802 -219444 -141937 -361300 -552479 -246221 203862
9898B03862K71854k11948k25298J26214j04431j90231K34797J85298K03129Q8824
$$ 203862 475716 263768 38470 164684 60253 -129978 104819 290117 493246 582070
$$ [...]
##END NTUPLES=NMR SPECTRUM
##END=
