##TITLE=C13_SAV-64(AcCl-8)
 CDCl3, 22400 sc

 2.3.2020
##JCAMPDX= 6.0         $$ Bruker NMR JCAMP-DX V2.0
##DATA TYPE= NMR SPECTRUM
##DATA CLASS= NTUPLES
##ORIGIN= UXNMR, Bruker Analytische Messtechnik GmbH
##OWNER= root
$$ XWIN-NMR		Version 3.5
$$ Tue Mar  3 13:41:52 2020 Russian Standard Time (UT+4h)  she@DPX200
##.OBSERVE FREQUENCY= 50.327896
##.OBSERVE NUCLEUS= ^13C
##.ACQUISITION MODE= SIMULTANEOUS
##.ACQUISITION SCHEME= undefined
##.AVERAGES= 18830
##.DIGITISER RES= 17
##SPECTROMETER/DATA SYSTEM= spect
##.PULSE SEQUENCE= zgpg30
##.SOLVENT NAME= D2O
##.SHIFT REFERENCE= (INTERNAL, D2O, 0, 222.624)
##AUDIT TRAIL= $$ (NUMBER, WHEN, WHO, WHERE, WHAT)
$$ ##TITLE= Audit trail, XWIN-NMR		Version 3.5
$$ ##JCAMPDX= 5.01
$$ ##ORIGIN= Bruker BioSpin GmbH
$$ ##OWNER= she
$$ F:/spectra/data/she/nmr/c13/1/pdata/1/auditp.txt
$$ ##AUDIT TRAIL=  $$ (NUMBER, WHEN, WHO, WHERE, WHAT)
(   1,<2020-03-03 10:38:15.20 +0400>,<she>,<DPX200>,
      <created by zg, POWCHK disabled, PULCHK disabled
       terminated by command 'halt'
       configuration hash MD5:
       00 E9 B6 7A A2 85 ED C7 34 08 36 98 17 FE 4E 26
       data hash MD5: 32K
       69 99 F9 A0 29 4D A1 26 2E 6D 82 9A 45 BC D6 5E>)
(   2,<2020-03-03 13:39:55.26 +0400>,<she>,<DPX200>,
      <Start of raw data processing
       efp BC_mod = 2 LB = 1 FT_mod = 6 PKNL = 1 PHC0 = -215.5619 PHC1 = 27.80638 SI = 32K 
       data hash MD5: 32K
       2E AB D8 33 DB 20 18 0A F4 82 DC 96 B3 C6 80 AE>)
(   3,<2020-03-03 13:39:57.65 +0400>,<she>,<DPX200>,
      <abs ABSG = 5 
       data hash MD5: 32K
       B6 E2 77 CB 31 11 84 D6 3D FB 16 C1 C4 55 D0 B8>)
(   4,<2020-03-03 13:40:19.59 +0400>,<she>,<DPX200>,
      <abs ABSG = 5 
       data hash MD5: 32K
       06 A6 6C 34 1F 8A 7D 36 6C E7 9B 16 E6 BA 6C 37>)
(   5,<2020-03-03 13:40:42.04 +0400>,<she>,<DPX200>,
      <abs ABSG = 5 
       data hash MD5: 32K
       C2 1A 00 B9 2A 83 4A DE 9E 59 BF B7 B2 05 93 8C>)
(   6,<2020-03-03 13:41:03.70 +0400>,<she>,<DPX200>,
      <pk PHC0 = 0.6598971 PHC1 = 0 
       data hash MD5: 32K
       47 29 D0 23 E4 78 65 8A 8F 89 31 FF B2 67 ED C0>)
(   7,<2020-03-03 13:41:06.70 +0400>,<she>,<DPX200>,
      <abs ABSG = 5 
       data hash MD5: 32K
       5D A2 28 DA 00 13 4B 72 E7 69 A2 15 28 61 4A CC>)
$$ ##END=
$$ 
$$ hash MD5
$$ 1B D1 03 7B 85 C4 75 42 12 E9 6A 9E 78 D0 53 80
##$RELAX= 
##$RELAX= 
##$RELAX= 
##$RELAX= 
##$RELAX= 
##$RELAX= 
##$RELAX= 
##$RELAX= 
$$ Bruker specific parameters
$$ --------------------------
##$DU= <F:/spectra>
##$EXPNO= 1
##$NAME= <c13>
##$PROCNO= 1
##$TYPE= <nmr>
##$USER= <she>
##$AMP= (0..31)
100 100 100 100 100 100 100 100 100 100 100 100 100 100 100 100 100 100 
100 100 100 100 100 100 100 100 100 100 100 100 100 100 
##$AQSEQ= 0
##$AQ_mod= 1
##$AUNM= <au_zg>
##$AUTOPOS= <>
##$BF1= 50.322709
##$BF2= 200.13
##$BF3= 50.322709
##$BF4= 500.13
##$BF5= 500.13
##$BF6= 500.13
##$BF7= 500.13
##$BF8= 500.13
##$BYTORDA= 1
##$CFDGTYP= 0
##$CFRGTYP= 5
##$CHEMSTR= <none>
##$CNST= (0..31)
$$ [...]
##$SUBNAM4= <"">
##$SUBNAM5= <"">
##$SUBNAM6= <"">
##$SUBNAM7= <"">
##$SUBNAM8= <"">
##$SUBNAM9= <"">
##$SW= 239.972175391363
##$SWIBOX= (0..15)
0 1 3 0 0 0 0 0 0 0 0 0 0 0 0 0 
##$SW_h= 12077.2946859903
##$TD= 32768
##$TD0= 1
##$TE= 0
##$TE2= 300
##$TE3= 300
##$TEG= 300
##$TL= (0..7)
120 120 120 120 120 120 120 120 
##$TP= (0..7)
150 150 150 150 150 150 150 150 
##$TP07= 0
##$TPNAME0= <>
##$TPNAME1= <>
##$TPNAME2= <>
##$TPNAME3= <>
##$TPNAME4= <>
##$TPNAME5= <>
##$TPNAME6= <>
##$TPNAME7= <>
##$TPOAL= (0..7)
0.5 0.5 0.5 0.5 0.5 0.5 0.5 0.5 
##$TPOFFS= (0..7)
0 0 0 0 0 0 0 0 
##$TUNHIN= 0
##$TUNHOUT= 0
##$TUNXOUT= 0
##$USERA1= <user>
##$USERA2= <user>
##$USERA3= <user>
##$USERA4= <user>
##$USERA5= <user>
##$V9= 5
##$VALIST= <valist>
##$VCLIST= <CCCCCCCCCCCCCCC>
##$VD= 0
##$VDLIST= <DDDDDDDDDDDDDDD>
##$VPLIST= <PPPPPPPPPPPPPPP>
##$VTLIST= <TTTTTTTTTTTTTTT>
##$WBST= 1024
##$WBSW= 4
##$XGAIN= (0..3)
0 0 0 0 
##$XL= 0
##$YL= 0
##$YMAX_a= 27310715
##$YMIN_a= -113073101
##$ZGOPTNS= <>
##$ZL1= 120
##$ZL2= 120
##$ZL3= 120
##$ZL4= 120
##$ABSF1= 222.624
##$ABSF2= -17.3728
##$ABSG= 5
##$ABSL= 3
##$ALPHA= 0
##$AQORDER= 0
##$ASSFAC= 0
##$ASSFACI= 0
##$ASSFACX= 0
##$ASSWID= 0
##$AUNMP= <proc_1d>
##$AZFE= 0.1
##$AZFW= 0.5
##$BCFW= 0
##$BC_mod= 2
##$BYTORDP= 0
##$COROFFS= 0
##$CY= -3
##$DATMOD= 1
##$DC= 0
##$DFILT= <>
##$DTYPP= 0
##$F1P= 0
##$F2P= 0
##$FCOR= 0.5
##$FTSIZE= 32768
##$FT_mod= 6
##$GAMMA= 0
##$GB= 0
##$INTBC= 1
##$INTSCL= 4.134877e-10
##$ISEN= 128
##$LB= 1
##$LEV0= 0
##$LPBIN= 0
##$MAXI= 10000
##$MC2= 0
##$MEAN= 0
##$ME_mod= 0
##$MI= 0.1934396
##$NCOEF= 0
##$NC_proc= 2
##$NLEV= 6
##$NOISF1= 120.0001
##$NOISF2= 80.00006
##$NSP= 0
##$NTH_PI= 0
##$NZP= 0
##$OFFSET= 222.624
##$PC= 1.4
##$PHC0= -214.902
##$PHC1= 27.80638
##$PH_mod= 1
##$PKNL= yes
##$PPARMOD= 0
##$PSCAL= 0
##$PSIGN= 0
##$REVERSE= no
##$SF= 50.3227315989248
##$SI= 32768
##$SIGF1= 140
##$SIGF2= 120
##$SINO= 11.81781
##$SIOLD= 32768
##$SREGLST= <13C.CDCl3>
##$SSB= 0
##$STSI= 32768
##$STSR= 0
##$SW_p= 12077.2946859903
##$SYMM= 0
##$S_DEV= 0
##$TDeff= 32768
##$TDoff= 0
##$TI= <>
##$TILT= no
##$TM1= 0
##$TM2= 0
##$TOPLEV= 0
##$USERP1= <user>
##$USERP2= <user>
##$USERP3= <user>
##$USERP4= <user>
##$USERP5= <user>
##$WDW= 1
##$XDIM= 32768
##$YMAX_p= 378592677
##$YMIN_p= -4428235
$$ End of Bruker specific parameters
$$ ---------------------------------
##NTUPLES= NMR SPECTRUM
##VAR_NAME=  FREQUENCY,     SPECTRUM/REAL,   SPECTRUM/IMAG
##SYMBOL=    X,             R,               I
##VAR_TYPE=  INDEPENDENT,   DEPENDENT,       DEPENDENT
##VAR_FORM=  AFFN,          ASDF,            ASDF
##VAR_DIM=   32768,         32768,           32768
##UNITS=     HZ,            ARBITRARY UNITS, ARBITRARY UNITS
##FACTOR=    0.368581032318806, 1,           1
##FIRST=     11203.0474431902, 0,            0
##LAST=      -874.247242800138, 0,           0
##MIN=       -874.247242800138, -4428235,    0
##MAX=       11203.0474431902, 378592677,    0
$$ Real data points
##PAGE= N=1
##DATA TABLE= (X++(R..R)), XYDATA
$$ [...]
18105 -599697 -485353 -197884 -46294 59845 215589 119371 133439 249175 104068 -215399
18095 -215399 -333841 -287904 -49589 13643 -197956 -313115 -308132 -372720 -283093 136455 395649
18084 395649 418114 157838 -273949 -414847 -241586 -77063 183646 367541 274590 231410
18074 231410 474864 902461 847557 692379 432935 211800 255619 133739 -120709 -288462
18064 -288462 -361742 -457383 -419834 -290919 104284 350330 56159 -482977 -640803 -478693
18054 -478693 -377538 -338612 -324866 -266765 -144614 -210967 -375370 -85408 193784 126856
18044 126856 -104972 -441938 -617812 -792996 -712711 -477617 -507750 -188996 58535 -135946
18034 -135946 -381412 -470896 -439579 -494084 -344118 -51669 886 -27859 -219387 -355539
18024 -355539 -302143 -411638 -486053 -649114 -585344 -110112 100798 255831 394158 404609
18014 404609 288587 16700 -286186 -342438 -322850 -332083 -353338 -517485 -404643 -61205
18004 -61205 -32340 -58862 24385 13615 74162 83909 114931 -11024 -451048 -853592 -817620
17993 -817620 -695873 -567388 -337093 -312395 -302355 164117 660260 472940 320605 528013
17983 528013 437452 405407 396513 294716 -115078 -714412 -896339 -827031 -691925 -435321
17973 -435321 18305 506806 473691 -584832 -1380274 -1323858 -1020710 -909656 -1063146 -907722
17963 -907722 -570885 -470558 -402870 -483729 -383674 -110408 -116387 109125 465376 935700
17953 935700 1186111 1558255 1844952 1731959 1583494 1347779 1099764 920084 1005927 1111023
17943 1111023 1098290 1131262 1498356 2100963 2178283 1803076 1641050 1727060 1837640 2022733
17933 2022733 2439609 3256510 4462263 6602583 9235769 12697746 17842020 25235793
17925 25235793 35668302 44921475 42548915 32032903 23116581 16756025 12400442 9448297
17917 9448297 7411095 5584731 4441678 3653190 2971075 2619736 2476098 2259347 1849471
17908 1849471 1788243 1639186 1271688 998536 663277 531562 435832 267908 208962 65907
17898 65907 -107439 -509001 -762698 -485754 -240661 -326644 -395386 -500819 -644651 -697869
17888 -697869 -288527 -35641 -21873 104774 317757 19690 -157430 -316593 -439221 -98879
17878 -98879 277538 412114 541373 430938 230118 102346 -89308 58604 469833 544169
17868 544169 423869 567429 731202 893487 867217 765337 785446 565022 505571 672964
17858 672964 624358 611748 756024 1103541 1087099 710810 261837 128372 145271 94661
17848 94661 377450 870158 813234 435312 501951 763757 327539 -44610 145229 587630
17838 587630 544901 315319 308735 178913 44378 -40311 -315734 -293824 -45543 128952
17828 128952 289651 437434 332091 61377 65800 436649 563358 717322 543802 539741
17818 539741 731263 603665 44767 -613475 -919937 -786966 -433931 -192903 -257954 -90340
17808 -90340 238522 222123 -228937 -747159 -723648 -524604 -183364 16207 113559 405642
17798 405642 832550 993762 1135752 1116160 608802 504946 885971 976681 1017192 1055265
17788 1055265 940218 542754 200466 22381 13786 -47576 -130457 -176592 -388241 -498257
17778 -498257 -532019 -338867 -136641 -4769 176102 126120 133150 342539 269082 43983
17768 43983 71997 94511 -44732 -42567 -85884 -485983 -787968 -942103 -683508 -496791 -439951
17757 -439951 134005 640709 907701 1040495 933712 914332 1123675 1107754 932956 166600
17747 166600 -780265 -822096 -621765 -547173 -460737 -347888 22685 255769 63542 -199266
17737 -199266 -730059 -777686 -434193 -386751 -791706 -1099017 -882354 -682471 -594368 -873042
17727 -873042 -1132735 -1190444 -1071255 -1048934 -646463 -159131 -253433 -401804 -144608 -63552
17717 -63552 -310555 -371775 -59611 442262 436811 644350 895897 735193 539875 212425
17707 212425 -237012 -635176 -122175 377594 267524 212321 431132 631229 580679 292576
17697 292576 2578 -370682 -843741 -995335 -758322 -526572 -446439 -561953 -564622 -171767
17687 -171767 182473 451305 556147 667771 412860 -238992 -678329 -713757 -521995 -159501
17677 -159501 126079 35081 -194116 149712 537841 244978 56018 397984 221814 -318810
17667 -318810 -805358 -723707 -464967 -606962 -864921 -864018 -917108 -895142 -627573 -602653 -342789
17656 -342789 -27914 91490 83984 85115 160796 427669 492910 640581 914485 786961 627387
17645 627387 381124 193589 302500 84120 -55455 -185617 -515055 -815088 -1172139 -1479531
17635 -1479531 -1321729 -1139173 -821771 -760717 -828072 -875247 -900869 -673314 -773104 -445584
17625 -445584 -143496 129327 293634 328463 -84760 -233179 225093 465383 400148 286528
17615 286528 170079 -158139 -210924 268172 550591 266671 -142665 -359282 -574140 -491173
17605 -491173 -323921 -598898 -816540 -950658 -1036252 -902593 -484211 -25494 309447 458504
17595 458504 37041 -140320 -61811 -81000 115711 47352 -27298 282018 525180 547431
17585 547431 961030 1320726 1198119 936637 1133997 1296609 1105039 1232524 1384551 1132886
17575 1132886 872125 636696 612629 767066 1116637 1445816 1536135 1259212 795811 489352
17565 489352 677090 900373 711742 439116 205495 86870 159980 193950 356425 201900
17555 201900 -162621 -264147 -154164 -64314 2952 153209 510026 750137 603990 491461
17545 491461 565857 594021 504045 426234 883345 1303069 1494978 1349292 830607 760029
17535 760029 792845 318533 -186520 -449720 -490579 -325830 -114476 126460 58404 -9702
17525 -9702 116263 288414 293683 -19159 -287125 -457190 -668052 -568328 -431504 -585179
17515 -585179 -899185 -954518 -583368 -68567 371671 552824 501960 693218 897409 826169
17505 826169 807138 548862 204468 67850 29135 -173173 -160444 139615 350324 370974
17495 370974 263993 226922 115863 -122602 -86037 -93505 -452189 -330744 -305051 -527770
17485 -527770 -626176 -834806 -955411 -1111155 -1140640 -1063286 -735966 -579473 -692492 -458822
17475 -458822 -91315 298272 386392 435591 215806 53845 5970 -283435 -227559 -2608
17465 -2608 -96967 -56355 107066 285943 489293 299755 -223374 -582277 -678668 -502571
17455 -502571 -552021 -815342 -795542 -157231 241788 197505 112889 218316 472306 766653
17445 766653 910555 583521 93398 158070 301714 321454 355578 648195 604460 338040
17435 338040 -163681 -399973 -384067 -507359 -463969 -190426 -26825 -205258 -240222 -50630
17425 -50630 -110234 -190684 235572 773846 1075702 1631124 1370115 753552 407204 8445
17415 8445 -227677 -398760 -166138 -5661 -571577 -1134375 -782568 -390147 -145936 336251
17405 336251 588425 250378 -146130 -401279 -376603 -364654 -601794 -790031 -962970 -811944
17395 -811944 -421471 -352808 -248423 36480 48440 -292199 -564846 -754381 -1147089 -1161777
17385 -1161777 -731930 -140978 -93061 -675969 -1007667 -962845 -838557 -797362 -1041896 -1241674
17375 -1241674 -909159 -379326 124792 398542 306842 96952 -280008 -658480 -895898 -702456
17365 -702456 -193215 -197538 -385495 -405094 -210423 67732 77895 64497 350658 412949 245177
17354 245177 57617 -67392 186708 225378 -203551 -322772 -452359 -418631 -939318 -1199478
17344 -1199478 -906299 -748475 -552377 -205069 -160736 -54594 4751 163544 403955 622818
17334 622818 887868 1094684 1196586 901501 366186 20800 -165278 -325670 -77292 464339
17324 464339 610167 177133 -91017 192573 416296 484503 525819 605190 624335 619599 483558
17313 483558 807560 1148870 865858 481245 336474 285894 560805 759328 830993 798237
17303 798237 470534 428471 568966 286153 314740 442874 572907 837368 679326 102252
17293 102252 -299638 -229838 145677 417747 246407 154063 84480 -62013 -62301 -152926 -61576
17282 -61576 456046 539054 497647 157459 -230376 -246002 -95556 53815 94908 223353
17272 223353 573234 899246 1103121 1172695 840828 104166 -152004 18980 26323 -324982
17262 -324982 -370647 -436720 -245342 180795 504383 496406 165693 -179001 -445492 -452359 -440577
17251 -440577 -420428 -435416 -363399 -35112 144146 36410 7064 -23526 -70148 -651549 -1113413
17240 -1113413 -1274210 -1052617 -812330 -698078 -275570 -28263 153175 14387 182206
17231 182206 418713 193596 100476 149243 131485 212490 277693 206952 31451 149689 125907
17220 125907 -74187 -343492 -653609 -638976 -364571 -258566 -341700 -658224 -795580 -467419
17210 -467419 -463439 -333359 74848 218561 -231519 -583492 -550476 -647273 -594684 -366500
17200 -366500 -266887 -252997 -744339 -1008475 -809629 -421556 -18879 -99981 -351707 -338016
17190 -338016 -322084 -405209 -247336 -171157 -143378 -267585 -491787 -484324 -249726 -188485 -238548
17179 -238548 -216435 -283319 -138907 198695 184043 299103 765341 844314 409545 -217657
17169 -217657 -385367 -210350 -14392 57897 128881 111363 -80406 73722 81278 -220418
17159 -220418 -501856 -131728 379232 418640 423727 195438 -211991 -290735 -491162 -469093
17149 -469093 -409072 -419976 -294047 -489601 -771457 -998509 -1047853 -902890 -508190 -234640
17139 -234640 -203319 -325749 -256567 -231270 91052 481184 398280 235636 14551 7051 41468
17128 41468 -201916 -265092 -116814 -354986 -412741 23577 425428 529338 183077 -293144
17118 -293144 -247770 360803 412979 -81653 -266079 -286715 -158941 3203 136220 164689
17108 164689 310187 502397 420076 196094 134271 238820 391382 304196 -10462 -249108
17098 -249108 13625 11554 -340288 -255648 -331090 -198787 235553 304550 153072 -79908
17088 -79908 -377030 -905625 -878158 -206135 438227 421105 67582 -245850 -481751 -760884
17078 -760884 -807188 -567993 -151057 -254681 -431789 -426082 -215007 -29998 186692 449619
17068 449619 348794 48706 -257011 -462471 -836008 -787957 -576512 -515344 -260978 -263562
17058 -263562 653 186513 20091 -27467 -149167 -46439 433292 710732 557957 480010
17048 480010 294369 707089 1220649 1136024 811451 766311 594270 571184 661326 630014
17038 630014 580649 417998 350329 435477 321420 155795 63683 -231490 -530638 -301721
17028 -301721 -144096 -277779 -341504 -370461 -256805 -109947 202821 413409 202343 92314
17018 92314 22800 -23662 -175419 -567387 -877188 -1239130 -1231034 -780430 -803114 -1109309 -1173099
17007 -1173099 -994899 -937321 -704833 -474866 -244411 -119963 -62780 -9537 314177 680056
16997 680056 1087413 1207710 746222 243203 12933 -210315 -298219 100771 146438 220855
16987 220855 392378 593251 812237 1004988 1114846 774430 -32237 -725684 -1077929 -1197565
16977 -1197565 -794068 -387510 -397334 -225871 378957 490780 368400 521207 519354 246079
16967 246079 62196 45250 -106625 -13545 61013 -166285 -439781 -598782 -1030803 -1478365
16957 -1478365 -1441413 -1339931 -1315132 -1124251 -841079 -710718 -455479 110201 540621 368387
16947 368387 56569 116425 305306 209814 76104 -392498 -616161 -464919 -241275 48048
16937 48048 489630 640844 670276 781950 565296 521238 482151 603475 810328 1129252
16927 1129252 736591 82870 -66193 -174773 -207210 -266762 -172131 252357 491533 409212
16917 409212 429414 647016 990120 805953 469351 297072 -65132 -86741 -40567 -6303
16907 -6303 28181 -101864 27006 159753 366194 450720 43027 -195347 -113538 -255327
16897 -255327 -647798 -872185 -903745 -505300 162145 497416 577833 653172 709712 535858
16887 535858 392468 213453 -4883 -45612 -113245 -212180 -348039 -634683 -703797 -745352
16877 -745352 -780946 -673562 -451224 -331579 -490767 -647459 -829160 -711485 -454627 -641569
16867 -641569 -931652 -872830 -278061 198632 135606 285254 376114 498263 761641 751865
16857 751865 447412 -101282 -586076 -598086 -346437 -577736 -593700 -291013 2570 324939
16847 324939 547286 229326 -61533 116081 95606 363929 572080 417977 395529 165732
16837 165732 -124450 -186701 -269521 57424 100090 -105068 -470091 -476591 -90523 130305
16827 130305 419201 536357 467823 265372 -261893 -302456 -286183 -370235 -395610 -254783
16817 -254783 141538 245858 -43465 -147135 -8518 -187362 -519382 -574508 -682656 -747854
16807 -747854 -616356 -783502 -1029940 -1162715 -1075087 -724010 -236028 421536 798556 694776
16797 694776 839001 1218217 1226528 1018281 637823 29887 -433696 -553484 -120868 440211
16787 440211 447503 201109 -5088 34092 125197 35452 68193 -54729 -183792 150257 303858
16776 303858 180449 35879 -200936 -160253 109442 71118 171364 269787 69036 319443
16766 319443 352616 308641 257484 28626 62056 2569 129660 555818 998807 683804
16756 683804 64124 -365995 7935 380316 177395 -22178 14403 372889 493222 220859
16746 220859 -284475 -473623 -299397 -399552 -887237 -1066065 -751247 -497853 -610445 -484159
16736 -484159 14199 620434 856607 669315 413887 217409 267453 267987 -229290 -228856 113739
16725 113739 98698 -364638 -627515 -807019 -1075650 -906382 -360182 -92338 -225510 -399964
16715 -399964 -656257 -774632 -516219 -354997 -460706 -407409 -40232 213843 223725 -64848
16705 -64848 -264581 -181721 83564 100615 128808 392457 766420 1044232 1222357 1263910
16695 1263910 571365 -467445 -537826 25373 192599 -130083 -621135 -690423 -77833 95881
16685 95881 -14014 126433 -67683 -699998 -647692 -221040 -54738 19670 52527 283546
16675 283546 682794 1098037 1018871 422772 145689 262750 536866 908337 949261 798409
16665 798409 890166 849023 551704 32235 148924 551557 612855 728969 910351 582610
16655 582610 -430271 -858001 -519558 -433544 -870556 -1036418 -1000776 -784627 -454763 -258479
16645 -258479 52210 100505 -133163 -335749 -483393 -532225 -1000381 -1481432 -1553871 -1162009
16635 -1162009 -237795 107259 -160646 -237723 -247230 -59066 -129810 -557867 -632834 -155407
16625 -155407 368387 413914 191719 51454 -171852 -282472 -71817 -245284 -587306 -586806
16615 -586806 -466603 -94255 510379 1066505 1219253 914518 702189 543756 300687 47267
16605 47267 -44214 243143 501269 578049 496682 421711 253508 212896 20537 -273031 -323078
16594 -323078 -41778 -102868 174750 296341 193719 456943 597336 393365 215133 482308
16584 482308 716982 820623 948730 940979 760019 278922 -162962 -123687 190328 525839
16574 525839 459305 202435 14067 89350 308623 385781 257472 78691 65633 -71351
16564 -71351 -199183 -225773 -373429 -756274 -819926 -499498 -97490 -204425 -141274 -192664
16554 -192664 -312333 16756 183759 29918 -41717 117557 381044 205991 170518 56757
16544 56757 -41113 251985 379556 272704 431707 430959 454030 535877 653800 830707 414468
16533 414468 18111 63512 409779 729522 481526 474942 799977 837378 838043 700522 540770
16522 540770 466949 303803 709445 929940 841436 691538 198417 223588 256506 -62615
16512 -62615 -556662 -775556 -659998 -514609 -409248 -191331 -82891 -51587 -128943 -16404
16502 -16404 238079 357070 45988 -440886 -771843 -683693 -423630 -319271 -81701 100499
16492 100499 156153 2893 -299001 -139079 15619 -150716 -250107 -116296 -141054 -346782
16482 -346782 -469932 -403773 -114589 -13090 223882 410755 519071 567919 619789 396247
16472 396247 70926 123477 215574 377583 603164 826493 825580 761329 719496 470872 235906
16461 235906 23055 -91586 -71577 -287784 -192672 66319 635005 770478 279575 -44342
16451 -44342 -664845 -978879 -842828 -687123 -675303 -605345 -616592 -654505 -586856 -526275 -1011650
16440 -1011650 -1196252 -1105295 -1125945 -724218 -407156 91287 539667 708726 121067 -56847
16430 -56847 60758 116919 -147892 -371499 -230298 -31819 76173 62767 -239389 669
16420 669 420963 94641 -128063 38659 -286154 -823475 -1099774 -1061387 -915086 -500109
16410 -500109 -282734 -223525 -356972 -719702 -627513 -285330 -561274 -718622 -364004 128413
16400 128413 76766 -522895 -807361 -578546 -327942 -308848 -300576 138346 495634 512520
16390 512520 255055 -195188 -272776 -157932 78538 820872 1592703 1216026 347121 314649
16380 314649 889543 1099921 848430 912629 1274479 1022089 469618 241836 -71985 -561351
16370 -561351 -655178 -584090 -514812 -225988 -114175 35617 232859 491355 664664 998444
16360 998444 1270047 937403 303973 -225964 -411695 -542160 -442512 -276775 -179766 -197573
16350 -197573 -100757 282977 556089 1042469 1200516 874124 797714 622956 433588 264496
16340 264496 -203374 -654061 -758027 -840040 -830547 -1207352 -1199870 -800071 -784688 -863653 -700185
16329 -700185 -423879 -125576 205010 280281 3469 429 -122510 -262289 -161528 -57040
16319 -57040 139998 281769 334188 291008 -201258 -558819 -417105 -51732 354758 653805
16309 653805 878110 706740 348582 229292 79555 11980 -56988 -190744 -374092 -420510
16299 -420510 -368893 -50669 297585 304022 376651 415049 342921 -131028 -451866 -432385 -552972
16288 -552972 -828820 -742290 -469641 -48470 399148 632283 647443 575533 474161 566243
16278 566243 438970 25169 -289382 -289995 -80299 -160682 -115906 -470690 -804455 -794830 -1055225
16267 -1055225 -1157325 -708109 -553073 -548102 -28262 -104842 -349415 -366762 -547309 -537861
16257 -537861 -484642 -211316 117039 169596 262184 270091 86504 -94088 -157387 -144632 -108265
16246 -108265 -310355 -371593 -95212 151011 428353 796925 1005927 836749 832284 989802
16236 989802 828862 701407 821321 793623 669888 470601 423479 168806 -517408 -667393
16226 -667393 -483578 -769924 -1124274 -960470 -689688 -286052 -90804 -73060 -173271 -654538
16216 -654538 -903749 -1059306 -722240 123715 837604 671138 513571 137838 31738 112793
16206 112793 196891 276519 283417 181396 41705 -120606 -144914 -250498 -44397 351060
16196 351060 227801 -1979 -62901 233863 379173 349865 357362 -24774 -338003 -599072
16186 -599072 -461357 341276 734701 722164 637355 458279 413100 455774 415600 462540 401114
16175 401114 163969 -115429 -405837 -520396 -160977 -27339 -258107 -380612 -345551 -166071
16165 -166071 -93185 2022 -105035 -238515 -221483 -279895 -467469 -335369 22762 242991
16155 242991 530993 631747 208552 -283484 -447892 -208313 88343 90333 97424 183817
16145 183817 252712 173875 18257 251076 495336 835117 1214709 1064233 937958 876832
16135 876832 438744 539807 627481 333684 -299012 -622912 -639135 -802926 -640054 -229823
16125 -229823 21705 96255 382574 761490 877507 408544 6535 1960 275164 521589
16115 521589 295082 76854 95909 364636 638341 739141 1076883 1032021 877542 505247
16105 505247 221142 157293 12768 -157748 19645 436717 700526 329287 -15041 -243272
16095 -243272 -409177 -612209 -637846 -722977 -794437 -1051251 -1573128 -1712328 -1279376 -804688
16085 -804688 -495439 -82470 187797 210870 121697 68183 491907 811108 857067 767146
16075 767146 137765 -507702 -662097 -662131 -654716 -969259 -1079982 -982141 -603359 -454524 -493014
16064 -493014 -548159 -664194 -461933 -138836 30355 -139653 -382458 -220891 -67503 22403
16054 22403 550817 1076690 1233821 1086053 697164 500694 788311 845558 577098 459038
16044 459038 145114 -922 162241 278806 92578 -74491 -293934 -395207 49996 95937
16034 95937 23327 -71318 -16971 -52578 -560301 -1129602 -1138479 -593322 -560093 -815669 -764022
16023 -764022 -583442 -462613 -225757 170440 -90902 -537008 -719300 -587955 -490266 -474099
16013 -474099 -509511 -533759 -620273 -835725 -986399 -772628 -969478 -1228020 -1046691 -898986
16003 -898986 -807720 -576547 -420117 -367133 -528031 -647633 -673136 -402960 339914 1024652
15993 1024652 1373144 1603505 1447052 979553 955780 842662 780917 790297 745710 413550
15983 413550 -34332 -157031 -261526 -165413 -97282 -88688 -221868 201404 452371 698428
15973 698428 1124987 1173861 793510 313781 45152 -216993 -328759 -7531 219685 -298674
15963 -298674 -825051 -662568 -477504 -862892 -876935 -691495 -443731 -312961 -179658 165354
15953 165354 701770 992772 718995 216075 200288 364816 244707 541721 811299 546183
15943 546183 60415 -507961 -556675 55461 455570 240139 38207 66185 80977 -52164
15933 -52164 -22122 272114 492427 737844 781075 801655 882619 763093 558235 546838 778213
15922 778213 542928 -35013 -559321 -916267 -971778 -744437 -810657 -500094 141134 589247
15912 589247 343379 -65814 -361543 -589563 -802681 -753804 -266121 -2965 287462 531267
15902 531267 440905 225546 241015 485595 576099 546013 403907 104933 -174189 -357193
15892 -357193 -656208 -373208 329157 656503 494691 -108888 -454885 -573319 -755888 -590345
15882 -590345 -236803 114301 473311 609347 429062 188233 -161782 -672487 -622425 -362168
15872 -362168 -107971 -71582 -438783 -221958 -194910 -525149 -669092 -611045 -360700 103375
15862 103375 409940 218952 155116 178411 335186 768551 819996 711964 934435 1472169
15852 1472169 1410658 1136657 1214713 1295235 1051038 722524 511527 174097 2464 179763
15842 179763 -154218 -714176 -426241 -340049 -503208 -299233 416 37204 250538 60434
15832 60434 -176868 -89954 102948 150576 138322 344021 559944 827986 930828 1164285
15822 1164285 1164524 1218072 1354512 742983 78884 -188983 -156459 -105082 -210047 -51446
15812 -51446 141421 -95416 -403357 -736934 -965209 -943874 -876505 -895609 -983197 -791055
15802 -791055 -484314 -118675 215540 -109341 -1014208 -1410693 -1211190 -610216 144496 73486
15792 73486 -146445 -70726 1312 -179586 -115661 -140733 -464576 -789258 -617619 -525225 -199217
15781 -199217 187755 278767 263179 259435 481175 608370 407741 321838 343674 339610 527690
15770 527690 454428 428552 449488 396752 261601 117027 -326722 -676872 -783323 -689133
15760 -689133 -290220 146984 267469 183385 97967 195530 455985 123688 -311537 36908
15750 36908 464620 523759 207629 -682702 -1134742 -1302452 -1465878 -1707765 -1546778 -948656
15740 -948656 -416187 -64680 196133 386598 318767 64021 -323212 -118410 450904 484477
15730 484477 351879 118442 -71770 13732 260310 110069 -230425 -249189 -265264 -157108
15720 -157108 47003 -41925 -213059 -382629 -206074 -2340 -94311 -289499 -571468 -524835
15710 -524835 -163080 -37117 20152 138803 282164 202948 240359 855320 1168117 1519288
15700 1519288 1869411 1611491 1002050 836725 429132 22457 -9194 80194 281646 341098
15690 341098 45813 -503438 -1259326 -1355615 -880305 -825816 -1034556 -775182 -130666 282663
15680 282663 174528 -146764 -29627 -20907 -273191 -508568 -595986 -484729 14217 393677
15670 393677 414839 53655 -248644 -277344 -183608 -520568 -741717 -414863 -515364 -376205
15660 -376205 -52237 -161278 -81467 40491 -31614 82604 440267 770296 745887 293950
15650 293950 -26452 127493 222489 -253735 -964628 -1061157 -834557 -431028 -487260 -680889
15640 -680889 -463250 5946 214784 341435 448379 255401 24698 -395977 -633443 -631468
15630 -631468 -346667 -15763 148632 396546 673405 854259 786379 469986 225821 8368
15620 8368 -360570 -665313 -780894 -967281 -1076265 -1176920 -1088606 -479977 -111243 -266148
15610 -266148 -293327 323943 552953 370985 372067 259135 71607 -118042 -124296 126627
15600 126627 197617 351897 374432 220881 -22213 -251069 -583847 -827801 -1061302 -1260372
15590 -1260372 -1445769 -1482879 -1147952 -769479 -634382 -888660 -972809 -1000399 -569774 226301
15580 226301 1009084 1146534 854145 545140 16236 -440969 -603383 -680780 -545706 -378248
15570 -378248 -78288 249775 396916 600942 772846 736984 472176 168002 178703 522817
15560 522817 556075 466757 499413 390126 44697 -448247 -817175 -542300 -130715 -94681
15550 -94681 272788 471222 350219 -15198 -166996 -118581 -294640 -457424 -737965 -825907
15540 -825907 -590757 -672063 -745362 -352247 -153524 -113778 24843 172980 25901 -12647
15530 -12647 41151 -179654 -187688 -108969 -336203 -419381 -39069 521392 1136585 1563030 1208505
15519 1208505 359078 -109543 -230091 -91062 340368 763949 633012 335347 365401 451493
15509 451493 72421 -119663 409 136615 80595 180546 470760 515984 200284 -104026
15499 -104026 155239 449194 274482 36478 -110475 -363736 -650426 -812238 -803778 -757410
15489 -757410 -932231 -662423 193754 715972 609770 64144 -409564 -428647 -380447 -136750
15479 -136750 297654 446412 590837 571385 520354 776590 990160 779073 577788 443971
15469 443971 250992 479495 1100610 1408697 1267608 737789 619319 599381 170744 -287050
15459 -287050 -578336 -687842 76407 580169 609303 637324 829108 716192 394393 361845
15449 361845 296289 161223 60585 -133226 -257638 -543103 -1072351 -1107186 -645873 -295420
15439 -295420 -176366 274216 404059 237490 142352 50958 34908 229608 466403 327781
15429 327781 -93052 -730100 -842061 -791132 -581640 -542772 -801955 -575417 -148912 116390
15419 116390 -107906 -195508 -48191 115916 155135 -25259 -376243 -679998 -926518 -855324
15409 -855324 -838250 -1256158 -944517 -249420 61332 -35986 -247447 -8457 317300 384871
15399 384871 400987 242782 205259 260032 143865 -41104 -47552 161893 59218 -139155
15389 -139155 -416118 -229062 233185 351386 88296 -261187 -259459 -505259 -949972 -869570
15379 -869570 -766512 -1087832 -1264420 -948154 -598998 -452173 -543503 -355972 -236454 -52253
15369 -52253 268364 74730 -37708 14845 -276434 -482745 -194294 5272 -164127 -409452
15359 -409452 -428051 -68598 187291 147882 -1309 -138900 86749 222435 253723 31837
15349 31837 -266946 42276 179523 30729 -294518 -615960 -646688 -524984 -376337 -433479
15339 -433479 -378658 -434368 -467812 -500278 -342970 -304236 -322075 -431860 -1045567 -1294817 -1108596
15328 -1108596 -776566 -811418 -546402 237370 748877 722871 575033 682441 527180 436530
15318 436530 635054 1010738 912409 361415 -244839 -785764 -923375 -726662 -593533 -501729
15308 -501729 -779009 -706740 -668283 -954007 -925612 -681128 -830873 -749060 -367384 -311811
15298 -311811 -266318 -236779 -355797 -326107 -287967 -355771 -421622 -403934 -236297 -27818 -32480
15287 -32480 -255989 -555879 -501322 -268097 -4487 78356 36620 -1811 -87457 -198836 -476587
15276 -476587 -693838 -671778 -409043 -78836 18980 -152247 -60690 -307898 -598727 -674214
15266 -674214 -506276 -367410 -432209 -486390 -492670 -639873 -403579 -36364 -75767 -283762
15256 -283762 -465307 -382337 98376 514617 522523 239536 -5917 -260510 -386960 -460970
15246 -460970 -641220 -597966 -410225 -94602 74740 -208430 -239946 123009 440661 448841
15236 448841 339318 -53618 -125141 114355 -30948 -235269 -268429 -465095 -416519 -291852
15226 -291852 -331926 -202030 39300 34132 -174694 -192860 -288529 -253912 91961 125215 53890
15215 53890 171489 280999 581455 715699 876623 995579 756529 756103 645750 245018
15205 245018 116121 460228 483529 377807 420972 708746 430492 -82916 -190088 -107097
15195 -107097 -45727 -214374 -731122 -711147 -307240 -419031 -603197 -625256 -870125 -819499
15185 -819499 -319835 -256194 -659704 -748812 -107411 363738 397047 531928 623461 530699
15175 530699 507712 472663 255944 471226 734660 870326 809441 381688 -39085 -23845
15165 -23845 136978 -112603 -484677 -464452 -114305 107600 270679 94337 -397583 -765118
15155 -765118 -1005905 -1381821 -1621349 -1184489 -283664 189688 221701 115614 166670 190036
15145 190036 371463 404291 383699 390844 -357154 -1035518 -1118813 -1003887 -688596 -631896 -733683
15134 -733683 -634451 -651481 -404223 -234475 -617205 -910368 -1042199 -815470 -210878 173377
15124 173377 217735 -258485 -645556 -573509 -434957 -749195 -994433 -487548 -65624 167044
15114 167044 212968 -84883 -393996 -595278 -1005574 -1083342 -694656 -431902 -260236 -253743
15104 -253743 -464315 -655133 -708767 -275517 90270 231534 -20283 -677606 -876299 -667908
15094 -667908 -632158 -275317 112207 191376 357994 649297 745524 591579 174939 63056
15084 63056 6218 -132506 -392130 -387544 -23367 225265 -64722 -393285 -358783 -93598
15074 -93598 -15645 -159874 -244812 -146606 166696 -26655 -135322 -89 21621 -203160
15064 -203160 -345485 -182307 -123035 -205181 -40984 166876 142011 62496 -77940 -309369
15054 -309369 -263715 -418596 -649340 -748378 -771778 -617463 -364706 46019 419675 473601
15044 473601 98570 -24062 231846 366940 295907 138757 219194 520566 406445 164277
15034 164277 146485 -109568 45822 145570 -280937 -585129 -571730 -443408 -560900 -524407
15024 -524407 -109920 515691 802494 792794 720358 307101 87411 131545 -122948 -331344
15014 -331344 -54918 255743 656744 834073 390949 -29003 -294233 -16423 162295 131249
15004 131249 49526 -65457 -65791 231514 710322 946990 834907 783496 858034 863683 694911
14993 694911 295789 148657 178736 278672 155990 155947 288240 -140790 -905639 -1186655 -882248
14982 -882248 -679295 -652882 -835116 -578382 -329252 -318433 22031 91225 143108 515651
14972 515651 600243 369714 155598 64416 -238253 -916 502145 952144 989509 228469
14962 228469 -203620 -494578 -492327 -470706 -647520 -764942 -996329 -1081911 -1114264 -1208186 -1282250
14951 -1282250 -1314712 -1805162 -2067649 -1544130 -958944 -319661 99875 255670 65664 -278611
14941 -278611 -214340 7639 204878 201709 199976 149921 -221785 -203536 -84451 -259723 -362394
14930 -362394 -174332 -77597 -70749 -194416 -76148 489612 478990 154621 229500 273158 -21716
14919 -21716 -135637 12137 98458 32418 40058 -248210 -855973 -1263117 -1231517 -1045320 -1157541
14908 -1157541 -947066 -411927 72263 239023 171212 249538 344002 90882 -72725 -26923
14898 -26923 103126 151092 343381 454159 498510 236248 -171236 -68274 243696 386527
14888 386527 143700 -104926 -94629 -76706 -294516 -567541 -272951 10958 292346 545877
14878 545877 488462 170663 -88823 -87673 -194378 -288372 -324910 -215033 -81063 -6329 201247
14867 201247 194674 -56252 -621498 -1054294 -548827 253505 487783 593504 557615 217771
14857 217771 -78821 -183995 -220831 -311824 -437358 -723399 -487863 -115562 -258756 -537986
14847 -537986 -545914 -398632 -347739 -359761 -305214 -316551 -314338 -368874 -353198 -318807 -333337 -93400
14835 -93400 -5912 -41512 70588 210042 394850 465180 404215 619423 314211 251677 577626
14824 577626 496999 578997 529507 354292 137800 -3139 184062 250249 -351508 -679580
14814 -679580 -510302 -465964 -440798 -693339 -1086587 -961681 -54062 605550 470112 54721
14804 54721 -302571 -579504 -675789 -600939 -587948 -597248 -608218 -311549 205441 291028 100497
14793 100497 404834 684062 781177 118049 -417510 -342972 -32994 103308 -14966 -105551
14783 -105551 -242830 -619532 -906378 -875567 -837502 -435090 404920 674180 610014 598513
14773 598513 570536 528158 481726 398605 -84800 -559578 -688441 -926887 -1049336 -807769
14763 -807769 -469728 -279405 -433023 -374926 -560849 -687587 -506472 -202281 -181251 -402995
14753 -402995 -375800 -54128 205166 942062 1099869 409217 -143262 -137794 -112978 -221176
14743 -221176 -295144 -36101 477867 454991 74278 -322199 -685429 -953866 -649842 -374681
14733 -374681 -323092 -409106 -55975 531240 710523 292724 -42624 -317428 -420662 -242811
14723 -242811 266768 748386 587138 271556 -54896 -247031 -279041 11824 354639 575889
14713 575889 635241 70519 -540093 -1019635 -1121083 -715867 -242429 -183113 -104191 27657
14703 27657 -82174 -350185 -442669 -219491 -293464 -433693 -461418 -527121 -515868 -424055 -775859
14692 -775859 -998904 -946149 -768765 -505305 -46242 200924 79029 151528 27845 -26165
14682 -26165 180745 327258 -4759 -452714 -760446 -849684 -743596 -720137 -548501 -256911
14672 -256911 -135879 -107944 -89111 -413842 -751265 -844268 -840547 -797820 -130441 -6275 -296044
14661 -296044 -346103 -550023 -598778 -594556 -304684 -4480 -370505 -1019614 -1103614 -603784
14651 -603784 -216494 85227 300837 243438 536566 742330 545327 173788 -294784 -262969
14641 -262969 -89755 -201966 -488547 -776016 -572268 -319552 -501888 -714064 -524727 -101029
14631 -101029 -23808 189192 238810 -227672 -581621 -631853 -791676 -930064 -800856 -1005050
14621 -1005050 -1417124 -1562881 -1764816 -1496351 -914914 -572162 -225845 94981 68533 -196386
14611 -196386 -205413 -194716 -79521 -134720 -558668 -1034269 -1066586 -500786 -504370 -1090513 -1416396
14600 -1416396 -1125688 -731699 -373766 -161377 -189613 -188813 -393134 -447164 -245298 -355800
14590 -355800 -707093 -739571 -583117 -421344 -179862 21480 21435 -297824 -276988 -241381 -242513
14579 -242513 -247946 -190973 -155045 292367 457928 115176 -25401 80870 436613 369581
14569 369581 133371 119495 -203646 -193405 631761 1196456 1145714 715337 47794 -409090
14559 -409090 -262701 -132407 -295928 -527675 -239059 110514 245396 246941 12846 -178014
14549 -178014 -117623 85385 409678 505515 489886 553882 246860 42282 185552 263133
14539 263133 156215 -136041 -626849 -619352 -458583 -411190 -456351 -697934 -975410 -898050
14529 -898050 -488557 -307213 -219395 -224235 -642436 -540500 7273 152449 335072 382327
14519 382327 170875 -52139 -281206 -557079 -468548 -701740 -807182 -696767 -512372 -219026
14509 -219026 -102436 -100855 -32898 -99003 -90816 -21159 115685 261280 514715 662221 508323
14498 508323 358843 138348 -31620 -488 92418 81331 -11815 37534 33587 295496 360999
14487 360999 -55680 -465489 -567603 -460579 -441402 -387538 -425883 -666397 -393832 122995
14477 122995 453180 453323 201417 -409261 -819858 -856425 -610545 -677377 -730284 -453838 -397021
14466 -397021 -414097 -585752 -756361 -561290 -43208 257928 103364 212766 488102 642584
14456 642584 521689 499689 613222 669312 269612 -62221 110951 962730 1771610 1565267
14446 1565267 1138098 834374 551163 146472 2446 118513 311392 396409 77894 -504564
14436 -504564 -1123615 -1361042 -1089263 -733510 -482448 -646293 -477578 -295645 -372232 -226862
14426 -226862 171659 676211 491730 78129 -315625 -841012 -586084 -226141 92548 271081
14416 271081 118424 -76034 -317673 -789524 -1073462 -1138556 -1051311 -576643 164054 193253
14406 193253 169386 207663 -151296 -384168 -177236 78595 237323 161583 270753 462738
14396 462738 375601 364177 365852 811970 1363230 806657 2698 136014 510054 712807
14386 712807 535015 118259 287963 600012 861398 631962 451862 341685 -107655 -362580
14376 -362580 -75848 140653 216973 -56141 -481329 -508969 -419306 -192002 -253304 -458053
14366 -458053 -175673 -232371 -456503 -417216 -564964 -464209 -485822 -756971 -359463 43092
14356 43092 -81941 -89935 -145229 -566405 -825932 -740642 -694542 -537071 -228873 -6037 16924
14345 16924 124778 -747 -179212 -313240 -400451 -574930 -630840 -471356 -273050 -339942
14335 -339942 -286803 -477082 -829798 -931453 -631047 -154965 -467737 -865310 -741224 -383201
14325 -383201 -240723 -80158 268372 542181 568802 408997 249027 -77887 -595303 -469650
14315 -469650 -284479 -531760 -652973 -688810 -597451 -721896 -821080 -693932 -744396 -1033031
14305 -1033031 -1433198 -1644353 -1414083 -712717 -196593 -449407 -738482 -835138 -775753 -630032
14295 -630032 -759471 -950155 -698500 -125774 256825 515785 460407 546206 754435 860933
14285 860933 600264 72470 -152740 -425135 -800250 -830642 -742418 -648478 -462027 -487209
14275 -487209 -641247 -669092 -815842 -621190 -322739 -63710 230536 -5587 -200671 -417040
14265 -417040 -751657 -1032802 -1135948 -1035519 -735975 -242862 98618 346240 556863 475245
14255 475245 393084 320296 114861 -156120 -218939 -313700 -450952 -454904 -417634 -708242 -796870
14244 -796870 -367384 124618 279912 163401 111829 258148 120977 -64230 35954 177607
14234 177607 559947 551910 170730 63976 -41043 51478 662394 1003100 500405 -124902
14224 -124902 -310348 -250002 -133090 -99850 -237261 -364203 -47898 331740 225388 -112598
14214 -112598 -407939 -527437 -330556 -218759 -227560 -141265 -208843 -271287 -81992 -213404
14204 -213404 -439443 -128105 143932 126870 -106235 -73329 261560 236592 -177300 -359498
14194 -359498 -242635 -135245 67007 203731 399682 594071 790263 673325 626232 501695
14184 501695 372016 337544 329980 257679 -148752 -455168 -325757 204764 588154 766735
14174 766735 537599 225729 277369 286262 -299378 -516382 -392860 -337744 -496638 -630884
14164 -630884 -702411 -681691 -433008 -44492 83442 198806 255939 -36698 -170678 -292549
14154 -292549 -310602 -141602 66146 120717 -182602 -705122 -1138156 -1276220 -701009 -462626
14144 -462626 -767883 -816720 -488353 -3230 238156 222754 289455 263160 -43822 -422006
14134 -422006 -527424 -486859 -629402 -816934 -1020202 -775919 -507598 -212060 67287 76447
14124 76447 -85096 -247031 -204356 -142610 -92304 -13397 -108637 24975 250263 196930 -80334
14113 -80334 -161644 -444277 -770881 -635635 -542161 -380589 -262512 -549320 -737747 -852287
14103 -852287 -705728 -144853 338149 624022 554389 297136 165932 228764 305589 147272
14093 147272 -187906 -324421 -337869 -385012 -208431 -168818 -282091 -172390 -111880 20131
14083 20131 19452 -282503 -114999 173772 243649 118627 122178 228750 459217 325165 25963
14072 25963 -52929 -140918 -64031 21972 28094 -173723 -374020 -520851 -598391 -414136 -242493
14061 -242493 -134550 78599 -111657 -15890 336690 530123 494105 444425 93474 -335310
14051 -335310 -294473 -121688 -252240 -98077 35258 108832 257202 475542 722712 733216
14041 733216 379389 -40293 -251301 -158374 14463 47148 -107924 -192004 -402310 -490169
14031 -490169 -823625 -1063433 -1092119 -1002455 -796242 -665868 -514569 -63464 295045 224539
14021 224539 216698 89951 -169360 -226663 -2996 -60182 -281724 -62671 160458 -33348
14011 -33348 -158019 -78122 23775 -151983 -655868 -752290 -426741 -485279 -394183 -182953
14001 -182953 -273704 -302122 -28638 -99872 -187368 -54279 -27877 -247537 -691728 -957636
13991 -957636 -933554 -761130 -278175 422598 241175 -281587 -228712 396932 882826 828634
13981 828634 644908 337894 -204412 -445595 -344402 -124404 71920 160951 199064 295240
13971 295240 218384 87754 31059 -94793 -106434 21706 132936 -245184 -747749 -1173826
13961 -1173826 -1187439 -787564 -490645 -156353 -158685 -247911 -215643 -484958 -567682 -273844
13951 -273844 -54406 60280 -52958 -115878 -90640 -184682 -358646 78539 295787 87021
13941 87021 -196813 -504912 -355653 -49667 19996 -169575 -304887 -491572 -243178 -98684
13931 -98684 -317012 -142951 222762 25633 -358977 -666198 -758614 -351167 -30690 -237003
13921 -237003 -348524 -153287 356289 672821 924507 729137 190997 169641 498094 634783
13911 634783 477587 374556 320936 -19160 -416943 -529415 -294223 181657 389836 269725
13901 269725 286693 504401 503007 296242 256285 339926 277811 -334245 -807308 -641727 -489344
13890 -489344 -453748 -382298 -176483 -152875 -84857 389967 864428 761830 264264 61430
13880 61430 185821 83144 -499760 -738169 -508337 -549605 -622861 -391225 -396578 -160744
13870 -160744 352687 540429 235557 -98664 -32926 362963 864799 1051941 913448 853004
13860 853004 968677 1013307 880251 432376 -245627 -614579 -722411 -870736 -780174 -926642
13850 -926642 -1094532 -875697 -493760 -271596 -253608 -527875 -803772 -732935 -519200 -249944
13840 -249944 -201161 -288298 -301164 -85991 59998 -85470 -190592 90623 253466 224148
13830 224148 263830 410974 664888 646491 291557 -218747 -904414 -1132857 -1043842 -961439
13820 -961439 -543754 -35979 -133435 -435228 -425889 -349412 -281561 -157643 -109886 234320 602055
13809 602055 308507 -253849 -292792 -243371 -127251 -188429 -270501 -217604 -604373 -998130
13799 -998130 -1155531 -890457 -508165 -729835 -714560 -355438 -488939 -667110 -403601 -25990
13789 -25990 510974 582612 93573 -159131 -75799 284923 483389 187749 -222942 -419960
13779 -419960 -661084 -864396 -873580 -872691 -664342 -35966 233519 -65729 -248733 -211664 -218739
13768 -218739 -407488 -614658 -811730 -968349 -785609 -638352 -839597 -1022948 -1030119 -1111306
13758 -1111306 -1005429 -798357 -578726 -407772 -242846 -16650 48424 -161446 -158457 -69368
13748 -69368 -27341 -2361 269050 205058 62303 208875 444786 694889 367020 -243791
13738 -243791 -643588 -1034415 -1107533 -967303 -931408 -801817 -513003 -257347 161554 313317
13728 313317 490517 494665 157217 -116482 -83035 -94696 -414136 -430690 -469667 -488794 -296421
13717 -296421 -440111 -783887 -631970 -218555 -92683 -149714 -216041 -149277 70 247924
13707 247924 274270 158864 -177480 -443323 -489071 -392348 -103682 399804 824595 838610
13697 838610 827101 783619 644220 386662 106685 6170 68635 -112835 -230932 -19550
13687 -19550 159928 -48062 -498540 -749427 -682017 -443868 -471633 -950295 -985586 -596442
13677 -596442 -534644 -699710 -798677 -495913 -561404 -999245 -1106888 -839862 -410117 -137930
13667 -137930 117009 342828 302670 32338 -55384 -159053 -355394 -416656 -381988 -482188
13657 -482188 -590219 -807083 -885154 -739920 -647879 -701591 -889616 -872731 -784310 -982661
13647 -982661 -901971 -778429 -747666 -505007 -90105 -83904 -36696 -40401 -165012 -147842 -222888
13636 -222888 -45789 -135826 -318925 -82174 157563 326566 553186 497236 352549 371236
13626 371236 350760 678786 862901 763916 392438 -167702 -457805 -525429 -847130 -1144411
13616 -1144411 -1214653 -1056377 -649884 -287605 -291722 -380958 -307380 -324643 -515204 -569501 -394425
13605 -394425 -365661 -122605 -127470 -74975 138986 -52493 -272643 -472741 -777330 -884048
13595 -884048 -515602 -290034 -259794 191066 503905 409964 254015 114228 340208 407572
13585 407572 251415 349336 542998 743468 605691 135250 272288 461682 177016 -74952
13575 -74952 -391396 -540821 -328897 -80233 -73912 152541 413752 360570 549369 750155
13565 750155 805461 709721 396718 513937 414491 147367 190675 281489 516051 646680
13555 646680 567600 623628 871532 1109179 973838 847063 911826 680435 375105 614771
13545 614771 826026 475302 191601 77466 260797 366727 326855 486401 480441 376405
13535 376405 60510 -167320 -300810 -334683 -294812 -369209 -462949 -360141 -128519 29795
13525 29795 -137538 32692 242771 336523 609670 800179 367690 174312 396040 581910
13515 581910 799958 556707 384106 432651 469801 551304 452724 615841 721989 621035
13505 621035 364699 -69026 -249319 -335088 -236680 -368684 -711438 -767913 -678124 -438596
13495 -438596 36214 393290 533095 487623 235933 451776 938600 1034654 768401 103518
13485 103518 -493932 -517773 -149885 118133 187780 33988 -3206 -49396 -2147 -40654 -109951
13474 -109951 -16354 75075 -34329 -87754 -205190 -182316 146503 348694 89589 -63070
13464 -63070 -149112 -132118 182048 472849 405455 429634 451797 285889 198257 6494 -138124
13453 -138124 -310353 -439307 -481788 -361262 -533487 -574305 -536768 -131423 379976 250006
13443 250006 -102814 -265345 -326595 -334269 -200533 -61740 -313713 -693752 -722311 -795181
13433 -795181 -866160 -657566 -248572 -183289 -209752 -78420 233252 214424 215756 18815 -431680
13422 -431680 -419377 -54124 20523 20816 -101120 -257822 -305691 -174394 179287 329374 390500
13411 390500 245572 137364 139786 -23468 -269433 -157594 177607 253904 279087 239768
13401 239768 -121842 -258702 -331274 -32669 -63068 -491612 -679377 -592675 -663614 -557114
13391 -557114 -233287 -32025 -104220 -338924 -282828 -276942 -455165 -416978 -81957 383412
13381 383412 865114 989925 1092059 893814 448007 137797 -202555 -715925 -1114823 -851954
13371 -851954 -341056 -155152 44694 120349 -198276 -413833 -279687 -87823 103168 432445
13361 432445 516270 372928 234536 229127 186641 -71762 -244543 -184768 175747 620479
13351 620479 525032 333229 72857 -250452 -132448 -60909 -218386 -315128 -402379 -627480
13341 -627480 -616797 -233563 249277 649861 988864 1097411 656151 414713 291201 199337
13331 199337 -16527 22612 505332 906637 1218529 1452776 1146815 662762 480113 488824
13321 488824 683523 549710 536880 736400 828643 442624 294646 468085 299850 125721
13311 125721 56843 55139 15743 -67875 -249805 -174655 -303917 -741263 -1141780 -1148056 -1069142
13300 -1069142 -1089581 -552154 118847 473850 568278 659723 436915 351884 746828 828262
13290 828262 949764 1316046 1346220 890301 462912 403634 322553 461578 729055 758676
13280 758676 654111 748241 937222 876095 848063 973913 787803 318693 10328 11896
13270 11896 -27105 -82586 196215 519792 513488 609161 884748 883567 689506 483724 470321
13259 470321 718138 856592 743624 417500 339329 749643 1173857 938839 261949 -103382
13249 -103382 81820 673643 909752 912852 849166 497311 411564 748786 1157324 1360262
13239 1360262 1354385 1312247 1059630 938002 851163 587195 509357 743445 1120935 1467922
13229 1467922 1115828 1047980 1242249 1238398 1009932 658643 779078 662625 431925 119622
13219 119622 319010 874084 1015401 993435 1103692 834126 688310 720264 643340 447696
13209 447696 598395 802415 688703 622687 305065 -125079 -208740 -394665 -208690 182342
13199 182342 156992 98798 320338 538507 576375 414914 454215 639949 417688 157300
13189 157300 14592 -112543 9202 322516 668676 1102198 1275198 1207092 1118841 912664
13179 912664 716473 449489 417603 687870 972425 900396 865289 839194 1052116 1543745
13169 1543745 1803045 1830969 1951973 2056550 1959362 1602162 1435742 1314223 1218826 1118098
13159 1118098 1012346 902374 1083844 1621832 1949160 1987502 1793568 1800669 2053253 1890573
13149 1890573 1626889 1585534 1600754 1590884 1629823 1832563 1953335 2000464 1928914 1421109 1251396
13138 1251396 1704665 1851100 1619737 1246752 670253 353032 849546 1287253 1244917 882112
13128 882112 624342 479991 552081 751647 899574 1004359 997381 1040673 1186632 1437438
13118 1437438 1613045 1766753 1927756 1951674 2062134 2041344 1767614 1300978 1056898 1264907
13108 1264907 1810271 1946145 1958904 1653582 1262496 1276318 1456547 1559257 1579441 1290842
13098 1290842 1302533 1422462 1495529 1462499 1463813 1822435 2191176 2257513 1846119 1457093
13088 1457093 1526272 1490389 1520324 1759624 2079281 2310930 2262054 2254195 2073515 1778353
13078 1778353 1877415 2147881 2462518 2772343 2751474 2096823 1676923 1675218 1569138 1695853
13068 1695853 1875371 1549016 1220772 1239332 1677491 2073001 2008514 1963595 1762472 1122097
13058 1122097 803106 935472 1311468 1704986 1934994 1825842 1756332 1991116 2276935 2309547
13048 2309547 2142247 2310351 2493195 2548158 2419464 2381571 2810513 3450783 3563128 3352609
13038 3352609 3358522 3463638 3289118 3143634 3108060 3014029 3062294 3132907 3049486 2830549 2804305
13027 2804305 3036151 3738973 4299740 4060514 4102048 4356255 4557357 4371727 4016300 4045944
13017 4045944 4313676 4334028 4238353 4410525 4501424 4878547 5283216 5298504 5574032 5786341
13007 5786341 5897880 5834536 5671641 5721749 5846571 6396836 7097848 7432601 7663729 8015350
12997 8015350 8566599 9219387 10039456 11093968 11880266 12716552 13385751 14134627 15612638
12988 15612638 17782884 20232213 23143119 26443647 30510246 35721176 42802144 52298824
12980 52298824 64786736 81191495 102659826 132447265 173782968 228472232 292515547
12973 292515547 347217000 363031530 330717123 273217141 216384894 170750770 136877301
12966 136877301 111990207 93243653 78669788 66975332 57567127 50069801 43969211
12959 43969211 38700707 34306430 30463757 27292853 24714562 21981475 19736393 18145993
12951 18145993 17453596 16849865 16048530 15081210 13709912 12860746 12440260 11974964 11659020
12942 11659020 11208679 10503566 9654635 8922521 8538121 8447350 8613966 8803320 8431885
12933 8431885 7959881 8255282 8630304 8595981 9004987 9334197 9050294 8825520 8983565 9239292
12923 9239292 9813429 10269544 10600478 10982322 11598472 12522755 13847299 16059600 18741285
12914 18741285 20625636 21026259 20418538 19201524 17660838 16609704 16268139 16853067 17747421
12905 17747421 18312430 18927346 19761056 21073471 22915446 25225716 28738933 33429181
12897 33429181 39108557 46585419 56911315 70545756 89014666 115429270 150993446
12890 150993446 190247975 229305808 277767266 335584705 378592677 376211572 328967756
12883 328967756 265401685 208624605 165341033 133186577 109543727 91724516 77489422
12876 77489422 65718609 56523195 49512041 43890829 38987266 34569049 30612614 27456963
12868 27456963 25137694 22866954 20871743 19136607 17381224 16180026 14958017 13978866
12860 13978866 13214670 12224621 11349172 10877213 10290248 9721424 9208945 8594176 8222268
12851 8222268 8015217 7710589 7359279 7376064 7714052 7850319 7749140 7562403 7261379 7431660
12841 7431660 7618196 7147490 6839110 6745681 6517561 6333985 6531480 6880676 6971874 7307804
12831 7307804 7699258 7479207 7455753 7422761 7386062 7749437 8409301 9283332 9947439 10307208
12821 10307208 10903576 11974048 13022180 13739733 14334882 15546619 17108853 19110134
12813 19110134 21971148 25435745 29688326 34686501 40651565 48413149 59238415 73739309
12805 73739309 92590830 118953591 155319173 204303230 265605575 327841123 363123162
12798 363123162 349600960 298935132 239048166 187708079 148551818 119734737 98396887
12791 98396887 82229184 69877753 60163484 52142187 45197008 39219175 34310679 30226928
12783 30226928 26715675 23707185 21316029 19476381 18092650 16738010 15475832 13957751
12775 13957751 12619768 11620961 10788766 10221389 9732778 9305539 8639466 7897787 7439427
12766 7439427 7580953 7713728 7386920 6795390 6139107 5659265 5147030 4391431 4048924
12757 4048924 3755381 3277616 3148310 3455552 3874588 4092773 3958162 3534624 3091891
12748 3091891 2801634 2575346 2646982 2627664 2330425 2414339 2648449 2803184 2378148 1858982
12738 1858982 1592301 1416482 1726817 2145686 1989403 1560192 1349229 1356334 1715325 1800725
12728 1800725 1729502 1490747 1501608 1676388 2057951 2440854 2347143 2202006 2129718 2007911
12718 2007911 1938751 1828294 1748136 1698188 1501677 1247542 1213370 1277578 986155 1107951
12708 1107951 1389356 1329646 1174326 1048491 964505 1033086 936338 1080787 1428783 1758171
12698 1758171 1678222 1216925 1193174 1398614 1008130 538542 360757 593740 930762 1021207
12688 1021207 1231488 1712542 1881475 1449884 1271746 1249568 1190745 754464 713330 1138259
12678 1138259 1580245 1679743 1600247 1525821 1163687 1002549 1403259 1907322 1957074 1524650
12668 1524650 1041587 840649 606554 747641 1173766 1333364 1352114 1141626 970167 1048392
12658 1048392 1032461 680926 181573 -24813 -38491 -108467 61516 283200 365220 97640
12648 97640 54340 350898 506797 410963 300886 470058 461618 266860 66002 179426
12638 179426 432616 199307 411309 1146130 1692160 1547294 1110422 1260933 1718019 1834540
12628 1834540 1203729 626168 673141 1288535 1609029 1373962 972537 1142081 1027496 553177
12618 553177 171645 -2862 307042 154074 58772 208912 567389 906904 1142889 1233880
12608 1233880 1079846 924670 976101 1245498 1280600 792965 389233 247857 -27584 71646
12598 71646 331119 451696 391772 99556 -96702 -100103 -204792 -105257 -220459 -456170
12588 -456170 -757922 -778984 -467454 -422419 -592312 -680022 -440444 -279021 -121558 -137120
12578 -137120 -170191 -156440 -238808 -66713 147115 42665 -120310 -37881 195939 428552
12568 428552 656471 533442 343552 225121 311719 377290 191429 40365 84814 19445
12558 19445 101824 365243 147142 -62704 139875 167965 124698 -388802 -737753 -232252
12548 -232252 79900 39165 93557 95948 -54298 166079 276505 -39691 -301743 -188549
12538 -188549 3704 187956 230142 -109970 -197288 169545 505513 709036 933977 927838
12528 927838 682535 546475 239999 -144069 -545577 -930223 -866603 -433674 -293015 -482022
12518 -482022 -223855 143416 240060 142155 672612 1262220 1113874 660824 408741 337916
12508 337916 -117900 -288334 -95600 277465 657650 830456 766540 321432 -465783 -793953
12498 -793953 -680419 -560974 -398534 -61821 -247668 -757290 -879523 -459153 105227 222419
12488 222419 -42341 -359519 -233297 12675 -124319 -560419 -827392 -896340 -679364 -343008
12478 -343008 -177549 -331849 -357528 -313182 216557 869028 795418 824128 1024401 970820
12468 970820 712630 462752 272096 609740 878339 900628 745612 677329 342149 -381524
12458 -381524 -713141 -359384 -306304 -198533 -90619 174068 657653 1027707 907375 271443
12448 271443 -341954 -693383 -936486 -1030796 -868421 -578914 -18828 208851 367854 274992
12438 274992 -236292 -545780 43275 980320 1603587 1837979 1791906 1557638 1140445 741578
12428 741578 586449 585462 703743 1025557 1000814 557284 284308 9827 -54833 172709
12418 172709 529698 602510 351032 -273909 -489980 -472878 -353866 -276609 -372600 -321863
12408 -321863 131325 574736 323641 93432 109356 218676 512889 848623 828793 516683
12398 516683 172243 147819 613838 755040 517672 386192 205211 105209 169613 504377
12388 504377 655286 442379 106807 96708 337741 300274 148159 -265316 -749822 -807729
12378 -807729 139075 597472 475413 192097 -185952 -131718 36834 97391 240664 100760
12368 100760 83403 114754 -54141 -76654 155486 392748 386881 278481 -97772 -527984
12358 -527984 -1139815 -1164963 -535253 -265316 -149069 -111865 -361346 -738064 -890704 -825926
12348 -825926 -914006 -584007 160740 513731 781763 922301 815439 935653 968762 762351
12338 762351 388467 181911 275195 215506 -160006 -300244 -373400 -636725 -752828 -785067
12328 -785067 -1344112 -1545024 -969590 -297991 118403 44241 -446654 -364607 -264312 -137768
12318 -137768 -195715 -505873 -666733 -882547 -951110 -751592 -299613 92946 408614 518790
12308 518790 741788 910068 638533 282500 282687 476501 587606 748142 946960 946058 655811
12297 655811 338246 -340347 -406194 121888 681350 1292807 1004882 210289 -136338 75299
12287 75299 -3736 -254876 -469056 -454118 -245071 -345272 -508799 -325575 -173711 -306053
12277 -306053 -195670 136849 110083 52872 462318 302534 -304243 -568278 -324645 67268
12267 67268 -10995 100777 282697 -58764 -266413 -146801 43293 42987 -32278 483622 746670
12256 746670 793159 559313 409830 646891 958622 1074383 967253 955644 946663 661304
12246 661304 167991 -393060 -668174 -624102 -390283 -164002 -377081 -325722 -187092 -79394
12236 -79394 309756 409932 400048 545080 725619 910772 752521 374822 183586 304273
12226 304273 415340 491430 643340 365498 207035 347181 620353 590790 338061 343105
12216 343105 351459 268393 233239 218954 -339812 -861550 -873204 -1029072 -961146 -757237 -508205
12205 -508205 -427398 -175712 537968 875373 951863 889867 460593 -31369 -153569 144071
12195 144071 543312 472713 319349 129382 64883 111635 214254 291350 142606 49922
12185 49922 -301550 -398880 -161481 -251443 -503580 -570273 -622191 -961635 -1332149 -1041262
12175 -1041262 -260223 209133 429730 566272 462222 39705 -291782 -656247 -907579
12166 -907579 -820224 -869040 -526927 32376 108677 35556 -394974 -388789 -155594 -471726 -660141
12155 -660141 -494926 -379159 -518262 -508090 -18195 332379 82159 -570729 -1079470 -1306148
12145 -1306148 -1087943 -499637 216762 478622 38166 -200791 -16387 -169132 -653564
12136 -653564 -994697 -1013034 -986928 -1053596 -1046970 -889824 -953843 -1373909 -1489092 -1311560 -1129903
12125 -1129903 -745585 -474071 -515103 -725629 -836542 -805550 -795499 -662290 -596697 -517836
12115 -517836 -489230 -634876 -392132 -191835 -255871 -676045 -919632 -913118 -1255362 -1486667
12105 -1486667 -1253005 -1538966 -1833839 -1804168 -933724 -213148 -92798 178817 260405 340784
12095 340784 791588 1003234 571240 555770 922449 1035602 749270 520022 559716 802541
12085 802541 557352 363856 106850 134370 311959 282773 227368 184483 289495 517252
12075 517252 763223 921688 875570 735435 453746 480248 737178 673574 499304 517397
12065 517397 626040 575735 640821 658806 415012 27722 50796 156973 -212313 -474181
12055 -474181 -301673 -182387 -231200 -404911 -597654 -919678 -791765 -788125 -708285 -241666
12045 -241666 616545 1094833 883258 743586 530549 237968 41915 125054 -18120 -310286
12035 -310286 -352406 -98450 -101528 -225240 206444 179115 5816 -197501 -472522 -429238
12025 -429238 -409012 -413296 -262076 158177 184826 502845 670567 45503 -651335 -901628
12015 -901628 -768869 -532372 -656891 -758989 -557029 -459804 -214222 -219792 -699969 -1179058
12005 -1179058 -1144453 -951701 -820542 -401439 223468 153987 -226427 -62333 -11800 -198695
11995 -198695 -401360 -364496 -482317 -611614 -955376 -1430143 -1385525 -768310 -515543 -417686
11985 -417686 -125680 -101143 -225904 -341327 -182658 434183 588514 127516 -188237 -166253
11975 -166253 -75062 -163715 -234212 -158537 92234 630407 918367 601786 459881 638833
11965 638833 425006 -251316 -534564 -531077 -705857 -793706 -497743 -419677 -446909 -502722 -438115
11954 -438115 -522613 -794072 -586035 100208 271294 -337298 -889126 -1387554 -1276437 -601354
11944 -601354 -161022 36043 234038 197761 203012 68871 167029 379975 690176 720946
11934 720946 368762 -256421 -311002 4745 -25359 -227759 3978 232385 390214 53701
11924 53701 -109186 -407770 -620107 -565127 -565498 -433812 54129 377023 556440 690317
11914 690317 453130 353288 299398 266185 444447 860057 888801 975016 932510 700981 561739
11903 561739 444307 302191 44213 -486480 -522045 -559607 -537950 -271692 39110 230657
11893 230657 565339 362080 -55217 -74150 66880 69193 -435 250212 412557 51731
11883 51731 -304275 -342503 56234 333280 391137 438919 455531 310471 136564 224560 573374
11872 573374 741187 730963 529703 132694 35978 77052 -386884 -879965 -802206 -572390
11862 -572390 -495385 -509046 -644920 -430088 -438833 -567772 -155744 348757 461609 343378
11852 343378 223676 244550 364892 407654 519000 377430 -129996 -619333 -758668 -450452
11842 -450452 67906 172055 60827 -108997 -475159 -721523 -822302 -932570 -524218 481463
11832 481463 740935 288689 -35762 -265707 -319004 -240079 -143650 -225866 -568219 -815561
11822 -815561 -803365 -813490 -658354 -981287 -1119764 -718743 -429985 -264760 65982 165420
11812 165420 367776 425516 285086 -123238 -451191 -418093 -446039 -691200 -805825 -769821
11802 -769821 -698271 -581702 -451862 -622048 -474751 -94409 -145094 -136577 -479406 -905224
11792 -905224 -707086 -35030 721479 970551 372625 -353379 -501136 -275894 16324 256085
11782 256085 381763 205226 -203887 -113553 -19396 47196 -3283 -276044 -582809 -630550
11772 -630550 -441605 -149731 175283 458147 287459 -297047 -698388 -770901 -607178 -359781
11762 -359781 -389247 -306330 -7395 84484 -288001 -624872 -560765 -118775 185166 7128
11752 7128 -119503 -224278 -487992 -542380 -483784 -445794 -645704 -924893 -986416 -1038480 -1362556
11741 -1362556 -1520880 -1322407 -820556 28908 189228 -86569 -309521 -281503 -313781 2384
11731 2384 264507 409984 661419 745477 716637 566150 -35444 -591033 -555188 -274957
11721 -274957 -132345 186386 485362 380199 149845 43477 205643 -17890 -648544 -1229236
11711 -1229236 -1959300 -2600058 -1511290 1517063 2711611 1720560 1189078 489970 -51866
11702 -51866 -240966 -277334 -162188 -51793 -74442 20679 377946 808790 1240231 1439569
11692 1439569 1292088 764386 499997 716449 687946 449276 545654 680353 604583 404944
11682 404944 -30741 -48860 224544 402194 395117 627516 660555 692899 821564 763553 428542
11671 428542 305056 197118 -54823 120946 104718 -217180 -486030 -415680 -487390 -791849
11661 -791849 -1025923 -1205634 -1036587 -499623 -183629 -247517 -337723 -120788 164881 29678
11651 29678 -287051 -408116 -407547 -483146 -654581 -803291 -863502 -781144 -340187 -430576 -699645
11640 -699645 -254241 453481 797733 816548 788703 343181 -182870 -316521 -306763 -426895
11630 -426895 -669247 -549333 -377332 -523933 -693111 -668718 -689353 -519733 -62887 324025
11620 324025 345163 293068 203604 296644 984818 1619064 1517718 1078531 845724 734784
11610 734784 477485 -140566 -172867 -154092 -542963 -819310 -579369 -652261 -461654 -3571
11600 -3571 308137 732354 975577 746663 309098 -35392 -58444 181225 147967 36634
11590 36634 -243707 -710178 -1241519 -1244245 -1160034 -1384399 -1394766 -1076134 -630539 -652046 -1268052
11579 -1268052 -1406853 -907500 -376161 35649 195931 33268 35417 -58491 -206083 -246085
11569 -246085 -32661 376097 709563 425312 4250 -398922 -776839 -1025527 -990290 -766248
11559 -766248 -212238 565203 1312208 1603571 1150607 551127 289196 332411 446294 614318
11549 614318 671511 646063 545170 226723 81187 252635 182692 -69621 -26734 149107
11539 149107 -8877 104389 413083 783765 773999 697220 611440 298737 -116019 -8424
11529 -8424 177445 279856 326606 201128 -14659 86480 102848 36580 33800 240902 421769
11518 421769 269563 169947 217176 382123 174407 68067 -19924 24042 205223 462445
11508 462445 392988 172658 142666 208168 411038 781637 686240 390780 149221 259309
11498 259309 485925 298270 -133149 -841702 -1015601 -811646 -672675 -713337 -623881 -333433
11488 -333433 -135143 87786 273448 225589 147786 -213201 -649950 -688420 -310270 -570934
11478 -570934 -696400 -420339 151954 607708 717381 500168 175672 193944 -18813 -39873
11468 -39873 1188 -306529 -478675 -372928 -236339 -168320 -111789 -53654 -81181 -93424 -341189
11457 -341189 -470167 -268821 -163835 -82626 -57461 6564 203189 414787 184752 -37485
11447 -37485 383140 541937 448896 536634 654609 340279 27638 14163 -43787 -148035
11437 -148035 117503 502384 422057 62945 -20869 -399928 -938505 -1174067 -898337 -700895
11427 -700895 -853622 -739694 -361271 229092 646331 804948 722480 702293 603292 273130
11417 273130 400435 664183 871496 693400 98371 -200967 -111368 109226 513049 843255
11407 843255 447180 -597121 -964034 -1002460 -1157793 -702571 -97398 -133312 -651715 -1523744
11397 -1523744 -1760581 224882 3228677 4817707 4613320 3576978 2586945 2415030 2032808
11388 2032808 1139631 85071 -374992 -612617 -702678 -698943 -744249 -517233 -152240 153906
11378 153906 174372 288966 257115 316982 -264188 -1068921 -941377 -336790 2306 63683
11368 63683 307084 176971 -63325 -456129 -544851 -232947 -175386 -99997 292088 377580
11358 377580 159284 33829 329509 846583 1222890 1098405 1301746 1447807 1241842 1181946
11348 1181946 1234476 1023814 544477 278432 27382 -140630 -56004 -179596 -106634 152971
11338 152971 53680 -135618 98855 310686 278997 257079 161825 172407 397505 1005002
11328 1005002 1373293 1063146 475647 403529 548358 277153 -538115 -1092484 -1248799 -1351915
11318 -1351915 -1038081 -803153 -689709 -341236 -185983 -552886 -543660 -347555 -71628 127157
11308 127157 -93172 -25362 110467 79941 194673 616574 918447 1052883 1239734 1331956
11298 1331956 1255638 1196658 977788 795300 300960 223484 305260 342861 327172 -149812
11288 -149812 -760054 -900543 -430699 -243684 -299301 -437607 -539562 -627411 -589518 -410205
11278 -410205 -375183 -380819 -242447 65950 -11422 -270140 -250673 -161015 -27451 275814 264825
11267 264825 21498 -47212 -84720 -153707 -446995 -501942 88965 334901 82795 65419
11257 65419 300596 294475 291175 284633 455464 402527 78692 -3706 -4457 179080 242999 186507
11245 186507 125580 -190069 -433685 115038 368015 114330 -41477 -326355 -191615 -32003
11235 -32003 22193 107457 -122431 -464113 -307811 102349 160831 -85004 -434342 -886204
11225 -886204 -930870 -684412 -333942 -129963 -202036 -97050 363788 628285 286878 89010
11215 89010 -352759 -721581 -587597 -344028 -318221 -564532 -748088 -517781 -385446 -770849
11205 -770849 -860837 -411623 -71820 -458855 -869520 -930136 -372839 212929 477489 339709
11195 339709 105223 -184955 -313074 -141573 -172144 -335751 -369553 -7170 356263 526541
11185 526541 302140 -266066 -522849 -609664 -631717 -461262 -385786 -151123 23730 149530
11175 149530 421019 619332 494839 49961 -27637 66641 -193478 -522718 -690619 -879226
11165 -879226 -901423 -1251112 -1542483 -1167242 -645441 -191183 -134988 -307570 89248 735108
11155 735108 1004361 974584 936723 751840 255487 -44092 -885694 -1131755 -652200 -762365
11145 -762365 -988328 -989917 -671205 -198971 23811 178431 -204172 -338557 -235734 -168503
11135 -168503 71194 324878 475915 171861 -269914 -310221 110328 479723 563934 450572
11125 450572 172361 215180 537102 724239 671063 645292 678476 946773 1120734 818828
11115 818828 305908 19210 59088 408459 601225 587782 164219 -374887 -447039 -257176
11105 -257176 -261911 -252831 169862 418473 369245 -101824 67344 412923 716995 855335
11095 855335 324417 52283 20551 -240126 -603591 -663843 -267019 -33713 333 -32956
11085 -32956 215531 227373 187636 752163 1185400 1094984 766202 329630 320819 705248 1243906
11074 1243906 1178483 968755 1005212 1052263 1116499 1142709 824647 193041 -53979 -234145
11064 -234145 -603404 -702738 -691053 -790415 -766701 -692867 -482423 -62926 -74426 -294576 5729
11053 5729 342386 474429 371507 370222 581540 627218 583071 870817 568529 -51683 -435018
11042 -435018 -852957 -983250 -855444 -568565 -374956 -200847 23547 292889 705361 125764
11032 125764 -623193 -329993 345814 607902 494826 416000 239194 228727 456259 696529
11022 696529 448743 -181978 -257178 39837 224352 246697 50894 -506552 -640266 14842
11012 14842 500019 540468 416548 265937 197160 360783 540579 628569 250194 79947
11002 79947 390493 838952 802566 168169 -39858 -216202 -467912 -244350 114982 522531
10992 522531 695917 809319 683182 436134 501079 547690 -58816 -270408 -5949 134182
10982 134182 146762 151387 17968 -18951 150311 405854 155547 -419150 -545445 -303839
10972 -303839 200255 281988 33314 -17773 -120981 -383066 -246073 -20402 100290 -34304
10962 -34304 121540 213922 243427 186163 -99646 -9768 83799 96501 88043 33846 251115
10951 251115 262933 10833 -28764 418684 992102 1209621 913467 547059 238947 -165768
10941 -165768 -667538 -925000 -962131 -574249 -559019 -669422 -350125 -265436 -286032 -170038
10931 -170038 -31108 42473 172940 264813 157429 -138319 -270803 -476599 -497776 -607723
10921 -607723 -654894 -871821 -1203915 -1055324 -722576 -553040 -525575 -460251 -355114 -24556
10911 -24556 476596 795744 820413 771118 688786 318065 73659 -126929 -145389 47511
10901 47511 35214 -244323 -545728 -606983 -672642 -633638 -482723 -476179 -341627 96240 510154
10890 510154 352907 366927 691736 784175 925537 742174 157762 -138358 180481 210167
10880 210167 -69964 -346849 -267985 -173354 -23249 315204 502230 302738 89254 96992
10870 96992 183827 504426 931352 893698 612304 290132 23752 28890 350334 508578
10860 508578 353757 42726 106578 211767 253832 134766 12938 175792 437149 520212
10850 520212 949218 1258003 990646 834268 953500 1364095 1424694 1143292 932763 780843
10840 780843 730507 591793 608267 562249 170993 201719 46761 -489485 -468160 -315744
10830 -315744 -122879 -86858 -307983 -100140 230377 475942 444975 459312 843567 1156359
10820 1156359 1283499 1151878 935083 1053912 1298033 1172318 871188 458508 -41495
10811 -41495 -71138 111976 19220 -255719 -333465 -575124 -648832 -437328 -496146 -729460 -791822
10800 -791822 -111901 294781 183088 141289 2463 -124947 52217 391228 506055 322770
10790 322770 70604 -13315 144361 167223 -136392 -353760 -400350 -277751 85764 333476
10780 333476 81802 367673 694463 807231 828109 559447 -54296 -746949 -659489 -300831
10770 -300831 -257227 -227979 313264 641966 885201 792707 530988 374106 245681 277246
10760 277246 364919 555928 485460 289458 152427 149836 277949 286169 278907 302110 442952
10749 442952 443809 333601 -102587 -693404 -613040 -154112 280084 609282 497920 32365
10739 32365 -180577 -171815 -22550 7411 21465 80261 -207198 -521986 -517743 -301118 285155
10728 285155 575240 317912 47542 -141104 -117252 -162703 -23723 335987 409395 622690
10718 622690 537144 382766 131965 4563 40139 -74529 -28027 308010 490298 309433
10708 309433 -83104 -366921 -663465 -645741 -719001 -556267 60181 271937 63705 -149924
10698 -149924 163390 412785 261837 40740 152168 232539 627044 735719 456928 27006
10688 27006 -203439 -254650 -221015 41680 323293 639143 854505 773440 594662 425029
10678 425029 224634 -94871 -236117 -4730 174892 461227 365706 -63897 -35567 85453
10668 85453 -35502 -218589 -534602 -757924 -1007307 -577398 -330681 -141456 62363 -131762
10658 -131762 -136480 108796 782584 921106 676280 680974 740278 646006 275951 117792 221172
10647 221172 388238 560088 313858 -133610 -362002 -427854 -356110 -99415 224762 245133
10637 245133 375264 288356 -346395 -857789 -1120687 -1116531 -793128 -659684 -354213 -170123
10627 -170123 -228046 -350731 -93683 52151 113018 537173 734471 509917 758349 1133955
10617 1133955 1171995 950913 683094 393127 139458 -172783 -555468 -896411 -779353 -428343
10607 -428343 -113749 159455 -48153 -265362 -435231 -132544 -44679 -238780 -150943 -121937
10597 -121937 -255391 -230077 -220637 -102043 216685 290157 -52969 -413045 -280198 -674163
10587 -674163 -1095507 -1013338 -709641 -424109 -384898 -136600 -43245 -18439 -43564 -20227 273852
10576 273852 564098 476565 111808 158041 172937 83687 -7665 101071 189580 215197 150504
10565 150504 -186271 -581247 -583826 -306141 -13424 54230 -122849 36959 284504 727156
10555 727156 973869 407140 -224899 -322099 -307618 -299152 -513538 -655475 -457402 173143
10545 173143 388940 323228 482682 589275 301048 -6160 -362769 -608114 -977762 -1421115
10535 -1421115 -1429599 -1226899 -875750 -723587 -497225 -326068 -100804 195709 -40825 -522774
10525 -522774 -408326 -406109 -728000 -830650 -926122 -1076710 -789825 -423075 -201292 -261748
10515 -261748 -304198 -161088 -190876 9146 240228 432546 686123 327010 -236323 -662790
10505 -662790 -800333 -522922 -285037 -226450 18036 435832 524295 191579 26519 198747
10495 198747 -185009 -566071 -661673 -1063379 -1374920 -1279918 -796087 -581618 -562509 -407572
10485 -407572 -550504 -708471 -739001 -532138 -167667 90789 160499 95767 -124224 -180496
10475 -180496 -98584 -22535 370671 865415 839182 219570 -335437 -397696 -193567 112613
10465 112613 328839 297887 312633 214604 -200599 -370920 -341586 -160114 205710 407597
10455 407597 336107 313979 184616 -173494 -659827 -942314 -1034132 -1024001 -819578 -627925
10445 -627925 -355016 42075 240214 66253 -169605 -111487 -328053 -562817 -289851 -45502
10435 -45502 32945 28579 216536 243905 -18906 45929 439169 684027 806622 859987 768853
10424 768853 882104 966848 678537 394060 15113 -431987 -397740 -677886 -673723 -605621
10414 -605621 -556856 -179378 -11600 199454 280459 -68892 -122226 -129478 -104932 -14983 93084
10403 93084 355900 690281 908882 509363 -29207 -530196 -1044562 -1205650 -1178109 -1147439
10393 -1147439 -1242739 -1225705 -1036193 -495403 -86542 58573 167070 621393 1060521 1089784
10383 1089784 510834 -20765 84811 258876 -35900 40146 182694 254003 294574 -360741
10373 -360741 -899290 -903308 -904249 -786171 -947670 -788418 -596948 -589181 -654982 -631429 -625291
10362 -625291 -679583 -686578 -609256 -570244 -515499 -591863 -799886 -759477 -620120 -605002 -592391
10351 -592391 -582360 -547670 -219791 -69790 -232543 44392 517935 65162 -554931 -523927
10341 -523927 -246946 -40842 217716 382737 764917 738850 739548 997908 847915 494169
10331 494169 295825 199821 343697 214332 153154 178697 357897 639526 602931 362737
10321 362737 322214 609739 191417 -381674 -406095 -591315 -978765 -966140 -742270 -418198
10311 -418198 -98163 520312 1139126 1389578 1549179 1224812 795661 404780 94415 -364858
10301 -364858 -661241 -691530 -552811 -424358 -330387 -240875 -294949 -173488 187294 264878
10291 264878 549093 956014 887766 344146 -246549 -646410 -313116 160238 94998 -212210
10281 -212210 -548319 -515361 -250863 -617131 -957681 -787866 -744315 -463146 213485 505266
10271 505266 371792 154523 -220061 -781035 -911005 -815416 -815473 -825509 -720842 -271695 241319
10260 241319 509013 767333 646003 161068 -300668 -551845 -627732 -512376 -385879 -303040
10250 -303040 29110 87918 77117 124648 107812 364689 296456 -155014 -306310 -266681 -107444
10239 -107444 26955 154640 117988 50395 109759 93137 -149209 -244067 17542 413386
10229 413386 463552 187872 -189309 -421280 -321407 -167820 178660 211943 419489 257413
10219 257413 -52559 -322299 -660490 -565085 -18469 602389 772958 638044 389560 188102
10209 188102 543955 659223 255230 -24257 85300 117548 -134453 -284612 78599 334215
10199 334215 446629 360295 -12380 -136768 159126 196079 145872 628054 696298 653430
10189 653430 286499 -169178 -144826 75741 64305 -33168 18291 -19398 9358 196794 33591
10178 33591 -370302 -540337 -496087 -511156 -636597 -686614 -820930 -1213328 -1295848 -783064
10168 -783064 -235685 75234 68576 243858 543965 443745 177603 246238 -126131 -639186
10158 -639186 -552971 -453090 -467313 -487012 -529188 -625564 -843900 -1130182 -971251 -250626 340605
10147 340605 515125 585213 533643 286097 -7667 -183219 10068 370519 446846 645208
10137 645208 652565 561947 542318 484965 69477 -316857 -207176 -113395 -486487 -861799 -524531
10126 -524531 -180348 -419459 -624254 -511701 -188213 266997 360049 262334 206159 33653
10116 33653 -73261 -149028 -472039 -415203 107409 344291 -77440 -541070 -348406 -179
10106 -179 255018 333815 144906 12540 126346 280087 21912 -203666 -237112 -341797
10096 -341797 -362832 -477234 -344556 6458 459059 462950 -154676 -523079 -637665 -595414
10086 -595414 -398470 -489798 -449905 -484232 -494213 -344798 -290920 -312243 -412765 -359972 -454587
10075 -454587 -623897 -594664 -720231 -843473 -704515 -281161 -173991 -311122 -652047 -677415
10065 -677415 -496845 -648886 -568437 -92050 400678 446876 221136 -141445 -561993 -940775
10055 -940775 -1277494 -1471452 -1242153 -1290121 -1548128 -1307710 -777984 -320010 -81162 254277
10045 254277 392024 40267 -128317 157188 407935 217591 73008 -25866 -152787 -283365
10035 -283365 -164962 -139000 -443411 -211968 168531 477653 613421 534739 356937 221746
10025 221746 126772 163950 389205 613799 720079 872053 940555 993836 1137341 894275
10015 894275 563996 432795 305201 418325 432237 290886 136545 -45931 278478 813455
10005 813455 872458 219811 -340107 -273685 -254691 -423748 -765980 -692744 -519949 -188653
9995 -188653 118526 277941 263798 79651 -114507 -289354 -267469 -136522 146577 142105
9985 142105 -245415 -368157 -366128 -376605 -106558 201700 175508 152423 417131 745764 835134
9974 835134 1021979 1098469 609350 243219 358488 391750 152827 212970 522007 1140905
9964 1140905 1127457 597004 185747 170926 520137 371484 163490 283978 -4700 -354260
9954 -354260 -595183 -725756 -438292 -169289 -105917 17141 76771 -34841 -141690 -67782
9944 -67782 2285 34337 317865 441064 257025 -5809 -279002 -397468 -172507 22643
9934 22643 377385 563762 433485 168025 136606 392021 436562 313436 237911 259652 202440
9923 202440 490124 679473 438339 230952 62350 164811 414948 440186 393846 201756
9913 201756 138329 -134857 -268820 5918 149507 42397 -27594 70973 75652 5114 -13815
9902 -13815 32141 157359 592241 656085 46369 -447311 -501525 -365300 -509058 -618069
9892 -618069 -643140 -402486 -148009 9381 28445 -25061 101944 441665 527348 176819
9882 176819 -181980 -308154 -259702 -171803 -142368 -497739 -591938 -505012 -294796 94379 527950
9871 527950 391740 74207 -354537 -576453 -602467 -581619 -230179 11688 37878 50555
9861 50555 22238 224997 230605 -207636 -485923 -232090 -72369 -446787 -218431 41411
9851 41411 -54196 -238338 -491184 -879042 -775091 -37583 497007 414747 376364 300384 186212
9840 186212 61311 -19421 248268 477220 633552 523264 549154 686160 609884 462893
9830 462893 330622 -119534 -240192 -264180 -296514 -392384 -506700 -345476 -294904 -471705
9820 -471705 -656139 -522500 -504191 -554414 -565530 -370578 60194 405105 245749 103246
9810 103246 112572 171144 69634 -32908 -70611 -248100 -373053 -452983 -677126 -1048154 -1244591
9799 -1244591 -568988 -379161 -476425 -368901 -419877 -549714 -595827 -565850 -426738 -634216
9789 -634216 -1047448 -1153936 -716698 -224107 48315 -90053 -381863 -253278 -301734 -334406
9779 -334406 -446311 -193059 141334 298225 688961 1048426 1413527 1346156 948677 695488
9769 695488 354063 -92086 -314028 -214499 -118898 -259280 -192555 114807 95239 298457
9759 298457 928114 1239598 665174 -209514 -489789 -414212 -312754 -504356 -587044 -57533
9749 -57533 403144 279477 147453 260952 228393 55813 -195377 70193 571855 839996
9739 839996 515791 -36482 -221442 -149195 -448879 -627639 -293449 -59021 287787 501781
9729 501781 463429 685872 685401 569728 734056 756222 540765 468508 283625 130655 423016
9718 423016 532714 442165 936311 1439485 1217123 854334 808370 938508 949005 747342
9708 747342 396209 167906 9936 -66550 -258055 -646938 -691994 -582292 -261983 -77565
9698 -77565 -100973 -199185 -337956 -499574 -312375 -141825 -280477 -644922 -753954 -308450
9688 -308450 -12607 346311 662347 384733 -59498 -316680 -219126 -86943 -183487 -387292
9678 -387292 -503347 -606772 -602269 -621895 -870914 -1092218 -1006512 -727632 -720523 -809383 -824600
9667 -824600 -978592 -850419 -483455 61656 269125 94493 -142438 -274537 -20188 -119993
9657 -119993 -344012 -119290 166368 224069 157361 258142 322049 326739 788676 705299 450035
9646 450035 603696 648461 745989 680176 420299 313382 248835 172116 170175 -37157 -149491
9635 -149491 -95844 64089 176197 259739 532971 656190 665565 458160 -200873 -860344
9625 -860344 -956490 -812252 -478567 -90886 -204823 -434095 -5932 469058 668083 763355
9615 763355 749150 169033 -285164 -356213 -281045 -192681 93256 151396 -335618 -520810 -702959
9604 -702959 -1029921 -1185418 -1093617 -870903 -684043 -740682 -1000775 -1112913 -901977 -926295
9594 -926295 -934995 -599249 63630 738483 990655 624150 266165 374260 393484 286676
9584 286676 135569 288037 609998 774433 570930 75759 -114729 149845 -46295 -656098
9574 -656098 -1289589 -1340294 -1049221 -843430 -623717 -357088 -200478 -230433 -65340 -14477
9564 -14477 -205911 -434760 -752763 -714329 -399214 -55725 290183 295267 314389 542919 672847
9553 672847 575530 415553 315500 455213 461232 558232 818359 1015119 977160 373842 -78007
9542 -78007 -82591 145792 74395 -193113 61016 165059 246314 291807 256438 459712 746580
9531 746580 1021945 904433 350707 -57861 -436364 -552287 -422837 -358885 -352594 -105073
9521 -105073 520411 746275 231809 -315976 -371556 -98042 134357 -21218 186921 546425
9511 546425 192050 -589455 -1109845 -960506 -543980 -594418 -430476 -199986 -273207 -287731
9501 -287731 -352768 -273533 -244740 -164643 11793 -39104 -323103 -654687 -406880 63586 507034
9490 507034 936303 1261175 1358221 745257 133544 122018 406890 1048630 1347803 1105395
9480 1105395 547401 -92968 -751450 -944900 -801305 -445815 -307536 -412266 -345024 -245005
9470 -245005 -247114 -356193 -161881 -64346 -116693 -151286 -66559 273918 250123 -74806 -277392
9459 -277392 -540989 -652834 -310367 83685 158449 43472 -165586 -143490 -19461 75353
9449 75353 -75744 -273613 -499353 -542787 -403372 -175958 201528 416278 316202 44114
9439 44114 -415883 -601484 -300870 27786 327379 418060 339054 255371 385011 104528
9429 104528 -538612 -1082970 -1198727 -680341 -169815 70161 8793 6798 210560 186594
9419 186594 19879 -142672 -221879 -371067 -841846 -1153927 -1214956 -1047063 -997132 -916722
9409 -916722 -693707 -497426 -161357 53483 -149241 -327030 -381508 -249638 -261023 -376626
9399 -376626 -304091 291073 544993 611667 708547 735760 671883 390403 262047 383792 249903
9388 249903 -163598 -374333 -267966 4436 223178 204794 -78196 -154222 -42997 331931
9378 331931 370579 -214607 -594290 -837302 -834617 -354889 -16235 219758 -16914 -435239
9368 -435239 -372894 -202092 -504751 -900371 -586964 -326878 -278042 -426849 -800520 -1052603
9358 -1052603 -944376 -485556 -287567 72761 352697 104130 -403282 -517321 -407213 -430349
9348 -430349 -557027 -935858 -1016795 -956451 -891380 -644314 -189013 104599 251548 235879
9338 235879 378219 660204 985535 1457602 1906579 1674871 777793 102721 -304999 -653845
9328 -653845 -825958 -572253 223820 852728 773511 414529 -94929 -175197 -5573 57645
9318 57645 19495 -21769 71428 -16806 -232938 -359612 -401513 -149651 -282532 -320546 2534
9307 2534 295657 253950 333506 664422 869940 855603 451397 -42463 -414582 -367869 348422
9296 348422 782767 525579 73896 21300 23126 -85907 253076 539289 257301 -287111
9286 -287111 -591469 -688722 -1086579 -1149953 -467140 -264948 -591454 -628289 -524756 -428339
9276 -428339 -297667 -196799 -142120 -226364 -273417 -262884 -187467 109793 81790 248497 340028
9265 340028 398700 -65265 -819228 -839462 -560492 -362844 -712150 -1191984 -1218827 -996475
9255 -996475 -1055235 -1003009 -640923 -450089 -414038 -649960 -1172524 -1646763 -1751928 -1251868
9245 -1251868 -754184 -732100 -940728 -701583 -673359 -285617 527644 898901 628802 238881
9235 238881 181924 139962 -176881 -455289 -528913 -592298 -658704 -788367 -552626 -244687 -224736
9224 -224736 -455107 -808479 -919071 -803473 -994177 -1330681 -1218754 -1179353 -1059099 -617713
9214 -617713 -309868 -332998 -562425 -558601 -378240 -275386 -493675 -714374 -425945 -126720
9204 -126720 -401503 -524483 -516399 -883294 -953235 -474851 -312994 -312052 -488042 -723686 -671062
9193 -671062 -370427 49058 132246 -65786 -379755 -902568 -1241619 -1124744 -838021 -658683
9183 -658683 -423201 -282353 -379975 -691651 -318153 211965 290891 291073 511547 741364 911355
9172 911355 1020881 693036 586309 1012152 1316655 1149982 815859 448591 545441 858323
9162 858323 874965 1029090 1553367 1643796 1149502 485858 290317 332096 -140658 -457970
9152 -457970 -322974 -267674 -134525 -187535 -445082 -452772 -121151 133334 133247 267613 169147
9141 169147 -154320 -341471 -447413 -525904 -852984 -600972 136340 912010 1200923 828756
9131 828756 410703 125032 -196169 -449583 -246446 155951 465307 215388 -300524 -540103
9121 -540103 -518875 -182030 68294 6065 -79048 87538 378501 579245 403448 49584
9111 49584 -9735 23652 -302089 -323066 -207512 -25241 -33155 -147015 -558461 -774036 -674282
9100 -674282 -189717 248223 194165 -140474 -483079 -734712 -724954 -523542 -484162 -695479
9090 -695479 -806766 -884871 -922150 -880094 -1201035 -1472525 -1167332 -1108413 -1077916 -879669 -418305
9079 -418305 82706 612202 936513 893574 767902 469041 154757 -255670 -424399 -386909
9069 -386909 -160873 347177 571508 818152 843149 797699 772514 424564 395573 601814
9059 601814 642737 347380 327346 330768 -20629 -45467 338967 424706 249298 98221 -184045
9048 -184045 -216393 221725 521526 1002525 1244217 981276 424394 131766 -162174 -910087
9038 -910087 -1397226 -1300393 -723382 60256 363432 166150 -157593 -522635 -867535 -1099606
9028 -1099606 -945484 -359631 -179097 -331189 -680106 -1261121 -1528999 -1291953 -1230184 -1365165
9018 -1365165 -1417042 -1163289 -883669 -594377 -480344 -450813 -311036 -258195 -171363 -84637
9008 -84637 -6712 355490 614147 696297 632127 236187 -275585 -526783 -682186 -799894
8998 -799894 -1207517 -1467583 -1236933 -915913 -631685 -604664 -983993 -1114326 -861081 -605640
8988 -605640 -355738 -310517 -370004 -410317 -506391 -600343 -613773 -652469 -728500 -361554 -139976
8977 -139976 -288222 -765788 -637690 -573059 -749419 -705069 -636445 -613057 -315249 -71255
8967 -71255 -133771 -150678 -587578 -1045660 -757493 -313923 -272148 -166736 -34753 -247158
8957 -247158 -367428 80968 490361 498433 308875 303181 -226062 -850210 -823460 -354580 -77535
8946 -77535 -283804 -323755 -160477 -17284 -228857 -495492 -596276 -546756 -540358 -394766 -491546
8935 -491546 -379504 33002 238834 -161869 -807274 -1026755 -1075648 -776801 -362396 -354789
8925 -354789 -697687 -876242 -971939 -888716 -420817 74789 425465 665073 539511 347208
8915 347208 373053 523730 427991 -228595 -603790 -488515 -291454 -43931 22859 5439
8905 5439 271882 562043 443195 222171 493637 650656 406117 -45518 -396921 -538720
8895 -538720 -432845 -162005 -146054 -228697 -320736 -397078 -671343 -713464 -939090 -1308076 -1268437
8884 -1268437 -1083970 -513881 -7834 -185150 -652409 -871516 -802576 -399965 -22167 71222
8874 71222 -37056 -103527 -140372 -583485 -513295 -43966 177237 233095 165095 61633 -183135
8863 -183135 -49401 357394 345976 -48185 -435264 -684723 -889052 -1000337 -1248295 -1286063
8853 -1286063 -1051139 -543392 -1758 252747 -19430 -511179 -792960 -721845 -448830 -277088
8843 -277088 -513182 -745492 -795959 -621898 -503934 -219163 -38495 -19219 -174628 -304271
8833 -304271 -105874 -158626 -367534 -748668 -853477 -603938 -221721 63650 -27111 -118134
8823 -118134 -19927 193107 375377 594177 536671 129008 87413 368050 209355 -268591
8813 -268591 -406082 -466340 -496626 -393338 -127068 165354 379212 434391 323540 440212
8803 440212 498174 442872 532315 870278 1170349 1334711 1028894 409734 -47436 -329886
8793 -329886 -410585 -223558 -320941 -276884 -289459 -231452 -202740 -183406 -138532 -13600 190492
8782 190492 99512 -13221 66732 17901 191183 576605 734273 351194 -51593 -298121
8772 -298121 -658303 -712847 -404080 -103684 -76955 -422954 -757396 -690413 -588462 -510805
8762 -510805 -483977 -624912 -792707 -940558 -1116853 -1027654 -585812 -80780 -10659 -312180
8752 -312180 -436367 -563079 -369965 -131139 115596 126056 201666 197669 -426764 -859671
8742 -859671 -857606 -850125 -811470 -252950 56165 -89913 -43699 -99003 -321180 -353366 -145351
8731 -145351 63433 -131063 -586982 -647839 -456520 -399356 -380730 -554333 -253122 205516
8721 205516 258628 118979 96104 88246 164939 238037 492617 737172 772710 606718 666605
8710 666605 363910 -81065 -115642 -335118 -565634 -106251 527557 668510 599366 478001
8700 478001 639227 1003242 910355 460475 67800 326906 743448 809431 663763 568019
8690 568019 107413 -288995 -404593 -564463 -625609 -386427 41137 290705 580860 1100152
8680 1100152 1598263 1410171 986506 715131 502511 354760 227921 -20613 -575301 -943994
8670 -943994 -703433 -451569 -464560 -385173 -274906 14153 -108013 -332583 -259092 -51013
8660 -51013 213391 254204 -44143 -626307 -1102151 -1177585 -938255 -733696 -381788 -130414
8650 -130414 -19596 147264 306203 -40658 -389851 -691144 -890421 -685875 -322494 -54280
8640 -54280 89872 -92569 48268 203645 341160 533254 288625 -160093 -338577 -10743
8630 -10743 653199 713884 95865 -329031 -253386 -77382 -28884 -234626 -684014 -1109380
8620 -1109380 -972780 -390644 -151291 -289699 -326807 -288399 -464563 -597521 -411465 4634
8610 4634 480069 754780 854920 397003 -213103 -799711 -1153877 -1060408 -416028 290345
8600 290345 109158 -348466 -624072 -616565 -586026 -335493 -309668 -595185 -563000 -599300 -551579
8589 -551579 -461790 -685287 -786833 -686732 -574890 -547209 -333030 -300407 -479009 -958857
8579 -958857 -1031312 -563836 76353 711414 823165 341076 219420 40419 -142340 -312857
8569 -312857 -182058 -201159 -202782 -172847 -416264 -451389 -131451 157999 330172 421379 647962
8558 647962 746972 382009 104528 130057 425314 426933 171530 35156 -178599 -315152
8548 -315152 -108864 90707 157631 274539 528465 263072 -280849 -384328 -498366 -937220
8538 -937220 -759143 -590859 -694440 -529100 -167921 54870 -47881 -560345 -680948 -619201
8528 -619201 -707615 -358419 54188 122604 113546 432201 776641 932540 942090 1384523 2289154
8517 2289154 2916646 3495649 4312035 5678255 7543648 9797121 13451455 19163293 27877088
8508 27877088 39813590 47565837 42020881 30132723 20590270 14589448 10520369 7494287
8500 7494287 5552109 4270514 3406340 2762538 2784617 2532871 2147576 2166109 2396338 2550870
8490 2550870 2232909 1924730 1434043 1293248 1274599 1357524 1353118 995682 573965 161985
8480 161985 209130 605605 830077 981381 1020478 991579 817185 254603 -351364 -735311
8470 -735311 -863584 -1000912 -1210453 -1514944 -1597282 -1652302 -1030257 -171822 276953 497107
8460 497107 456137 46033 -330646 -494762 -325007 -157300 79943 369887 425512 524175
8450 524175 1003576 1049243 418261 161967 266664 193210 -264239 -566411 -35337 721437
8440 721437 814593 499795 297321 259336 169495 23981 -217813 -125971 724403 1092964
8430 1092964 1022748 1077794 1003905 931010 981614 921559 639883 -7340 -486890 -510456 -256264
8419 -256264 486016 941639 715968 128356 -443334 -425568 -441490 -431497 -624795 -773720
8409 -773720 -479517 -257789 -234213 -282332 -3203 187711 -250908 -783859 -903266 -817327
8399 -817327 -624793 -731929 -1170951 -1380334 -1364605 -1470282 -1287742 -750101 -516462 -343413
8389 -343413 8753 521990 776556 699846 424131 217557 -40567 7160 454854 576797
8379 576797 323943 -103765 -630050 -860482 -723219 -587276 -239379 84896 -149632 -551526
8369 -551526 -398767 -232508 -102941 77564 139043 354147 638604 624236 179431 -176752
8359 -176752 -163468 119144 54434 -65363 -206166 -234018 3189 319566 -129247 -780987
8349 -780987 -845955 -877274 -664546 -151441 46916 147650 156213 -147282 -133058 118575 155697
8338 155697 148376 173444 312939 554168 742258 781522 910996 1008880 1089866 948050 942829
8327 942829 1237931 1395198 1115792 751006 480640 191182 12050 -372956 -813148 -949004
8317 -949004 -692063 -557065 -797683 -821173 -331310 -75940 -21191 -55727 -61954 93715 622897
8306 622897 850584 667124 554208 467164 426655 362507 82330 -276412 -347878 -364167 -389329
8295 -389329 -337608 16015 496290 753801 769163 323157 -286170 -532547 -773638 -723544
8285 -723544 -526221 -370651 -103923 219491 370447 246069 361952 414239 517778 747523
8275 747523 746673 778109 997077 863180 581960 492189 277270 -159794 -664023 -795762 -616450
8264 -616450 -458656 -204238 -240388 -467172 -519134 -241375 -152522 -366730 -464677 -350154
8254 -350154 -143072 19764 -97679 -200476 -23130 231520 -20497 66118 -77229 -436186
8244 -436186 -407032 148356 931262 1240485 1474635 1306121 537849 263472 244285 471173
8234 471173 747677 540523 228179 -111143 -67328 128899 41307 -42636 -84066 145017
8224 145017 634883 991924 1020482 915020 690464 649511 651614 442538 384806 289664 116332
8213 116332 -189214 -248267 -63563 388346 830613 1087762 1387650 1966364 2303026 2093125
8203 2093125 2169055 2778832 3272638 4263962 5636322 7287907 9595958 12962747 17956338
8194 17956338 25164728 34483591 42620355 42587001 34442212 25335770 18220330 13310238
8186 13310238 10298329 8250703 6797722 5587560 4640417 4045386 3774976 3377769 2943125
8177 2943125 2436916 1689185 1506029 1949395 2013229 1788235 1488337 1189507 879470 576191
8167 576191 404309 153526 34452 -22702 -342151 -572078 -385915 -313147 129032 807042
8157 807042 1013255 571693 -80724 50548 584523 701515 1020271 1052738 683354 482996
8147 482996 617356 826062 1095921 1456069 1937090 2796805 3613921 4419861 5364962 6795711
8137 6795711 8408862 11097783 15747785 22501869 31520402 40743429 43836505 37392969
8129 37392969 27837485 20155786 15326763 12449942 10088251 7850747 6251019 5294061
8121 5294061 4701453 4312762 3565255 2712011 2267107 2248583 2172351 1725087 1295536 1047922
8111 1047922 995499 1381135 1863764 2121401 1919415 2019493 1965357 1559209 1316859 952400
8101 952400 700099 735680 696002 400926 245664 286469 99310 -54923 -56695 219264 562894
8090 562894 522134 322436 506344 952724 1018315 692750 268824 230338 189141 93869 149312
8079 149312 325750 444295 275706 346035 571867 606793 424200 223069 74883 -7729
8069 -7729 168743 653714 821462 473464 79145 -18407 -465631 -810188 -581401 -419122
8059 -419122 -255517 -349049 -622183 -616331 -764856 -738806 -420889 -465927 -640787 -669691 -882787
8048 -882787 -547724 -30995 139014 255443 347528 540715 866108 1050817 1066000 870116
8038 870116 340698 -192603 -568775 -608746 -717139 -681293 -201864 102970 155397 32748
8028 32748 -202158 -514608 -786416 -763909 -636341 -739670 -802012 -715041 -641017 -468790 -333427
8017 -333427 -143275 77316 3546 -441823 -492358 -323687 -205074 -226544 -227202 -75573 -4654
8006 -4654 -114197 -13338 63619 93356 -112776 -431880 -594835 -498867 -362487 -477878 -493934
7995 -493934 -180212 172612 685148 879782 703338 684098 741522 729299 664203 445724
7985 445724 14037 -306350 -462603 -855585 -1263440 -1103484 -665409 -85795 298580 13322
7975 13322 -363683 -201102 -204346 -178862 66580 186384 -74456 -427806 -690185 -838020
7965 -838020 -498347 47298 149225 250106 567493 360869 -27627 -34233 -203951 -479995
7955 -479995 -215042 147564 518845 854425 817339 532405 212741 237178 233283 193537 302954
7944 302954 301864 -78586 -513978 -690985 -631619 -697606 -649907 -213328 131663 176882 -35512
7933 -35512 -527811 -643221 44590 526173 731202 459625 140537 151480 -31324 -229621
7923 -229621 -553866 -537704 -288406 -92025 56839 210465 324547 504971 609322 390913
7913 390913 135120 192392 365809 600303 900934 1023034 991642 753032 695614 849456
7903 849456 744484 -24996 -373863 -184169 -261652 -390719 -249798 36755 213573 222816
7893 222816 81266 424604 804970 829380 625997 486561 143867 -190411 -185766 -112173
7883 -112173 201903 322530 474063 510117 414589 259531 261121 591283 714879 320836
7873 320836 -21228 -218810 -525558 -828701 -558183 -187213 104547 250661 504856 703022
7863 703022 804958 953692 982377 925903 858401 669496 227840 -140904 -609438 -843979
7853 -843979 -900379 -861191 -688029 -726120 -776058 -723076 -595299 -158536 135395 116333 -311928
7842 -311928 -574773 -357805 -242279 74647 837257 1132726 804835 832295 507438 -181165
7832 -181165 -129209 -168261 -248841 -72506 -93588 -288367 -589085 -372081 151625 61421 -472421
7821 -472421 -546430 -341288 -199020 -183136 -110302 191869 305226 223129 329233 523074
7811 523074 457898 392187 241149 -188094 -648358 -693350 -128322 339173 206526 -137776
7801 -137776 -320187 -197178 129689 430757 345147 -259003 -434674 -424460 -125776 448087
7791 448087 464191 215563 -75151 -446129 -572624 -621079 -710137 -762954 -791383 -593201 -148606
7780 -148606 145241 266595 294927 490812 487322 74111 -178101 -275171 -286809 -201454 427267
7769 427267 767886 589173 428890 755538 731214 336723 170258 44017 86402 179430
7759 179430 331758 750967 1215596 1425567 1225434 843963 406872 49055 -201496 -285008
7749 -285008 -312316 -205830 -203153 -421406 -552044 -362112 -46686 169599 316062 260108
7739 260108 155983 -97029 -295 406151 492605 328172 174590 287972 476546 575026
7729 575026 811352 848135 575455 73483 25078 -157138 -200773 -242726 -610158 -608352 -177486
7718 -177486 375105 678166 431612 194373 -4105 -287856 -517677 -698798 -734922 -465962
7708 -465962 56836 392932 501646 410226 512268 768251 819640 404413 -191335 -614603
7698 -614603 -570851 -655975 -691610 -536346 -238518 -233286 173714 438871 340603 347511 454458
7687 454458 644465 765172 771414 574318 486109 377448 117672 93911 -177338 -425775
7677 -425775 -319087 265057 805289 835904 647218 608011 842530 1085839 853914 336632
7667 336632 -200554 -414592 -233581 -206850 -18543 261826 128157 -168819 116393 716632
7657 716632 1025600 1372901 1697756 1838760 2368181 3374333 4590935 6390767 8502100
7648 8502100 10449580 13669085 19368842 28491502 40377527 47573431 41460314 29897560
7640 29897560 21101535 15310405 11452555 8668731 6823718 5656257 4833990 4271603
7632 4271603 3824446 3399907 3309059 2855860 2007354 1350063 1065626 756668 817878 1383730
7622 1383730 2024439 2189179 1833513 1161098 563738 335975 622926 784569 765923 784770
7612 784770 809886 702996 394516 293026 406555 429344 417613 251069 274721 456775
7602 456775 368814 99268 77795 102600 -195631 -142639 104511 58992 -122721 -316794 -344581
7591 -344581 -58825 441179 1028943 1535925 1398318 710193 360291 469089 573463 740591
7581 740591 905411 648926 296340 487170 603144 315959 60757 -27104 -61083 341868
7571 341868 794483 975552 900659 852349 811851 598613 618110 688827 724245 912830 1110045
7560 1110045 1404509 1914763 2602254 3116738 3377912 3601297 4364495 5553274 7056501
7551 7056501 9563632 13173240 17715178 24373809 33224015 41060600 41155282 33420766 24606540
7542 24606540 18087040 13470418 10441991 8579502 7258185 6163240 5043132 4111318
7534 4111318 3600224 3241239 2614105 1762138 1191148 1272348 1312171 1000520 725388 789257
7524 789257 957261 920714 838298 559206 192753 83006 28696 159522 412479 817276
7514 817276 1133533 1215367 1022520 818763 602058 370573 225389 378447 732295 1006160
7504 1006160 1170881 1447538 1554298 1335738 873220 619743 641412 489889 145705 190485
7494 190485 554923 842235 1102030 961690 854111 952250 842274 685111 397429 -4339
7484 -4339 -52406 65144 403741 823226 725013 375845 449263 921309 1110791 1004542 1061403
7473 1061403 1088948 962411 841400 385613 -171049 -393986 -356525 -211897 -33039 -177458
7463 -177458 -7559 366089 481894 470789 310157 123259 243356 294716 66086 -353698
7453 -353698 -469912 -48575 292912 200788 185411 131276 -101715 51861 432496 634700
7443 634700 571622 458841 441910 626484 465493 108247 163991 374364 717882 664919
$$ [...]
##END NTUPLES=NMR SPECTRUM
##END=
