##TITLE=C13_SAV-58(f4)
 CDCl3, 22400 sc

 26.2.2020
##JCAMPDX= 6.0         $$ Bruker NMR JCAMP-DX V2.0
##DATA TYPE= NMR SPECTRUM
##DATA CLASS= NTUPLES
##ORIGIN= UXNMR, Bruker Analytische Messtechnik GmbH
##OWNER= root
$$ XWIN-NMR		Version 3.5
$$ Thu Feb 27 13:46:31 2020 Russian Standard Time (UT+4h)  she@DPX200
##.OBSERVE FREQUENCY= 50.327896
##.OBSERVE NUCLEUS= ^13C
##.ACQUISITION MODE= SIMULTANEOUS
##.ACQUISITION SCHEME= undefined
##.AVERAGES= 17670
##.DIGITISER RES= 17
##SPECTROMETER/DATA SYSTEM= spect
##.PULSE SEQUENCE= zgpg30
##.SOLVENT NAME= D2O
##.SHIFT REFERENCE= (INTERNAL, D2O, 0, 222.624)
##AUDIT TRAIL= $$ (NUMBER, WHEN, WHO, WHERE, WHAT)
$$ ##TITLE= Audit trail, XWIN-NMR		Version 3.5
$$ ##JCAMPDX= 5.01
$$ ##ORIGIN= Bruker BioSpin GmbH
$$ ##OWNER= she
$$ F:/spectra/data/she/nmr/c13/1/pdata/1/auditp.txt
$$ ##AUDIT TRAIL=  $$ (NUMBER, WHEN, WHO, WHERE, WHAT)
(   1,<2020-02-27 09:48:11.95 +0400>,<she>,<DPX200>,
      <created by zg, POWCHK disabled, PULCHK disabled
       terminated by command 'halt'
       configuration hash MD5:
       00 E9 B6 7A A2 85 ED C7 34 08 36 98 17 FE 4E 26
       data hash MD5: 32K
       38 67 D3 5D A0 09 15 F5 AF F8 00 2A D9 13 BA 4B>)
(   2,<2020-02-27 09:48:15.04 +0400>,<she>,<DPX200>,
      <Start of raw data processing
       efp BC_mod = 2 LB = 1 FT_mod = 6 PKNL = 1 PHC0 = -229.8936 PHC1 = 50.40639 SI = 32K 
       data hash MD5: 32K
       0E 10 76 CA 07 EB 13 88 C4 B9 7F 86 35 B8 A9 45>)
(   3,<2020-02-27 13:44:10.76 +0400>,<she>,<DPX200>,
      <abs ABSG = 5 
       data hash MD5: 32K
       8F 07 85 C2 58 12 6E 49 6E 35 3E 28 E6 E1 3B 05>)
(   4,<2020-02-27 13:44:49.70 +0400>,<she>,<DPX200>,
      <pk PHC0 = 26.9428 PHC1 = -42.4 
       data hash MD5: 32K
       65 1D 60 7F 68 15 8D ED 55 98 E3 28 C1 66 C2 58>)
(   5,<2020-02-27 13:44:53.01 +0400>,<she>,<DPX200>,
      <abs ABSG = 5 
       data hash MD5: 32K
       DB 22 F7 3A C0 1F 83 B9 90 C2 B2 19 24 A6 6F A5>)
(   6,<2020-02-27 13:45:46.48 +0400>,<she>,<DPX200>,
      <pk PHC0 = -12.61106 PHC1 = 19.79999 
       data hash MD5: 32K
       DD 8F EE DA 4F D5 C3 71 CA 0D 61 4A 1C 08 78 D2>)
(   7,<2020-02-27 13:45:49.64 +0400>,<she>,<DPX200>,
      <abs ABSG = 5 
       data hash MD5: 32K
       37 37 8A 0B 53 DF F8 4A 35 4A 22 70 18 DC CF 10>)
$$ ##END=
$$ 
$$ hash MD5
$$ 29 C3 4B E5 C8 0F 53 D5 55 B1 02 B3 6E 3B C4 4E
##$RELAX= 
##$RELAX= 
##$RELAX= 
##$RELAX= 
##$RELAX= 
##$RELAX= 
##$RELAX= 
##$RELAX= 
$$ Bruker specific parameters
$$ --------------------------
##$DU= <F:/spectra>
##$EXPNO= 1
##$NAME= <c13>
##$PROCNO= 1
##$TYPE= <nmr>
##$USER= <she>
##$AMP= (0..31)
100 100 100 100 100 100 100 100 100 100 100 100 100 100 100 100 100 100 
100 100 100 100 100 100 100 100 100 100 100 100 100 100 
##$AQSEQ= 0
##$AQ_mod= 1
##$AUNM= <au_zg>
##$AUTOPOS= <>
##$BF1= 50.322709
##$BF2= 200.13
##$BF3= 50.322709
##$BF4= 500.13
##$BF5= 500.13
##$BF6= 500.13
##$BF7= 500.13
##$BF8= 500.13
##$BYTORDA= 1
##$CFDGTYP= 0
##$CFRGTYP= 5
##$CHEMSTR= <none>
$$ [...]
##$SUBNAM4= <"">
##$SUBNAM5= <"">
##$SUBNAM6= <"">
##$SUBNAM7= <"">
##$SUBNAM8= <"">
##$SUBNAM9= <"">
##$SW= 239.972175391363
##$SWIBOX= (0..15)
0 1 3 0 0 0 0 0 0 0 0 0 0 0 0 0 
##$SW_h= 12077.2946859903
##$TD= 32768
##$TD0= 1
##$TE= 0
##$TE2= 300
##$TE3= 300
##$TEG= 300
##$TL= (0..7)
120 120 120 120 120 120 120 120 
##$TP= (0..7)
150 150 150 150 150 150 150 150 
##$TP07= 0
##$TPNAME0= <>
##$TPNAME1= <>
##$TPNAME2= <>
##$TPNAME3= <>
##$TPNAME4= <>
##$TPNAME5= <>
##$TPNAME6= <>
##$TPNAME7= <>
##$TPOAL= (0..7)
0.5 0.5 0.5 0.5 0.5 0.5 0.5 0.5 
##$TPOFFS= (0..7)
0 0 0 0 0 0 0 0 
##$TUNHIN= 0
##$TUNHOUT= 0
##$TUNXOUT= 0
##$USERA1= <user>
##$USERA2= <user>
##$USERA3= <user>
##$USERA4= <user>
##$USERA5= <user>
##$V9= 5
##$VALIST= <valist>
##$VCLIST= <CCCCCCCCCCCCCCC>
##$VD= 0
##$VDLIST= <DDDDDDDDDDDDDDD>
##$VPLIST= <PPPPPPPPPPPPPPP>
##$VTLIST= <TTTTTTTTTTTTTTT>
##$WBST= 1024
##$WBSW= 4
##$XGAIN= (0..3)
0 0 0 0 
##$XL= 0
##$YL= 0
##$YMAX_a= 28335707
##$YMIN_a= -115109238
##$ZGOPTNS= <>
##$ZL1= 120
##$ZL2= 120
##$ZL3= 120
##$ZL4= 120
##$ABSF1= 222.624
##$ABSF2= -17.3728
##$ABSG= 5
##$ABSL= 3
##$ALPHA= 0
##$AQORDER= 0
##$ASSFAC= 0
##$ASSFACI= 0
##$ASSFACX= 0
##$ASSWID= 0
##$AUNMP= <proc_1d>
##$AZFE= 0.1
##$AZFW= 0.5
##$BCFW= 0
##$BC_mod= 2
##$BYTORDP= 0
##$COROFFS= 0
##$CY= -3
##$DATMOD= 1
##$DC= 0
##$DFILT= <>
##$DTYPP= 0
##$F1P= 0
##$F2P= 0
##$FCOR= 0.5
##$FTSIZE= 32768
##$FT_mod= 6
##$GAMMA= 0
##$GB= 0
##$INTBC= 1
##$INTSCL= 4.134877e-10
##$ISEN= 128
##$LB= 1
##$LEV0= 0
##$LPBIN= 0
##$MAXI= 10000
##$MC2= 0
##$MEAN= 0
##$ME_mod= 0
##$MI= 0.1934396
##$NCOEF= 0
##$NC_proc= 2
##$NLEV= 6
##$NOISF1= 120.0001
##$NOISF2= 80.00006
##$NSP= 0
##$NTH_PI= 0
##$NZP= 0
##$OFFSET= 222.624
##$PC= 1.4
##$PHC0= -215.5619
##$PHC1= 27.80638
##$PH_mod= 1
##$PKNL= yes
##$PPARMOD= 0
##$PSCAL= 0
##$PSIGN= 0
##$REVERSE= no
##$SF= 50.3227315989248
##$SI= 32768
##$SIGF1= 140
##$SIGF2= 120
##$SINO= 11.81781
##$SIOLD= 32768
##$SREGLST= <13C.CDCl3>
##$SSB= 0
##$STSI= 32768
##$STSR= 0
##$SW_p= 12077.2946859903
##$SYMM= 0
##$S_DEV= 0
##$TDeff= 32768
##$TDoff= 0
##$TI= <>
##$TILT= no
##$TM1= 0
##$TM2= 0
##$TOPLEV= 0
##$USERP1= <user>
##$USERP2= <user>
##$USERP3= <user>
##$USERP4= <user>
##$USERP5= <user>
##$WDW= 1
##$XDIM= 32768
##$YMAX_p= 432558603
##$YMIN_p= -4122024
$$ End of Bruker specific parameters
$$ ---------------------------------
##NTUPLES= NMR SPECTRUM
##VAR_NAME=  FREQUENCY,     SPECTRUM/REAL,   SPECTRUM/IMAG
##SYMBOL=    X,             R,               I
##VAR_TYPE=  INDEPENDENT,   DEPENDENT,       DEPENDENT
##VAR_FORM=  AFFN,          ASDF,            ASDF
##VAR_DIM=   32768,         32768,           32768
##UNITS=     HZ,            ARBITRARY UNITS, ARBITRARY UNITS
##FACTOR=    0.368581032318806, 1,           1
##FIRST=     11203.0474431902, 0,            0
##LAST=      -874.247242800138, 0,           0
##MIN=       -874.247242800138, -4122024,    0
##MAX=       11203.0474431902, 432558603,    0
$$ Real data points
##PAGE= N=1
##DATA TABLE= (X++(R..R)), XYDATA
$$ [...]
15865C62772K25473n9185o6256L020J85033J44205k4774k18131j4624O4999k59472
15854C43060k13916K32063J54904l41382m10045n07442j62826J17673L19526N95119
15844A26734K98854m01656n41532j92608J81401M51631Q2421K80450M71781L47950
15834A105426N01689J59220o07988r30047r2666M89317j18097m65717n4618K57420
15824B43939J85018r1374j32323O9352o9721j86491k37567J98741J96016m51929
15814b76339k71544n2967j20359Q1808J76082K1511R5988L33205J98752M6763
15804B32900K89989N53591Q419m8419j70548m62000j46519K63816P8482q5667
15794E14044O8904K39461K36802n1100k5298K4620l69657l86103J61617K51165
$$ plain form
15865 362772 588245 529060 462804 465824 650857 795062 770288 552157 537533 602532 343060
15854 343060 129144 361207 516111 174729 -235316 -742758 -905584 -787911 -468385 126734
15844 126734 425588 23932 -517600 -710208 -528807 -77176 5245 285695 757476 1105426
15834 1105426 1607115 1766335 1158347 228300 135634 624951 506854 41137 -13481 243939
15824 243939 428957 337583 205260 274612 204891 18400 -219167 -20426 175590 -276339
15814 -276339 -547883 -600850 -721209 -639401 -463319 -441808 -345820 -12615 186137 232900
15804 232900 522889 1076480 1084899 1036480 865932 403932 257413 521229 599711 514044
15794 514044 582948 822409 1059211 1008111 982813 1007433 637776 251673 413290 664455
15784F64455R486l32901k12554M5948J10090K86460j8364k19857l86586m55135
15774e08958J687R5284j50276l3884J15511N4606N6806r8998o7311P1170K56318
15763b08045M7115j18116M43150K87539r400n3520P3371j82492j52706K24557
15753C51453J35837k10410j58879M1664m1209O0536o6551l30277j95593R3978
15743c19451K71621Q583K3088J4745k22052k79784k12638K27877L84797J16606
15733A3392k51884j76892l07331m18450k22051L4600K42670L20724L53149J30642
15723b81431j93740j79120J1772L8010l3112j7151L12210L42599R0054l75424
15713b85333k39961j00955J01007K54011l1035J00766R3530j42599k03495L60696
$$ plain form
15784 664455 673941 341040 128486 174434 284524 570984 552620 332763 -53823 -508958
15774 -508958 -507271 -411987 -562263 -596147 -480636 -426030 -369224 -468222 -535533 -464363 -208045
15763 -208045 -160930 -279046 164104 451643 442243 388723 462094 279602 126896 351453
15753 351453 487290 276880 118001 159665 118456 178992 112441 -217836 -413429 -319451
15743 -319451 -47830 -39247 -16159 -1414 -223466 -503250 -715888 -488011 -103214 13392
15733 13392 -238492 -415384 -722715 -1141165 -1363216 -1328616 -1085946 -765222 -412073 -281431
15723 -281431 -475171 -654291 -642519 -604509 -637621 -654772 -342562 37 90091 -285333
15713 -285333 -525294 -626249 -525242 -271231 -302266 -201500 -107970 -250569 -454064 -93368
15703i3368M27691l75697m59402n0653l303j02767p6915k7436J72908L95633o3906
15692b57215K8867K77821J00032L7202p3403k7788K74832j0326k76498R0806L85345
15681E49675Q7041P999O0764Q0406J56226o7548m43505k91552K0558j00441j52528
15670i2905k29129l54058m98477j47641R24354L40375m3765L64196J31247M1486
15660D35683P4817q0581o1062q8840k63067j89305j39371j57874L00664K93585
15650A24649k00855j81512q0442J16356M9370n6929j89559j27828K11189Q0195
15640b55366j37447p6213N52510L80435n79276k26733j1528M6554o0558P6551
15630b91071J19117j01797M2001k20626k91859K2195L74571M50184l3892l02163
$$ plain form
15703 -93368 334323 -41374 -500776 -551429 -554732 -657499 -734414 -761850 -588942 -193309 -257215
15692 -257215 -228348 49473 149505 186707 113304 85516 360348 350022 73524 164330 549675
15681 549675 636716 644715 705479 785885 942111 874563 431058 139506 160064 59623 -92905
15670 -92905 -322034 -676092 -1174569 -1322210 -397856 -57481 -101246 262950 394197 435683
15660 435683 510500 429919 368857 280017 16950 -172355 -311726 -469600 -168936 124649
15650 124649 -76206 -257718 -338160 -221804 -172434 -229363 -418922 -546750 -335561 -255366
15640 -255366 -392813 -469026 83484 463919 -115357 -342090 -353618 -307064 -367622 -291071
15630 -291071 -171954 -273751 -231750 -452376 -744235 -722040 -347469 102715 68823 -233340
15620b33340k58510q3173m7829k8058O5846K25467j48969j41012K29124K95122
15610a25332q545j10986j23877L7512M04056L9196j82652J27699o0405k87875
15600b91209J32130J11402q8384m2213J80055M06161N47313J04200k0993k19175
15590H19287m78129l01213R6290R9319o1773k51980l27226m2600K15760k832k95360
15579e30457J56876N87842J13931J28670n0551p50962k50833K46955L02621J73920
15569A28012r3292L22718K79695k41868l78829l8701M65028L89733L8054m23869
15559D46681l76662n8271j43741j66281o086J18195M44522K46770J51432j1010
15549F45549l7964l47899l41927k63819j86151k9078k35487r1438L69931K25544
$$ plain form
15620 -233340 -491850 -575023 -622852 -650910 -585064 -359597 -508566 -649578 -420454 -125332
15610 -125332 -133877 -244863 -368740 -331228 72828 112024 -70628 57071 -3334 -291209
15600 -291209 -159079 -47677 -136061 -178274 1781 407942 955255 1059455 1038462 819287
15590 819287 341158 39945 136235 235554 173781 -78199 -405425 -448025 -232265 -235097 -530457
15579 -530457 -373581 214261 328192 456862 406311 -344651 -595484 -348529 -45908 128012
15569 128012 34720 357438 637133 395265 16436 -22265 442763 832496 870550 446681
15559 446681 70019 11748 -131993 -298274 -304360 -186165 258357 505127 656559 645549
15549 645549 607585 259686 -82241 -346060 -532211 -561289 -796776 -888214 -518283 -292739
15539b92739J72186J51028j32045j2414k79504k25917J09618Q6649Q2284K25853
15529a15001O6597J80463M47048M94900k2316l16420j66089J43145L93515K99598
15519A405440k24030m12904j91504J57349J76561j34676j30193J54207j33867
15510F66383n42713n38302j01342m3150n4074p5280O3145q5638O3004M56385K26678
15499C5096q2525j29930Q39J14767J43292J70881J67436K2748j39585j51696k33972
15488h2649k12163k38697J93679K25065q6673r5849k3795n0642k33782k73810
15478h79316j79745K18570M8909j12989o8286K74255N68836K18723p6114j83588
15468a70745m0220P0083K92007M54636R9873m03394l74999j03272m3068N96556
$$ plain form
15539 -292739 -120553 30475 -101570 -113984 -393488 -619405 -509787 -423138 -340854 -115001
15529 -115001 -48404 132059 579107 1074007 1051691 735271 569182 712327 1105842 1405440
15519 1405440 1181410 768506 577002 734351 910912 776236 646043 800250 666383
15510 666383 123670 -414632 -515974 -559124 -613198 -688478 -625333 -710971 -647967 -191582 35096
15499 35096 -47429 -177359 -176520 -61753 81539 252420 419856 442604 303019 151323 -82649
15488 -82649 -294812 -533509 -339830 -114765 -201438 -297287 -321082 -371724 -605506 -879316
15478 -879316 -1059061 -840491 -791582 -904571 -972857 -698602 -129766 88957 12843 -170745
15468 -170745 -210965 -140882 151125 605761 705634 302240 -72759 -176031 -219099 377457
15458C77457K51463l16538k23141j52482k97802j59098j57230k58010p400J01026
15448h41755k08421l68752l00997J29507K26643L72226K85226K01375M65986K66520
15438B27558m1498k83784n63336l39589P0806J73508J34668j12501k94386k81060
15428a309614o9782J92479R3926J24980L04963M23456J66084p0897Q0534K53569
15418A89698J20912J93301J92133o2423k09603p9082k36479m04999K51650N28764
15408D83872L25277J77851j51822l13617o14823p26262k19069L93156N84153J10572
15398D9288p4784Q242l41783j43639O9844o7726o2093J74142L13046J86786J79849
15387B91172K13490J7436k17507n15227l76216M1166N29348L95037j11421n28245
$$ plain form
15458 377457 628920 312382 89241 -63241 -361043 -520141 -677371 -935381 -942781 -841755
15448 -841755 -1050176 -1418928 -1719925 -1590418 -1363775 -991549 -706323 -504948 -38962 227558
15438 227558 186060 -97724 -661060 -1000649 -929843 -756335 -621667 -734168 -1028554 -1309614
15428 -1309614 -1379396 -1186917 -1092991 -968011 -663048 -239592 -73508 -144405 -63871 189698
15418 189698 310610 503911 696044 633621 424018 344936 108457 -296542 -44892 483872
15408 483872 809149 987000 835178 521561 -93262 -819524 -1038593 -645437 -61284 49288
15398 49288 -25496 -17254 -359037 -502676 -432832 -500558 -562651 -388509 -75463 111323 291172
15387 291172 504662 522098 304591 -210636 -586852 -545686 -16338 378699 267278 -260967
15377b60967l94549l81464p4746K45386P9659k28020l40957j35052k16509J94951
15367a512268L82254L6996J0885o7865j31214J77784j76993L5115L16486J45203
15357g83617L34882K09567J9251K40648M25518R0740l95574L1088J68661r0234
15347B50930k66687l17787l24802j61104J30859L23697L77203J86599J55304r2153
15337B62059j4385L09802l65671m87469l47272J97046N49186O6399k53928o9587
15327a53820q3611j45968l9871q6779l3959m2940j58829K6787J48307R5026L07915
15316a67742L23050J22535m0225Q9371K26314J60391J27165k04601j87846j84581
15306B63831q2967j17221m12485l37006L65898M24040k30942n14627l35826j89360
$$ plain form
15377 -260967 -655516 -1036980 -1111726 -866340 -786681 -1014701 -1355658 -1490710 -1707219 -1512268
15367 -1512268 -1130014 -1093018 -1082133 -1149998 -1281212 -1103428 -1280421 -1245306 -928820 -783617
15357 -783617 -448735 -239168 -219917 20731 446249 536989 141415 172503 341164 250930
15347 250930 -15757 -333544 -658346 -819450 -688591 -364894 12309 198908 354212 262059
15337 262059 247674 557476 191805 -295664 -642936 -445890 103296 169695 -84233 -153820
15327 -153820 -237431 -383399 -423270 -510049 -544008 -586948 -745777 -718990 -570683 -475657 -167742
15316 -167742 155308 277843 237618 326989 553303 713694 840859 636258 448412 263831
15306 263831 180864 63643 -348842 -685848 -319950 104090 -126852 -641479 -977305 -1166665
15296a166665j09674K24322K28333P1510L00425M20973N4570L18260J30247k73915
15286A98386l71612Q2024L86937J03359P4363j37268k93662m2120l8094k65916
15276c03603j74755K18924L50643L68982J4208m28904n24272k8311L08859J17835
15266h0394K51095M59137J81401l08782o06053k85466Q3751J21710J47782K2772
15256a3047M4870K1076K4946r5360j10183L50849K14821k53103k74666N5697K55380
15245B21280K80776L61896J21919k24723l65054m61268j66787Q6331Q3740K1509
15235d0381N9980J33238M6745j78417k11113k85129k64640K56984L36700j49576
15225b95609m07421J68459N38801L55613l90757l37749J19149N3485Q7258N2693
$$ plain form
15296 -1166665 -1276339 -1052017 -823684 -752174 -451749 -30776 23794 342054 472301 198386
15286 198386 -173226 -91202 295735 399094 473457 336189 42527 407 -37687 -303603
15276 -303603 -478358 -259434 91209 460191 474399 45495 -478777 -507088 -198229 -80394
15266 -80394 170701 629838 811239 502457 -103596 -389062 -305311 -183601 -35819 -13047
15256 -13047 31823 52899 77845 -17515 -127698 223151 437972 184869 -89797 -34100 221280
15245 221280 502056 863952 985871 761148 396094 -65174 -231961 -145630 -61890 -40381
15235 -40381 19599 152837 199582 21165 -189948 -475077 -739717 -482733 -146033 -295609
15225 -295609 -703030 -534571 4230 359843 -30914 -368663 -249514 -196029 -108771 -56078
15215e6078j83798j90934N7222J18442M1154J65656J32520j13562j33106L16161
15205A53677N48540j0031l37770Q0830L21600K41684j61674j69243m73869n07388
15195c13644r7292j59024j76509K99331M56860Q1176j88530k81249N650N52719
15185A79488L67648K8069K50356J83865J18263l38003o19092m13095k37435P8831
15175d01105K25705J39284n19287j90857J63674j04223q1423l19003l3508M82326
15165f38417O27296Q5459k53129J28542J60872K4108J48686j67688k24384J44717
15155C6062J68940j50750j79279j74147n64503n32997J50230J71658j74531J47584
15145a101733L43479O8040k83471m3360K17904K01905l668k62522l2645J77356
$$ plain form
15215 -56078 -239876 -430810 -373588 -255146 -213992 -48336 84184 -29378 -162484 153677
15205 153677 702217 692186 354416 435246 756846 998530 836856 667613 193744 -313644
15195 -313644 -410936 -569960 -746469 -447138 9722 90898 -97632 -378881 -373231 179488
15185 179488 547136 575205 825561 1009426 1127689 789686 170594 -242501 -479936 -401105
15175 -401105 -175400 -36116 -555403 -746260 -582586 -686809 -768232 -1087235 -1120743 -638417
15165 -638417 -11121 74338 -178791 -50249 110623 134731 283417 115729 -108655 36062
15155 36062 205002 54252 -125027 -299174 -863677 -1396674 -1246444 -1074786 -1249317 -1101733
15145 -1101733 -758254 -690214 -973685 -1017045 -799141 -597236 -600904 -863426 -896071 -718715
15135g18715N10385M90249J48958J29326k48001l48550K69351J80768j15158L12290
15125F10903M36711j60036m08779m51022j49302J70594r5396j82576J31048P5134
15115b2721J83320J74599Q513q7153m11948l99849L24864N31471n5509l17695
15105g2108k58202k16562j11929l42462k24880K1874k28673k03148J38759K10012
15095a287319L54761N09717J50757J93475L02584L5842l1660n9341l32756j40435
15085c04375K49262L02211K72788L9794m0703R6960l88326o57382n6913K56331
15075b30353P1892k5480k56768o59140k04211L36041M92948L9259k7336K9065
15065d34083j81095J00320J76970J78608K4935j61005J91L5865M53221K76620
$$ plain form
15135 -718715 -208330 281919 430877 560203 312202 -36348 233003 413771 298613 610903
15125 610903 1047614 887578 478799 27777 -121525 49069 -46327 -228903 -97855 -22721
15115 -22721 160599 335198 343711 256558 -155390 -555239 -230375 301096 245587 -72108
15105 -72108 -330310 -546872 -658801 -1001263 -1226143 -1204269 -1432942 -1636090 -1497331 -1287319
15095 -1287319 -932558 -422841 -272084 -78609 223975 259817 228157 168816 -163940 -304375
15085 -304375 -55113 247098 519886 559680 518977 615937 227611 -429771 -486684 -230353
15075 -230353 -158461 -183941 -440709 -1099849 -1304060 -968019 -475071 -435812 -463148 -434083
15065 -434083 -615178 -514858 -337888 -159280 -134345 -295350 -295159 -259294 193927 470547
15055D70547j73341m93103l29880J11528J53736J19103J18599L24023J28691p7154
15045C52749K06348j10092j00780J81753K01627R3398k42690k28225O9764J97421
15035F21273k05820k29155k47657j77992k21627r3714L10913j6184j92028m2817
15025d94808k99995k38043k10094l383K66619N04605L47000j02188k19854R7493
15015c52648L70740K68512l0184l76653j47780J33744o1230k47983k940o6429
15005e12851M4377O8051o2843j66582j81633L5335K08795L99933K05189K88431
14995C26202M9020j39242k05213K4817r996r8934n1151l25272l20620N4382M83801
14984b12206M61130m3699k82822j65995J43065K2339m110L6301j67845l16255
$$ plain form
15055 470547 297206 -195897 -525777 -414249 -260513 -141410 -22811 301212 429903 352749
15045 352749 559097 449005 348225 529978 731605 825003 582313 354088 423852 621273
15035 621273 415453 186298 -61359 -239351 -460978 -554692 -243779 -259963 -451991 -494808
15025 -494808 -794803 -1032846 -1242940 -1246323 -979704 -475099 -128099 -230287 -450141 -352648
15015 -352648 18092 286604 256420 -120233 -268013 -134269 -195499 -443482 -446422 -512851
15005 -512851 -468474 -400423 -463266 -629848 -811481 -776146 -567351 -167418 37771 326202
14995 326202 375222 235980 30767 55584 45588 -53346 -104497 -429769 -750389 -696007 -212206
14984 -212206 248924 205225 -77597 -243592 -100527 -78188 -82298 -45997 -213842 -530097
14974e30097m73459o3797K91525J40593K63523M69527M20838l3765l85084K41536
14964C41340Q06442M9759n21329l07731l63525l55659M06877K89088j96745k23764
14954g5247k08166N4583J82194K85666k31263j48386j05151l34259K14464J10804
14944b54761l36070j92254P385K57934O55415K82009j80003j16061R0681N6403
14934B70678k77474k81567m01780m17619j86682N26912Q22894N63373j25876l20915
14924A71944j42973k7862k63512m68692K50533P84827N03114K54498k39733n12387
14914C09757l07201m03837J31711N26884j13080o32890l60886j50577J24090q4030
14904i60059J0472L37966P8633m51312n1226M07426M96011K93661M7672O2676
$$ plain form
14974 -530097 -1003556 -1067353 -775828 -635235 -371712 97815 518653 484888 99804 341340
14964 341340 1147782 1197541 676212 368481 4956 -350703 56174 345262 148517 -75247
14954 -75247 -283413 -228830 -46636 239030 7767 -140619 -245770 -580029 -365565 -254761
14944 -254761 -590831 -783085 -775700 -517766 137649 419658 239655 123594 214275 270678
14934 270678 -6796 -288363 -690143 -1107762 -1294444 -767532 55362 618735 492859 171944
14924 171944 28971 1109 -262403 -731095 -480562 304265 807379 1061877 822144 309757
14914 309757 2556 -401281 -269570 257314 144234 -488656 -849542 -1000119 -876029 -960059
14904 -960059 -949587 -611621 -532988 -984300 -1035526 -628100 -132089 161572 209244 271920
14894B71920j78047k98902r0893O119j75994j47368K03092J58517j42176k00682
14884e94414j08004K89057K98635l08243k82909J39469M36744L35738q4429k95420
14874a73776j631K15334J52736J46484k48759o24409k79598K42940p2435o3769
14864g06883K26146L25170P5323J1596R822m4879n1208M2937Q437k41358m13872
14853g58769j78679J48126K01792J85093K7614L1082J62719P4994l58069n21432
14843i85529k17069j2114k6774P2861O33994O65630K65487J80126K57165P7399
14833I11176j73377k08147l91784l30851k88616k4164O1483n6072L39848K43793
14823H3289J11253O935k89104j64456J84959m8445j41175J16448Q5559j30695
$$ plain form
14894 271920 93873 -205029 -295922 -289803 -465797 -613165 -410073 -251556 -393732 -594414
14884 -594414 -702418 -413361 -114726 -422969 -705878 -566409 -129665 206073 121644 -173776
14874 -173776 -175407 39927 192663 339147 90388 -534021 -813619 -570679 -643114 -706883
14864 -706883 -480737 -155567 -80244 -68648 -58826 -103705 -154913 -111976 -103539 -344897 -758769
14853 -758769 -937448 -789322 -587530 -402437 -374823 -343741 -181022 -106028 -464097 -985529
14843 -985529 -1202598 -1214712 -1241486 -1168625 -534631 130999 396486 576612 833777 911176
14833 911176 737799 529652 137868 -192983 -481599 -505763 -444280 -500352 -160504 83289
14823 83289 194542 201477 -87627 -252083 -67124 -115569 -256744 -140296 -54737 -185432
14813a85432j86314j23507k9761K276N4666K92352N93760K76233k27243q1038
14803C85992O7916j06641j93026k58978j32386L95107M96271n3541m77984k26871
14793a04141O4354m4497K7462J2200q2450j18310J69830L66367J22048q3242l62386
14782c2765k41349r6192L0498J98213p1189m2579j7411l04772j67448K99849L68291
14771g6854J7021k49613J13474L75538K26752k2632l39173k32881k14588J10964
14761b91992M05990R7041n93301n29203p3632O28917P74970M13424J04365J59462
14751A096041L53355J41696J51859n6746m64779m21235L9162k1063o3479l82100
14741C72711k78764J06063P46J6291L31084M6851k10903l09819q6933m1943l88959
$$ plain form
14813 -185432 -371746 -495253 -525014 -522738 -468072 -175720 418040 694273 467030 385992
14803 385992 453908 347267 154241 -104737 -237123 157984 654255 600714 122730 -104141
14793 -104141 -39787 -84284 -56822 -44622 -127072 -245382 -75552 290815 412863 329621 -32765
14782 -32765 -274114 -370306 -339808 -141595 -212784 -255363 -272774 -577546 -744994 -445145 -76854
14771 -76854 -59833 -309446 -195972 179566 406318 383686 44513 -188368 -402956 -291992
14761 -291992 113998 211039 -382262 -911465 -985097 -356180 418790 832214 936579 1096041
14751 1096041 1449396 1591092 1742951 1686205 1221426 800191 839353 818290 754811 372711
14741 372711 93947 200010 200756 217047 548131 594982 384079 74260 -12673 -54616 -443575
14730d43575k31045J54813M82580N29795L58006L5710K6308m280j28051j22282
14720F57979k91757o97472p09117R9783k4422l3558K37626M2660J51820L11477
14710b54981K11199N3163O0531q7719O0347K86360k2166k49760k30797k24390
14700c98213m8178J86439Q2011K05947K12094J57249k22458m55038l38075o9811
14690f88033L70156J37346k21997k71008l43693J71949K42795o4116K13988L40137
14680a12476R7917M8563L56140K68917r8180l71452j47359r2654J3202j27694
14670a65076k80975j24595M12868J43623j90616L2074n3085l24299J8843M32882
14660i8356j46691k08530r9404P867M84909M9661m1289j9811K5414n0641l79949
$$ plain form
14730 -443575 -674620 -519807 -37227 492568 850574 886284 912592 908312 780261 657979
14720 657979 366222 -331250 -1040367 -940584 -965006 -998564 -760938 -718278 -566458 -254981
14710 -254981 -43782 9381 69912 -17807 42540 328900 306734 56974 -173823 -398213
14700 -398213 -446391 -259952 -177941 28006 240100 397349 174891 -280147 -618222 -688033
14690 -688033 -317877 -180531 -402528 -673536 -1017229 -845280 -602485 -666601 -452613 -112476
14680 -112476 -14559 34004 390144 659061 560881 189429 42070 -50584 -37382 -165076
14670 -165076 -446051 -570646 -157778 -14155 -204771 -172697 -225782 -550081 -531238 -98356
14660 -98356 -245047 -453577 -552981 -545114 -60205 -10544 -51833 -71644 -46230 -96871 -476820
14649d76820l42897j58274l3016K50920J9296K9622j91388j86819J29576J42317
14639h17483J14554m4663J13990K70931K00636o4095j49634K73164L76927j75127
14629I9200k650K11208R8123J2028j21540r2088k44349l24464j32832R3985j77789
14618e81168j2269L29363q028n79141k08350J19147m0106L07697N05166J28673
14608c9016l5410q8780O084l37712K8646M71799K53194j63020k17487k89968m52511
14597h64181o2885J18034m6063L915J65077K93689L14635k37844j67182J80076
14587c02729K12343K35214J40155J5463m60091l98206N4085R2689K33738J28542
14577d8797j8613j32782l54343o91626M215M62343M83283M84617N7977l54874
$$ plain form
14649 -476820 -819717 -977991 -1011007 -760087 -740791 -711169 -902557 -1089376 -959800 -817483
14639 -817483 -702929 -747592 -633602 -362671 -162035 -226130 -375764 -102600 274327 99200
14629 99200 96550 307758 405881 417909 296369 204281 -40068 -364532 -497364 -403379 -581168
14618 -581168 -593437 -264074 -272102 -851243 -1059593 -940446 -980552 -672855 -167689 -39016
14608 -39016 -74426 -163206 -157122 -494834 -466188 5611 258805 95785 -121702 -411670 -864181
14597 -864181 -927066 -809032 -855095 -851180 -686103 -392414 -77779 -315623 -482805 -302729
14587 -302729 -90386 144828 284983 300446 -159645 -557851 -503766 -411077 -177339 -48797
14577 -48797 -67410 -200192 -554535 -1246161 -1241946 -779603 -296320 188297 246274 -108600
14567a08600l42054m36221j87580m8146J46688O5362j24338k65707j17586K22382
14557a195800L07627J49980j50899M6377O6343j496K06770J45705J22156L65394
14547F2157L99788l6881j31829k75622n08060q2744n5632P9269L19218M19191
14537A88855K01270l27338K24291J77513k76706l36942j47057j14213L20485K71864
14527A82022p9781j08919j57401j89165j61961J74406L81965K34904J80783J62862
14517F19715k21525j97317k33123J17354J44903j0245J1625J9041L46073K27976
14507H24477o1256k82787m89868q4591K30575L12480k2539m33916k49091j7843
14497b74359K48285K89077O8865R9596O4862j32146j82321M7036J76912l69422
$$ plain form
14567 -108600 -450654 -886875 -1074455 -1122601 -975913 -910551 -1034889 -1300596 -1418182 -1195800
14557 -1195800 -888173 -738193 -889092 -842715 -776372 -777868 -571098 -425393 -303237 62157
14547 62157 461945 425064 293235 17613 -490447 -573191 -628823 -549554 -230336 188855
14537 188855 390125 62787 287078 464591 187885 -149057 -296114 -410327 -89842 182022
14527 182022 102241 -6678 -164079 -353244 -515205 -340799 41166 276070 456853 619715
14517 619715 398190 200873 -32250 85104 230007 219762 231387 250428 596501 824477
14507 824477 763221 480434 -9434 -94025 136550 449030 426491 -7425 -256516 -274359
14497 -274359 -26074 263003 331868 431464 496326 364180 181859 228895 405807 36385
14487C6385p57451m36346J10526j8585L28964M27737n796O0548J2933J50283J88182
14476I7380m483k3438O996O5661n0147l89994q2653R5036m7374J47328K20499
14465C4811o0706l3755j41334l10211j8551J47614Q356k10329r4158K6242Q0990
14454e71031M44350L90434j03329j48403O6936n8185j94737J24945J78671o043
14444A23608j67326Q2850J00986o4472j64011j65528l97329j4857N19602N99056
14434D52579O63247k038k78115j11981j99906j95957j56071M9167M69558k40612
14424D49871n99289P6990J33701j61236n9036j64347l79003m23555r4233M21966
14414g98171M61244J70850O7703k73164j48530K23930K35746R4842l1164l12954
$$ plain form
14487 36385 -721066 -1157412 -1046886 -1065471 -736507 -308770 -314566 -254018 -241085 -90802 97380
14476 97380 92897 69459 76455 142116 91969 -298025 -380678 -285642 -333016 -185688 34811
14465 34811 -25895 -59650 -200984 -511195 -529746 -382132 -373776 -584105 -678263 -652021 -571031
14454 -571031 -126681 263753 160424 12021 78957 20772 -173965 -49020 129651 123608
14444 123608 -43718 39132 140118 75646 -88365 -253893 -651222 -666079 -146477 452579
14434 452579 1115826 1113788 835673 723692 523786 327829 171758 220925 690483 449871
14424 449871 -149418 -72428 61273 -99963 -158999 -323346 -702349 -1125904 -1220137 -798171
14414 -798171 -336927 -166077 -98374 -371538 -520068 -296138 -60392 34450 3286 -309668
14404c09668l0541K49786j24265j67119J45735P1278k1715P0515n8841J45227
14394b9608K14811j50358m14102k78458P3040M71726M30317R3756j70264k14932
14384B5928k38556j36673J2131Q4514R6280J902k12659k33457k30664L3122K45086
14373e53046K44214J92119J05299o2499j97110j28102q2765L23242P71589L35385
14363I48326l42188m17914o0938K07227J4603Q6882n1514l6196o2417o55270m54529
14352h23928J56700K50992L08336K48842K28933J26263Q700l04022M5832M0299
14342B86947l38552K65426J10971j78467p9769K56615j22558k42776j24877l73399
14332e40439l25379j44861L66308M87306N699j37715L2969l4240r913J74619l2105
$$ plain form
14404 -309668 -340209 -90423 -214688 -381807 -236072 -164794 -186509 -115994 -174835 -29608
14394 -29608 185203 34845 -379257 -657715 -584675 -112949 317368 411124 240860 25928
14384 25928 -212628 -349301 -337170 -252656 -156376 -154474 -367133 -600590 -831254 -798132 -553046
14373 -553046 -308832 -116713 -11414 -73913 -271023 -399125 -481890 -158648 612941 948326
14363 948326 606138 188224 127286 334513 349116 435998 384484 348288 285871 -369399 -823928
14352 -823928 -667228 -416236 -107900 140942 369875 496138 504838 200816 246648 286947
14342 286947 -51605 213821 324792 146325 66556 323171 200613 -42163 -167040 -540439
14332 -540439 -865818 -1010679 -644371 -157065 -151366 -289081 -256112 -290352 -300265 -125646 -157751
14321a57751R1804K59099K73948J82243j06717m43869l95468J13503M17713L54604
14311E89109M11911J3417n78351j0587k84087n03922k29584J83166P5625K1734
14301c11569n7198j22820M02578M91799L1846k75439k50668J39557K80601q110
14291C20577N513K005j94928o6953o6890j28254k06104o1759L5436K26047L37950
14280B02640k3667k70882q6907j22137m51155n9259K82164K52575K96372M98127
14270E17871J80845J22649k42544l07505J87289K37776Q2942j01494p927R3202
14260G63104j02582j0781q0360J24116M8017k31127j60408Q1720l913j50514m47752
14249a70480l97579M8049n2123K40760L28737J12793N3278J02319j25978j29788
$$ plain form
14321 -157751 -65947 193152 467100 649343 542626 98757 -296711 -183208 234505 589109
14311 589109 1001020 1014437 436086 425499 141412 -362510 -592094 -408928 -333303 -311569
14301 -311569 -368767 -491587 -89009 402790 434636 159197 -91471 48086 328687 320577
14291 320577 326090 328095 133167 66214 -676 -128930 -335034 -396793 -361357 -135310 202640
14280 202640 178973 -91909 -178816 -300953 -752108 -811367 -529203 -276628 19744 517871
14270 517871 698716 821365 578821 271316 458605 696381 779323 677829 669902 763104
14260 763104 660522 649741 569381 693497 741514 510387 349979 431699 427786 277272 -170480
14249 -170480 -568059 -520010 -572133 -331373 -2636 110157 163435 265754 139776 9988
14239I988j28746M1857K61977j7845k8363M9483m1787p0618m27981m69857k12480
14228a034372J68483O66557O69162K34456J77889K8567k10977m73074J0522J9673
14218B56886K30602K22930j42632j48426N4358p4417l24597j09104L20849K06379
14208D92828k09010Q3291L01929J22902j4014J48410J43417K4236k28659k12698
14198F52632o32308m76435j28051N23562L04113J03974O2680O3390J80831M9857
14188G04245n1945r5988j50165L01604K10332j67490k31705q4134n9741p1638
14178C03375O2290J45101o4601q1657l591j15551M6506j72369j49928J01374J74845
14167B45794k18223j77341J99529R9709J83738Q7812j59590j68804q8930P5066
$$ plain form
14239 9988 -118758 -76901 185076 167231 138868 188351 146564 75946 -352035 -821892 -1034372
14228 -1034372 -865889 -199332 469830 704286 882175 910742 699765 226691 237213 256886
14218 256886 487488 710418 567786 419360 473718 399301 74704 -34400 286449 492828
14208 492828 283818 367109 669038 791940 777926 926336 1069753 1093989 865330 652632
14198 652632 20324 -456111 -584162 -60600 243513 347487 410167 473557 654388 704245
14188 704245 652300 556312 406147 707751 918083 750593 518888 434754 375013 303375
14178 303375 365665 510766 446165 364508 360917 245366 291872 119503 -30425 70949 245794
14167 245794 27571 -149770 49759 149468 333206 421018 261428 92624 3694 78760
14157G8760M05460L60861L12018j04426n13733k91593j84091j75172j05045j12282
14147c29243J52451K16647K23894N699l08945J65853K89311M7402j04804o8230
14137B90035k06488o2052j68587Q1837N15247k13606l3170L39432j17551p6225
14127C48872k10571j16892J7671J01625k07951k79022J35058K13968r1816l11233
14117d00291l47885J3613N85989N76745l6197m59945j96315k61832k23450J93345
14107e56223J69598M11675J84694k1815P8267Q8081k18558j84486J34799M0483
14097A26515J77841J51487Q6353K03008o9642r4535J6380O1813r1146j56464N354
14086D16964j26018m37216l60226K59876K5078m05845j69973J95831j89891l69824
$$ plain form
14157 78760 484220 845081 1157099 1052673 538940 247347 63256 -111916 -216961 -329243
14147 -329243 -176792 39855 263749 269448 -39497 126356 415667 463069 358265 290035
14137 290035 83547 21495 -147092 -65255 449992 236386 203216 542648 425097 348872
14127 348872 138301 21409 39080 140705 -67246 -346268 -211210 2758 -89058 -400291
14117 -400291 -748176 -734563 -148574 428171 391974 -67971 -264286 -526118 -749568 -556223
14107 -556223 -386625 25050 209744 187929 266196 354277 135719 -48767 86032 126515
14097 126515 304356 455843 542196 745204 675562 581027 597407 659220 568074 411610 416964
14086 416964 290946 -146270 -506496 -246620 -221542 -627387 -797360 -601529 -791420 -1161244
14076a161244K33241K66714J16612r9580J45229L17974J99302J64524N9939J0279
14066B52990J20219L4012q8982K9782J88659q8315k6706O4436P8209j54703o0711
14055C48890j07439J26484J08971L1523J43724Q2726m175j85661j81717j06356
14045B56970j6602J295K46937j96368l62860j80063O805K42027L13922J9263m63551
14034a32225k83625K47466M11049O2156J5438j26429l24371j49184k54640N5908
14024d78457K76321J68540l42682p241Q2821O4809k5545k76988l24561J79926
14014f83057N46725P80087M72272j13689j38858m0407j08434q366j65321k64280
14004B76672j04796M0342J2538r0811J8023K9862l17461k30569J36578L16226
$$ plain form
14076 -1161244 -928003 -661289 -544677 -644257 -499028 -181054 18248 182772 242711 252990
14066 252990 373209 407221 318239 348021 536680 448365 421659 486095 564304 409601 348890
14055 348890 241451 367935 476906 508429 652153 734879 730704 545043 363326 256970
14045 256970 240368 241663 488600 292232 -70628 -250691 -243886 -1859 312063 331326 -132225
14034 -132225 -415850 -168384 242665 304821 320259 193830 -130541 -279725 -534365 -478457
14024 -478457 -202136 -33596 -376278 -383519 -300698 -235889 -261434 -538422 -862983 -683057
14014 -683057 -136332 643755 1116027 1002338 863480 823073 714639 706273 540952 276672
14004 276672 171876 212218 224756 133945 151968 181830 -135631 -366200 -229622 86604
13994H6604K12426n3270M6685J94670J08930n4292l70570k15649J68471M06688
13984E30693K98890p3012j33472K392k37254m15074j84537R4621j56598m72157
13974g45508o44847k22103K73995J92460K22059K23289L53348M10384J00882l07579
13964a43620j62847L60218J22329q4887L53935M82760L38517q3202k75388o74758
13954B33057o00224m034J71312p9318o34752m54188J20149L95880L29448K51215
13944b71455N7167p1981j7053l7793j39277m12259k82994L10129O20946M10813
13934A66243Q1277J68216L10540p8461j02216O9371K67457J32286J00541k67689
13924H47565o32604l64668J04927L67513L7880n5719M2240q9655j06528q3482
$$ plain form
13994 86604 299030 245760 292445 487115 596045 541753 171183 -44466 124005 530693
13984 530693 829583 756571 623099 625491 388237 -26837 -211374 -116753 -273351 -745508
13974 -745508 -1390355 -1612458 -1338463 -1146003 -923944 -700655 -347307 63077 163959 -143620
13964 -143620 -306467 53751 176080 91193 445128 927888 1266405 1183203 907815 233057
13954 233057 -367167 -371201 -199889 -279207 -913959 -1368147 -1247998 -852118 -522670 -271455
13944 -271455 -214288 -286269 -303322 -341115 -480392 -892651 -1175645 -865516 -244570 166243
13934 166243 247520 415736 726276 647815 545599 614970 882427 1014713 1115254 847565
13924 847565 214961 -149707 -44780 322733 360613 304894 347134 257479 150951 67469
13914F7469r2772p2955j12263R2507M411k16727j32072r1647m6419q6621j26437
13903h13526J0189M1587K7329L01177K91331o8409q2671n0772M9047K38587R4058
13892C7927k97646l09911j31483k68718j48658q0330J01883L33122R9576K07102
13882d57136J70397N642J08551j60610L540K732l3069P7886K77908J74929J75131
13871C45901k75572m93785r1153R4592L69612N46451j7747l87311p8510L14929
13861C27407O29037K77175k97837k12377m99714k27882j94943k54977k78590M7744
13851f84957L34042K29356J04557j60994m81114l76288o7566L65569M07647J36032
13841a93716r5949l52377k0835J78126J70134M7484j5173J24415n9569n55946
$$ plain form
13914 67469 -25303 -98258 -210521 -118014 -113603 -330330 -462402 -554049 -600468 -687089 -813526
13903 -813526 -803337 -761750 -734421 -433244 -141913 -210322 -292993 -343765 -294718 -56131 37927
13892 37927 -259719 -569630 -701113 -969831 -1118489 -1198819 -1096936 -763814 -664238 -457136
13882 -457136 -286739 -281097 -172546 -333156 -329616 -326884 -359953 -282067 -4159 170770 345901
13871 345901 70329 -423456 -514609 -420017 -50405 496046 478299 90988 12478 327407
13861 327407 956444 1233619 935782 723405 223691 -4191 -199134 -454111 -732701 -684957
13851 -684957 -350915 -121559 -17002 -177996 -659110 -1035398 -1102964 -737395 -329748 -193716
13841 -193716 -289665 -642042 -662877 -484751 -314617 -267133 -282306 -157891 -217460 -773406
13831g73406n46064j97551J83844K93577K36693K09147R1725M22714J44509m59755
13821c94567m58356J11366K24994K35658J09218l69415j92362J2994n5412Q4864
13811f91018J38492r7627n0344L80926L74832O2332k91127l14120k77865j40535
13801i06054L91304J22675k33285k38529M03148P22279N05438K3365k83578Q1610
13791E88373L23389r345j61806j86005k17096M2357L05009K49587k30807l81806
13781C21850N9238Q5507n7901o4351K91777J44681l20933m55445k51601l89050
13771f36228j17886O0749J39543J77098K27036L41903M48036j59108n22102l51669
13761c92628O8029L46628J46341k38029j18760N7773L74754J27755l74522j70271
$$ plain form
13831 -773406 -1319470 -1517021 -1333177 -1039600 -802907 -593760 -502035 -79321 65188 -394567
13821 -394567 -852923 -741557 -516563 -280905 -171687 -541102 -733464 -720470 -775882 -691018
13811 -691018 -552526 -650153 -700497 -319571 55261 117593 -173534 -487654 -765519 -906054
13801 -906054 -514750 -392075 -625360 -863889 -460741 261538 766976 790341 506763 588373
13791 588373 911762 902417 740611 554606 337510 379867 684876 934463 703656 321850
13781 321850 381088 466595 408694 344343 636120 780801 459868 4423 -247178 -636228
13771 -636228 -754114 -693365 -553822 -376724 -149688 192215 640251 481143 -40959 -392628
13761 -392628 -324599 22029 168370 -69659 -188419 -130646 244108 371863 -2659 -172930
13751a72930n8219j13387p420N1245J28235N5843J61866L31910J60779m723J806
13740E35005j20678p7527J17441J99586M2482j47281k89638l67386k89792l9965
13730d37753N16554K65242j00092k63485K10106N2857l27918k36478M4579j90629
13720d67017p407J68006J35506R9113l1311J32795J88060M468j97301k23654j19482
13709c18224J83770k864r9287J11889J82938p9535K88230K26430k11730j43845
13699A37772M09861L68227j81912l76121m42227l06674q8827P2141J01847K66342
13689c9571K37199J54800P0195j23095m35416K2608L98101M00193K859m17289
13679B70584M5960K72728K7753K1418K9593l7515p4463k45765m68709q593J61172
$$ plain form
13751 -172930 -231149 -344536 -351956 -300711 -172476 -116633 45233 377143 537922 533199 535005
13740 535005 414327 336800 454241 653827 696309 549028 259390 -107996 -397788 -437753
13730 -437753 78801 344043 243951 -19534 190572 243429 -84489 -320967 -276388 -467017
13720 -467017 -474424 -306418 -170912 -71799 -103110 29685 217745 222213 24912 -198742 -318224
13709 -318224 -134454 -137318 -236605 -124716 58222 -21313 266917 493347 281617 137772
13699 137772 547633 915860 733948 357827 -84400 -391074 -479901 -407760 -305913 -39571
13689 -39571 197628 352428 422623 299528 -135888 -113280 284821 685014 687873 270584
13679 270584 316544 589272 617025 638443 668036 630521 556058 310293 -158416 -167009 -5837
13668e837j88660J30493M45866M07620j76411O3457P949m49573o51139k30029
13658f46264j92169k70680Q0682l8674L6709J26475n0236j55946L255l8509o0959
13647a206316K22282J26315L08250M96841M81888J24435k18789k08228m06458
13638b79780k70515J02892P5740l7821j42419k51056J49537M7028k66503q3545
13628i56442J48361N6349q2505k02972J40076M72649M02346J34099J08088K76812
13618D96861J0915l50419k5116N08448M88579J24394j22184m42659k08872j97083
13608B82864k65554l0474j69582R7105L29679j36786l56478l37157j18454M86760
13598b18077K10174M9299r9373m24372j81854j03755Q8329P4876Q4315K21998
$$ plain form
13668 -5837 -194497 -64004 381862 789482 613071 676528 684477 234904 -416235 -646264
13658 -646264 -838433 -1109113 -1028431 -1067105 -1030396 -903921 -954157 -1110103 -1106848 -1145357 -1206316
13647 -1206316 -984034 -857719 -549469 -52628 429260 553695 334906 126678 -279780
13638 -279780 -550295 -447403 -371663 -409484 -551903 -802959 -653422 -606394 -872897 -956442
13628 -956442 -808081 -751732 -834237 -1037209 -897133 -424484 -22138 111961 220049 496861
13618 496861 507776 157357 132241 640689 1129268 1253662 1131478 688819 479947 282864
13608 282864 17310 -13164 -182746 -85641 244038 107252 -249226 -586383 -704837 -218077
13598 -218077 -7903 41396 -57977 -482349 -664203 -767958 -679629 -604753 -520438 -298440
13588b98440K35123K10952L29185L87659j44736l90357j73633J5878j17709j02091
13578d8169L52095M34613N5925j68853k17801j36850k238K1064M5614k774n31847
13567a99221m20181n2740k5641P6841k31432J64107L97005K38081J64432M019
13557A15270O7981J23336n8342j20065r7666J73435L63857n4206r3337J54540
13547E74803M2181j92943j79926j93370j68774J05670J89854J43083J77249j15431
13537C82396m20902k6101K65545J12229r2202j0514k56852l04384j25893j83253
13527f59931N7578J70889l02488j42744K21331M04177L36743N5111j36594k2328
13517a8256M51299L3686m69040m85590p9183M94222K01808j48604m2259l8326
$$ plain form
13588 -298440 -63317 147635 476820 864479 719743 329386 155753 171631 53922 -48169
13578 -48169 303926 738539 794464 625611 407810 270960 268722 289786 335400 332626 -199221
13567 -199221 -619402 -672142 -697783 -620942 -852374 -688267 -291262 -53181 111251 115270
13557 115270 183251 306587 248245 128180 30514 203949 567806 513600 420263 574803
13547 574803 616984 424041 244115 50745 -118029 -12359 177495 320578 497827 382396
13537 382396 -38506 -64607 200938 313167 220965 210451 -46401 -350785 -476678 -659931
13527 -659931 -602353 -431464 -733952 -876696 -655365 -251188 85555 140666 4072 -18256
13517 -18256 433043 466729 -2311 -487901 -567084 -72862 128946 -19658 -61917 -100243
13507a00243k2553j9096r0784k06206j09636J07528L48511L18570j78264l15794
13497b67967j09381J04312K92315L52545m41883m12898l48723r9497M14503O57008
13487A40334L12325j15031l38192n21487j96025r1344J66565K10502j02752J92397
13477c42708M32165J98387j47974k33024J70088K26742K07937k8423O245J04920
13467E94355P5160j15821j26642j5412l8775J48825m6330o78645l13419J55271
13457c61433k18918j99660L10403J65864K69632M57343K43543J07188J311k43666
13447E31607l79595m91144j20656L43472J63896j9228Q5933j27580Q2518K55210
13437C24433l21459k48432K5259j31195J80132J0547R7519j98791k70694J99990
$$ plain form
13507 -100243 -122796 -141892 -232676 -438882 -548518 -440990 -92479 226091 47827 -267967
13497 -267967 -377348 -273036 19279 371824 -70059 -482957 -831680 -931177 -516674 140334
13487 140334 452659 337628 -564 -522051 -718076 -809420 -642855 -432353 -535105 -342708
13477 -342708 89457 287844 139870 -93154 76934 303676 511613 483190 489435 594355
13467 594355 669515 553694 427052 411640 372865 521690 475360 -203285 -516704 -361433
13457 -361433 -580351 -780011 -469608 -303744 -34112 423231 666774 773962 775273 531607
13447 531607 152012 -339132 -459788 -116316 47580 28352 114285 -13295 69223 324433
13437 324433 2974 -245458 -220199 -351394 -171262 -160715 -63196 -261987 -532681 -332691
13427c32691j37189l26225K6132L00746O86319N19837Q7924m6880J11781j06535
13417G83219n56672k04082l413L35134M33876j37031k22169j70370j36140L41342
13407D63694J31124j55019m2228n5221k33847N0576N7493j23424j1866j10687
13397b9405j9058L83120J09944k61004j39882l32842j49786J66596J62783l26132
13387d35666k49815L0405L10923O02704K89803q5853m23699l36176k53214J42351
13377d08237K59061J47417j12597q201J52000J99766p9101k18637j7886j18990
13367b05405P9689k6426K26374K18576l58027P5612N44537K15875j36890j8729
13357F15186J34225n4939m18791m38586j65746N9637K18290K60570O1109m7474
$$ plain form
13427 -332691 -469880 -796105 -769973 -469227 217092 736929 824853 777973 889754 783219
13417 783219 226547 22465 19052 354186 788062 651031 428862 258492 122352 463694
13407 463694 594818 439799 397571 342350 108503 159079 216572 93148 81282 -29405
13397 -29405 -48463 334657 444601 183597 43715 -289127 -438913 -272317 -109534 -435666
13387 -435666 -685481 -655076 -344153 258551 548354 462501 38802 -297374 -550588 -408237
13377 -408237 -149176 -1759 -114356 -122557 29443 229209 150108 -68529 -86415 -205405
13367 -205405 -125716 -152142 74232 292808 -65219 10393 554930 770805 633915 615186
13357 615186 749411 694472 275681 -162905 -328651 -269014 -50724 209846 270955 223481
13347B23481J02942Q1290J70987j78015l50630n457J35531J91036J49353J37892
13337F58410L37210J59909J31430j03098k48250k05486q3527j61357O1018K43244
13327G89503j50444k82675l01928m0972O2791N3441l49224m92909k58225N6891
13317i13751L13903N71539N18384J92033J25797R287j52103n6852j26434j4934
13307D66869J14891K47259L02565M52996K75742K0730P6191K02199l02545k71968
13297A584929o897j36457n26473n16227m19n1036j54817N9407P4399j93513j99899
13286f7003O5093J6829K3880K40435M43639K73895j04466j42508k07836m05888
13276A36070k53049K33591M74250Q5783J23271P8780M9110j3253j61119K45566
$$ plain form
13347 223481 326423 407713 578700 400685 50055 44598 180129 371165 520518 658410
13337 658410 995620 1155529 1286959 1183861 935611 730125 646598 485241 546259 789503
13327 789503 639059 356384 54456 13484 76275 129716 -219508 -712417 -970642 -913751
13317 -913751 -599848 -28309 490075 682108 807905 817192 665089 608237 481803 466869
13307 466869 581760 829019 1131584 1584580 1860322 1881052 1957243 2159442 1856897 1584929
13297 1584929 1578032 1441575 915102 398875 398456 347420 192603 252010 326409 132896 -67003
13286 -67003 -1910 14919 38799 279234 722873 996768 892302 749794 541958 136070
13276 136070 -116979 116612 590862 676645 799916 878696 927806 914553 753434 999000
13266I99000L58038K34699J13644k40514m37577l34066j56802J82869j1078K07853
13256I16066L98621L2180K5784j63219m04069J24783q7099m94775P1538j6448
13246D03362K37706J60392j24129j4103P6141k99069l61023O2002J53152J60320
13236D54751L91375L80206k05625P6439p1771l37949q4195p2548K730M1196K26583
13225H01192Q4560j44786j38356J32061L60358o651j40421J16790K05378k86546
13215I83579m93209J87214M72487O81957M45281j20207n7524m53862m21065j7779
13205A206872k82828j26806m0585j03890K7328n010k2461j05671J37505K37509
13195I21963J61263j96838j05462M8872j26529l57657j3928J56895j37039j06865
$$ plain form
13266 999000 1357038 1591737 1705381 1464867 1027290 693224 536422 719291 708213 916066
13256 916066 1314687 1346867 1372651 1209432 805363 930146 843047 348272 419810 403362
13246 403362 641068 801460 677331 663228 739369 440300 79277 141279 294431 454751
13236 454751 846126 1226332 1020707 1097146 1025375 687426 603231 530683 533413 574609 801192
13225 801192 885752 740966 602610 734671 1095029 1088378 947957 1064747 1270125 983579
13215 983579 490370 677584 1150071 1832028 2277309 2157102 2099578 1645716 1224651 1206872
13205 1206872 924044 797238 756653 652763 680091 675081 652620 546949 684454 921963
13195 921963 1083226 886388 780926 829798 703269 345612 331684 488579 351540 244675
13185B44675K88994J39667k77357j06716J87921L95837K35415j74447l31109k50689
13175C52191m4946K38851L77160J05114j88796l20692l54160j05831q6901J49925
13165A21915O6751M5685M2440j38173J85065L33646K53433K74641J75787l3950
13155A327240k89692m97560k89736k25708m1215R0335J23486K4263K26440K24907
13145F72760J74556J77101P3166J46287K42370o643l26028r5980N22937J49445
13135A729971j85777k49012k71753j53218m5282m3430m8462j23548L14702L16251
13125A240442K1060j65173j78825k62321K9296M2388K00948N62176J31297n82294
13115A038994m93221K01021J01651m14894l47148K4954J88278K56131L50356J10560
$$ plain form
13185 244675 533669 673336 395979 289263 477184 873021 1108436 933989 602880 352191
13175 352191 307245 546096 923256 1028370 839574 518882 164722 58891 -28010 121915
13165 121915 188666 234351 276791 138618 323683 657329 910762 1185403 1361190 1327240
13155 1327240 1037548 539988 250252 24544 -16671 73664 197150 221413 447853 672760
13145 672760 847316 1024417 1097583 1243870 1486240 1479597 1153569 1057589 1580526 1729971
13135 1729971 1544194 1295182 1023429 870211 824929 781499 733037 609489 924191 1240442
13125 1240442 1261502 1096329 917504 655183 684479 726867 927815 1489991 1621288 1038994
13115 1038994 545773 746794 848445 433551 86403 111357 299635 555766 906122 1016682
13105A016682K78983N40570J3648r4743L21552O60257j7415n05649l71976j96975
13095A644934P0474j96j48173l30404n5940J99599K21663j59970k86397n8926
13085A096664L53275K20727j78204o5255K74936L27376j00376N4890m681q2045
13075A897307J8129J19174K34060l6668K7139J59378K69768Q0823k72380k1033
13065B475697m8778N8543J87903O3969K9157k9950j30593q2849q9625j56421Q2066
13054B359119Q0739J71815J93625p5131p4985K9469K78275L08383N3704J72389
13044C497402J76100j46832J36642J23986K46790o0143l19032r9053L67660N59923
13034D483443O02039M42462n3404j64729k17930m93315m43697k50749l3203j12157
$$ plain form
13105 1016682 1295665 1836235 1849883 1755140 2076692 2736949 2719534 2213885 1841909 1644934
13095 1644934 1715408 1715212 1567039 1236635 1180695 1380294 1601957 1441987 1155590 1096664
13085 1096664 1449939 1670666 1492462 1427207 1702143 2029519 1929143 1984033 1979352 1897307
13075 1897307 1915436 2034610 2268670 2232002 2259141 2418519 2688287 2769110 2496730 2475697
13065 2475697 2426919 2485462 2673365 2737334 2766491 2736541 2605948 2523099 2433474 2277053 2359119
13054 2359119 2439858 2611673 2805298 2730167 2655182 2684651 2962926 3271309 3325013 3497402
13044 3497402 3673502 3526670 3663312 3787298 4034088 3973945 3654913 3555860 3923520 4483443
13034 4483443 5085482 5527944 5474540 5309811 5091881 4598566 4154869 3904120 3870917 3758760
13024C758760j64477K73424M68891M55726J48448k05750j44082L05161N65529
13015E461630L60577k29653q6426k74293j92550J80759O19348P33736K98277L77593
13005G248998L56310J42624K04327K18501J86319M64088N31986P41331Q01937
12996A0896421P89462Q89994J035571J199468J134997J271376J789758K145773
12988B1152820K274992K873935L673159M612548O023027P534820J0268145J3650400
12980G2063846J7528474K2350773K9726572M0746186N5054525O9484581P2012933
12973C78967890M2951082j3926314n9004424p0455879o0971637m6746717l4418444
12966A36395557k5364826j9096447j4535764j1802122r286890p254203n718599
$$ plain form
13024 3758760 3594283 3867707 4336598 4792324 4940772 4735022 4590940 4896101 5461630
13015 5461630 5822207 5592554 5506128 5231835 5039285 5220044 5839392 6573128 6871405 7248998
13005 7248998 7605308 7747932 7952259 8170760 8357079 8821167 9353153 10094484 10896421
12996 10896421 11685883 12575877 13611448 14810916 15945913 17217289 19007047 21152820
12988 21152820 23427812 26301747 29974906 34587454 40610481 48145301 58413446 72063846
12980 72063846 89592320 111943093 141669665 182415851 237470376 306954957 378967890
12973 378967890 421918972 407992658 348988234 278532355 217560718 170814001 136395557
12966 136395557 111030731 91934284 77398520 65596398 56309508 49055305 43336706
12959D3336706m685612m051817l550749k968876k248612k079911j905555j373964
12951B0471610j046965p98029k86256j27668l08428j74033M84548J635526K274124
12942B2124429L055058M803050P893129J0896759O693274n624264j0795765q577251
12934C0468419n805751l854356k592900j949945j339352j038841j000099o96010
12926A2191165m84294o0081L73972M16884L43257R1838N04325J134194J286606
12917A5797866J495635K126675K113972J021250m02840j554800j645980j032599
12909A7919179l15323n5798r2112K03337M90236J016533J764862K186891K572483
12900B5690288L346289M074769M948868O414940Q073260J0307586J3525241J7835550
$$ plain form
12959 43336706 38651094 34599277 31048528 28079652 25831040 23751129 21845574 20471610
12951 20471610 19424645 18626616 18340360 18212692 17904264 17730231 18214779 19850305 22124429
12942 22124429 25179487 29982537 37875666 48772425 55465699 49841435 39045670 30468419
12934 30468419 24662668 20808312 18215412 16265467 14926115 13887274 12887175 12191165
12926 12191165 11706871 11646790 12020762 12437646 12780903 12872741 13377066 14511260 15797866
12917 15797866 17293501 19420176 21534148 22555398 22152558 20597758 18951778 17919179
12909 17919179 17603856 17548058 17455946 17659283 18149519 19166052 20930914 23117805 25690288
12900 25690288 29036577 33111346 38060214 44475154 52548414 62856000 76381241 94216791
12892I4216791K4212820L2677976M4375825O0647746P5424524P1262281K9740640
12885D32558603l1176384o9012659p1542463n7462918m2847883l1884496k3859247
12878A04772553j8122730j3854935j0960951q834092p086953n676207m557940
12871C5678745l703232l287852k512526k405894k092306j869303k037322j778899
12863A5991411j236798p74361m17502p38445r97105o43205n63797l85037n62495
12854I672666p90959l61692j63898k67327j92587J4504L25429j61455m34998n92090
12844G047593l55935J23319J74783J15723J21069K98179K63039k4912j91452k34241
12834G337165J0037L72086O50337N21020J76431l1245j43180J60984L89267Q86697
$$ plain form
12892 94216791 118429611 151107587 195483412 256131158 331555682 402817963 432558603
12885 432558603 401382219 332369560 260827097 203364179 160516296 128631800 104772553
12878 104772553 86649823 72794888 61833937 52999845 45912892 40236685 35678745
12871 35678745 31975513 28687661 26175135 23769241 21676935 19807632 17770310 15991411
12863 15991411 14754613 13980252 13562750 12824305 11827200 11183995 10620198 10235161 9672666
12854 9672666 8881707 8520015 8356117 8088790 7896203 7910707 8236136 8074681 7639683 7047593
12844 7047593 6691658 6814977 6989760 7105483 7226552 7524731 7787770 7762858 7571406 7337165
12834 7337165 7347202 7719288 8369625 8890645 9067076 9035831 8892651 9053635 9442902 10329599
12824A0329599Q55530N93589N48083P40373P06876P91238R80889J606533K201437
12815A9354147K465127L014111L580315M496696N476171O514888Q348173J1130547
12807F4380175J4803798J9891823K6778423L6197822M8797870O3807812P3688657
12800C48346380O0283630J1807427m3761248o9553276o6740355n3211638l9464749
12793A47706171k8863862k1703619j6560316j3000430j0442973q164070o425400
12786D2545501n186006m346160l882336l296653k928389k191172j652760j729760
12778A7332265j631066j389857j425001j205972p60158n65472q52742r26611o67874
12769G907512m63802l84743m44602n30804k69322k26681p05628n47949j17651
$$ plain form
12824 10329599 11185129 11778718 12326801 13067174 13774050 14565288 15546177 17152710 19354147
12815 19354147 21819274 24833385 28413700 32910396 38386567 44901455 53249628 64380175
12807 64380175 79183973 99075796 125854219 162052041 210849911 274657723 348346380
12800 348346380 408630010 420437437 376676189 307122913 240382558 187170920 147706171
12793 147706171 118842309 97138690 80578374 67577944 57134971 48970901 42545501
12786 42545501 37359495 33013335 29130999 25834346 22905957 20714785 19062025 17332265
12778 17332265 15701199 14311342 12886341 11680369 10920211 10354739 9501997 8575386 7907512
12769 7907512 7443710 7058967 6614365 6083561 5814239 5587558 4881930 4333981 4216330
12760D216330k41940j27872j90658p2800j2745L50994P203k47947Q765j5867l75366
12749C298097n53977m90418l46656j34440J9229l7928M5465N9693K6699J11597
12739A997361L24468K9847l5355o1783l2365k7714k46580j61648l6048l43433
12729A406750p0105N86143K69344k10272j33935j8202k63137k04518j36486J65933
12719A391515J11643l16163j63874j3832j5856O8181N3842Q6810k17784m77938
12709E06544P7905N17049N617j3047J99731K30462l7414l39178J91988J95173
12699A534830r0536k12947k32941l43063n59277k11466J41470L06548J08305j51952
12689B88971j25913O3479M31972K15770m6695n1568N063J01320J97721K85046
$$ plain form
12760 4216330 3974390 3846518 3655860 3583060 3570315 3921309 3928512 3680565 3689330 3673463 3298097
12749 3298097 2744120 2253702 1907046 1772606 1791835 1753907 1799372 1859065 1885764 1997361
12739 1997361 2321829 2351676 2316321 2254538 2222173 2194459 1947879 1786231 1750183 1406750
12729 1406750 1336645 1922788 2192132 1981860 1847925 1829723 1566586 1362068 1225582 1391515
12719 1391515 1503158 1186995 1023121 1009289 993433 1061614 1115456 1202266 984482 506544
12709 506544 584449 1101498 1107115 1094068 1293799 1524261 1486847 1147669 1339657 1534830
12699 1534830 1444294 1231347 998406 655343 96066 -115400 26070 332618 440923 288971
12689 288971 163058 226537 658509 874279 827584 776016 781079 882399 1080120 1365166
12679A365166k84162l66846O7935n0743j18648k46022j90701j7535J20206J18497
12669C97147L69058L37572R951j72401o08346k85265j28711r1613M2797J79365
12659D9554J06252j45725k40701m0585K51172K36250M15949L88673j75640K6764
12649H71963K1803k37527q5549J46912k56385l19181K2891n3342J50091R4924
12639C56600P8013O2279j60807k36485j73907R3379K13577K43765L15442M59216
12629A251072L9942k96998m57537k32404k09191m76736k87690J52010N54016O53418
12619F89902K42216Q2010j490l75970p08359l10942K50951O12059N84360L51785
12609A416522k01704m03198j74782k62065j21094k8114J64296M8454N20199L45428
$$ plain form
12679 1365166 1081004 714158 782093 731350 612702 366680 175979 158444 278650 397147
12669 397147 766205 1103777 1113728 941327 332981 47716 -80995 -172608 -129811 49554
12659 49554 155806 10081 -230620 -271205 -20033 216217 632166 1020839 845199 871963
12649 871963 893766 656239 570690 717602 461217 142036 164927 111585 261676 356600
12639 356600 434613 496892 336085 99600 -74307 19072 232649 476414 791856 1251072
12629 1251072 1291014 994016 536479 304075 94884 -381852 -669542 -517532 36484 689902
12619 689902 932118 1014128 1012638 636668 -71691 -382633 -131682 480377 1064737 1416522
12609 1416522 1214818 811620 636838 374773 253679 225565 389861 438315 958514 1303942
12599A303942k11487J68442n9974o51465n53562m49820o3605L53561L72737j12949
12589I5820j38419J86529K47422M00087m07326l89446o253J27729L3760k15542
12579f5639m52435j53932l8710K91419M69946K39771n781o2066l507O2415K85017
12568E66498j08209l84550r0939J79138K02492N41208K6042l39406j45150q3181
12558C63943J00143K4127Q2430j01177j4780J72102K708r1870K69410m0930k10616
12547E55490n0849J25820K74152L1441m27834m26312q2116L32021M72624m0045
12537G64392J97730k27356k83585l0916J7361o7976J35585J32854J07788j39018
12527F06859l95077j00973m3211q1538k7289j2951Q1103J19048K85176K37360
$$ plain form
12599 1303942 1092455 1260897 1200923 549458 -4104 -453924 -517529 -163968 208769 95820
12589 95820 -42599 143930 391352 791439 384113 -5333 -11586 116143 149903 -65639
12579 -65639 -518074 -672006 -710716 -419297 50649 290420 284639 222573 219066 281481 566498
12568 566498 458289 73739 -17200 161938 364430 905638 931680 592274 447124 363943
12558 363943 464086 488213 570643 469466 454686 626788 629496 537626 807036 766106 555490
12547 555490 504641 630461 904613 936054 508220 81908 -208 331813 804437 764392
12537 764392 962122 734766 451181 420265 437626 369650 505235 638089 745877 606859
12527 606859 211782 110809 67598 -13940 -41229 -54180 26923 145971 431147 668507
12517F68507j48054l05294l26211N6258N24577J69694j10781J73016j1658j42185
12507E47869j69896l02364o8423J78864J20159L2873j89419l06542j80697J98344
12497a39232K13482M99613L56976r430K5089J68657k46379o58918k07120P9901
12487H2639l46382m77589j38737L07222M08064K73818J04253j73145j27872K70971
12477A83242L48579L26717q4449r8164j05685j32242j72671j74775J56729j63727
12467H3554n79985l07028J02518L86415M23789j20264m18805l52243j93962L2617
12457i43394K86377R9928n1338k94484j31522L46018L72235l4847l79662j39406
12447h70095K1993j24527l8479N5455R9238k701N7894K54598N01439N46270L35471
$$ plain form
12517 668507 520453 215159 -111052 -54794 469783 639477 528696 701712 690054 547869
12507 547869 377973 75609 7186 186050 306209 339082 149663 -156879 -337576 -139232
12497 -139232 74250 573863 930839 921409 946498 1115155 868776 209858 2738 82639
12487 82639 -263743 -741332 -880069 -572847 -164783 109035 213288 40143 -87729 183242
12477 183242 531821 858538 774089 675925 570240 437998 265327 90552 247281 83554
12467 83554 -496431 -803459 -700941 -314526 109263 -11001 -429806 -782049 -976011 -943394
12457 -943394 -657017 -557089 -608427 -902911 -1034433 -688415 -316180 -351027 -730689 -870095
12447 -870095 -848102 -972629 -1011108 -955653 -856415 -859116 -801222 -546624 -45185 501085 836556
12436H36556J1391k09756l71167n2619j41812j89484J42650K61898o6749n59069
12426c38161k15546J91610p0241l31936j1491J67336J39819M92213K87909l98115
12416h6603m62370k59380j35895k97562K35648M83757K88770O7631l28353j14607
12406f08964K76788j0041m2497j1637j77601k68261J46746N77447N34955Q3049
12396D99984l62928k41299p426O7036k29975n646J72373M9826p0106l1044k05447
12385c64652k80965j86513R3072L5896j04110j29366L31649O39085K01601j19115
12375A16582J13112L76736K75517j4507m02490l30724K9431J93314l8553j89404
12365A29014k77673R5075J67300J09979J04211j669K4965m6040l95126j34199
$$ plain form
12436 836556 847947 638191 267024 214405 72593 -116891 25759 287657 220908 -338161
12426 -338161 -553707 -362097 -432338 -764274 -775765 -608429 -468610 23603 311512 -86603
12416 -86603 -548973 -808353 -944248 -1241810 -1006162 -522405 -233635 -166004 -494357 -608964
12406 -608964 -332176 -342217 -384714 -396351 -573952 -842213 -695467 -118020 416935 499984
12396 499984 137056 -104243 -111669 -44633 -274608 -280254 -107881 -58055 -128161 -159205 -364652
12385 -364652 -645617 -832130 -739058 -703162 -807272 -936638 -604989 34096 235697 116582
12375 116582 229694 606430 881947 867440 464950 134226 163657 356971 318418 129014
12365 129014 -148659 -53584 113716 223695 327906 326237 351202 305162 -89964 -224163
12355b24163j0838k79826p4125M6005K89689M53203J10909j59373j14541n9500
12345b2560J44417L39429M08144j68438k18654k80410l58481j26961L05193K06635
12335B28314r6502J04932k38598j33026j76991o04513k13609J29638o2459O245
12325a056569k3744K45616L31477j23649k07040j1093j6079J30295O33221N94682
12315D97117K83570r5982P4328M3506J5472j16665l80411j70728p4230J00937
12305A76914O9599J31111q1989j15250k44739l25683j26144N9968L0960K00630
12295b24623N56689K44709j42678n54677k53758R6803j1759p3438K5764J83848
12285a53120n2154j55469n4482J24382K59767P3146Q5133K4933j12021K29446
$$ plain form
12355 -224163 -235001 -514827 -588952 -542947 -253258 199945 310854 151481 36940 -22560
12345 -22560 121857 461286 869430 700992 482338 201928 -156553 -283514 21679 228314
12335 228314 131812 236744 -1854 -134880 -311871 -916384 -1129993 -1000355 -1062814 -1056569
12325 -1056569 -1080313 -834697 -503220 -626869 -833909 -845002 -861081 -730786 -97565 497117
12315 497117 780687 684705 759033 802539 818011 701346 320935 150207 75977 176914
12305 176914 246513 377624 295635 180385 -64354 -390037 -516181 -456213 -425253 -224623
12295 -224623 332066 576775 434097 -120580 -374338 -277535 -289294 -362732 -336968 -153120
12285 -153120 -205274 -360743 -415225 -290843 -31076 42070 127203 152136 40115 269561
12275B69561O19414L60690j80996k36911o7700M8857k73572l32542k66594p6119
12265a35912N1196L58453L12246Q2348j62387j52950K0693o4614L27507M62934
12255A099514M78983K86304j70177o83317n01903p030J80247j04832J17473M73998
12245A169260K0893O2832k00697n81391j62702j11309k28259j56201j73454l87684
12235g48712J277N75865O43365q4557k79184l9466J322j76048J14712M05551J60425
12224E74550m0500j02445J9161k77035k81419k63813k06873J32265k67505k06982
12214i20596j2497j47961r1034K70557M13799L28090K84868P9300k80784k61377
12204c37635L87568O46370N39701j31423n85625k82340k87271q2556j70878q7090
$$ plain form
12275 269561 888975 1249665 1068669 831758 764058 812915 539343 206801 -59793 -135912
12265 -135912 -84716 273737 585983 668331 505944 352994 373687 309073 636580 1099514
12255 1099514 1578497 1864801 1694624 1011307 509404 502374 682621 577789 695262 1169260
12245 1169260 1190153 1252985 1052288 470897 308195 196886 -31373 -187574 -361028 -748712
12235 -748712 -747435 -171570 471795 387238 108054 68588 69910 -106138 8574 414125 574550
12224 574550 534050 431605 450766 173731 -107688 -371501 -578374 -446109 -713614 -920596
12214 -920596 -933093 -1081054 -1172088 -901531 -487732 -159642 125226 204526 -76258 -337635
12204 -337635 49933 696303 1236004 1104581 518956 236616 -50655 -133211 -304089 -391179
12194c91179k40915l92601K56160L34627M71660N39748P596k88399l82522m5861
12184a31686J93694L45596j02886p49686k37428K05716Q8649K05032K58371J81482
12174B56854Q3387k82203l33151N2631L53878K37560k08482n38552n9297L24630
12164a12745M05754K10547l4880j61942k1875j62623k36619J29876J87710j24103
12154G9100O561j43405p9950K99659M5109k53276P8857L73616J94333L4924M4333
12143F79861k3814k79707m57384k64719R1427L03435m840l82825J05664K55977
12133B3075O834J10567O6686P4955K9968J18968Q7737k30687j04487J26702K20248
12122E30566M4161k05255l87703k06117j10305J2870L25917P8493K27726N3522
$$ plain form
12194 -391179 -632094 -1024695 -768535 -433908 37752 577500 585096 296697 -85825 -131686
12184 -131686 62008 407604 304718 -444968 -682396 -476680 -388031 -182999 75372 256854
12174 256854 340241 58038 -275113 -222482 131396 368956 160474 -378078 -437375 -112745
12164 -112745 293009 503556 468676 306734 284859 122236 -114383 15493 203203 79100
12154 79100 85661 -57744 -137694 161965 207074 -46202 32655 406271 600604 635528 679861
12143 679861 656047 376340 -81044 -345763 -254336 49099 44259 -338566 -232902 23075
12133 23075 29909 140476 207162 282117 312085 431053 518790 288103 183616 310318 530566
12122 530566 574727 369472 -18231 -224348 -334653 -321783 4134 82627 310353 363875
12112C63875j6883j33754R2416K55932Q62338J082560O49512j47966k215214j818286
12102a025470R1285N44302N6624j07775r354j79502j98826K42673N67512O2350
12092D3819o9570j523l95915j67150j95255l20683p2810K10398K67207N80746
12082a20736P72587J26891l91551l4911J99156o1510k90011k5458J62470N2969
12072C89896j49447k53204j01263N99320M66888m21361m21030j04684J5702j50071
12062a29254r453k6419O2718M5450M5283J26870n0912J71783M14777o2522j47121
12051D41200m16486n22009J51493L20336r7360j28246J43795k9988N0562K41877
12041A55174k856j48894L2837J02852L9965J07412K83831J24464l51705l45104
$$ plain form
12112 363875 346992 213238 305654 561586 1423924 2506484 3155996 3008030 792816 -1025470
12102 -1025470 -934185 -389883 -333259 -441034 -450388 -629890 -828716 -586043 -18531 43819
12092 43819 -25751 -27274 -423189 -590339 -785594 -1106277 -1179087 -968689 -701482 -120736
12082 -120736 651851 778742 387191 352280 551436 489926 199915 174457 336927 389896
12072 389896 240449 -12755 -114018 485302 952190 530829 109799 5115 20817 -129254
12062 -129254 -138707 -165126 -102408 -56958 -11675 115195 64283 236066 650843 588321 441200
12051 441200 24714 -497295 -345802 -25466 -122826 -251072 -107277 -137265 -86703 155174
12041 155174 152318 3424 36261 139113 179078 286490 570321 694785 343080 -2024
12031b024r3922L2860J34479p355j86243j23876k17382k34263J54050N2860k55064
12020g45880K81801L93208n8620r5124k06345j28274k09255k00728J49976K11878
12010f07363K22172L4639j14347J48294L4715j79132j16371j3098j65228l00460
12000a056179p7293K37562L57363K36247J54402j24935p1320k31794l98264j58128
11990a132339j20223J01333O33085Q13012O19980j3926k85189l05240m78810k50903
11980d19220j90729M32199K88537J51857K57535J11928L7345m33416l20593j65866
11970b50423j27195j25038l16721r3303j00240L1206K20076L70992K26818R8320
11960f5508k33403k58164L7474q2645o8349j07003K52812L96127L59745J13810
$$ plain form
12031 -2024 -95946 -63086 71393 64038 -122205 -246081 -463463 -697726 -543676 -490816 -745880
12020 -745880 -464079 -70871 -129491 -224615 -430960 -559234 -768489 -969217 -819241 -607363
12010 -607363 -385191 -350552 -464899 -316605 -281890 -461022 -577393 -590491 -755719 -1056179
12000 -1056179 -1133472 -895910 -538547 -302300 -147898 -272833 -344153 -575947 -974211 -1132339
11990 -1132339 -1252562 -1151229 -518144 294868 914848 900922 615733 310493 -168317 -419220
11980 -419220 -609949 -177750 110787 262644 520179 632107 669452 236036 -84557 -250423
11970 -250423 -377618 -502656 -819377 -912680 -1012920 -981714 -761638 -390646 -163828 -65508
11960 -65508 -298911 -557075 -519601 -602246 -670595 -777598 -524786 -128659 231086 344896
11950C44896o5701J30104K37294R5154j53424m83025m94637j79666J40464R5952
11940c32589K9867L16036M20148j31583l00683j52833J0883J26461M4796m4865
11930a4362P7061L19504J44071o9080l45411j27512l57500k21789L24865L53685
11920H3532J92063j03688k28226j28603m0608M03186O06425Q1467l60413k78171
11910B26964l01636j02954j92158j41076p036j39410l52710k67411J89330M33743
11900f54354N62834K91891M3265k29007j37569j59785J22858J17359Q1779m8927
11890i656k39129j66843j7631J62948K01379K07560K31189J47014k4605N6877
11880E49103J849j03798J29402J26467N2961l7968r9263o60277j1518N23432M6244
$$ plain form
11950 344896 279195 409299 646593 741747 588323 105298 -389339 -569005 -428541 -332589
11940 -332589 -302722 13314 433462 301879 1196 -151637 -140754 -14293 30503 -14362
11930 -14362 62699 382203 526274 457194 111783 -15729 -373229 -595018 -270153 83532
11920 83532 275595 171907 -56319 -184922 -225530 177656 784081 865548 505135 226964
11910 226964 -74672 -177626 -369784 -510860 -517896 -657306 -1010016 -1277427 -1088097 -654354
11900 -654354 -91520 200371 243636 14629 -122940 -282725 -159867 -42508 39271 -9656
11890 -9656 -248785 -415628 -433259 -270311 -68932 138628 369817 516831 492226 549103
11880 549103 550952 447154 576556 703023 755984 718016 618753 -41524 -53042 470390 516634
11869E16634j02885j79668r259J31101M1786L1356j93191l28433k00822l6514
11859c29895M42323M98463J0465K12085J51930p7206k46117k37986n5761P9123
11849D47424K45351J01989m5794k34938l40663l28897k70852j93016O9528k4668
11839e74536J69016L43897r0305l89086J48137L12303k46221q7901L78275K01471
11829A65050R7025R5149M1471J44267j79534l31072l5611k00017L4545K42389
11819G3662M18741j42792l95069l12216j97173K28425J37235j06262k38282K92625
11809b41106K99440O1423J14798L0433j43577m72317n86158k70226j75638M0377
11799a342551k14790l74929k05652J78717M52124N95426K94565p4965K17253J04179
$$ plain form
11869 516634 413749 234081 224822 355923 397709 429065 235874 -92559 -293381 -329895
11859 -329895 112428 610891 621356 833441 985371 908165 662048 424062 368301 447424
11849 447424 692775 794764 748970 514032 173369 -155528 -426380 -619396 -549868 -574536
11839 -574536 -405520 -61623 -151928 -541014 -392877 -80574 -326795 -414696 -36421 165050
11829 165050 262075 357224 398695 542962 363428 32356 -3255 -203272 -168727 73662
11819 73662 492403 349611 -45458 -357674 -554847 -326422 -189187 -295449 -533731 -241106
11809 -241106 58334 119757 234555 264988 121411 -350906 -937064 -1207290 -1382928 -1342551
11799 -1342551 -1557341 -1932270 -2137922 -1959205 -1507081 -911655 -617090 -692055 -474802 -370623
11789c70623J61794K12143r4781l31000m02600j62807N91495N31984k74542j66186
11779c05123M07009N34466K72551q5632n89997j66609j83290o42089j76560J94228
11769g41046K79820J15329k63634k77527j58948J11798M17911L12631J90026N09755
11759D96115J50411o46390n97502J92165M75177o0466l44248Q1308O36673J56572
11749E39815J0407n8079m21509m17142K04886N90691M07964J36814l00012j85745
11739E08090l7156q4147k33916k48605M1694j22154j41961J27080j20099J32389
11729a78785J82100n6062k73423L1620j10892o18993l0571J95416K75621M08659
11719a75310L86449K66767K78863j01078K50441K18950j6366L20327R01819Q4872
$$ plain form
11789 -370623 -208829 3314 -91467 -422467 -825067 -987874 -396379 135605 -138937 -305123
11779 -305123 101886 636352 908903 823271 233274 66665 -116625 -758714 -935274 -741046
11769 -741046 -461226 -345897 -609531 -887058 -1046006 -934208 -516297 -203666 -13640 496115
11759 496115 646526 136 -597366 -405201 69976 9510 -334738 -253430 383243 539815
11749 539815 550222 492143 70634 -346508 -141622 449069 857033 993847 693835 508090
11739 508090 470934 386787 152871 -95734 -54040 -176194 -318155 -191075 -311174 -178785
11729 -178785 3315 -52747 -326170 -294550 -405442 -1024435 -1055006 -859590 -583969 -175310
11719 -175310 211139 477906 756769 655691 906132 1125082 1108716 1429043 2330862 2415734
11709B415734l42114r82654r06047j58264j34929j35932J03258K25641l6318n9719
11699a1344n491j74001k28249R8885o8135J99657J34299k18957N9325N49662M47679
11688G83330K14269l99107o57599l03412j29656j63207j03896J91672K45952M2299
11678b79355M3296J51266K53488K93871l960M2455J99974L43620L29413j08850
11668A265218n62797p56400n30546k1315K32374L63980K64236J21590n9594l62581
11658d5835K12131L28803o438k4076J3751l14141l82921J41690N62721N07641
11648I93326R1569k27428L9535K41363k60598m99001j95739j80901j14544J42088
11638B9670K6662k68647m59895j44717L52225M48958n1093J89223J50324J08220
$$ plain form
11709 2415734 2073620 1090966 184919 26655 -108274 -244206 -140948 84693 48375 -11344
11699 -11344 -16835 -190836 -419085 -320200 -388335 -188678 -54379 -273336 -214011 335651 783330
11688 783330 997599 598492 -59107 -362519 -492175 -655382 -759278 -567606 -321654 -279355
11678 -279355 -236059 -84793 168695 462566 458606 501061 701035 1044655 1374068 1265218
11668 1265218 702421 -53979 -584525 -605840 -373466 -9486 254750 376340 316746 -45835
11658 -45835 166296 495099 488661 464585 478336 164195 -218726 -77036 485685 993326
11648 993326 1084895 857467 897002 1138365 877767 378766 183027 2126 -112418 29670
11638 29670 56332 -212315 -672210 -816927 -464702 -15744 -66837 122386 272710 380930
11628C80930R8785R569j74905n42923m81255j11350J59303O67791Q15715j43619
11618F78041o16884l64483j89492m27169l5054M40522N32309j18787n95405k4399
11608g20801J58026j30872o1771r1979O2355J44097K35668Q1437K59369K63740
11598A99269R3841M03507L91922J61814Q0008m21523p39774k23370N7292Q6995
11588H9981L705L4218N6563k03355j36106K16990M83155J69760k24017l08697
11578A82197k09453L8780j74202K34601M93427K55329j5018m57656m95690m0832
11568a88517J57764q9816O2275o8874l68679l7416M39799L28789j5406q2103k91222
11557a53406Q947K07293K95573K55810J48928r2528q1023j16371k24470j91278
$$ plain form
11628 380930 479715 489284 314379 -228544 -709799 -821149 -661846 5945 821660 678041
11618 678041 61157 -303326 -492818 -919987 -955041 -514519 17790 -100997 -696402 -720801
11608 -720801 -562775 -693647 -755418 -847397 -785042 -640945 -405277 -323840 -64471 199269
11598 199269 293110 696617 1088539 1250353 1330361 908838 169064 -54306 2986 89981
11588 89981 93686 127904 184467 -18888 -154994 61996 545151 714911 490894 182197
11578 182197 -27256 11524 -162678 71923 565350 820679 805661 348005 -147685 -188517
11568 -188517 -30753 -120569 -58294 -127168 -495847 -533263 -93464 235325 219919 137816 -153406
11557 -153406 -144459 62834 358407 614217 763145 670617 589594 473223 248753 57475
11547E7475k33052O0215r317k62969j08411R0401J82904N69926N66346J13373
11537A026891J54178k9374m63896k01391j35305l9242j39809k72025l13544k80844
11527f94361R3626M49010M59214P2140L5951n4976K62248J07762j90625l68230
11517A71759n89158l33733J05287K50022L37376L53668k13627l23611R0311L12774
11507A61068J41516k40227o4290J4379K294K92494J82610J31620j85919k52720
11497A82825R2149K20222N6535l54238j67033J35573M0340K2495l7678L6604p4158
11486A53636j65438p6708j09717k95124J1416L45027K8755k79961l11269m11795
11476a111178j97808l4921K68208M3794p2132K57870K86771K67879J08455J39719
$$ plain form
11547 57475 -175577 -115362 -124679 -387648 -496059 -405658 -222754 347172 913518 1026891
11537 1026891 1181069 1151695 687799 486408 351103 311861 172052 -99973 -413517 -694361
11527 -694361 -600735 -151725 307489 379629 415580 360604 622852 730614 539989 171759
11517 171759 -417399 -751132 -645845 -395823 -58447 295221 81594 -242017 -151706 161068
11507 161068 302584 62357 -1933 12446 14740 307234 489844 621464 435545 182825
11497 182825 274974 495196 551731 197493 30460 166033 206373 228868 191190 227794 153636
11486 153636 -11802 -88510 -198227 -493351 -481935 -136908 -108153 -388114 -699383 -1111178
11476 -1111178 -1308986 -1343907 -1075699 -1031905 -1104037 -846167 -559396 -291517 -183062 -43343
11466d3343L48072O9572k35960k96156n0759J99422k26585k10818j99259m7558
11456f93372O03514M87369J30368k45578m66759m73289k25354J08370N05014O62372
11446C92655M78586j31597j95508J4976Q0250q6835J26087L17527k95491l47714
11436C52936j2385M2404k18380j60155j69818l03404J84144l5169k26305j80285
11426g26417M3939K89316M21628N2923j85966J33772L70053K44830r2520m51229
11416A00329k98926N5363k13553l92989j2518K1190k6928K03448K45428K17582
11406a01574K13873Q7343K10096L23217J67319M09570O9939n17529m56921N2956
11396D58289K89928r51617q94675M49895o2728k32932M04961M17483p8590j14288
$$ plain form
11466 -43343 304729 374301 138341 -157815 -208574 -9152 -235737 -446555 -645814 -693372
11456 -693372 -89858 397511 527879 282301 -184458 -657747 -883101 -774731 -269717 392655
11446 392655 871241 739644 544136 559112 639362 552527 678614 996141 700650 352936
11436 352936 340551 382955 164575 4420 -165398 -468802 -284658 -319827 -546132 -726417
11426 -726417 -682478 -393162 28466 81389 -104577 29195 399248 644078 551558 100329
11416 100329 -198597 -143234 -356787 -749776 -762294 -741104 -768032 -564584 -319156 -101574
11406 -101574 112299 199642 409738 732955 900274 1309844 1379783 862254 405333 458289
11396 458289 748217 -203400 -1098075 -648180 -710908 -943840 -538879 -121396 -199986 -314274
11386c14274J74266M10114O3089l22975k09192J69174L08482J13785m6303k31714
11376A14452m0529j62919j21517o628p9597j53265k44936j49542k41939p2431
11366a158851J15758L84848L02958K47366J80453J2225l8997j70682M6406j24447
11356b02963J91J79809K19658K87624J53687K01133K20074q4393o68078m70931
11346a64189j92829J90839K53342n7332J1141l6862n2423Q7998K28031K07660
11336D75376l07707k15791R883M1015j00391j91830r7921O6147J35235J17402
11326f8582k00043k85535k38178j44138m6059J11695L02944J90914J63886K42261
11316B9165m4032j06031J58630J67466j1690j81160j43354o5821j12393R2637
$$ plain form
11386 -314274 -140008 270106 333195 10220 -198972 -29798 278684 392469 346166 114452
11376 114452 73923 -88996 -210513 -217141 -296738 -450003 -694939 -844481 -1086420 -1158851
11366 -1158851 -1043093 -658245 -355287 -107921 72532 84757 45760 -124922 -78516 -202963
11356 -202963 -202772 -22963 196695 484319 638006 839139 1059213 974820 306742 -164189
11346 -164189 -357018 -166179 87163 29831 40972 4110 -48313 39685 267716 475376
11336 475376 167669 -48122 -38239 2776 -97615 -289445 -387366 -321219 -185984 -68582
11326 -68582 -268625 -554160 -792338 -936476 -982535 -870840 -567896 -376982 -213096 29165
11316 29165 -14867 -120898 37732 205198 193508 12348 -131006 -196827 -309220 -216583
11306b16583j60014p0081k8859n9967J43072J32481K06450Q2410N2011M5225J97160
11295C23305j88109n05814n43777k68517Q7295J82697O43082L12922j81686l58431
11285d97033J8939L87541K90538j13475k91083l95350l18187J66048K91420O2691
11275c97951k35318k37695J82989L51463L33066Q9193l24964j81242j41499j78235
11265g40193m30991J1568O34129M21551j5405k26912k68814L13598L73536N082
11255G7149j68731j42006j47203k18812J4722L96509N09565n6131n29036n07973
11245g71947k83030J13865K01883M05619L25499K09281K92657Q8699k52590m9745
11235B80191R393j5701j50717r5716L03677L4369J22094k21226k48356J78944
$$ plain form
11306 -216583 -376597 -446678 -475537 -535504 -392432 -259951 -53501 28909 80920 126145 323305
11295 323305 135196 -370618 -914395 -1182912 -1095617 -912920 -269838 43084 -138602 -497033
11285 -497033 -478094 -90553 199985 86510 -204573 -599923 -918110 -752062 -460642 -397951
11275 -397951 -633269 -870964 -687975 -336512 -3446 85747 -239217 -420459 -561958 -740193
11265 -740193 -1171184 -1159616 -525487 -103936 -119341 -346253 -615067 -301469 72067 77149
11255 77149 -91582 -233588 -380791 -599603 -584881 -188372 321193 265062 -263974 -771947
11245 -771947 -1054977 -941112 -739229 -333610 -8111 201170 493827 582526 329936 280191
11235 280191 289584 273883 123166 27450 331127 365496 487590 266364 18008 196952
11225A96952p6927j99406R1130J22284j0687M0638q7713n77025k85179K84911
11215e01022J16611r769J43709K17529K6899j06902j20611j36927L20461L45193
11205B95171L27376k4097k78210k17619K8994L19659M9661J48396k35255N2203
11195D66279J78245k84333l31190m50757j63264q783J15701O33721N03797j06289
11185E53127k78382J88352M33643J06075J2145l08913n65906m97672j18995n6147
11175e32673L1767J99232J52828j02684k06009j25934j44598O1542j67412k10484
11165a044425K94289K69867j18109L8547M02335L25212o9678l54436l92096K67731
11155c80763M34927K01323J64739j69101m04760m05278k73000k62899j8794N02790
$$ plain form
11225 196952 120025 -79381 11749 134033 123346 163984 76271 -500754 -785933 -501022
11215 -501022 -384411 -394180 -250471 -32942 -6043 -112945 -233556 -370483 -50022 295171
11205 295171 622547 598450 320240 102621 131615 451274 500935 649331 414076 466279
11195 466279 644524 360191 29001 -421756 -585020 -593803 -478102 155619 659416 553127
11185 553127 274745 463097 896740 1002815 1014960 706047 140141 -357531 -476526 -532673
11175 -532673 -500906 -301674 -148846 -251530 -457539 -583473 -728071 -666529 -833941 -1044425
11165 -1044425 -750136 -480269 -598378 -559831 -157496 167716 98038 -256398 -648494 -380763
11155 -380763 54164 255487 420226 251125 -153635 -558913 -831913 -1094812 -1113606 -610816
11145f10816O26050J82816j69633m48836n11083j72531K38444M33481J25127O7407
11135b39574M58744K34943n8627j34479q785J57120k19824l51944n0728L05553
11125I2399m4371K83663N64486j67426n63725k92728J52022K31793k51653m83711
11115d79251l09856K2679M30021K84592K14490M7192l84337m73123k03476J04548
11105g46521L92945K19168O7179O7888K5461p0759j10343J52573L63223k1223
11095C39591r1127L9788j97404l36801l25676L950j58794j28853Q2960l4909j57137
11084i64412L31296N54078O07768K51682j15476m15113m32327m48081l12394j00224
11074a043203K80845K29763R4411M93780K13814j95674k5787J59117r8962l23545
$$ plain form
11145 -610816 15234 198050 28417 -420419 -931502 -1104033 -865589 -432108 -306981 -239574
11135 -239574 219170 454113 395486 261007 252222 409342 189518 -162426 -213154 92399
11125 92399 48028 331691 896177 728751 165026 -127702 24320 256113 4460 -479251
11115 -479251 -789107 -766428 -336407 -51815 162675 209867 -174470 -647593 -851069 -746521
11105 -746521 -353576 -134408 -67229 659 26120 -44639 -154982 -2409 360814 339591
11095 339591 248464 288252 90848 -245953 -571629 -567679 -726473 -855326 -772366 -807275 -964412
11084 -964412 -633116 -79038 528730 780412 664936 249823 -182504 -630585 -942979 -1043203
11074 -1043203 -762358 -532595 -438184 55596 269410 73736 47949 207066 108104 -215441
11064b15441k97612R6461N25369N70663J21623j81434j68111N54m4248j19081
11054B88743R4201L5221k87659k34741k32018j6260k1673J03583K79676k89377
11044b80304n93673j45347K70899L8969k6343J65423k9417k92409j64388K54338
11034h02252K05873L23995O0025J90209O8995l98383l32402J44649M39737o832
11024a06386m43541k99469q0400j23842k6982o6490j46468J57178J64380L2481
11014i39539L64727P03193M63170N8766j63462l27427j98640k04730k49186j07696
11004f00824P3614L42802K22608k93460k09682L37064J92983l37793k02867Q1694
10994c93861o1902k27251j37396L78841M14635j82501l08736q4777J96986K17369
$$ plain form
11064 -215441 -513053 -416592 108777 679440 801063 619629 451518 452072 407824 288743
11054 288743 382944 418165 130506 -104235 -336253 -352513 -374186 -270603 9073 -280304
11044 -280304 -873977 -1019324 -748425 -709456 -735799 -570376 -599793 -892202 -1056590 -802252
11034 -802252 -596379 -272384 -212359 -22150 46845 -351538 -683940 -539291 -99554 -106386
11024 -106386 -549927 -849396 -929796 -1053638 -1080620 -1147110 -1293578 -1136400 -972020 -939539
11014 -939539 -574812 128381 591551 650317 486855 159428 -39212 -243942 -493128 -600824
11004 -600824 -527210 -184408 38200 -255260 -464942 -127878 65105 -272688 -475555 -393861
10994 -393861 -455763 -683014 -820410 -441569 -26934 -209435 -518171 -602948 -405962 -188593
10984a88593J73024J21401k33297r2334R3234J36092J57412j77047m25125o53215
10974a088448n16329p475L52769K57309r443r692L33550J53008J16745L03963
10964a14043j25472m57209k29408P5326k71230k67282J14277K12436K68937K12399
10954e81269K95985R2907K18786M69105J08661J34281L25496r400n10277m04178
10944A40097M5754K32223K04944j79634k19621j05880k52045k24381j51463J10507
10934c99499J71763j03861M3314N13570M34097k7160l27658k71683L53530N41071
10924I27484o9670j35559j1062j70787r9042o5967j98586j52888K04535L97869
10914F26327Q5710l45562k66012j14540N1991J90841n65565m28430L48238L13135
$$ plain form
10984 -188593 -15569 105832 -127465 -219799 -126565 9527 166939 -10108 -435233 -1088448
10974 -1088448 -1604777 -1612252 -1259483 -1002174 -1011617 -1021309 -687759 -534751 -418006 -114043
10964 -114043 -239515 -696724 -926132 -850806 -1122036 -1389318 -1275041 -1062605 -793668 -581269
10954 -581269 -285284 -192377 26409 495514 604175 738456 1063952 1054552 544275 140097
10944 140097 185851 418074 623018 443384 223763 117883 -134162 -358543 -510006 -399499
10934 -399499 -227736 -331597 -288283 225287 659384 632224 304566 32883 386413 927484
10924 927484 857814 722255 711193 540406 441364 375397 176811 23923 228458 626327
10914 626327 712037 366475 100463 -14077 37914 228755 -336810 -765240 -417002 -103867
10904a03867M7988l39297o58817l56281J00047m4090q7897K75035M71839M59215
10894b36125J65291n3333j79311j52818j27111P0191K73747M45358J85985M4596
10884D36470j25584l2095M61683k1184l41228l85729j67580n1046j07415l2476
10874c66184L35352K73408J30946L41390N84276L57528k96295n54741j54081j60698
10864D90901k63092Q3957N1721M6739j74391K5051J36102o5921j24096n8934k69833
10853a21796l4841J88635M30918L56832m26902m31045M2354N54704Q8002j27288
10843E19573p588Q8734j13535j50998R4343K68672k21337m23757l17347l10021
10833e73261j54036j96387J83091N88564J83050j95923j18644K25786N4698j03991
$$ plain form
10904 -103867 -55879 -395176 -1053993 -1410274 -1310227 -1354317 -1442214 -1167179 -695340 -236125
10894 -236125 -70834 -124167 -303478 -456296 -583407 -513216 -239469 205889 391874 436470
10884 436470 310886 278791 740474 719290 378062 -7667 -175247 -226293 -333708 -366184
10874 -366184 -30832 242576 373522 714912 1299188 1656716 1360421 805680 651599 490901
10864 490901 227809 311766 363487 410226 235835 260886 396988 331067 206971 148037 -121796
10853 -121796 -156637 31998 462916 819748 392846 -38199 4155 558859 646861 519573
10843 519573 511985 600719 487184 336186 430529 699201 477864 54107 -263240 -573261
10833 -573261 -727297 -923684 -740593 -152029 31021 -164902 -283546 -57760 -3062 -107053
10823a07053j83100k46212J71497N03987J95803J58034J85085J92122O8242o6960
10813H71445k92537k39597p0898l65234k55924k33430k47831q9086O4290J85083
10803f73719O00776L79083K0236R0926J10077j8169m211o8735j56760o0714l71201
10792a52411k22236Q2355J73626N0922J0460j7964M8019l4874l40716J64321M29176
10781A90678J17123q6114j31255j44815J00976K81198L8393l34268N8863J51488
10771B42267j97063m46575l76355K76707L19666j07115J50734J45828K98306J70914
10761D77314m70371n45379j77593K43127L41174j11108l63158o7534l2642J75448
10751e30722J64287j17100r7361k76786N6182J46935J00324K48958K97671N5308
$$ plain form
10823 -107053 -290153 -536365 -364868 139119 334922 492956 678041 870163 938405 871445
10813 871445 578908 339311 268413 -96821 -352745 -586175 -834006 -923092 -858802 -673719
10803 -673719 -72943 306140 326376 417302 527379 509210 504999 436264 279504 218790 -152411
10792 -152411 -374647 -292292 -118666 -67744 -57284 -75248 -27229 -62103 -402819 -238498 190678
10781 190678 307801 221687 90432 -54383 46593 327791 366184 31916 90779 242267
10771 242267 45204 -401371 -777726 -501019 -181353 -288468 -137734 8094 306400 477314
10761 477314 6943 -538436 -716029 -472902 -131728 -242836 -605994 -673528 -706170 -530722
10751 -530722 -366435 -483535 -580896 -857682 -801500 -654565 -554241 -305283 -7612 47696
10741D7696j82601k8757J04531Q5717J85885q0532k26605j86736j70742M9344
10731d02800J77719N4698k9356K75239P3434j77134J34658P4241j45587n93719
10721e58607m34569K68475M45286N28651L03849K34951l72821p0933L68561j43848
10711E68995l44201k22591j9826j43193K46347M93560q9899r6332P4296l6951
10701D30205j31928P9136k77385k95615K27993L50145K81179J4756p6885j26791
10691D74810l96735n04708j8171K52692R7731M848n2659k5583k68581k0178M29879
10680b6655M6845q4830M5954P972j50388k96863O8061J53733P7773L90144L10709
10669E42455J97303j04517j70566m97744l98588J5843o7795J51688l3171j06745
$$ plain form
10741 47696 -134905 -163662 -59131 26586 212471 131939 -94666 -281402 -452144 -402800
10731 -402800 -225081 -170383 -199739 75500 148934 -28200 106458 180699 35112 -558607
10721 -558607 -993176 -724701 -279415 249236 553085 788036 415215 344282 712843 568995
10711 568995 224794 2203 -17623 -160816 85531 579091 489192 392860 467156 430205
10701 430205 298277 377413 100028 -195587 32406 382551 663730 678486 601601 474810
10691 474810 78075 -426633 -444804 -192112 -94381 -89533 -142192 -167775 -436356 -456534 -26655
10680 -26655 20190 -64640 -18686 -10714 -161102 -457965 -389904 -236171 -158398 231746 542455
10669 542455 739758 635241 464675 -33069 -431657 -415814 -483609 -331921 -365092 -471837
10659d71837p7438p939J5413J97436J29924j82978j21933K36014O4429k43306
10649d62215J31276K91196J60524k11353l11226J55460L76237Q3663j24544k86052
10639a97034L4957m4166l29634R1075K06640j14328p5980Q689M640K6786J12393
10628b75962j72436j10455K34058j24962j05878L5091L684J12425J64835J24358
10618a15242P7227L83367J43650J04768m11129m93698k06895k68681K90797M22972
10608g2864L02053J46755k3497j1190m22230k02030J28549L68586L1078j38241
10598A06969M9630j7828k45449m4332M26351R2126k87063r1889R7960J47528R4568
10587C28571J9551j45545m7937L58016K31566r9453K06237K53879m0892l94574
$$ plain form
10659 -471837 -549275 -557214 -541801 -344365 -214441 -397419 -519352 -283338 -218909 -462215
10649 -462215 -330939 -39743 120781 -90572 -401798 -246338 129899 213562 89018 -197034
10639 -197034 -162077 -206243 -535877 -444802 -238162 -352490 -428470 -419781 -415141 -388355 -275962
10628 -275962 -448398 -558853 -324795 -449757 -555635 -520544 -516860 -404435 -239600 -115242
10618 -115242 -38015 345352 489002 593770 182641 -311057 -517952 -786633 -495836 -72864
10608 -72864 229189 375944 352447 341257 -80973 -283003 -154454 214132 245210 106969
10598 106969 156599 138771 -106678 -151010 275341 367467 80404 -11485 86475 234003 328571
10587 328571 348122 202577 154640 512656 744222 644769 851006 1104885 1063993 669419
10577F69419l22747N8337K10066j45343l39006j23942J06081j41764m95216k68200
10567g92315k410K70792J45770M9854J49019J35764L55405J05539j79759L11776
10557E49435K6346n03689o79021o2699L70365J74453o1868L02813M31195J09143
10547F56473l55408n95029M9440K25011K58722K60521P8646O5988L15150K26045
10537A185559j18546R4099l1625m07002p46772m28961J17172J36438n7044J8331
10527b38351j38944M9274P6947K65265N14790J04279o15599n76233j71345K09065
10517e20852K46759J32484n7869J23510K20222K00721n8333M1004K47443k6747
10507E48342k31708j37320n0861J80800M38511K17873k29547k24656O9955K44658
$$ plain form
10577 669419 346672 405009 615075 469732 130726 6784 112865 -28899 -524115 -792315
10567 -792315 -794725 -523933 -378163 -328309 -179290 -43526 311879 417418 237659 549435
10557 549435 575781 72092 -606929 -669628 -299263 -124810 -186678 116135 547330 656473
10547 656473 301065 -293964 -244524 -19513 239209 499730 578376 644364 959514 1185559
10537 1185559 1067013 1161112 1129487 722485 -24287 -453248 -336076 -199638 -256682 -238351
10527 -238351 -377295 -328021 -251074 14191 528981 633260 17661 -558572 -729917 -520852
10517 -520852 -274093 -141609 -199478 -75968 144254 344975 286642 327646 575089 548342
10507 548342 316634 179314 128453 309253 747764 965637 736090 511434 581389 826047
10497H26047J30047o9814k86818k11220q0626j54005j35041k06356k08507Q5394
10487c10899M977j0827K2887k96759j32150J37269K4874j98263j65450L65479
10477e58862P87538K89450j58488l30962k9022K43659K52381p9015j13923J14546
10467D17302J43194N917j93863k86416j87670o4196k1029J4983Q9823m3483n4694
10456a80132m3899O5168J5340N7905l9804l73214l23370P3677M29570J55126l31716
10445d95349l53515l43190Q85K84471n231L6401q2816m55877n6872j45931j52282
10434a769306N18698P94536O05345l7489k41571j78185K6226j25710n645L71952
10424d1149K00324j35n7172j21324k97105j86885J71440Q5410K54924L80696L2039
$$ plain form
10497 826047 956094 886280 599462 388242 307616 153611 18570 -187786 -396293 -310899
10487 -310899 -305922 -316749 -293862 -590621 -722771 -585502 -560628 -758891 -924341 -558862
10477 -558862 228676 518126 359638 28676 -346 243313 495694 416679 302756 417302
10467 417302 560496 566413 372550 86134 -101536 -165732 -186761 -171778 -81955 -125438 -180132
10456 -180132 -224031 -158863 -143523 -85618 -125422 -498636 -822006 -748329 -318759 -163633 -495349
10445 -495349 -848864 -1192054 -1191169 -906698 -911929 -875528 -958344 -1414221 -1471093 -1617024 -1769306
10434 -1769306 -1250608 -456072 149273 111784 -129787 -307972 -281746 -407456 -413101 -41149
10424 -41149 159175 159040 101868 -19456 -316561 -503446 -332006 -246596 8328 389024 421063
10413D21063m04720O0990J36457k28576l32000R3149O4268k91214j75448N8585
10403e97446J93089J5719O0285N6035r0640r5893L26520L53504J82571o4685k71562
10392F7497l61961l0963J25970K16071K01704j04140j32035l5452K92138L30779
10382E69608N6433m8143Q5227l0208m43980n06862k32990L1833l19798l23574
10372a162454J3874L64740J22267K40716L47079J49718J03718K6196j45268m3143
10362A7443o9214j83048k28731L08307K86073Q0071R4968q0341k322j39899l78668
10351b95361m49341P7582K77911J51081K19593K20880k459K37294q8366m45158
10341i6344l02021j55132l80147O29L86723L64743N19759L85899j93418m68514
$$ plain form
10413 421063 16343 77333 213790 -14786 -346786 -253637 -189369 -480583 -656031 -597446
10403 -597446 -404357 -388638 -328353 -272318 -362958 -458851 -132331 221173 403744 339059 67497
10392 67497 -294464 -325427 -199457 16614 218318 114178 -17857 -53309 238829 569608
10382 569608 626041 577898 663125 632917 188937 -317925 -550915 -519082 -838880 -1162454
10372 -1162454 -1148580 -783840 -661573 -420857 -73778 75940 179658 205854 60586 17443
10362 17443 -51771 -234819 -463550 -155243 130830 210901 305869 225528 223206 83307 -295361
10351 -295361 -744702 -667120 -389209 -238128 -18535 202345 199886 437180 348814 -96344
10341 -96344 -398365 -553497 -933644 -933015 -546292 -181549 338210 724109 530691 62177
10331F2177j35651P1031M5452M5706n2943J87613K38308K62407o5148m11381l97406
10320a49835K68651M02826r6296R9020k0857l12323j64072j69181m3777L21885
10310A36041L794l62407k95083n53652l17730J94819L5983J73988N39127L23869
10300a21251J37859K55326M7487k96453l03746j36768K81375L84393l99070p53945
10290i04793N7278M49876M69140J67330J45795M32278Q1939m48080o10267l84567
10280e44071p1210K09099M5734J28599n3256j86836l78468l26337K74531K18908
10270f83307q1222J48795P1780m9867J74385K84708j73163j99844P9178J65641
10260b62916L65565K17842J413J05818K34629M1090k82901j72774j84841K1867
$$ plain form
10331 62177 -73474 -2443 43009 88715 35772 223385 461693 724100 658952 247571 -149835
10320 -149835 118816 521642 425346 524366 503509 191186 27114 -142067 -185844 136041
10310 136041 139835 -222572 -517655 -1071307 -1389037 -1194218 -1158235 -984247 -445120 -121251
10300 -121251 16608 271934 319421 22968 -280778 -417546 -136171 248222 -150848 -904793
10290 -904793 -847515 -397639 71501 238831 384626 816904 898843 450763 -159504 -544071
10280 -544071 -615281 -406182 -360448 -231849 -285105 -471941 -850409 -1176746 -902215 -683307
10270 -683307 -764529 -615734 -543954 -593821 -419436 -134728 -307891 -507735 -428557 -262916
10260 -262916 102649 320491 321904 427722 662351 703441 420540 247766 62925 84792
10250H4792Q4583J2636m0913q704j07705m2350j65973J93165M65073K28395k8903
10239F74096l12528N5195L83192k18082j71830j80638l37067j25531o6090K51081
10229d8202L86424O8504j70111j72741l24847k20206L7583K5670r0872o1839J6368
10218e54269P3881N1622p3513O0137K68157J00398p1051p0279O6734N2380K71576
10207A75773K12955k81764l75518j52445J81415J22993K6581j8162r4789k83452
10197d86413k52641K78144M46691K71443J40708r5016k09392l63176J10430K36364
10187G7142R0340M9760j44379n0458l0780K6686L83584L01909k37604o13089l17180
10176d64069n7839J9780M16477K43814k34783l80152N2372L36812L43075J77936
$$ plain form
10250 84792 169375 182011 141098 132394 24689 -17661 -183634 9531 474604 702999 674096
10239 674096 361568 416763 799955 581873 410043 229405 -107662 -233193 -299283 -48202
10229 -48202 338222 406726 236615 63874 -260973 -481179 -443596 -417926 -508798 -570637 -554269
10218 -554269 -480388 -428766 -502279 -442142 -173985 -73587 -144638 -214917 -148183 -95803 175773
10207 175773 388728 106964 -268554 -420999 -239584 -116591 -90010 -108172 -202961 -486413
10197 -486413 -739054 -460910 -14219 257224 397932 302916 93524 -269652 -159222 77142
10187 77142 167482 217242 72863 22405 -8375 18311 401895 703804 466200 -146889 -464069
10176 -464069 -521908 -502128 -85651 158163 -76620 -456772 -404400 -67588 275487 453423
10166D53423p9855k64307R7440M14864L49504J56179k36553k85079K1753k15639
10156D11730p8179L10618K14165j23346j87346k83687o9015J61963l0558j21730
10146B04615j04194j47238l3357l8491Q0618l0551K973Q3378l89304l34154K02508
10135e03197J13843O6460J43782P7365Q9648p3425j17599K26633j11088m58841
10125e46419l98766k69096L26745M61963K40596N2679j32592k9368K49163K88264
10115B43169L5259J51681k42959n17374J06614M14739P5832K2588k38095l21630
10105b70176K72547P6327M9395N2698L0369j58195r0369L38362J16691j3286j68107
10094B36256p5413k23818l01719p5272l3358J65539J76236Q5812J28775L07576
$$ plain form
10166 453423 373568 109261 206701 621565 971069 1127248 890695 605616 627369 411730
10156 411730 333551 644169 858334 734988 547642 263955 194940 356903 326345 204615
10146 204615 100421 -46817 -80174 -118665 -38047 -68598 -65625 17753 -371551 -705705 -503197
10135 -503197 -389354 -322894 -179112 -101747 -12099 -85524 -203123 23510 -87578 -546419
10125 -546419 -945185 -1214281 -887536 -425573 -184977 -132298 -264890 -294258 -45095 243169
10115 243169 278428 430109 187150 -330224 -223610 191129 266961 289549 51454 -270176
10105 -270176 2371 78698 128093 180791 211160 52965 -37404 300958 417649 404363 236256
10094 236256 160843 -62975 -364694 -439966 -473324 -307785 -131549 -45737 83038 390614
10084C90614K37339k31125r1421O9250R573n8047k4694K24937P92j86228P7719
10073D18709J91237k8750k88492l78386m03063j61838L21840K11558j38565O2548
10063a93202L12631L7292l61693k24351j52568k67096o7167P6410P7265o7719
10053h30198o4940J49505N05929M00058j04203j59496q9991j98797P9986J04271
10043b07876P3086K47459K20577K09822K17145J9737k70094m39195k49784j00329
10033b79452j04170K88294L21896J67758J77619n0913j76473J93567j17420o65668
10023b44962o74175j46954o4906J07578r2698K65480L57338J39879K10347J55359
10013A2286N7634K08535L7785q4426K2574j85257l09643k18519k620K86264L41415
$$ plain form
10084 390614 627953 396828 305407 374657 384230 326183 301489 526426 527218 340990 418709
10073 418709 609946 581196 292704 -85682 -488745 -650583 -328743 -117185 -255750 -193202
10063 -193202 119429 156721 -204972 -429323 -581891 -848987 -916154 -839744 -762479 -830198
10053 -830198 -895138 -745633 -239704 160354 56151 -103345 -193336 -392133 -312147 -207876
10043 -207876 -134790 112669 333246 543068 760213 779950 509856 70661 -179123 -279452
10033 -279452 -383622 -95328 226568 394326 571945 521032 344559 538126 420706 -244962
10023 -244962 -919137 -1066091 -1130997 -1023419 -1116117 -850637 -493299 -353420 -143073 12286
10013 12286 69920 278455 316240 231814 254388 69131 -240512 -459031 -461651 -175387 166028
10002A66028L01032o3292n2936J71810j64835l93724j78675M0734k8938k15054
9992d17850k88393j67311k19318k37957K7459J04631M00400P9295L41551O15250
9982B37757j02438m24643m62358j80197k33324j02550K08655L41280K30574K26708
9972b60536k73457n79960j83323L88931M112r9700K6201J27941L59382K27528
9962b62881J9550K25589p5215k33773k87113j46042j03689p7554L9086K32310
9952f69732L00754L66994K38185L37974J77733k69302l74125O9535P2090M1100
9942B91206K45464o4705j91405J02026m08185l74938q1716M991L70819M70538
9932C64095P9117j91450m37462k13116J99845L94387L01095K5982L9833P2540
$$ plain form
10002 166028 467060 403768 350832 522642 357807 -35917 -214592 -173858 -202796 -417850
9992 -417850 -706243 -873554 -1092872 -1330829 -1303370 -1198739 -798339 -719044 -377493 237757
9982 237757 135319 -289324 -751682 -931879 -1165203 -1267753 -1059098 -717818 -487244 -260536
9972 -260536 -533993 -1113953 -1297276 -908345 -904233 -1003933 -977732 -849791 -490409 -262881
9962 -262881 -243331 -17742 -92957 -326730 -613843 -759885 -863574 -941128 -902042 -669732
9952 -669732 -368978 -1984 236201 574175 751908 482606 108481 178016 250106 291206
9942 291206 536670 471965 280560 382586 -25599 -400537 -482253 -477262 -106443 364095
9932 364095 443212 251762 -185700 -398816 -198971 195416 496511 522493 562326 634866
9922F34866M8273q277K62691n2231n10881o13387k84934K37058J51697J53042
9912A7917J91582J46306r6392j03619k58904o0235K96682J26655K50567P154k63900
9901B53813l14069J52699K50950j22650l12730m34296l27625j50472k10584K3539
$$ plain form
9922 634866 683139 674862 937553 885322 374441 -238946 -523880 -286822 -135125 17917
9912 17917 209499 355805 259413 155794 -103110 -163345 133337 259992 510559 517713 253813
9901 253813 -60256 92443 343393 220743 -91987 -526283 -853908 -1004380 -1214964 -1191425
$$ [...]
##END NTUPLES=NMR SPECTRUM
##END=
