##TITLE=C13_SAV-52-f4
 CDCl3, 19000 sc

 6.2.2020
##JCAMPDX= 6.0         $$ Bruker NMR JCAMP-DX V2.0
##DATA TYPE= NMR SPECTRUM
##DATA CLASS= NTUPLES
##ORIGIN= UXNMR, Bruker Analytische Messtechnik GmbH
##OWNER= root
$$ XWIN-NMR		Version 3.5
$$ Fri Feb  7 13:46:19 2020 Russian Standard Time (UT+4h)  she@DPX200
##.OBSERVE FREQUENCY= 50.327896
##.OBSERVE NUCLEUS= ^13C
##.ACQUISITION MODE= SIMULTANEOUS
##.ACQUISITION SCHEME= undefined
##.AVERAGES= 18150
##.DIGITISER RES= 17
##SPECTROMETER/DATA SYSTEM= spect
##.PULSE SEQUENCE= zgpg30
##.SOLVENT NAME= CDCl3
##.SHIFT REFERENCE= (INTERNAL, CDCl3, 0, 222.624)
##AUDIT TRAIL= $$ (NUMBER, WHEN, WHO, WHERE, WHAT)
$$ ##TITLE= Audit trail, XWIN-NMR		Version 3.5
$$ ##JCAMPDX= 5.01
$$ ##ORIGIN= Bruker BioSpin GmbH
$$ ##OWNER= she
$$ F:/spectra/data/she/nmr/c13/1/pdata/1/auditp.txt
$$ ##AUDIT TRAIL=  $$ (NUMBER, WHEN, WHO, WHERE, WHAT)
(   1,<2020-02-07 09:57:30.82 +0400>,<she>,<DPX200>,
      <created by zg, POWCHK disabled, PULCHK disabled
       terminated by command 'halt'
       configuration hash MD5:
       00 E9 B6 7A A2 85 ED C7 34 08 36 98 17 FE 4E 26
       data hash MD5: 32K
       FE A0 94 08 33 63 DB D8 F0 8F F4 D4 CD BA DE D1>)
(   2,<2020-02-07 13:44:59.04 +0400>,<she>,<DPX200>,
      <Start of raw data processing
       efp BC_mod = 2 LB = 1 FT_mod = 6 PKNL = 1 PHC0 = -218.3042 PHC1 = 32.00638 SI = 32K 
       data hash MD5: 32K
       5B B5 E8 8A 24 34 EA 5D CC 88 81 31 67 4E 65 F4>)
(   3,<2020-02-07 13:45:01.89 +0400>,<she>,<DPX200>,
      <abs ABSG = 5 
       data hash MD5: 32K
       F6 48 6C F2 B5 F0 F3 EB 90 27 5B 33 EF 77 11 7B>)
(   4,<2020-02-07 13:45:27.73 +0400>,<she>,<DPX200>,
      <pk PHC0 = -3.99745 PHC1 = 6.8 
       data hash MD5: 32K
       82 F2 5A 98 56 B2 21 64 CC 7D 24 2E A6 3A 3D 72>)
(   5,<2020-02-07 13:45:32.53 +0400>,<she>,<DPX200>,
      <abs ABSG = 5 
       data hash MD5: 32K
       6B 37 21 E6 86 91 8F 2C 54 D4 ED 23 84 0F 61 73>)
$$ ##END=
$$ 
$$ hash MD5
$$ 05 6E 43 A7 7C 48 78 E6 6D AB 02 93 A6 0A 66 2B
##$RELAX= 
##$RELAX= 
##$RELAX= 
##$RELAX= 
##$RELAX= 
##$RELAX= 
##$RELAX= 
##$RELAX= 
$$ Bruker specific parameters
$$ --------------------------
##$DU= <F:/spectra>
##$EXPNO= 1
##$NAME= <c13>
##$PROCNO= 1
##$TYPE= <nmr>
##$USER= <she>
##$AMP= (0..31)
100 100 100 100 100 100 100 100 100 100 100 100 100 100 100 100 100 100 
100 100 100 100 100 100 100 100 100 100 100 100 100 100 
##$AQSEQ= 0
##$AQ_mod= 1
##$AUNM= <au_zg>
##$AUTOPOS= <>
##$BF1= 50.322709
##$BF2= 200.13
##$BF3= 50.322709
##$BF4= 500.13
##$BF5= 500.13
##$BF6= 500.13
##$BF7= 500.13
##$BF8= 500.13
##$BYTORDA= 1
##$CFDGTYP= 0
##$CFRGTYP= 5
##$CHEMSTR= <none>
##$CNST= (0..31)
1 1 145 1 1 1 1 1 1 1 1 1 1 1 1 1 1 1 1 1 1 1 1 1 1 1 1 1 1 1 1 1 
##$CPDPRG= <waltz16>
##$CPDPRG1= <>
##$CPDPRG2= <waltz16>
##$CPDPRG3= <>
##$CPDPRG4= <mlev>
##$CPDPRG5= <mlev>
##$CPDPRG6= <mlev>
##$CPDPRG7= <mlev>
##$CPDPRG8= <mlev>
##$CPDPRGB= <>
##$CPDPRGT= <>
##$D= (0..31)
$$ [...]
##$SUBNAM4= <"">
##$SUBNAM5= <"">
##$SUBNAM6= <"">
##$SUBNAM7= <"">
##$SUBNAM8= <"">
##$SUBNAM9= <"">
##$SW= 239.972175391363
##$SWIBOX= (0..15)
0 1 3 0 0 0 0 0 0 0 0 0 0 0 0 0 
##$SW_h= 12077.2946859903
##$TD= 32768
##$TD0= 1
##$TE= 0
##$TE2= 300
##$TE3= 300
##$TEG= 300
##$TL= (0..7)
120 120 120 120 120 120 120 120 
##$TP= (0..7)
150 150 150 150 150 150 150 150 
##$TP07= 0
##$TPNAME0= <>
##$TPNAME1= <>
##$TPNAME2= <>
##$TPNAME3= <>
##$TPNAME4= <>
##$TPNAME5= <>
##$TPNAME6= <>
##$TPNAME7= <>
##$TPOAL= (0..7)
0.5 0.5 0.5 0.5 0.5 0.5 0.5 0.5 
##$TPOFFS= (0..7)
0 0 0 0 0 0 0 0 
##$TUNHIN= 0
##$TUNHOUT= 0
##$TUNXOUT= 0
##$USERA1= <user>
##$USERA2= <user>
##$USERA3= <user>
##$USERA4= <user>
##$USERA5= <user>
##$V9= 5
##$VALIST= <valist>
##$VCLIST= <CCCCCCCCCCCCCCC>
##$VD= 0
##$VDLIST= <DDDDDDDDDDDDDDD>
##$VPLIST= <PPPPPPPPPPPPPPP>
##$VTLIST= <TTTTTTTTTTTTTTT>
##$WBST= 1024
##$WBSW= 4
##$XGAIN= (0..3)
0 0 0 0 
##$XL= 0
##$YL= 0
##$YMAX_a= 29959765
##$YMIN_a= -110385929
##$ZGOPTNS= <>
##$ZL1= 120
##$ZL2= 120
##$ZL3= 120
##$ZL4= 120
##$ABSF1= 222.624
##$ABSF2= -17.3728
##$ABSG= 5
##$ABSL= 3
##$ALPHA= 0
##$AQORDER= 0
##$ASSFAC= 0
##$ASSFACI= 0
##$ASSFACX= 0
##$ASSWID= 0
##$AUNMP= <proc_1d>
##$AZFE= 0.1
##$AZFW= 0.5
##$BCFW= 0
##$BC_mod= 2
##$BYTORDP= 0
##$COROFFS= 0
##$CY= -3
##$DATMOD= 1
##$DC= 0
##$DFILT= <>
##$DTYPP= 0
##$F1P= 0
##$F2P= 0
##$FCOR= 0.5
##$FTSIZE= 32768
##$FT_mod= 6
##$GAMMA= 0
##$GB= 0
##$INTBC= 1
##$INTSCL= 4.134877e-10
##$ISEN= 128
##$LB= 1
##$LEV0= 0
##$LPBIN= 0
##$MAXI= 10000
##$MC2= 0
##$MEAN= 0
##$ME_mod= 0
##$MI= 0.1934396
##$NCOEF= 0
##$NC_proc= 2
##$NLEV= 6
##$NOISF1= 120.0001
##$NOISF2= 80.00006
##$NSP= 0
##$NTH_PI= 0
##$NZP= 0
##$OFFSET= 222.624
##$PC= 1.4
##$PHC0= -222.3017
##$PHC1= 38.80638
##$PH_mod= 1
##$PKNL= yes
##$PPARMOD= 0
##$PSCAL= 0
##$PSIGN= 0
##$REVERSE= no
##$SF= 50.3227315989248
##$SI= 32768
##$SIGF1= 140
##$SIGF2= 120
##$SINO= 11.81781
##$SIOLD= 32768
##$SREGLST= <13C.CDCl3>
##$SSB= 0
##$STSI= 32768
##$STSR= 0
##$SW_p= 12077.2946859903
##$SYMM= 0
##$S_DEV= 0
##$TDeff= 32768
##$TDoff= 0
##$TI= <>
##$TILT= no
##$TM1= 0
##$TM2= 0
##$TOPLEV= 0
##$USERP1= <user>
##$USERP2= <user>
##$USERP3= <user>
##$USERP4= <user>
##$USERP5= <user>
##$WDW= 1
##$XDIM= 32768
##$YMAX_p= 406366985
##$YMIN_p= -6413763
$$ End of Bruker specific parameters
$$ ---------------------------------
##NTUPLES= NMR SPECTRUM
##VAR_NAME=  FREQUENCY,     SPECTRUM/REAL,   SPECTRUM/IMAG
##SYMBOL=    X,             R,               I
##VAR_TYPE=  INDEPENDENT,   DEPENDENT,       DEPENDENT
##VAR_FORM=  AFFN,          ASDF,            ASDF
##VAR_DIM=   32768,         32768,           32768
##UNITS=     HZ,            ARBITRARY UNITS, ARBITRARY UNITS
##FACTOR=    0.368581032318806, 1,           1
##FIRST=     11203.0474431902, 0,            0
##LAST=      -874.247242800138, 0,           0
##MIN=       -874.247242800138, -6413763,    0
##MAX=       11203.0474431902, 406366985,    0
$$ Real data points
##PAGE= N=1
##DATA TABLE= (X++(R..R)), XYDATA
$$ [...]
18299 595371 366831 439343 602404 706140 715480 662978 487535 341500 472817 802339
18289 802339 619742 356108 322553 218644 -58316 -601005 -874860 -395014 -14076 -414144
18279 -414144 -865085 -750802 -279778 -111400 -55480 99394 69390 -229004 -705701 -1018747
18269 -1018747 -1201869 -990778 -925993 -1094330 -963777 -521222 48727 267469 201084 -18565
18259 -18565 -257000 -316854 215598 258656 -54321 -93520 -331432 -755927 -722696 -267245
18249 -267245 438700 1195068 1774307 1802053 1280323 530243 430394 684720 687166 630703
18239 630703 285785 -172239 18455 699073 1025276 1132274 800011 625581 926800 769580
18229 769580 466490 169374 173239 245216 -78760 -368425 -602025 -789247 -394645 117096
18219 117096 -4321 -191972 50464 3659 -169743 21694 385653 816138 1223178 1394771
18209 1394771 941205 554823 424871 696019 598823 246162 -17027 -247444 -183567 97148
18199 97148 266343 495725 599263 677787 548446 264575 182026 554484 696504 812606
18189 812606 1096036 1132112 1240592 1135258 1129690 1073760 703333 824853 1187466 1438686
18179 1438686 1577123 1416803 1027088 782731 837279 1156581 1158473 1378765 2119392 3198007
18169 3198007 4968081 7402406 11180151 17044656 21431594 18418754 12276474 8204485
18161 8204485 5741783 4065327 2851220 2123826 1310416 824633 944405 927388 1098781
18152 1098781 1681222 1586525 1357310 1113762 1054154 1119135 1270104 1795910 2378065 2522029
18142 2522029 2501172 1926226 1030601 460843 648168 913283 845583 526339 401003 473145
18132 473145 783441 924893 937645 893582 745180 857800 1152261 1025326 1130904 1601026
18122 1601026 2070962 2244142 2243141 2185350 2590245 2939507 3362343 4049473 4867033 5384364
18112 5384364 6154559 7133976 8636775 11147042 15435915 21565462 31499680 47897166
18104 47897166 67084926 66331916 47599043 31979720 22578053 17430419 14307359 12967948
18096 12967948 12809152 13519927 15048413 18136538 23904763 33781833 46264209 47625366
18088 47625366 35244687 23704641 16439622 12137219 9244573 7296108 5733098 4885423
18080 4885423 4081887 3541811 2910203 2337898 2236964 2407148 2475355 2290061 1668184 1448392
18070 1448392 1346702 1245109 951970 913930 987849 1111687 1286105 1296566 1091958 600181
18060 600181 131576 642918 1254704 1592941 1437699 1313467 1337975 1330726 1003978 719898
18050 719898 355750 -30421 -106793 -40634 -188401 -386688 -174304 -89349 -200771 -357411
18040 -357411 -356094 -48460 151220 308378 761543 980487 870804 800137 743253 460206
18030 460206 295707 632150 937622 1164909 1377692 1197978 1133800 1292208 991565 801577
18020 801577 1168164 1539718 1796838 2171179 2370672 2292006 2252605 3039451 4437122 6524511
18010 6524511 8659426 11626250 16311799 23245849 33510475 43199074 40586197 29153266
18002 29153266 19884079 13990067 10384606 7908483 6103729 4755877 3834333 2988107
17994 2988107 2351405 1971424 1846255 1962411 1989902 1764103 1271645 1098200 1085365 1017263
17984 1017263 806123 318105 -34728 -130690 497203 1028305 1228144 1105018 877436 650563
17974 650563 557537 541707 464484 244885 96439 -172457 -27055 246900 312253 354583
17964 354583 253525 176253 139084 224283 459833 774605 809260 558062 387339 126983
17954 126983 -19171 57110 -129812 -258968 -192711 -347739 -488660 -305905 -281774 -241339
17944 -241339 28994 316711 414323 451656 433424 113035 -76743 -72956 -121738 -363722 -612522
17933 -612522 -631465 -325463 30233 77733 -136142 -11651 393565 682310 600495 399813
17923 399813 81162 -322725 -775518 -1102997 -1291273 -1063764 -841118 -860457 -712051 -362924
17913 -362924 -168953 273965 717765 682190 69293 -450794 -433086 -301323 -41507 252949
17903 252949 -123764 -428183 -135437 188861 198159 368524 610950 515500 254777 6482
17893 6482 -45572 190095 295297 128727 -180567 -677378 -989077 -819743 -92552 481786
17883 481786 200643 -279625 -601384 -559439 147921 1108403 1480559 1224088 625486 230790
17873 230790 118519 -25474 -357405 -250740 134638 529983 1158547 1380019 1404237 940620
17863 940620 272831 -82677 -11662 335716 219794 16126 -84579 -32038 217865 533987
17853 533987 872002 1032615 774391 650291 871897 792460 472807 409238 455470 342631
17843 342631 336120 292494 68447 -2610 121001 160072 128929 29296 -6233 -47860 67943
17832 67943 -160115 -669904 -611975 -57023 382159 149432 23292 223661 223101 243154 284191
17821 284191 371534 292612 -274129 -849762 -959239 -758137 -311560 41961 398210 665824
17811 665824 712127 616556 233171 231540 502989 564892 364078 145310 -108453 -499691
17801 -499691 -802662 -993965 -946137 -830366 -875700 -794475 -472627 -434675 -599558 -415672
17791 -415672 -96625 -29236 -211610 117257 327450 327167 251342 47618 -296382 -702423
17781 -702423 -403957 60594 264220 606770 533454 386839 299922 139130 -32273 -113289
17771 -113289 -854300 -1290677 -1056671 -693029 -476738 -292077 1116 302098 624539 827852
17761 827852 717119 467739 346863 353596 299675 -103820 -400159 58169 419453 403830
17751 403830 -18606 -305864 -307625 -259015 -15513 73257 -33057 115096 279912 -36637
17741 -36637 -8411 79152 235852 296073 29344 -428710 -607301 -561401 -313918 133819
17731 133819 226990 -168908 -309102 -411800 -447446 43446 678380 492258 -146504 -484985
17721 -484985 -189617 -96916 -270923 -43779 425298 367618 120920 96930 292451 118839
17711 118839 -255495 -203675 412335 713178 666433 293073 -93831 150993 512854 316101
17701 316101 143021 183787 33570 60493 192399 651004 995881 761987 344098 -418097
17691 -418097 -905306 -770025 -670805 -633562 -674063 -503459 -516294 -935845 -983968 -674406
17681 -674406 -660399 -797858 -474109 303957 722478 556992 305651 -39312 -151309 -158375
17671 -158375 -296761 -493603 -449588 -388648 -577537 -884281 -756713 -839415 -1038876 -1145240
17661 -1145240 -1123383 -728172 -466793 104141 188782 -153265 -462618 -468871 233174 765264
17651 765264 1085832 1382800 1047832 204932 -161719 3625 364924 249704 11068 259095
17641 259095 843741 1222740 1129020 1067810 910885 913476 784667 1054536 1294552 1331325
17631 1331325 1524779 1052815 301414 70225 -39367 -182915 -314573 -327317 -421661 -225885
17621 -225885 313903 354952 40116 -16440 68945 280278 621986 685416 517031 206525
17611 206525 256783 449673 664429 631173 438584 314698 157131 -32184 -148142 -290850
17601 -290850 -421548 282360 1312840 2280834 3423879 4725345 4564176 2773365 1450130
17592 1450130 1062698 1027078 1211708 1393784 1161401 777801 389863 161677 99618 -51766
17582 -51766 -86860 50337 137605 3967 -196537 -151471 79195 242987 182235 30999
17572 30999 144613 254279 97802 56652 -28224 -8050 -380371 -396936 81054 267621
17562 267621 211963 216042 416882 689813 535088 305946 287676 302281 261880 103840 51843
17551 51843 -45193 -153162 66723 105581 169651 -6701 70400 148045 -115692 7101 355829
17540 355829 308838 -32126 -300130 -423683 -643373 -647839 -178682 234028 478088 617415
17530 617415 296778 108659 566289 952066 1224918 1271783 1098234 817912 347118 -107963
17520 -107963 -401301 -354336 206092 201323 -200188 -186606 -223017 -247151 62284 80316 72211
17509 72211 -186556 -659361 -876403 -546811 34261 534637 452349 168269 -5423 -67342
17499 -67342 -236123 -450590 -352750 -125008 -107074 -12591 -46200 -484912 -940679 -1247062
17489 -1247062 -886745 -255828 166947 379232 551661 471752 470787 403797 225376 88716
17479 88716 161371 284919 283738 30682 -398881 -602335 -516225 -338164 -288907 -155897 -9115
17468 -9115 -154998 -85801 11490 -73480 234491 541150 276019 -177025 -406481 -745794
17458 -745794 -885399 -903544 -802925 -656644 -544608 -557947 -715644 -784253 -438661 -256011
17448 -256011 43830 296808 -133389 -215326 266456 133067 -261355 -695899 -943960 -809974
17438 -809974 -584096 -232643 120859 331569 358392 582388 741220 312705 -106219 2072
17428 2072 308081 322459 315367 468493 214542 -10017 11592 21089 16677 198189 -91477
17417 -91477 -529069 -354614 -243345 -248212 -506405 -552369 -182973 247205 485021 482733 352659
17406 352659 -97183 -406024 29246 461960 656690 502199 226649 11221 7926 11449
17396 11449 301792 668796 319763 -240104 -526362 -762913 -704927 -424147 -105253 32289
17386 32289 26056 -178538 -250529 -278388 -258102 35324 321263 221214 -69061 73285 513863
17375 513863 645098 108964 -226311 -422953 -913343 -1288600 -1072417 -779556 -103883 355971
17365 355971 245762 -92275 -264578 -178909 -61548 -208526 -205693 140155 369232 397872
17355 397872 220848 -393681 -1000176 -1053532 -593506 -42403 265312 702024 921180 488920
17345 488920 18607 -282358 -399075 -241709 -326157 -560804 -685173 -515358 -279347 -375632
17335 -375632 -303469 -99331 197164 314209 110818 282715 800165 1071220 1041039 805164
17325 805164 371520 -68413 -259806 -185364 -123865 -98178 -363274 -552699 -174753 559049
17315 559049 1076115 1287515 973394 355264 -51859 -362755 -622639 -469362 -25424 503003
17305 503003 635583 300350 287716 732514 998211 826226 401331 -120394 -398465 -471567
17295 -471567 -117574 255766 223090 -240320 -384786 -204007 -68749 243107 522853 420946
17285 420946 370025 410589 299539 405554 561954 406735 240759 331596 162093 -183956
17275 -183956 -207942 -118985 -318727 -292370 170811 584937 720318 615291 655087 492527
17265 492527 21921 -208652 -659762 -1046058 -890024 -359372 -360275 -724535 -529661 -590780
17255 -590780 -1079572 -1167557 -725584 -152170 -15272 82346 45200 9532 9575 5977 -580978
17244 -580978 -564257 -323655 -358474 -522625 -757589 -658897 -469886 -397523 -517887 -300232
17234 -300232 -220659 -539622 -747780 -483395 -187287 67639 79250 -81018 36298 319254
17224 319254 364945 83534 -202505 -187031 -242625 -583648 -989560 -1288735 -1483516 -1355192
17214 -1355192 -1252498 -940659 -610956 -344204 -43622 19925 130636 421378 572759 634025
17204 634025 553143 196324 -247666 -598516 -298411 252801 557627 526930 444954 487862
17194 487862 458052 489160 513710 608068 606542 694599 739964 503917 159044 142014 308731
17183 308731 131812 98913 -85179 -193498 238209 313365 237282 319442 252246 385056
17173 385056 239151 -143965 -165881 -200082 -201054 -76054 -121861 -202326 -171769 -195084 -463621
17162 -463621 -482095 -689570 -1271062 -1470659 -1207459 -688236 -538911 -503070 -161050 359800
17152 359800 412527 19148 -166782 -253893 -718609 -722601 -466547 -18493 94916 61314
17142 61314 -65815 -458533 -572667 -107051 73182 -175372 -411712 -594378 -519040 -317804
17132 -317804 -635763 -1085183 -1179899 -1395407 -1422533 -847800 -275455 321521 415079 361910
17122 361910 683557 691128 606082 549700 537268 348910 -26348 -328958 -278124 -169493 -140247
17111 -140247 -278942 -848470 -1428915 -1528102 -1456553 -1277096 -1101904 -824667 -527681 -464070
17101 -464070 -620252 -899883 -893482 -650367 -260712 431433 655529 450466 -117598 -475599
17091 -475599 -315304 -464768 -235477 104357 -92726 -470507 -628501 -463156 -455515 -356692
17081 -356692 -140912 -53581 -32055 -329872 -390363 -794139 -1272869 -1188505 -1103590 -1192040 -1161968
17070 -1161968 -1079617 -687759 -177907 197329 153399 -282122 -305632 -52319 -162028 -334287
17060 -334287 -305129 -88518 174571 15341 -370501 -337023 -72424 164899 124310 93899
17050 93899 -88202 -460808 -615228 -714080 -977842 -855226 -346444 -193258 -529559 -771241
17040 -771241 -337266 128214 722403 1103418 892259 301158 -55585 325100 933142 847595
17030 847595 478559 264474 50570 -11660 73439 -13967 -272275 -559402 -422990 87934
17020 87934 271541 219221 421720 662973 566166 398718 462156 493009 197253 -116376
17010 -116376 -232174 -366469 -252390 87053 432150 459826 402380 -26815 -453047 -589984
17000 -589984 -545471 -343435 60670 616995 640479 32343 -315189 -361628 -362645 -249543
16990 -249543 -209831 -43298 250054 602022 369639 -79776 -352432 -477299 -390565 -242853
16980 -242853 -297183 -351014 -163660 86150 414979 441965 429833 595517 752059 433334
16970 433334 73830 77019 -15420 -186527 -264582 18329 376122 345536 315977 411506 529756
16959 529756 515317 256450 244893 290460 -52256 -245668 -126593 111008 247587 211092
16949 211092 152576 -79573 -413655 -297131 170661 563475 460045 125508 -241933 -542939
16939 -542939 -506411 -211588 -253054 -332845 -413868 -719772 -904983 -757378 -850041 -1048823
16929 -1048823 -948181 -920735 -838342 -785839 -866783 -634612 -424762 -509330 -549854 -569268 -239860
16918 -239860 271409 298711 -14581 -178471 -275038 -201392 -67314 -292965 -620385 -1067912
16908 -1067912 -1513329 -1464824 -890171 -805306 -875737 -681503 -757224 -832722 -322702 -45928
16898 -45928 -491250 -802450 -631088 -464111 -337418 -464056 -408050 -492924 -962367 -1353409
16888 -1353409 -1326600 -771510 -26813 172011 -260033 -542288 -413034 -200934 202708 262578
16878 262578 -83451 -73848 267186 780464 748662 678905 737514 732088 781698 676085 508491
16867 508491 465377 516584 318260 64523 -187288 -637574 -709169 -305719 4076 -45632
16857 -45632 344600 625477 517123 598944 717202 581627 379177 277436 419720 484818
16847 484818 494884 258524 84562 -32522 -8367 330966 717099 913309 727228 453155
16837 453155 404718 407228 -63674 -594205 -814829 -821343 -496185 79043 177169 251354 466969
16826 466969 578201 806331 932819 902148 791017 765986 850284 747097 588633 678432
16816 678432 938945 1027705 412787 -278756 -471388 -262085 -155089 21339 387237 582984
16806 582984 701164 1033145 1214263 949719 539080 219662 -91992 -183418 -169855 84747
16796 84747 564944 747817 724956 115604 -738968 -1098687 -706501 -388008 -95205 304883
16786 304883 -86465 -540902 -482161 -91487 -156095 -289380 -392513 33606 515110 248923
16776 248923 -419182 -850694 -963633 -1040070 -1064619 -994739 -531264 -56268 120010 150123
16766 150123 5358 -381115 -553375 -424498 -154916 -114288 -241097 -104457 -9763 32158
16756 32158 68947 91819 217853 54613 -369338 -576469 -610694 -312653 -76967 -253585
16746 -253585 -329099 -630426 -493971 -45190 233371 127602 -380707 -875238 -565693 -166273
16736 -166273 -93669 48817 -154870 -287170 35434 321377 565228 289909 -290296 -321801
16726 -321801 1032 269490 326557 -175492 -407682 -58191 643453 1017335 783226 475799
16716 475799 -231146 -875030 -647055 -114895 73727 14273 -226567 -310185 -230305 -121102
16706 -121102 -144545 73282 -18646 -141729 84134 113498 -43196 -151013 -213253 -235623
16696 -235623 -286465 -574944 -752870 -660110 -526090 -385810 -106340 -75811 -301026 -456512
16686 -456512 -612637 -652922 -358548 -119611 -54900 178273 71434 -124168 -204696 -186920
16676 -186920 162710 187347 -142353 -285182 -27643 330276 464655 448571 320043 372038
16666 372038 675039 900714 749998 470574 105664 -395287 -876479 -996244 -745827 -528103
16656 -528103 -64540 775907 729128 73247 -212408 -493680 -832702 -814099 -375108 -104873
16646 -104873 -196540 -165263 -209590 -225976 -428433 -597221 -566543 -159189 202467 400561
16636 400561 524503 273741 -132011 -433873 -336005 -122847 -29791 116877 650816 985006
16626 985006 981695 905332 869960 638138 531700 360836 -97982 -121966 223840 663985
16616 663985 680345 564776 586069 264101 -190161 -115142 113770 -93920 -338690 -602395
16606 -602395 -801847 -1027589 -825386 -709507 -560059 -368574 -323062 -39792 -110543 -263008
16596 -263008 -126067 236594 384745 359430 33887 -135541 142098 458686 699707 382795
16586 382795 -152825 -628387 -803049 -840735 -1126406 -1459396 -1470824 -1023538 -636689 -618836
16576 -618836 -195256 188915 208996 115918 -50932 -186820 -502769 -495713 -488230 -662698 -515290
16565 -515290 -538666 -581502 -308942 -24830 26886 3165 -148785 -83990 205685 -4344
16555 -4344 -139570 161520 12558 -89591 335359 355791 42521 -195851 -294344 -423364
16545 -423364 -401339 -299865 -275199 -273370 -303578 -452084 -566039 -713876 -533883 -300035
16535 -300035 10873 -5621 -240824 -12219 -27933 -63606 304497 660734 645616 376545
16525 376545 314698 410715 651642 540093 151339 90593 -315 -370039 -107310 295863
16515 295863 200033 287115 720325 918316 778736 540210 195837 226816 502368 269931
16505 269931 -160998 -625372 -647517 -54503 311581 295684 337582 268054 -37422 5333
16495 5333 300331 239957 -125676 -424626 -331795 -155592 -201104 -454711 -458326 -607195 -914476
16484 -914476 -846576 -546873 -182192 -120519 -485212 -534813 -5131 325719 340262 522315
16474 522315 805127 759572 418962 351231 481192 687587 905904 829233 986171 875322
16464 875322 474893 345378 392928 323628 236521 137344 10193 96140 482403 481925 193825
16453 193825 276206 541181 675486 418606 332726 431862 -33769 -636112 -637700 -280822
16443 -280822 -203024 -429822 -647509 -485903 -233614 50479 32738 -258394 -286164 114986
16433 114986 284282 82299 98262 209718 -142191 -414700 -299124 54610 289940 333799
16423 333799 361001 351021 18601 -249911 -366175 -55696 82091 -310363 -445371 -390949
16413 -390949 -539412 -609189 -532653 -368791 -85118 133759 220710 340028 362242 611300
16403 611300 546854 46574 -312053 -41556 352478 326098 400611 672672 706687 465932
16393 465932 289395 -151603 -317311 -389340 -538863 -472338 -178664 84849 442488 609494
16383 609494 279932 149353 326569 317818 -58438 -540228 -707505 -730032 -937983 -1316156
16373 -1316156 -838183 69757 474718 258613 -82825 -188519 -473370 -757183 -349607
16364 -349607 -96313 -49401 403939 393305 232756 -97325 -320755 -686492 -1117694 -1332104
16354 -1332104 -1365639 -1040052 -555274 -43491 79333 -33265 -174889 -208725 -433401 -496550
16344 -496550 -314944 -520432 -948063 -839985 -642842 -449553 -112266 274080 308110 49875
16334 49875 -183650 -113775 253858 408363 105892 -73798 -102293 38030 228446 168357
16324 168357 500368 1006116 1081821 865658 652697 394866 216330 -212918 -236546 40716
16314 40716 641093 839365 711872 576335 171086 -18594 460083 973026 1149029 902653
16304 902653 384444 80560 84332 35541 -207456 -452177 -331852 -102948 -288227 -448651
16294 -448651 -482332 -534199 -635759 -718714 -502782 -78562 184367 -56600 -86348 236872
16284 236872 383115 273666 154758 44952 -116870 -25451 -12211 -150725 -348058 -438301
16274 -438301 -366817 -102274 82068 135028 -28760 -372692 -188488 282809 488502 348788
16264 348788 -52515 -524436 -285479 344917 695809 564011 -60110 -529997 -525109 -114868
16254 -114868 113680 135627 211461 233292 254176 354961 690992 987651 989924 799067 746972
16243 746972 1199409 1315430 1006947 464401 67345 -372645 -624730 -598083 -331247 -393959
16233 -393959 -419267 -257687 -437213 -615248 -283330 199833 479367 354009 231079 340610
16223 340610 514471 333494 -133709 -448956 -376545 -140578 -158022 -193940 -375037 -511794
16213 -511794 -448444 -579181 -872208 -1002192 -1043241 -743568 -472034 -276923 -103384 -136869
16203 -136869 65482 328154 240084 78971 -117520 227951 238094 -28316 268782 282147
16193 282147 150312 42823 169716 305479 643433 1090084 1171463 842941 446124 289010
16183 289010 140102 6379 384592 677785 669597 892642 653383 50246 -702673 -1060248
16173 -1060248 -710946 -201329 -48713 -307431 -465176 -296815 145991 433071 461569 520737
16163 520737 432653 329517 -70323 -203752 197769 420452 262412 209753 140787 -88960
16153 -88960 -275131 -464275 -559106 -329562 27393 400120 154059 -311309 -694884 -854068
16143 -854068 -735399 -536739 -219858 -217000 -290150 -409837 -307428 92639 170572 235520
16133 235520 255809 -44899 -59677 217960 378495 517357 517659 377222 22157 -418631
16123 -418631 -530002 -571314 -620459 -804801 -707856 -550304 -442886 -498311 -512501 18545
16113 18545 649352 515491 73181 127667 331227 356391 216138 -134802 -339528 -317552
16103 -317552 149066 580780 712157 458923 -109719 -602071 -689096 -321222 322063 595409
16093 595409 602293 534735 378023 180677 -30977 -358365 -674718 -998258 -1218218 -1237828
16083 -1237828 -1046701 -854103 -458246 214345 648078 790247 741829 544954 95186 -166836
16073 -166836 -205411 -236716 -476543 -679259 -571030 -470648 -209414 108528 250519 284379
16063 284379 16642 -363377 -692984 -482169 -278231 -151747 -297897 -650115 -769508 -569311
16053 -569311 29925 338651 702223 694484 526425 283010 371651 422450 -11194 -462472
16043 -462472 -169440 165571 122984 147110 169388 306113 494225 590263 839783 644006
16033 644006 -129096 -787783 -988873 -823629 -497547 -391031 -460528 -390685 -387442 -347828
16023 -347828 -337160 -313573 -234693 -248860 -156170 400374 859301 900741 527544 199216 -87413
16012 -87413 -132029 -159463 -351624 -361404 -654781 -763942 -648329 -350471 213767 589522
16002 589522 859387 761904 627146 457879 85693 -205923 -164257 -318344 -357947 -180668
15992 -180668 -87021 299037 365636 3830 -528626 -766999 -692870 -723973 -555751 -405206
15982 -405206 -214319 -310141 -827784 -928727 -339822 38935 73679 -372592 -237432 -32040
15972 -32040 -37808 46216 428796 425376 197243 11214 -37884 67242 283415 488957 429124
15961 429124 -131528 -382723 -407222 -396511 -329076 -132366 8284 -107293 -31351 -14949
15951 -14949 -79125 -295957 -526212 -754954 -845607 -1157719 -1371678 -1336673 -1148195 -750268
15941 -750268 -225658 156045 242129 266805 111116 -38220 124775 275012 267095 67627
15931 67627 144557 400768 638782 941593 1220346 948195 462312 55056 -53709 36663
15921 36663 10027 175505 229355 348841 652462 485195 316754 227684 7327 -257101
15911 -257101 -486915 -861507 -849355 -719473 -864800 -1085570 -978785 -562334 -674706 -884669
15901 -884669 -786639 -538694 -540705 -391613 -217823 -190464 -344368 -488089 -389329 -161163
15891 -161163 -60942 -262794 -316673 -579827 -1157136 -1282501 -1256432 -1052257 -677771 -687365
15881 -687365 -796370 -902306 -972866 -1205024 -1137116 -928641 -804035 -653866 -711204 -483484
15871 -483484 -224543 62517 383279 496173 483989 421977 481910 610276 989855 1323200
15861 1323200 1356662 1147369 590694 432819 595802 570097 626537 369191 262591 489017
15851 489017 577401 310075 -207221 -307415 -119050 -60082 -134933 -351437 -377314 -308269
15841 -308269 -320379 -291449 -531558 -619633 -317101 53943 150751 142258 -123510 -451850 -388563
15830 -388563 -539844 -385444 64021 78866 -51052 -48781 163236 563512 333931 -64227
15820 -64227 -247275 -482225 -265925 43292 206337 425604 686488 900359 674017 618642
15810 618642 418996 -15135 -240368 -239810 -204912 -130090 -35046 -31798 64322 245247 273600
15799 273600 235442 408302 683821 718425 140100 -566049 -666115 -428552 -103337 151552
15789 151552 493542 685685 266624 -172703 -325889 26038 74351 -183079 -60692 580319
15779 580319 782389 258471 85524 133786 -137469 -389463 -814843 -1358135 -1547090 -1444477
15769 -1444477 -1134594 -771084 -535507 -386501 -717105 -1059627 -911806 -541929 -492816 -194840
15759 -194840 102603 -39372 -779297 -1242156 -1069361 -745446 -615841 -734220 -565176 -493619
15749 -493619 -378841 -50511 -232521 -780056 -825306 -793090 -724045 -163092 422111 549532
15739 549532 329841 67712 -225705 -633684 -965915 -927498 -633441 -226358 -21051 126837
15729 126837 270224 382252 118518 -136270 -322305 -534812 -526482 -420928 -43757 149960
15719 149960 90201 -254077 -215788 -255835 -632395 -728953 -608454 -322209 40371 -171186
15709 -171186 -304714 -35162 239393 113575 -172268 46008 628840 949741 879166 407653
15699 407653 120780 158257 283993 283871 234373 469776 729504 749227 564041 366769 395318
15688 395318 545449 217556 -417728 -434939 -205322 -226087 -135879 -48071 51232 -60354
15678 -60354 -110824 -150783 -233403 -186337 -84173 234459 454699 215209 -28146 20054 199928
15667 199928 234334 330786 643393 997744 1047283 831832 623695 706357 951862 1112198
15657 1112198 1134199 821250 474047 555884 706704 90734 -456560 -334094 -83219 78254
15647 78254 78650 -101920 -385862 -765999 -944508 -1001662 -748531 -102314 73938 34156 125089
15636 125089 87546 106521 222837 395464 593218 489981 264358 -174135 -483668 -368604
15626 -368604 -524190 -567129 -250640 -105937 -133828 -162041 -63310 276174 -108615 -240037
15616 -240037 -47603 -120323 -201441 -500584 -616161 -276415 -16924 -168466 -14434 619053
15606 619053 758164 485051 163194 19016 -150696 -210745 -349732 -79162 361056 499221
15596 499221 683863 450869 -24288 -263142 -384866 -475444 -851243 -1140354 -1042946 -598881
15586 -598881 -271210 -51896 -327222 -660661 -719616 -355755 -75728 -435868 -397572 -238226
15576 -238226 -134279 -165511 -131325 -184185 -175354 -4669 91192 338510 227438 -12788 -42259
15565 -42259 2829 34183 14511 -2202 53236 274205 237792 277896 360479 176364 -214622
15554 -214622 -650050 -719058 -606753 -187836 470790 546010 374852 -12958 117053 372233
15544 372233 251802 61021 -155055 -390246 -671280 -520019 -285734 -329039 -112851 88567
15534 88567 226492 268082 231364 149369 -34473 -134098 -543857 -728744 -449423 -121096
15524 -121096 -89264 -344307 -431929 -351250 -240247 -188019 6544 90835 28973 -228865 -494492
15513 -494492 -541137 -392911 -189867 295731 964374 958750 335573 20194 79685 137684
15503 137684 354141 466220 145677 -120850 93641 -21312 -185845 -168638 -448720 -373300
15493 -373300 -102347 237015 741048 1009974 919327 610147 277071 24632 -230965 -351226
15483 -351226 -584736 -524240 -193928 19141 208834 238736 549029 968173 1188162 809655
15473 809655 180417 -153302 -554558 -624775 -344580 -212148 -372750 -546684 -832884 -704943
15463 -704943 -686223 -374332 232925 356588 453756 421989 175959 -270719 -433044 -505244
15453 -505244 -839401 -823398 -189621 207718 239351 133602 -39933 420631 545063 351471
15443 351471 294165 248859 136970 -6938 -428713 -834909 -648481 -457543 -702711 -841507
15433 -841507 -677133 -592583 -727152 -820064 -680053 -152603 -71868 -225488 -45723 167471
15423 167471 537745 647443 630845 509137 394761 330295 159938 3216 -185978 -402345
15413 -402345 -411710 -402916 -110810 355246 467765 191871 -407672 -635980 -505369 -527502
15403 -527502 -720546 -775487 -708746 -613713 -198120 5812 -103888 -136477 459716 766371
15393 766371 264960 -151170 -447611 -282903 -97187 139209 235963 114816 -291511 -634369
15383 -634369 -263935 454817 574847 234074 -177770 -239567 -234074 -107710 -113534 -569016
15373 -569016 -984200 -1168376 -1424778 -1468016 -977857 -753900 -807353 -774457 -647522 -603956
15363 -603956 -479047 -128484 36777 -208364 -531558 -683985 -664197 -740381 -867891 -878634
15353 -878634 -561697 -304675 -156287 -50146 -26420 -96569 45114 -8731 -198501 -293518
15343 -293518 55249 111034 -311263 -698268 -833713 -931721 -783795 -759924 -604634 -744923
15333 -744923 -739409 -606388 -731708 -786030 -566703 -200117 -78810 133238 566762 601735
15323 601735 323729 241386 -93417 -261860 -174731 -164838 -106362 -193766 -641355 -831542 -440858
15312 -440858 -363877 -414217 -99327 170315 137939 169140 459627 279645 -144816 -167166
15302 -167166 88740 235240 17239 -72361 85375 370960 397694 331848 66488 -218301
15292 -218301 -505662 -451144 -237847 -152836 -247542 -472699 -609782 -358594 -106959 65352
15282 65352 199268 30790 -273666 -814653 -1182603 -1158541 -987326 -827204 -377147 -302409
15272 -302409 -367531 -226666 11866 251349 595407 632034 365100 298383 309794 238836
15262 238836 205908 203977 134452 201836 415644 653883 749233 335069 24928 229587 784473
15251 784473 922435 610488 396662 242705 157510 114916 177770 -201229 -518575 -581107
15241 -581107 -536161 -296471 -146554 -107245 -124705 113430 235976 167234 -283883 -256676
15231 -256676 -11892 -246719 -402863 -321798 -498663 -511153 -256849 -116977 -144501 -326904
15221 -326904 -449972 -446071 43680 276169 68387 -270694 -742068 -825144 -824644 -979222 -867054
15210 -867054 -587086 -412643 -130960 195205 708397 1083186 1019219 491619 98498 -164551
15200 -164551 -414753 -142097 333547 93197 -563472 -739387 -869511 -862636 -790858 -706171
15190 -706171 -838640 -995583 -789786 -726213 -740652 -741393 -736354 -511235 -291978 -110595 264289
15179 264289 719565 891642 681831 427521 226703 138841 288008 242010 -234525 -860185
15169 -860185 -1229258 -1001121 -388777 -125858 -425962 -787481 -662719 -339617 8199 370547
15159 370547 808145 1071256 669875 30749 -238885 -486292 -817941 -929641 -905943 -650668
15149 -650668 -312871 209099 186083 24056 347915 676542 638201 413728 196169 94828
15139 94828 -378092 -562228 -437279 -290258 -125213 -136572 1982 132536 106848 -148118
15129 -148118 -37549 760 -135574 -19677 161300 258943 255459 -8377 -74354 -46178 -140621
15118 -140621 -144341 -164988 -111432 168180 322040 122263 -425664 -574250 -465708 41158
15108 41158 348278 230250 462927 483977 426284 203407 222160 45337 -416167 -573559
15098 -573559 -468431 -257347 -207344 139393 19268 -441745 -362001 -247602 -83468 -178805
15088 -178805 -57281 170846 327168 207936 -459117 -830455 -289987 65726 132073 26651
15078 26651 235693 642733 564863 457165 465078 180015 -167477 -218346 -59273 -1464 251995
15067 251995 523388 586199 470099 334626 254454 239432 321992 82156 -80067 -127193
15057 -127193 -281981 -238406 -471904 -743775 -779963 -591874 -796041 -1301929 -1256832 -1203698
15047 -1203698 -749009 -81517 738945 942130 674375 542061 626548 602082 522019 270692
15037 270692 -107112 -189080 114773 368910 208289 -87963 -305345 -331341 -5654 -130130
15027 -130130 -260892 123432 448120 426030 -117813 -491268 -726085 -912469 -673393 -221514
15017 -221514 265199 631280 1052157 1064665 477268 32481 47039 106554 43658 170635
15007 170635 415595 467237 528618 792541 1237745 1528044 1297320 1046458 958736 835677
14997 835677 1035922 1005782 455949 -37051 -173985 -61361 48784 193192 31354 -425386
14987 -425386 -679464 -486230 73734 509152 629761 726325 652667 727856 539604 -11041
14977 -11041 -382974 -599971 -615140 -577838 -298678 -69486 414803 708831 734261 825345
14967 825345 755030 572078 374004 269348 204807 84491 158201 93840 56998 87224 -61065
14956 -61065 -258402 -496393 -567304 -497733 -494266 -469193 -346108 -121963 186736 202727 89913
14945 89913 277949 53637 -425886 -576997 -747818 -1056009 -1187344 -1286487 -1240126 -641319
14935 -641319 -220261 -382205 -693689 -781816 -468874 134946 454933 365510 254239 290692
14925 290692 256840 318524 553356 141918 -476657 -483064 -411055 -469131 -276252 -237447 -283558
14914 -283558 91091 177846 -55122 -300670 -622559 -927997 -906658 -760106 -659255 -553798
14904 -553798 -314326 -335083 -736580 -578350 -279569 -573914 -941376 -653868 -495086 -559407
14894 -559407 -495982 -450939 -471419 -655742 -845052 -790098 -744265 -802729 -830195 -1051622 -1114993
14883 -1114993 -765186 -474029 -476189 -342329 -93450 199379 120539 -295586 -485143 -355636
14873 -355636 -223289 -241014 -552461 -617871 -237326 -149434 86868 508104 413065 23788
14863 23788 -228911 -179704 -299647 -279966 -75935 -149836 -593294 -700542 -524859 -768805
14853 -768805 -994953 -832593 -612134 -349328 -564171 -832928 -525259 -357721 -471500 -543102
14843 -543102 -552248 -590124 174648 1006670 903081 722554 819523 843262 720298 859773
14833 859773 945554 790244 319126 -42933 -215561 -102527 26249 -16692 -212228 -293342
14823 -293342 382184 841752 600331 290325 188131 45824 95243 208539 55709 -296821
14813 -296821 -406853 -72852 -26002 19240 228920 266878 244102 276925 475677 527691 179198
14802 179198 -190768 -504093 -938875 -1087604 -719626 -215632 16906 -350875 -668913 -740034
14792 -740034 -960368 -696117 -335298 -168809 102788 351059 603672 568572 247817 -128600
14782 -128600 -500975 -886077 -1157762 -807914 -438030 -562680 -711277 -424874 -494158 -823010
14772 -823010 -750436 -680121 -527724 -546225 -496377 -238450 -199791 -225131 -442895 -1020610 -1111082
14761 -1111082 -334790 343174 472999 412221 371086 -37054 -382793 -275992 -379241 -507148
14751 -507148 -527481 -150528 261155 111938 -165411 -370141 -646579 -580417 -577169 -364297
14741 -364297 -154334 -619014 -1176886 -1015514 -906683 -956916 -783675 -737140 -717901 -1036342
14731 -1036342 -1118504 -1020467 -900436 -588787 -477708 -725760 -731361 -447003 -176338 -36625
14721 -36625 -21992 -153826 -250552 -320773 -604281 -394891 304665 571032 167486 -163159
14711 -163159 -442913 -988057 -1240110 -1399517 -1187090 -560309 37027 -186774 -590863 -510301
14701 -510301 -493393 -763804 -859295 -710078 -601598 -628149 -727914 -879713 -621522 -295158
14691 -295158 -519574 -793266 -795834 -801214 -788940 -697885 -311734 65023 -10787 -330964 -555921
14680 -555921 -140612 135445 220059 506599 837998 1070050 971035 322305 -128911 114314
14670 114314 480357 310201 -10406 -33814 -94607 -307218 -538200 -945085 -838366 -390948
14660 -390948 28735 258417 436121 470008 27083 -88839 186117 -88664 -316961 -230842
14650 -230842 -191845 -189547 -177182 -200066 -63129 373654 384619 286817 72896 418503 653415
14639 653415 236592 -56518 -200515 -37527 104303 242416 377505 241368 -87710 -210231
14629 -210231 -384145 -498110 -312909 -198146 207791 430743 431654 287132 -108453 -232211
14619 -232211 -117664 70575 89600 -84329 -226193 -133216 -140604 -486098 -459313 -351784
14609 -351784 -685618 -945587 -892114 -624184 -259995 -47798 224371 477491 131525 -460351
14599 -460351 -657558 -348528 -326838 -208730 5161 122159 359709 352458 45548 -234391
14589 -234391 31936 514436 1078879 1169359 1086081 909379 410899 -70974 69528 706891
14579 706891 1080445 999455 626064 578261 801649 705883 332603 89800 182870 241184
14569 241184 168282 37996 -179182 -423960 -375858 -273483 63631 334141 404190 177215
14559 177215 -184639 -175749 -12397 155299 74167 316330 358094 -242056 -567549 -700675
14549 -700675 -745702 -797982 -961733 -922818 -459778 -111398 -87404 71563 220469 60145
14539 60145 -120714 -510582 -767170 -660687 -881753 -1229922 -1335365 -1107431 -796815 -790339
14529 -790339 -746576 -600609 -472226 -259963 -124508 69619 -12693 -249110 -334037 -197810
14519 -197810 422558 663097 678076 952518 749052 246696 -211742 -419492 -818790 -1251636
14509 -1251636 -998455 -303492 6400 145659 -30798 -460117 -591196 -555113 -182657 301211
14499 301211 314355 353315 500409 390615 29737 -260499 -295070 -205445 -352688 -235148
14489 -235148 139328 231280 361344 489784 473782 524256 65985 -297570 -16566 192192
14479 192192 173531 459654 392998 -176856 -281485 -500943 -802810 -827043 -527430 -121727
14469 -121727 -60431 -411166 -136037 318927 210862 300309 238835 -62033 -48142 63084
14459 63084 110860 362598 189240 -274813 -229157 -71537 -11811 32840 -49587 219171 608479
14448 608479 431761 114752 43802 315903 590546 633355 518119 368679 194222 -14860
14438 -14860 105787 209295 214919 211468 247534 246393 167955 93910 -92496 -329244 -594394
14427 -594394 -442949 -206888 -342895 -473369 -477163 -741304 -794244 -753113 -779154 -718396 -818169
14416 -818169 -1006023 -1185550 -1077282 -488714 -338088 -207206 -43790 313137 665198 482198
14406 482198 57428 -116533 -144335 -108636 241588 277043 187106 13411 305531 315718
14396 315718 -283824 -573191 -466939 -501915 -282807 120773 130061 101345 501589 1080560
14386 1080560 1359528 1106758 570186 117468 -273310 -480109 -483296 -110161 346104 545815
14376 545815 87491 -481445 -630904 -535415 -245846 59512 -105146 28962 199670 24100
14366 24100 -12425 362601 844548 1160729 988237 410194 93844 153721 79868 -58120
14356 -58120 -196687 -84009 361915 773850 512105 -163523 -565672 -643146 -460302 -369810
14346 -369810 -266448 -149040 64041 210700 -10662 -41966 27429 -101550 -229801 -650477
14336 -650477 -535980 -364108 -374603 -336115 -376397 -324994 -32709 425153 578882 150637
14326 150637 -125856 -126123 -136767 -2280 -216865 -557471 -443802 -268827 -445815 -296770
14316 -296770 8355 253398 311448 -264335 -729368 -673410 -246810 -17049 232169 459351
14306 459351 490261 466871 49078 -167731 -28660 -19245 26370 -136163 -420746 -917504
14296 -917504 -922538 -468398 -340826 -507294 -628652 -725058 -1103280 -1015085 -832383 -747080
14286 -747080 -600708 -587244 -391970 -126738 340633 476581 459638 358876 -233652 -738522
14276 -738522 -630080 -243765 -216609 -297729 -105571 405638 914416 851548 431822 -37973
14266 -37973 -341725 -343412 -77382 140853 377580 210657 449166 759848 714552 1010197
14256 1010197 1055730 855494 494691 76101 33352 87900 -242788 -459470 -939877 -1332334
14246 -1332334 -1054517 -743873 -652449 -412129 -443484 -689478 -370636 -320939 -485845 -365921
14236 -365921 75657 261369 12866 218669 746162 807487 468163 120304 158650 594797
14226 594797 788808 825410 345215 -45661 -144811 -562781 -526297 -252907 42054 488405
14216 488405 774726 867984 490702 -2254 -320653 -919010 -1332427 -1362960 -1242033 -1010476
14206 -1010476 -1136937 -1079462 -963945 -734831 -306755 -315458 -377147 -299197 -278638 -247550 -445612
14195 -445612 -607806 -637994 -539994 -178683 391111 493671 323902 258436 431690 875021
14185 875021 1229389 1337239 1238491 918070 390504 21041 -246422 -113170 257662 319737
14175 319737 194907 320642 281618 230120 417954 369306 -141333 -357983 -91713 -84118
14165 -84118 -137243 -77786 -129835 150061 92805 -435416 -660548 -533961 -321153 -8086
14155 -8086 75415 158389 269435 -135142 -328083 -460659 -718029 -655287 -505038 -499571 232395
14144 232395 640055 409381 197335 218278 361547 238580 37960 -212015 -115949 58860
14134 58860 215811 784821 927914 434913 -90439 -262889 -487215 -680020 -643939 -556133
14124 -556133 -699606 -569544 -197909 -109066 -101004 -187863 -304068 -278233 113308 622891
14114 622891 1022878 1163657 748732 98516 131503 687670 691570 600112 580311 608567 432478
14103 432478 129716 27116 -103551 -30948 196543 286319 454280 961228 1351059 1293390
14093 1293390 646729 152150 249296 213893 368863 594327 552950 328244 325291 392663
14083 392663 209833 -120799 -19506 54185 -119368 197843 538784 719374 780899 709210
14073 709210 488815 383133 180477 -160249 -98518 335364 261913 -311921 -446007 -50166
14063 -50166 355218 381742 -173329 -646666 -587976 -56875 303764 368436 217372 208986 240075
14052 240075 36774 -194916 -271581 -79900 471694 745519 667409 537017 410881 28487
14042 28487 -307668 -332412 -173206 -259540 -296990 -302637 -506910 -844533 -914024 -864049 -885530
14031 -885530 -973823 -1167500 -1362882 -1213182 -1092427 -1056230 -1027004 -1154245 -839263 -548206
14021 -548206 -378846 -648372 -1073829 -1104638 -633571 -157541 -336203 -294432 -78960 -239814
14011 -239814 -159892 -276727 -306001 -177544 -343834 -294632 -75045 303952 538182 868357
14001 868357 793717 676408 921474 814109 157277 -526308 -938723 -807021 -494169 -435718
13991 -435718 -524662 -471006 -132536 71883 168609 381130 448830 212056 -249259 -402150
13981 -402150 -56368 566790 1157932 1585925 1975137 1887327 1423188 1074794 810820 371084
13971 371084 265358 292977 169383 279294 503845 303761 71107 152024 277575 213509
13961 213509 363307 546492 481338 205404 -14633 -230969 -401444 -578914 -553135 -467338
13951 -467338 -596097 -419243 -68810 -338064 -1070319 -1583444 -1611238 -945426 -555842 -694682
13941 -694682 -1098370 -1140729 -711498 -616121 -1069272 -1581792 -1465154 -939935 -300529 94365
13931 94365 154418 217332 462754 391104 270991 61282 54310 300163 414436 320774 -59714
13920 -59714 -349263 32717 506448 802554 1092115 1298770 1112785 571304 394357 851857
13910 851857 997646 712680 706577 555080 184712 -53471 -352644 -388854 -288389 -372181
13900 -372181 -443074 -53387 601098 547559 -22281 -416175 -139769 -25257 -200485 -394362
13890 -394362 -564692 -479117 -366011 -173399 13432 37300 254415 470906 553506 511994
13880 511994 488774 520984 369738 332590 545917 653576 422452 379123 558515 178106
13870 178106 -465393 -805317 -810437 -678039 -266455 193812 425076 668028 638929 240359
13860 240359 -392978 -755786 -1040246 -1047091 -707200 115308 602999 499306 266912 306936
13850 306936 489062 504585 130776 102874 492224 600792 417820 242941 269069 495812
13840 495812 185177 -44982 -37776 -72176 -127742 -208155 -254484 -239189 110228 113666 242948
13829 242948 269364 139887 396471 505991 23041 -250038 100324 227770 -36768 -96731
13819 -96731 249093 606201 684307 799253 856132 498763 33639 -219312 -581620 -1040496
13809 -1040496 -1268907 -913027 -219035 -10524 -72450 94041 -24583 -371105 -568448 -704397
13799 -704397 -1248314 -1506680 -1360675 -1357756 -1045210 -848507 -1122651 -1082951 -691222 -713277
13789 -713277 -601619 -56226 144766 -212756 -340852 -235334 -11936 -54800 -77883 -209663
13779 -209663 -205074 -14923 -218670 -566216 -521526 -488141 -447070 -196895 -275711 -403818 -561903
13768 -561903 -515238 -511959 -346871 -82949 -134283 -299954 -194118 -240100 -603871 -568706 -400835
13757 -400835 -1005890 -1658372 -1296240 -707378 -411800 -296609 -467219 -484002 -398392 -271794
13747 -271794 137423 577527 843230 1190488 1179304 1075138 936860 998461 975514 646106
13737 646106 254605 176121 269896 115269 41609 293186 385187 390145 -64131 -678774 -633582
13726 -633582 71480 407582 688278 682056 312551 -131725 -500303 -352324 21987 -110702
13716 -110702 -592313 -607731 -510037 -544385 -544781 -615990 -493126 -87596 166110 -17683 -400376
13705 -400376 -204777 134107 18634 -3327 -116484 -166636 231928 580519 462298 286169
13695 286169 336799 586930 996958 1027672 927175 935662 959427 802811 155377 -406862
13685 -406862 -752448 -584128 -128173 219231 433396 646068 622684 468087 95295 -255402
13675 -255402 -273860 -249726 -4237 -38636 -30754 3324 -232729 -258181 -644483 -934903 -718752
13664 -718752 -531812 -464903 -66394 265304 217627 390800 350312 -156229 -303493 -262811
13654 -262811 43180 45688 -150998 -295712 -773953 -864579 -596077 -250389 -206045 -70978
13644 -70978 -335875 -363492 -337127 -225998 244043 237255 186232 355868 452242 390910 339307
13633 339307 317869 169257 314406 514056 555203 291973 117904 320625 337334 330390
13623 330390 147992 30196 77176 59465 148979 147951 59032 65826 100806 151214 -204916
13612 -204916 -227410 49145 57736 470820 852044 995991 1135940 1030176 1050745 1101211
13602 1101211 1120499 1025254 874013 933431 737600 520183 402059 538908 641921 479778
13592 479778 203158 243508 552622 539668 449566 294064 88264 -293592 -434848 -248970
13582 -248970 -204409 -317620 -268299 -12953 -15200 -39216 92353 321949 745150 1224417
13572 1224417 1291413 1198001 1033055 755934 379431 151406 -195611 -358536 -397341 -225571
13562 -225571 -996 254820 159623 -262819 -739428 -820988 -428817 -7847 394662 360925
13552 360925 31147 -110696 75895 319151 339691 111322 -139439 -38424 165928 53870
13542 53870 -149435 41432 506345 860167 852588 684806 720159 607390 390100 458506
13532 458506 548846 501959 575512 872732 839918 1070928 1507177 1536381 1313876 822940
13522 822940 197181 -213677 -529389 -605005 -571827 -311410 1022 11234 201142 418528
13512 418528 731696 461409 -213018 -300603 -135601 -78309 -84363 -74390 -94756 270413 381185
13501 381185 333754 338480 172020 442671 1046904 1013259 527714 342516 368981 342478 248808
13490 248808 327500 580197 561451 143880 -32168 -285622 -394118 -412906 -421253 -235315
13480 -235315 303447 616884 681006 723547 665272 580612 558776 553409 329425 150421 -65520
13469 -65520 -126324 38888 114845 117498 150748 327776 358100 528988 800139 779728 515872
13458 515872 174352 -7044 101532 291949 181621 -119848 -435030 -400177 44291 337328
13448 337328 618579 1077064 1184378 1049375 721407 474672 546369 402284 508830 506820
13438 506820 296665 255916 264536 308237 410798 561815 415773 64741 -46383 109410
13428 109410 155433 358291 467566 422104 431355 292371 195314 360778 525616 710164
13418 710164 896094 949955 755140 834479 1077328 1155698 945137 630585 299992 -228356
13408 -228356 -490787 -414744 -294732 -58769 400861 625997 491381 266397 45934 -96823
13398 -96823 -6334 -363 -31537 -15841 192117 328265 163432 497368 707499 254437 -298127
13387 -298127 -291721 5587 -150301 -144311 92317 172484 425936 547621 455720 556608 612082
13376 612082 460886 18857 -176703 -295975 -419994 -256090 -53165 367161 1032114 1558640
13366 1558640 1436604 910620 588227 790653 1073027 753043 288499 164918 116015 -105223
13356 -105223 -122826 207178 793292 1106692 1076021 944799 882358 547673 213086 296961
13346 296961 425935 350846 29127 -127110 -116012 219492 672793 890269 486144 203879
13336 203879 28913 107021 330579 297071 176457 171976 103370 -172769 -214235 -43412 17898
13325 17898 -127493 10623 142978 436598 503411 405690 654701 638665 540572 685904
13315 685904 815420 842283 723281 616069 496525 273188 65001 15805 -153021 -550716
13305 -550716 -630487 -267879 -407899 -162981 297978 759739 753050 188508 256667 628934
13295 628934 610124 222045 -107557 -281551 86953 404308 284347 -200854 -430454 -648761
13285 -648761 -723782 -482198 71419 728345 975756 784561 534135 421362 235555 551823
13275 551823 475288 -44818 -547089 -486456 -283059 -332720 -693456 -549435 -68355 181139
13265 181139 447255 701522 570660 23966 36495 357341 291637 146298 214690 680243
13255 680243 1164929 1478255 1883118 1902920 1747295 1340378 783570 627200 832456 1012035
13245 1012035 1229733 1338234 1358620 1291734 1235178 1166552 964501 642856 520805 658963
13235 658963 666174 758588 1034568 1045721 829475 878244 1122209 1246709 1285706 1279220 1166655
13224 1166655 1050469 706559 404085 314741 48168 -110538 -108316 -164053 -601575 -727800
13214 -727800 -358456 113061 401113 527357 954819 904184 829263 1023166 932810 655590
13204 655590 261365 -197611 -225874 131502 608052 554920 261219 -167068 -467189 -355034
13194 -355034 38268 231477 669457 1173954 940641 882778 1190802 832254 167356 -152994
13184 -152994 100702 845326 1510435 1758531 1723782 1480773 859208 209418 34360 337341
13174 337341 678243 775458 768256 846740 910005 861050 837073 840172 994689 910356 699107
13163 699107 423719 410465 673660 1154381 1259705 859779 872966 1224216 1707457 1874139
13153 1874139 1748179 1586122 1526408 1290684 1223143 1422256 1819694 2126564 2184616 1878497
13143 1878497 1944085 2052166 1813345 1642277 1736220 1662476 1590751 1328872 1354257 1696272
13133 1696272 1695883 1528218 1264555 1072849 1368105 1610237 1742376 2018571 2001295 1392761
13123 1392761 835697 784674 1074379 1303285 1468336 1627544 1222213 868446 870457 661673
13113 661673 374814 154107 383266 859559 1435972 1985240 2359893 2267918 2002988 1736243
13103 1736243 1684633 1706607 1585577 1790984 1703600 1672938 2299589 2756411 2674758 2504491
13093 2504491 2285335 2143168 2226597 2178396 1499221 1151307 1042859 1227088 1819490 2327145
13083 2327145 2544649 2576501 2813981 3090068 2859298 2282758 2096773 2246893 2263531 2158214
13073 2158214 1793001 1436111 1512487 1706453 2110079 2362843 2377463 2482048 2462149 2534523
13063 2534523 2781890 2672699 2214983 1874444 2157336 2546741 2595746 2934175 3068847 2709022
13053 2709022 2306127 1986154 2197892 2799328 3104006 2911176 2686556 2579783 2880821
13044 2880821 3416903 3706707 3500613 3244874 3124973 2991672 2927830 3170860 3516513 3753619
13034 3753619 3647467 3282351 3001159 3051545 3387620 3721550 3636539 3410408 3493895 3550256
13024 3550256 3425146 3071859 2655740 2697509 3187814 3103644 2813037 3042398 3259456 3649982
13014 3649982 4330319 4848251 4947061 5180180 5703906 6094998 6121299 5984433 6069356 6316706
13004 6316706 6591296 6889372 7379068 7789153 8057000 8519200 9027738 9539499 10481843
12995 10481843 11737492 12779403 13994548 15505923 16973556 18595098 20744627 23196057
12987 23196057 26548189 31237180 37070841 44067038 52962852 64970145 81030297 103053266
12979 103053266 132529945 172135381 226017020 293820619 360364921 392627547 369981022
12972 369981022 310709722 246021248 192398242 152117303 122420826 100283442 83656358
12965 83656358 70830330 60533779 52304927 45322354 39188709 34174955 30183145 27285983
12957 27285983 25347954 23265844 21373105 19672143 17776170 16275409 15527110 14920457
12949 14920457 14176194 13470318 12984324 12183704 11251822 10533827 9865263 9566572 9491573
12940 9491573 9553998 9590640 9186904 8910531 8547567 8022802 7998883 8031332 7889904 7734393
12930 7734393 7456891 7628435 7969312 8221897 8339434 8290115 8347719 8775079 9801335 11294256
12920 11294256 12966388 14822066 16948166 19497775 21798839 22805897 22081249 20616206
12912 20616206 18840332 17327080 16746007 16739364 16709344 16828992 17801191 19534460 21474762
12903 21474762 23551185 26498773 30551860 36128079 42862153 51257586 63539545 81452622
12895 81452622 106396137 132319494 149812424 170494976 206633371 261394544 330254075
12888 330254075 390784671 406366985 366068175 298580486 233881824 182881696 144990490
12881 144990490 117385099 97128866 81684341 69642253 60060455 52040744 45527738
12874 45527738 40160804 35725629 31966546 28794349 25972027 23439274 21442090 19712390
12866 19712390 18047483 16511000 15034302 13696147 12429815 11803576 11779754 11654124 11170155
12857 11170155 10521738 10076051 9976702 9944371 9391393 8771335 8489568 8140831 7992745 7970314
12847 7970314 7987173 7758055 7453244 7398636 7527577 7461223 6816184 6292739 6171782 6507973
12837 6507973 6751123 6814242 6882830 6870741 6966001 7190263 7595557 7804009 8339366 8984902
12827 8984902 9304142 9855079 10371837 10619487 11274692 12332626 13395818 14417289 15053374
12818 15053374 15860817 17336119 19546583 22355196 25634360 29577557 34396586 40574741
12810 40574741 48691530 59394765 73573355 92544162 118604974 154158017 202068866
12803 202068866 264566611 334344256 384380386 383703973 335140423 270032141 211327972
12796 211327972 165541027 131910173 107018660 88372782 74292470 63352367 54351194
12789 54351194 46840792 40686831 36156376 32087434 28011731 24247895 21283571 18935049
12781 18935049 17102460 15705288 14467203 13620257 12036197 10440720 9818502 9302748
12773 9302748 8665264 7828131 7082654 6868490 7054999 7021807 6781318 6661204 6388715 5872053
12763 5872053 5450464 5412085 5282248 4793366 3998656 3213675 2881142 2726970 2582638 2347564
12753 2347564 2195494 2475135 2675104 2668830 2530690 2071845 1859184 2006613 2054003 1836018
12743 1836018 1417969 947324 816547 820545 1052873 1099415 884136 970845 1437678 1616595
12733 1616595 1649755 1603705 1468625 1372560 1239265 1380482 1524781 1295752 899512 826338
12723 826338 896560 820111 668989 796304 779355 751223 565044 516616 441008 176106 104965
12712 104965 126081 409654 848400 928797 827472 924838 888672 424985 237511 440861
12702 440861 333252 185606 46886 -201504 -223367 -332293 -93310 -63342 -529999 -534059
12692 -534059 -262326 -21119 332201 1014123 1730075 1895901 1632014 1337286 814548 703602
12682 703602 1176363 1280812 1173031 1123427 1034569 765029 304678 260309 113703 -170344
12672 -170344 -264982 121482 69538 -48411 243437 695796 1219262 1694060 1854423 1619760
12662 1619760 1494604 1269593 1075605 1298870 1373788 831060 211848 -87476 -229526 -1929
12652 -1929 568591 671326 530557 386494 180968 12321 59309 592350 998664 1003136
12642 1003136 981156 923840 463862 182386 367152 623728 720688 771878 886254 882851
12632 882851 769695 631773 586382 631169 273595 -31838 -115100 -96845 -9538 123916
12622 123916 -148723 -149490 163472 373126 417259 376307 580565 871491 710857 319196
12612 319196 192170 31434 20812 187502 495330 478839 -4965 -442908 -442620 -438836 -486475
12601 -486475 -460242 -457498 -534746 -377451 -86865 -77602 -82810 -302688 -708748 -878259 -773511
12590 -773511 -641137 -631819 -731590 -693050 -686407 -850510 -1162669 -1371889 -1396767 -1128432 -574773
12579 -574773 -181582 159006 391497 499605 350357 331531 568088 705867 792882 639541
12569 639541 685238 869871 1224178 1976194 2812420 3120049 2671393 2210880 1552935 1063119
12559 1063119 869867 712605 826855 825231 689812 621621 485870 390107 372527 597385
12549 597385 722058 166750 -359227 -28936 858652 1596453 1868421 1639007 990760 749348
12539 749348 751036 616613 456909 388640 399749 484567 214372 -446081 -508934 20599 210963
12528 210963 495627 822611 591466 296826 292708 348955 103339 -169738 -190320 7386
12518 7386 17415 -262305 -431051 -531547 -695564 -1016330 -912828 -702317 -725307 -835844
12508 -835844 -870417 -814468 -763883 -526734 -180016 -122329 -199936 -313247 -256247 -134619 -123002
12497 -123002 -37499 -328722 -763080 -417392 23548 -11789 -56078 384115 255606 -26384
12487 -26384 -132639 -19131 236509 244469 -56240 -129586 85710 421441 582435 448204
12477 448204 513394 528841 923216 1011416 611169 371647 139043 298225 783371 971992
12467 971992 912900 687682 459675 302651 -83068 -205333 50462 77996 -81352 -158391
12457 -158391 -16517 147278 79360 137530 360542 523656 402734 591935 637147 352259
12447 352259 327997 268642 121802 -339066 -713549 -647762 -532754 -365922 -311974 -148662
12437 -148662 2255 -202584 -199689 -189124 -135187 -32884 -413850 -331437 -279637 -559616 -549164
12426 -549164 -494931 -271263 -435468 -470713 -441933 -471508 -642052 -475908 171128 579903
12416 579903 546272 219938 -432914 -856918 -84273 926135 1123555 749587 300672 124073
12406 124073 121676 216842 132636 161223 223669 35345 403663 703859 440458 205806 16984
12395 16984 -39919 33860 1546 -55948 94608 470732 588157 786504 1056999 1139754 849904
12384 849904 -34886 -817719 -842342 -434457 -165870 -230523 -495836 -286732 215518 360847
12374 360847 342645 -71999 -620379 -439775 -335981 -212971 -123637 -96153 -52723 70172
12364 70172 310015 275684 -417844 -969628 -869102 -851733 -638565 -356637 -459922 -577986
12354 -577986 -359411 -5688 229838 241173 473169 587612 176977 30482 385686 489279
12344 489279 139563 -222524 -353006 -60454 225674 690139 824788 417873 432073 766050
12334 766050 929200 722809 501688 565645 542720 212816 76596 -127585 -256930 -82390
12324 -82390 -29643 -323542 -506418 -419222 -409916 -124222 130452 431922 667624 673178 539771
12313 539771 356623 219004 -56830 56548 -125731 -505279 -822490 -768171 -453160 -483315
12303 -483315 -251527 82530 295610 341124 -162162 -502528 -235869 190790 588994 739953
12293 739953 482050 211019 100751 32128 130747 316744 269374 128327 -44134 -366863
12283 -366863 -590710 -780432 -961185 -867093 -342656 180652 635976 397837 -57632 -153546
12273 -153546 137445 299239 326266 368577 379468 444406 584576 600659 365369 -142028
12263 -142028 -430343 -111418 351098 246559 121722 -219709 -696662 -593332 -433705 -273383
12253 -273383 -300795 -563007 -587495 -115369 225282 528769 806309 592772 291817 100252
12243 100252 -197354 -416549 -34019 295369 614876 739640 561388 349758 340990 259521
12233 259521 302241 537023 332840 268907 141914 197193 768561 1121803 778172 52596
12223 52596 -478028 -204388 435654 830078 878852 322757 -180604 -485493 -694763 -779258
12213 -779258 -1049620 -1164945 -781686 -583956 -507674 -551458 -551048 -349411 -212298 -328979
12203 -328979 -666918 -864942 -996418 -694017 -698714 -812234 -864787 -935250 -624657 -187376
12193 -187376 184315 532256 1111340 1157965 820519 508569 287667 129908 145437 351952
12183 351952 505182 275640 398368 398243 136879 135995 119103 -42605 -174374 -57537 561457
12172 561457 962510 815240 605019 456205 -59906 -209227 -26731 34116 268432 647882
12162 647882 992163 979826 870905 637411 636126 574796 529753 506284 685493 543573 271543
12151 271543 267499 311797 237289 -151203 -334071 -178746 -277959 -552475 -512291 -402954 -180711
12140 -180711 50758 288842 355845 201694 494938 815841 982697 1118866 1432975 1542921
12130 1542921 1268674 980569 693550 572533 429972 166999 179223 323128 197510 493289
12120 493289 717617 471386 379290 274479 95328 -128170 -114058 23343 -43586 49671
12110 49671 83473 -37936 -366299 -638270 -187220 531554 1169850 1779754 1814791 1505192
12100 1505192 1040504 725021 943097 941900 935188 592633 581575 911297 760008 182896
12090 182896 -171289 -176166 -87283 -227083 -276829 79147 220998 153308 -35492 -17106 165159
12079 165159 -16923 -184424 -504057 -547418 -361265 -284748 -214217 -75751 40728 278105
12069 278105 389716 362879 451202 654326 476242 258505 -186315 -489688 -402273 -396405
12059 -396405 -559925 -1046647 -1291653 -1129947 -819849 -538305 -616330 -839028 -1008964 -943494
12049 -943494 -672238 -610569 -666924 -531128 -300935 -466749 -670551 -328627 159671 302329
12039 302329 109979 189345 75282 -484821 -621392 -521563 -531087 -489687 -390195 -794074 -1050712
12028 -1050712 -885137 -683231 -638529 -792827 -880451 -803876 -746381 -793425 -622647 -85764
12018 -85764 537797 841524 762821 342552 245949 425214 507403 876528 1061701 954330
12008 954330 658156 227292 -303440 -833671 -868960 -573291 -72465 155232 134426 -195143
11998 -195143 -318104 -104106 -259119 -965273 -1174686 -1101574 -895191 -563891 -178351 47649
11988 47649 -42551 69236 231688 460887 462732 270605 186192 161506 557158 1021535 1046743
11977 1046743 839321 791290 986717 1134252 1242977 1342343 1198170 739455 203537 8560
11967 8560 -59478 -186914 12669 15914 -371859 -895151 -1173672 -915507 -521031 -306551
11957 -306551 -356447 -482118 -427543 -333585 -242105 -458902 -656906 -538417 -137825 222308
11947 222308 360582 421525 156310 -360601 -532044 -513359 -628747 -594102 -411913 -378562
11937 -378562 -202820 74880 11343 -228529 -298931 -344188 -448807 -380743 191644 821063
11927 821063 721867 178430 -40943 -544114 -981930 -502641 148460 463897 385635 281980
11917 281980 92912 -57733 -132862 -463881 -902000 -877126 -482747 -448205 -496790 -454052
11907 -454052 -560549 -394821 -164051 -433378 -449083 -585199 -872402 -1164214 -647696 288137
11897 288137 752213 660051 414353 288155 221463 580843 862220 659902 499975 668442
11887 668442 397637 -57860 -283293 -445516 -435576 -477987 -541841 -836262 -1070517 -1053041
11877 -1053041 -946506 -856666 -775372 -810694 -922059 -811198 -655325 -711933 -424918 -241073
11867 -241073 -229030 262578 401959 15222 -578129 -701708 -151890 439412 589016 594374
11857 594374 360678 152113 182647 246607 80428 -60834 -63513 -406955 -432704 -260658
11847 -260658 14202 -60524 -307566 -277058 -65696 17728 191765 85509 -314184 -452546
11837 -452546 -450511 -603941 -773405 -703285 -505138 -298921 -150173 58948 -89897 -163633
11827 -163633 -43157 -177093 -378043 -253979 -141241 -229181 -213636 -298445 -101576 -21868
11817 -21868 -194858 -266087 -91713 164239 293616 100063 75495 448634 333257 -7418
11807 -7418 -59537 -314902 -904971 -1025465 -870746 -522607 -101493 1379 87422 91741 -190061
11796 -190061 -490712 -858479 -1104056 -909502 -469591 -153714 -33924 -73545 -80055 -161235
11786 -161235 -340416 -310702 -153853 177827 328971 364585 97025 -224484 -180702 -42610
11776 -42610 73062 -238918 -810111 -866905 -819400 -915286 -625560 -554754 -696929 -586744
11766 -586744 -712017 -567749 3738 416887 196481 -3622 -62914 38756 -93048 -399047
11756 -399047 -590377 -584732 -204241 115201 297640 375322 769351 1113934 1224871 1371655
11746 1371655 1389300 1160506 759381 406377 274401 70620 35563 30272 -465278 -730359
11736 -730359 -733847 -690985 -570102 -470917 -403958 -569493 -341100 -8142 375722 841952
11726 841952 1033036 780691 821201 1025488 1260783 1225842 902093 900411 965887 558880
11716 558880 287644 163162 66105 28878 -290516 -834309 -829579 -588036 -357022 77061
11706 77061 -60883 -214169 -165148 60030 154362 459900 722140 520566 -55377 -365407
11696 -365407 116172 559955 636247 436965 -63792 -270216 -449555 -217325 442055 738622
11686 738622 526955 263375 239370 160632 31770 -84622 -237418 -136054 138848 208317
11676 208317 424197 292654 -303203 -811052 -955421 -778493 -437071 -495033 -742943 -1058105
11666 -1058105 -1108853 -790287 -1215991 -1577824 -1094588 -641917 -585236 -603619 -480322 -170085
11656 -170085 40357 -166153 -516865 -688850 -823948 -1020517 -1318073 -1214947 -726536 -728697
11646 -728697 -978740 -754005 -199406 -168185 -378403 -178242 16872 -72318 -252538 -183153
11636 -183153 28388 -71730 -362760 -433537 -293883 137808 393438 324600 148491 -149292
11626 -149292 -346507 -484539 -759002 -821098 -933752 -1044696 -890499 -884372 -1098582 -1005307
11616 -1005307 -605520 -190007 366320 887733 1226068 1386733 1253385 858978 620583
11607 620583 430833 451349 351988 -248355 -647023 -662840 -271642 29023 -112586 -50382
11597 -50382 -158133 -430969 -815635 -993706 -1052693 -837289 -629267 -594350 -454657 -355406
11587 -355406 -422955 -469832 -550131 -562887 -722985 -726969 -831140 -833216 -737318 -575703 -161658
11576 -161658 49448 262623 618016 761657 582749 299251 -81457 -7930 296068 265246
11566 265246 253538 639524 763335 273476 -221851 -409620 -213590 -478612 -682879 -490782
11556 -490782 -117728 -145636 -370068 -370314 -53240 4468 -304836 -473110 -710285 -801579 -795854
11545 -795854 -623972 -543204 -302821 -27213 255430 371541 358702 291873 337764 534684
11535 534684 292466 -259859 -722881 -886162 -538484 -105122 14585 165192 384026 407680
11525 407680 102636 -329217 -407834 -285589 -2143 10652 -401872 -472870 23324 346160
11515 346160 246143 -39877 -298119 -508271 -491841 -302987 -414257 -612886 -602474 -390119
11505 -390119 -88470 -79656 -262108 -264954 -332114 -517718 -676122 -547184 -547753 -727359 -868777
11494 -868777 -866320 -878659 -831786 -452117 -91733 106925 94344 124922 330989 623626 654228
11483 654228 466398 -11278 -391281 -321694 -194382 -403794 -755580 -846489 -824100 -935835
11473 -935835 -318094 455104 559753 569990 533210 356059 355668 228064 -151315 -509188
11463 -509188 -704084 -704578 -377222 -458863 -499991 -2995 128743 -236585 -338863 -166695
11453 -166695 -231995 -262072 -247432 -400878 -319679 -237816 -162377 159890 106475 -211317 -157190
11442 -157190 235471 236518 384452 187811 -399901 -652896 -523067 -722318 -1091351 -1554138
11432 -1554138 -1458677 -1050636 -729642 -166805 220215 442226 815767 1107533 1272775 1067896
11422 1067896 561248 -68089 -402020 -415235 -319641 274948 834166 766392 276268 303228
11412 303228 623048 516674 146498 -12528 125076 202345 325376 537923 566438 869396
11402 869396 1054327 1052592 863853 251635 -536882 -105671 2069606 3247380 2771125 1862975
11392 1862975 599208 -306693 -350277 -110075 -149923 -396151 -483088 -300309 -200403 16828
11382 16828 356949 588900 674085 336831 -355169 -751122 -756228 -402663 -359069 -420872 -284919
11371 -284919 -89661 24156 -186212 -5877 612299 927671 1063836 2124052 4392963
11362 4392963 6055793 5280111 3719616 2676347 1736193 1021376 458075 526826 650498
11353 650498 817030 947006 1080198 1011376 750679 646844 729420 854332 1009129 809718
11343 809718 585538 446456 471226 783368 807771 169673 -590015 -785631 -512693 -307896
11333 -307896 -398433 -528147 -882155 -1218919 -1019276 -606418 -214928 150624 -72438 -471027
11323 -471027 -612529 -729333 -880390 -907625 -1021031 -644616 -108145 -232733 -853597 -1197656
11313 -1197656 -940524 -625823 -478204 -476359 -158301 -64132 -433994 -623402 -489019 -314410
11303 -314410 -398418 -592505 -890797 -1367192 -1606028 -1505513 -1181037 -1145366 -1206118 -542554
11293 -542554 -48103 368592 433953 192113 32705 377300 464592 329145 60522 71730
11283 71730 376404 542252 593466 370120 57378 -120440 -93698 45230 136936 247525
11273 247525 238052 453852 955122 1038647 655193 430085 600404 628112 456126 237553
11263 237553 431807 635778 503493 277282 226841 9747 -349722 -347770 -216143 -484517
11253 -484517 -661909 -486907 -303862 -75368 161647 486243 829317 459650 -24339 -125297
11243 -125297 319123 637961 472768 488803 461688 62358 -63201 11142 -476786 -1024859
11233 -1024859 -968678 -677901 -513973 -676161 -853803 -565373 -533847 -670960 -272932 -44630
11223 -44630 67589 189756 336200 87981 -31957 178626 157627 180439 289297 236654
11213 236654 77457 -32575 176048 41833 -462595 -381687 136084 241211 285429 546684
11203 546684 670540 754736 852572 901891 711852 580359 274135 -209271 -309715 -206273
11193 -206273 -236701 -281828 -99195 -158213 -29552 229103 216981 -114603 -130814 27901
11183 27901 13112 -76089 -329768 -434720 -272849 -149650 -289500 -634182 -961276 -1200749
11173 -1200749 -1361944 -1092966 -807319 -675110 -463353 -474953 -329241 -65052 -72715 41053
11163 41053 153637 6456 -33345 -387881 -646927 -331597 291965 618129 813185 933026
11153 933026 552044 417273 420874 645944 816555 683169 564626 312041 411815 787076
11143 787076 784465 566274 453385 448444 328304 339369 348500 487458 639524 484350 184567
11132 184567 460078 986921 994376 902214 733673 378419 264691 124784 89190 428529
11122 428529 631191 378374 158976 175948 442692 537247 510435 468135 263528 150686
11112 150686 151370 75007 2090 68394 41961 -368768 -750557 -823723 -789431 -813020 -719907
11101 -719907 -866030 -1220394 -1006188 -114556 557958 770706 514549 220801 200045 138029
11091 138029 22776 -208510 -309417 -297400 -549265 -367248 168176 52191 -284840 -216313
11081 -216313 -289844 -499931 -771060 -992017 -996667 -710348 -575683 -802155 -758508 -358059
11071 -358059 -109240 -157757 -169200 -56682 -137205 -269940 -527788 -640249 -635498 -496840
11061 -496840 -73685 242283 70838 66518 605323 1163406 1284644 1129212 707712 269487
11051 269487 215224 415095 446760 580498 752087 557920 34007 -42059 -26478 -208207
11041 -208207 -395034 -225468 391776 863745 957789 685119 374993 292982 209254 130926
11031 130926 -4220 -401216 -497352 -498629 -562926 -701501 -593642 -322027 -136686 -132534 -174670
11020 -174670 124154 287328 187745 109973 6590 -134234 -215730 175525 196873 -18274
11010 -18274 216047 379405 144453 93389 211168 109535 174966 350614 489051 942096
11000 942096 1411326 1235443 346365 -514590 -671344 -302033 -121539 -36661 140703 177835
10990 177835 153123 105804 193466 444569 551403 121002 -167060 -279511 -203801 -395800
10980 -395800 -883714 -1389345 -1678906 -1405014 -790661 -668008 -722013 -340008 -280058 -420477
10970 -420477 -702312 -837455 -618692 -42709 367136 -97785 -313656 87668 -8877 -295794
10960 -295794 -10152 159719 57481 -38417 216565 239410 19857 427081 896227 1069135
10950 1069135 858802 511640 48294 -367459 -409758 -239242 -86811 276829 360251 -139828
10940 -139828 -551355 -587619 -501683 -254410 -3025 58750 -62836 -385340 -347569 -208491
10930 -208491 -58688 315812 541501 260384 -171787 -318550 -354702 -473796 -466358 -275340
10920 -275340 -514746 -707603 -714294 -351156 -270801 -118070 -111157 -261938 -421056 -725471
10910 -725471 -571719 -451460 -666884 -665460 -85895 307414 510230 405963 -47957 -405478
10900 -405478 -67076 482296 538074 148931 75425 279198 317606 250972 415974 93735
10890 93735 -408663 -621873 -648706 -620821 -635347 -223796 90205 322230 158428 -279618
10880 -279618 -649064 -510960 -504490 -443855 -32451 65492 -102871 -179076 -383345 -173411
10870 -173411 -313290 -591229 -225682 -118024 -171832 -415025 -749771 -755672 -189068 361280
10860 361280 425782 486698 580008 525496 623393 810338 857201 1238192 1182210 714610 726471
10849 726471 774491 336128 -344036 -792739 -982324 -946669 -774122 -841423 -1087593 -1245653
10839 -1245653 -1272028 -1095916 -754140 -629266 -599690 -456224 -57409 -115647 -625407 -991952
10829 -991952 -1239868 -1436934 -1393727 -1232856 -1002961 -817259 -683153 -682276 -656937 -830741
10819 -830741 -828938 -397932 -276805 -691568 -838034 -717475 -710689 -592565 -354453 -353754 -774563
10808 -774563 -1355852 -1613278 -1359903 -1004432 -885047 -696694 -173051 224768 404004 482100
10798 482100 210916 143177 142673 -133043 -78340 -38022 -127068 13419 65006 38933 80852
10787 80852 156718 210063 -170923 -660252 -924009 -745809 -627580 -524636 -216773 -14839
10777 -14839 119075 289199 295456 119077 10772 43413 -271468 -447847 -206493 -157169
10767 -157169 -502690 -522142 -132375 60378 93212 60599 179796 359710 288319 -6600
10757 -6600 -469357 -735490 -822071 -370147 117477 174597 101376 13681 3416 -24894 -169404
10746 -169404 -311731 -335707 -723173 -1056344 -584141 -23595 -392189 -1060274 -1132210 -839732
10736 -839732 -297993 333144 552867 388489 419466 212095 -223006 -254712 -310784 -457740
10726 -457740 -810059 -945237 -543762 141903 546793 519286 467117 398237 295232 59097
10716 59097 -514538 -1088319 -1202421 -1110264 -971984 -673610 -278029 -251252 -510123 -564441
10706 -564441 -472069 -127695 15767 195710 297762 11845 -681645 -866192 -474376 -444699
10696 -444699 -475337 -208740 -177953 -463469 -530066 -525830 -612795 -515864 -572223 -753479 -308749
10685 -308749 169471 -41594 -528981 -513124 -26583 524128 920526 872512 391260 294608
10675 294608 485952 211163 -98199 438100 482604 510586 692365 444509 66710 -33243
10665 -33243 384204 465097 49953 -182383 22709 62090 -109452 -175251 71960 544231
10655 544231 613340 615403 596237 528722 546377 13334 -797262 -1032563 -954429 -951477 -580281
10644 -580281 -132139 86307 60308 -159606 -315045 -281512 -27215 -35056 -54245 -346229
10634 -346229 -816686 -946375 -658719 -378556 -198828 -173827 -275339 41092 229826 -92501
10624 -92501 -210477 -89987 80947 239235 674644 1389920 1707412 1676305 1390457 886117
10614 886117 813137 922256 681514 386981 45845 -121034 -290005 -640275 -819229 -880152
10604 -880152 -644292 -122516 -160540 -479261 -511258 -266989 119124 45423 -427048 -654463
10594 -654463 -252265 148584 204726 176320 218543 -336739 -703012 -475451 -392619 -300729
10584 -300729 -318788 -679433 -942137 -728208 -274074 -179306 -425063 -247159 -110909 -438364
10574 -438364 -935950 -1162985 -1093135 -664670 -352077 -134122 63767 232878 329090 374922
10564 374922 231766 -358571 -562605 -455678 -242794 152415 728250 850883 753584 740671
10554 740671 659188 197838 -114246 4303 296204 827354 1150050 1085481 675441 71581
10544 71581 1321 -184511 -555543 -431591 -57558 135053 196655 104420 -164715 -163106 -436719
10533 -436719 -839922 -738697 -598401 -612433 -300639 -230364 -165267 162455 555186 826409
10523 826409 974110 1137425 824666 210012 -203312 -268416 -468017 -798690 -595463 -189331
10513 -189331 41331 38209 -211633 -470722 -599480 -548628 -9125 598298 687270 394269
10503 394269 216411 93040 -145623 -478388 -385986 -547484 -494921 -168302 -44659 -107374
10493 -107374 -183144 -204540 -424278 -294807 422915 1023817 971579 971116 1218932 1046677 335356
10482 335356 -623695 -1103344 -1111713 -991957 -736954 -723666 -935014 -1000777 -633931 -490265
10472 -490265 -722857 -905144 -814548 -562714 -416957 -481745 -506401 -580972 -773607 -777637 -617712
10461 -617712 -824161 -901747 -935094 -1065212 -1096595 -603745 -261883 -258141 -95514 62623
10451 62623 346937 632201 698643 615036 341340 30560 129452 433332 719765 443801
10441 443801 77495 -277373 -822451 -977498 -140545 635193 939228 1261810 1262815 783336
10431 783336 361723 372657 468779 221947 -168580 -423058 -390565 -118017 -125189 -177967 -176673
10420 -176673 -541173 -599879 -479457 -191866 136500 100950 -169604 23477 229207 391837
10410 391837 334481 -4782 -290750 -419259 -308882 -29072 -71799 -173674 39825 362781
10400 362781 475689 617594 1056338 1298285 1051133 468602 230125 30257 64554 260409
10390 260409 289261 -7839 -95450 -150592 -559401 -699460 -526702 -90519 59508 -45395
10380 -45395 -63152 154827 158097 -300910 -780547 -687530 24383 402448 318988 171440 54670
10369 54670 -161175 -380040 -387866 -98507 187251 607917 747147 591012 432389 477245
10359 477245 318141 192548 111269 -107876 9860 137708 342723 423765 266618 562882
10349 562882 1129594 1040485 131282 -68472 369524 277178 220019 693322 783151 398373
10339 398373 -253510 -721277 -652874 -557713 -952130 -1397556 -1558401 -1274334 -331084 122867
10329 122867 -457649 -939211 -801437 -390062 -237349 -236718 -137935 -168815 70475 233125
10319 233125 -165746 -450492 -279737 -224186 -373676 -130901 260571 621825 625834 374728
10309 374728 -3942 169108 777221 740492 97485 -591132 -1013970 -1193435 -1168753 -795719
10299 -795719 -349717 -121132 -190814 -440522 -506866 -385789 90724 145285 -376581 -428061
10289 -428061 -127509 -337533 -695858 -999360 -1179242 -1335817 -1016872 -763824 -956889 -1474722
10279 -1474722 -2064136 -2075187 -1506035 -1089786 -874037 -958461 -1075545 -946863 -880619 -653123
10269 -653123 -736027 -1033618 -1109188 -904350 -672304 -869878 -607964 -187239 -139653 -28731
10259 -28731 133933 30294 -24684 -232452 -75473 473009 832761 732458 523181 245448
10249 245448 -107016 -336572 -560536 -683913 -1009068 -1239493 -1157710 -656175 -276562 -219897
10239 -219897 -264398 -341617 -59289 316322 133242 -380801 -709509 -875366 -754658 -223623
10229 -223623 182558 -105759 -398865 -324386 -360263 -495328 -364951 63521 367526 637332
10219 637332 653095 674082 695073 513506 214205 -99308 -229864 -70268 -218679 -459780
10209 -459780 -585605 -369577 -147880 65201 72510 2576 14216 63189 186305 136532 29360
10198 29360 -19631 -195352 -527697 -740379 -614478 -449121 -554817 -867694 -685473 -307033
10188 -307033 -197366 -362895 -668312 -547925 -155129 -75167 -430996 -706974 -799227 -499303
10178 -499303 -160986 -79470 -273624 -367902 -456391 -240190 -380931 -638759 -578104 -349318
10168 -349318 -187085 -105816 -237190 -467936 -429397 -601177 -746465 -716932 -736038 -975249
10158 -975249 -1287515 -991163 -699471 -353910 -98295 -168068 -72056 61843 -441 -79532
10148 -79532 -315487 -492080 -535667 -395107 -43773 170622 119879 280575 596962 483828
10138 483828 86303 -27446 -108757 -551350 -679621 -264495 -89085 -321793 -345711 -472078
10128 -472078 -623304 -537168 -439257 -393910 -60703 553475 1106224 945235 328009 -135238
10118 -135238 -284476 -173818 15961 78694 58933 -7934 81800 270346 508245 500937 448564
10107 448564 235959 109796 50754 -116974 -431425 -245944 116636 216543 398844 694788
10097 694788 718974 320921 385739 509640 421312 214834 71410 331523 755567 985568
10087 985568 592194 156561 -31006 29209 117364 85058 -6404 -14657 156053 450818 704791
10076 704791 510068 345355 443970 492414 510200 366106 120405 -154180 -368828 -273638
10066 -273638 -200302 156403 448900 149794 -78359 270629 694186 723537 753838 595343
10056 595343 238219 110466 -103261 -326422 -547838 -658811 -343870 -152764 -248150 -41804
10046 -41804 -12953 -139400 -141145 -414208 -642508 -611169 -233850 250186 651552 622034 426203
10035 426203 474258 428484 322242 71299 -164607 -340698 -200399 139167 133841 38112
10025 38112 -153837 -282799 -28465 -11468 -580550 -688873 -14139 778683 1234749 1032960
10015 1032960 500192 418111 759595 819728 227065 -275380 -380468 -228851 -334358 -555901
10005 -555901 -477310 -392813 -287532 26200 149709 57811 -83615 -304766 -353687 -295786
9995 -295786 -408415 -757925 -494528 -99887 -207443 -453338 -334037 -137488 -280248 -330358
9985 -330358 -255602 -121557 -28059 20766 -257568 -333631 -206767 -88274 25402 -110663
9975 -110663 -112952 383535 732361 714235 749931 699580 640332 510457 257831 -16615 -218521
9964 -218521 -636564 -1208099 -1653206 -1724512 -1875320 -1990801 -1747097 -1562497 -1599736 -1572610
9954 -1572610 -1435241 -1074449 -729979 -630435 -693093 -703863 -475565 -408635 -581045 -700535
9944 -700535 -1051554 -1243481 -931268 -530259 -319863 -209719 -444719 -908804 -1011736 -865591
9934 -865591 -699475 -504370 -371667 -482167 -906410 -1232992 -1196810 -1097101 -867245 -360379
9924 -360379 -262822 -270974 31490 327666 404504 490941 608310 157463 -496847 -711868 -699631
9913 -699631 -495357 -315153 -26174 -123968 -438283 -360514 -144854 66391 162503 618507
9903 618507 458011 -517492 -1002874 -612648 29528 42023 -125096 -484519 -802845 -739674
9893 -739674 -640385 -477497 -487434 -533116 -411933 -221339 -117000 119669 -68800 -293687
9883 -293687 -574389 -730620 -467245 122500 479069 170962 34867 296147 281985 -286754
9873 -286754 -628370 -604254 -666129 -689473 -842943 -1083420 -975212 -769074 -686437 -1016996
9863 -1016996 -1226303 -1280264 -1447098 -1328008 -1049952 -669005 -601 277866 72765 -4225
9853 -4225 138439 275768 62950 -163534 -67913 -38822 123725 115494 -37933 -185570 -138035
9842 -138035 15030 -166170 -373464 -443762 -301375 -523039 -1123224 -1412486 -944822 -382534
9832 -382534 -17156 239359 317001 434696 380117 273096 126186 58016 401503 645790
9822 645790 432076 334322 375847 43629 -178457 48224 166552 84567 155336 248799 402320
9811 402320 644135 759719 541064 178779 -129867 -271063 -192309 -101601 -141534 -171716
9801 -171716 -169902 -355068 -689069 -479771 -257098 -261934 -162973 -119753 -88043 24293 -184302
9790 -184302 -520167 -367744 -351498 -790577 -1006331 -849608 -637388 -212228 -242462 -454421
9780 -454421 -534666 -680470 -330416 68223 211552 14732 -29794 -97865 -54621 14671 -55662
9769 -55662 24872 78479 95091 -280708 -559448 -736433 -810702 -769508 -900385 -1166517 -1033617
9758 -1033617 -561727 -275563 -533361 -1194632 -1478493 -1444982 -1160854 -755314 -394233 -189314
9748 -189314 -289875 -202944 63023 253568 541357 470819 -166791 -342794 -170666 294
9738 294 -38359 -363940 -326565 -78724 74475 42930 142574 230594 128013 -199129 -107517
9727 -107517 391870 707574 411716 260490 741088 893594 1015445 1009439 653717 311034
9717 311034 370515 492238 376835 431184 484057 285874 16088 -88636 -271458 -536038
9707 -536038 -773909 -1015353 -826987 -192203 473475 667344 337665 154507 288925 571682
9697 571682 393684 80745 -341572 -416833 -9395 232525 58699 -338246 -416503 -507436
9687 -507436 -490774 -338934 -270817 -382078 -573903 -560404 -474043 -258275 -375300 -684733
9677 -684733 -507529 107199 617085 625921 800925 954080 974457 1049205 1115232 1028045 643004
9666 643004 371051 112446 -335886 -382592 -121990 265568 298001 170543 -79079 -302059
9656 -302059 -422454 -502717 -421415 -347930 -624129 -641609 -104989 34936 -55602 -77158 -284606
9645 -284606 -549196 -585947 -380753 -270413 187134 704146 680341 177234 -398611 -785414
9635 -785414 -884794 -813011 -549606 -206919 -549792 -942642 -1046199 -988001 -823685 -541728
9625 -541728 -499357 -574224 -343591 14396 40451 188989 320082 -159496 -508899 -636039
9615 -636039 -713773 -703019 -320063 65550 370878 458058 230544 -310765 -488862 -583605
9605 -583605 -515216 -35687 -21287 -695498 -1423343 -1597680 -1059702 -866406 -757852 -642439
9595 -642439 -896210 -1221200 -1207005 -912105 -594549 -741570 -1149874 -1293191 -737387 -86629
9585 -86629 156392 185535 395658 559826 569388 392249 -43274 -272626 170289 558795
9575 558795 627573 966246 763748 181108 -219993 -234595 -40476 103427 122662 121061 -43461
9564 -43461 54984 238905 274717 -27134 -367536 -248145 180673 225177 -10698 -248049
9554 -248049 -282719 -374647 -492238 -372427 -219197 289322 1218334 1142546 303822 66890
9544 66890 216033 64874 -326446 -296124 -460612 -689681 -603522 -804162 -907631 -758218
9534 -758218 -711238 -462986 -30229 429466 591218 527246 299775 81047 315704 469456
9524 469456 232222 -113872 90155 186366 5491 -69563 -45803 52714 254092 309560 252642
9513 252642 67984 -452353 -859091 -1487927 -1904388 -1792212 -1482668 -979210 -632176 -420015
9503 -420015 -482977 -694423 -549474 -351307 -398733 -289423 122853 183733 143723 14878
9493 14878 -113676 40896 189009 324812 233547 323699 231263 56752 -132238 -225341 135889
9482 135889 709092 505537 120532 417995 800232 589269 322352 390191 394120 419645
9472 419645 828311 911610 551813 290892 358020 421857 -39026 -316721 -405610 -215410
9462 -215410 42958 -163232 -312650 -72302 127760 338222 793964 674450 -44629 -542091
9452 -542091 -479639 -248406 -43333 135661 240070 360308 660430 905156 986622 759460
9442 759460 537559 358585 291405 97266 -369899 -887851 -886309 -503085 -368865 -465218
9432 -465218 -40065 242931 284760 585992 428776 -68974 -278874 -438975 -810592 -848310
9422 -848310 -750705 -697216 -553766 -222077 39378 323984 736967 927918 847641 793748
9412 793748 743343 342607 170449 443696 216093 -48232 -41365 -149754 -333281 -447756
9402 -447756 -681452 -808851 -539329 -161791 -6827 -195508 -512139 -958948 -1378578 -1217450
9392 -1217450 -1008769 -817215 -299115 137268 461575 917281 1346314 1468748 1082870 255258
9382 255258 -528409 -901407 -813298 -508722 -231202 -123244 -292895 -447540 -594354 -624383
9372 -624383 -801677 -807173 -627623 -747966 -789098 -275035 203275 72938 -99044 -4277
9362 -4277 143125 -193050 -456985 -391891 -331222 -685252 -1093496 -1051897 -705256 -577312 -527432
9351 -527432 -386261 -338718 64212 158367 88649 133391 199108 292164 520263 508602 106616
9340 106616 -322885 -244233 -156066 23232 482005 615171 276429 -41113 44033 303851
9330 303851 569028 584071 135736 4712 370727 442169 71963 -135599 -48152 -116834
9320 -116834 -125326 -253765 -435154 -453426 -201180 -218880 -292926 -187559 65206 311009 395143
9309 395143 544562 670009 515394 449474 441452 356917 281611 420818 523010 394100 212534
9298 212534 154077 239898 308429 275809 25355 -188082 -282567 -190725 -166493 -307726 -474023
9287 -474023 -242243 -206784 -509401 -603331 -513984 -682109 -670035 -705042 -715734 -648021 -406573
9276 -406573 139255 303116 266820 15296 -179110 -331746 -276389 106413 652615 761821
9266 761821 443468 254379 37745 -54457 -117959 -215825 -344387 -429468 -315248 -270273 4804
9255 4804 -11258 -296230 -610855 -672731 -631838 -405887 -206921 -330224 -227276 -97619 13607
9244 13607 131454 456964 1004200 1180315 693602 274836 304743 695577 971796 812245
9234 812245 599664 875772 1164268 908187 802517 655380 724731 788461 606542 441698
9224 441698 396331 101432 -272042 -598145 -1033407 -998314 -753901 -804710 -614180 -444714
9214 -444714 -444716 -229104 239147 717511 695610 565242 496486 154444 -231367 -274955 -18098
9203 -18098 367474 212369 -121271 -28217 309808 251720 -219295 -557409 -766295 -534380
9193 -534380 134218 523697 279872 153085 351613 287836 121005 -4023 194459 402863
9183 402863 548482 584234 322829 67804 -70537 -511881 -557607 -355882 -99225 -122343
9173 -122343 -456571 -631406 -349551 -60760 -65245 -123196 246631 443895 335231 43205
9163 43205 -160761 31638 450430 710309 909593 1085461 812232 650534 535543 346415
9153 346415 325236 274244 237170 153376 395693 743643 861266 890867 761824 219797 -203181
9142 -203181 -436421 -562782 -692356 -1054856 -1156926 -1289385 -1316617 -1030029 -448882 -374720
9132 -374720 -931293 -1462267 -1458485 -773407 -249251 -218269 -146143 33502 129938 157841 -214584
9121 -214584 -666411 -1193982 -1338904 -1114176 -536445 71307 399681 488506 441247 102693
9111 102693 -47587 179371 171842 -4474 99959 361390 387630 177792 140325 323847
9101 323847 436198 315473 69278 279378 583580 838420 943344 860394 555898 320394
9091 320394 267491 627999 1175184 912759 571238 346090 -86672 -288645 -201220 -167305
9081 -167305 45421 240141 248253 377593 -251007 -923678 -1129744 -942313 -646686 -530549
9071 -530549 -586795 -602796 -427151 -148307 38455 77814 201655 205005 242662 269871 64874
9060 64874 -433121 -608522 -191516 84446 11327 -531371 -1089970 -1301795 -1220312 -1015293
9050 -1015293 -973870 -711150 -502856 -331571 -261004 -417352 -26810 662461 955931 1019032
9040 1019032 998228 1383090 1797685 1662258 1217731 879961 763972 472970 341178 334066
9030 334066 356843 385607 623326 1006312 1278914 1610356 1445025 724090 310887 61145
9020 61145 27873 -26516 169070 555635 824975 589520 47906 -130247 162793 433791
9010 433791 799455 943208 606354 318025 -24807 -332310 -271074 -336659 -384372 -460706
9000 -460706 -360598 144484 385038 377031 419454 407345 510968 460045 182111 -68520 -334443
8989 -334443 -604945 -461277 -271202 -450747 -700755 -919358 -785792 -624828 -966040 -1209881
8979 -1209881 -1129983 -1062354 -1024542 -1085948 -959739 -765854 -597863 -290244 -377216 -379248 -207146
8968 -207146 -375291 -569099 -505209 -481292 -252041 44372 53481 201191 560141 485596 236200
8957 236200 -255478 -474765 -96721 295589 194228 -105257 -39647 69081 136791 314408
8947 314408 542186 467630 400887 532292 698058 764583 1160088 1683576 1641739 1256840
8937 1256840 942997 665533 255534 143576 -317239 -783042 -357052 56593 13563 -76050
8927 -76050 -641349 -741113 -339852 -81325 -39964 -40569 275302 471586 191515 -186812 -528502
8916 -528502 -764187 -413413 -34952 79537 207359 300208 68391 -94541 -183111 -477644
8906 -477644 -515584 -525206 -649396 -768325 -837970 -720167 -387510 116753 477045 553318 168141
8895 168141 -348673 -674762 -932962 -1031270 -880495 -722723 -385120 -128149 -9925 535167
8885 535167 1189459 1245130 733248 270599 252482 223952 233031 -143574 -338947 244592 657500
8874 657500 856128 719974 232789 -353044 -880629 -915885 -664623 -52224 51736 -488079
8864 -488079 -446581 -219016 238119 582668 325892 -121763 -124689 315090 782337 781706 388525
8853 388525 53180 -22037 327854 686575 732956 333240 42396 -90514 -169642 6810
8843 6810 147034 -49937 -231807 -401543 -543898 -223829 406649 529898 193810 51118
8833 51118 9617 -1755 -78312 168060 307562 -177997 -550220 -882518 -860136 -492745 189736
8822 189736 518939 48798 -734591 -1137852 -921868 -378138 237702 179965 -239976 -215205
8812 -215205 -414266 -798101 -942828 -485558 -27303 83269 430917 644861 565731 597448
8802 597448 608014 507632 669599 626089 178029 -14804 209191 31059 -386434 -645694
8792 -645694 -891451 -627145 -282614 -386497 -482145 -302597 -227195 -254821 -340319 -442005
8782 -442005 -497455 -748578 -1154429 -1094688 -737464 -483625 -414371 -449584 -666683 -882501
8772 -882501 -1102309 -945720 -856326 -1116883 -1146280 -1046987 -984712 -889554 -629718 -319738 -381464
8761 -381464 -473952 -381617 107156 809869 1018871 858386 520982 374975 597399 613067
8751 613067 722546 861849 698088 695249 795891 782856 766333 915675 1109212 995180
8741 995180 481347 135072 309481 726605 910309 829945 362632 46836 -214958 -284448
8731 -284448 -59656 169269 413691 631256 516812 486173 548105 203119 -254282 -607156
8721 -607156 -201275 463732 693257 763703 1133114 1510364 1522684 1279680 751914 142026
8711 142026 -383521 -915153 -1235488 -1084731 -607789 -331428 -6454 108011 19141 -51933
8701 -51933 -134181 -235570 -258691 -417036 -251823 118780 366152 475762 423109 759589
8691 759589 890203 420561 -105589 -176231 -275721 -285953 -472695 -694044 -797571 -352196
8681 -352196 123932 35371 -46238 -15232 -153777 -581897 -721493 -416886 -69082 216032
8671 216032 454382 380356 383827 256353 -272948 -499054 -571684 -657739 -666685 -714331 -710086
8660 -710086 -962868 -924716 -632939 -767523 -1166562 -1434103 -1361037 -969684 -541018 -283940
8650 -283940 3366 398129 867232 852949 643705 589062 577949 628914 926881 968432 1028211
8639 1028211 1259871 1246269 1231146 1345680 1680297 1483928 1057054 633184 381645 237789
8629 237789 68350 20542 127446 518426 930017 833056 496221 260812 84462 158672
8619 158672 395608 183165 -295707 -467199 -335173 -157413 -200084 -105491 -140421 18616
8609 18616 400737 642580 544700 560872 524824 323373 282923 434445 494831 340065 397742
8598 397742 1025744 1983750 3221333 4697810 5982597 8671810 13116710 20027103 30604978
8589 30604978 42008643 42452138 32011467 21769025 14654835 10274157 7737274 6432955
8581 6432955 5706140 4898013 3920647 3213042 2486539 2007014 1848966 1855414 1965025 1817417
8571 1817417 1720203 1711669 1580288 1584428 1267939 1001129 949672 1011325 1145460 1118638 1086651
8560 1086651 1143317 976606 760488 580873 255198 56520 -14085 -312371 -596489 -568814
8550 -568814 -233710 -305870 -654619 -651283 -498791 -3568 785573 1219680 1367380 1017394
8540 1017394 260686 -149749 -243679 -239310 -310949 -236366 100918 179701 332078 454942 128834
8529 128834 -23882 -127637 -210240 137186 703207 724320 492179 94925 -324582 -187905
8519 -187905 469561 737050 268094 -377733 -588048 -340332 -113056 -117100 -253095 -89250
8509 -89250 -147532 -270604 -423955 -449996 -188509 94177 30178 -56924 -242292 -658744 -625917
8498 -625917 -337537 -303634 -277358 -454249 -515446 -439264 -410915 -235484 -473673 -827441 -935512
8487 -935512 -818796 -573087 -571418 -615042 -652259 -668921 -660549 -573865 -229672 78416 134685
8476 134685 -295402 -938654 -1129806 -713685 24219 229298 490227 984893 1185670 854452
8466 854452 516425 247550 230060 424324 455862 756772 869357 732536 725042 1021716
8456 1021716 1181497 1201390 1020161 554490 24826 -352464 -555225 -767853 -794186 -608421
8446 -608421 -191569 339345 328931 223534 186157 32208 -54698 -160083 -243989 -131481
8436 -131481 536804 779989 309312 299180 280459 209009 181900 -24949 -51139 -15407 -298649
8425 -298649 -323712 -168886 -223311 -51815 262278 277960 -123259 -214217 -3637 8119 7272
8414 7272 271627 415917 247306 166880 90511 124689 61750 -359405 -293208 11469 -98020
8403 -98020 -217311 12611 -67024 -231593 -252369 -147109 -27126 108450 72370 -65937
8393 -65937 -19027 132212 228229 285109 227280 586844 953719 1038466 1264148 1260651 1183925
8382 1183925 965488 329146 51563 183882 342439 943703 1398362 1216972 1091490 895858
8372 895858 649485 935370 1137862 790589 597506 634593 686804 808966 675763 515930
8362 515930 661959 908683 758704 301298 -297853 -538643 -194496 -28665 -378572 -351145
8352 -351145 -304581 -715031 -598473 -114096 -58117 -313953 -275757 -109714 -135062 -158624 -74294
8341 -74294 -92890 -263887 -290089 -153685 -175834 42010 125624 -3167 89411 -231066 -881150
8330 -881150 -972339 -703721 -268645 -23994 -186026 -345058 -252029 -121697 -115477 -16692 82560
8319 82560 -15851 -187903 -478515 -587560 -302407 -107936 -60377 161884 187766 -99065
8309 -99065 -346867 -440607 -289642 -133187 -56429 157873 369609 219089 -47996 -283090
8299 -283090 -613573 -727673 -335981 -242413 -326658 -490313 -609524 -337596 -74177 -283306
8289 -283306 -597941 -802725 -438610 -182637 -52812 168895 222985 187721 -260539 -628169
8279 -628169 -589010 -490846 -458308 -76894 431603 453108 645868 992772 1031785 1056587 989210
8268 989210 631679 232627 253563 244494 -311737 -682512 -285148 579778 929795 959563
8258 959563 592087 52877 -403442 -579535 -645787 -681255 -397668 -212840 -202744 -566445
8248 -566445 -859886 -716434 -784646 -1037002 -1412470 -1342226 -867543 -147984 292607 255547
8238 255547 -59896 -343134 -335871 -504957 -984656 -964414 -250842 509802 917200 1038401
8228 1038401 1024971 656077 513629 631367 790109 1318430 1618761 2049145 2901103 3916731
8218 3916731 5245744 6786391 8477935 11057608 14809777 20506184 29376984 39113730
8210 39113730 41169951 33587943 24423485 17590189 12781408 9635636 7506444 6186897
8202 6186897 5448324 5070853 4851370 4092386 3165435 2502223 1926011 1408919 1298958 1039996
8192 1039996 659701 409549 480347 920012 1140787 1152377 1278066 1422606 1618438 1609201
8182 1609201 1398184 1388729 1605555 1483860 670080 181312 398069 631955 790817 1004479
8172 1004479 1311793 1345631 1094360 776536 476471 660715 1040486 1053262 1009926 1542792
8162 1542792 2053061 2035790 1813773 1562694 1261673 1169517 1450387 1987780 2333711 2582795
8152 2582795 3064896 4121388 5419390 6637335 8500820 11527746 16339831 23358421
8144 23358421 32786751 41622685 41162464 32300919 23417091 16755371 12573420 10213563
8136 10213563 8685573 7186649 6044413 5343477 4941019 4659699 4383978 3861820 3464206
8127 3464206 3391266 2871721 1922724 1047314 660807 912953 1524236 1588425 1173425 1141544
8117 1141544 1224487 1381804 1127406 655828 679053 871201 472318 -124767 90601 175071
8107 175071 305609 830818 934701 537146 162004 209792 312572 288163 461607 968142
8097 968142 1324664 1355721 1025673 752573 806534 717456 340150 116182 314129 728934
8087 728934 861274 367984 -275533 -517610 -529139 -286096 433029 781169 861478 857516
8077 857516 760987 551084 101917 -138508 -177006 148468 435286 265271 239472 644790
8067 644790 1118910 1588978 1362401 679987 372823 168390 -26849 219149 530976 269239
8057 269239 -270101 -508551 -432993 -306019 -354693 -529994 -390565 -155999 154049 73619
8047 73619 -331787 -367545 69452 344111 358943 323412 133477 15222 -461483 -839865
8037 -839865 -979535 -1177383 -1332813 -1487676 -1289052 -1066236 -1045288 -907845 -951509 -1055270
8027 -1055270 -944295 -705018 -500057 -336155 -102372 231375 363363 267502 284022 593035
8017 593035 425494 -73233 -255568 -18849 389844 123302 -418601 -526117 -230968 57527
8007 57527 45970 -38391 -167633 -199002 -71393 141241 576448 804525 554817 354777
7997 354777 660153 799845 401347 -79582 -251561 -460167 -918249 -1134293 -940402 -562475
7987 -562475 70398 673796 682038 484517 294151 151765 34512 -93296 -6485 498653
7977 498653 515207 510201 723216 581391 393218 250870 82790 -321727 -600827 -427485
7967 -427485 -298883 -95552 240348 602535 507587 540015 321676 -221105 -425148 -161557
7957 -161557 -30641 -35854 15452 -293192 -463971 -249934 -99737 291793 552991 484628
7947 484628 366998 146569 22866 218648 382224 449729 519359 776132 914957 938251
7937 938251 972420 729611 373769 -77584 -236450 -121094 -52721 -168872 -403373 -460511
7927 -460511 -139635 315380 291971 119988 245283 275149 488592 346814 173694 212690
7917 212690 -55110 -308901 -457665 -480976 -189848 308923 593809 702273 682820 268077
7907 268077 52675 233043 190221 92981 324470 156056 -83323 -149398 -444147 -731844
7897 -731844 -1033320 -1135892 -529549 64267 -193862 -570832 -623109 -586183 -536274 -476078
7887 -476078 -484865 -229325 -196107 -420411 -528212 -467378 -245832 -83381 -83837 -338942 -399094
7876 -399094 -185818 -251469 -303585 -305964 -566900 -604874 -199514 -58095 -73583 -191714 34157
7865 34157 239046 173616 141313 16621 87395 -358 -425121 -660726 -332204 97109 451959
7854 451959 691740 725877 406451 11390 -475465 -464934 -105911 -177850 -175104 336622 710315
7843 710315 919091 980608 766764 394103 -20561 -160645 177914 122458 -5570 49277
7833 49277 11010 -68048 199766 472092 851245 1008030 762146 664275 864454 786533 447293
7822 447293 250114 285762 228169 84028 130713 396307 400103 232676 -153276 -726307 -809594
7811 -809594 -579141 -288116 -48496 93624 -39683 -450369 -1089009 -1346079 -1148108 -625325
7801 -625325 -242348 -121011 -158277 -179968 -16309 -429242 -807141 -773293 -338891 -338499 -706015
7790 -706015 -1003912 -1115257 -941536 -611545 -513014 -638339 -390261 -258278 -393279 -513415
7780 -513415 -481207 -364177 -118069 149156 559249 1423326 1811657 1472243 1129998 985739
7770 985739 710356 191991 -179968 -338345 -388550 -489914 -368589 -332942 -266656 18776
7760 18776 291566 171726 103037 434956 630428 472854 69036 -15244 -131594 -420438
7750 -420438 -573476 -423810 -187399 -221833 -505329 -719877 -733398 -905588 -1115967 -1233516
7740 -1233516 -718064 -369963 -575717 -633071 -512339 -360471 -198686 292479 623793 616381
7730 616381 381073 90585 186526 588538 811882 950532 1094171 478222 123676 354485
7720 354485 114432 -323708 -715663 -725535 -707890 -817219 -966016 -965307 -582838 -199688 -184669
7709 -184669 -387342 -334952 -453335 -596740 -601245 -157710 51984 -128465 -524268 -746612
7699 -746612 -583663 -769493 -617200 -310106 -234531 -348599 -207024 92869 183889 236624
7689 236624 667416 1014719 858220 337495 176268 122398 126010 169285 -228905 -517256
7679 -517256 -421748 -306571 -435969 -654463 -733461 -782874 -649604 -233913 185223 320365
7669 320365 130168 -200494 -449123 -162721 354401 965938 1048013 531195 196234 271645
7659 271645 543035 689142 556029 374416 843936 1337443 1363983 1223914 1522510 1684679
7649 1684679 1855188 2527177 3413342 4127523 5024951 6649448 9354863 13073187 19903897
$$ [...]
##END NTUPLES=NMR SPECTRUM
##END=
