##TITLE=C13_SAV-51-f7
 CDCl3, 1200 sc

 7.2.2020
##JCAMPDX= 6.0         $$ Bruker NMR JCAMP-DX V2.0
##DATA TYPE= NMR SPECTRUM
##DATA CLASS= NTUPLES
##ORIGIN= UXNMR, Bruker Analytische Messtechnik GmbH
##OWNER= root
$$ XWIN-NMR		Version 3.5
$$ Fri Feb  7 16:45:03 2020 Russian Standard Time (UT+4h)  she@DPX200
##.OBSERVE FREQUENCY= 50.327896
##.OBSERVE NUCLEUS= ^13C
##.ACQUISITION MODE= SIMULTANEOUS
##.ACQUISITION SCHEME= undefined
##.AVERAGES= 1200
##.DIGITISER RES= 17
##SPECTROMETER/DATA SYSTEM= spect
##.PULSE SEQUENCE= zgpg30
##.SOLVENT NAME= CDCl3
##.SHIFT REFERENCE= (INTERNAL, CDCl3, 0, 222.624)
##AUDIT TRAIL= $$ (NUMBER, WHEN, WHO, WHERE, WHAT)
$$ ##TITLE= Audit trail, XWIN-NMR		Version 3.5
$$ ##JCAMPDX= 5.01
$$ ##ORIGIN= Bruker BioSpin GmbH
$$ ##OWNER= she
$$ F:/spectra/data/she/nmr/c13/1/pdata/1/auditp.txt
$$ ##AUDIT TRAIL=  $$ (NUMBER, WHEN, WHO, WHERE, WHAT)
(   1,<2020-02-07 16:43:55.14 +0400>,<she>,<DPX200>,
      <created by zg, POWCHK disabled, PULCHK disabled
       terminated by command 'halt'
       configuration hash MD5:
       00 E9 B6 7A A2 85 ED C7 34 08 36 98 17 FE 4E 26
       data hash MD5: 32K
       B2 86 B2 BC 9A 0A C2 5A 99 1D 5B 74 DC 03 22 F6>)
(   2,<2020-02-07 16:43:57.64 +0400>,<she>,<DPX200>,
      <Start of raw data processing
       efp BC_mod = 2 LB = 1 FT_mod = 6 PKNL = 1 PHC0 = -207.5601 PHC1 = 11.60638 SI = 32K 
       data hash MD5: 32K
       52 62 28 E0 6C 29 D9 E2 A8 2D A8 ED C2 FD BE 81>)
(   3,<2020-02-07 16:44:00.57 +0400>,<she>,<DPX200>,
      <abs ABSG = 5 
       data hash MD5: 32K
       7D 4B AA 45 C3 0B 63 91 72 8A 28 39 1D C3 9A F2>)
(   4,<2020-02-07 16:44:32.50 +0400>,<she>,<DPX200>,
      <pk PHC0 = 1.033305 PHC1 = 0 
       data hash MD5: 32K
       B8 6A A9 E1 A8 DB 4A 85 F6 3A 6E 8D 85 05 A8 8F>)
(   5,<2020-02-07 16:44:35.68 +0400>,<she>,<DPX200>,
      <abs ABSG = 5 
       data hash MD5: 32K
       14 14 6C AE 89 64 82 E4 26 62 DD 24 DE A0 B2 35>)
$$ ##END=
$$ 
$$ hash MD5
$$ 06 B2 1C B8 7C F8 5B A9 F0 D9 92 83 D6 AF ED 09
##$RELAX= 
##$RELAX= 
##$RELAX= 
##$RELAX= 
##$RELAX= 
##$RELAX= 
##$RELAX= 
##$RELAX= 
$$ Bruker specific parameters
$$ --------------------------
##$DU= <F:/spectra>
##$EXPNO= 1
##$NAME= <c13>
##$PROCNO= 1
##$TYPE= <nmr>
##$USER= <she>
##$AMP= (0..31)
100 100 100 100 100 100 100 100 100 100 100 100 100 100 100 100 100 100 
100 100 100 100 100 100 100 100 100 100 100 100 100 100 
##$AQSEQ= 0
##$AQ_mod= 1
##$AUNM= <au_zg>
##$AUTOPOS= <>
##$BF1= 50.322709
##$BF2= 200.13
##$BF3= 50.322709
##$BF4= 500.13
##$BF5= 500.13
##$BF6= 500.13
##$BF7= 500.13
##$BF8= 500.13
##$BYTORDA= 1
##$CFDGTYP= 0
##$CFRGTYP= 5
##$CHEMSTR= <none>
##$CNST= (0..31)
1 1 145 1 1 1 1 1 1 1 1 1 1 1 1 1 1 1 1 1 1 1 1 1 1 1 1 1 1 1 1 1 
##$CPDPRG= <waltz16>
##$CPDPRG1= <>
##$CPDPRG2= <waltz16>
##$CPDPRG3= <>
##$CPDPRG4= <mlev>
##$CPDPRG5= <mlev>
##$CPDPRG6= <mlev>
##$CPDPRG7= <mlev>
##$CPDPRG8= <mlev>
##$CPDPRGB= <>
##$CPDPRGT= <>
##$D= (0..31)
$$ [...]
##$SUBNAM4= <"">
##$SUBNAM5= <"">
##$SUBNAM6= <"">
##$SUBNAM7= <"">
##$SUBNAM8= <"">
##$SUBNAM9= <"">
##$SW= 239.972175391363
##$SWIBOX= (0..15)
0 1 3 0 0 0 0 0 0 0 0 0 0 0 0 0 
##$SW_h= 12077.2946859903
##$TD= 32768
##$TD0= 1
##$TE= 0
##$TE2= 300
##$TE3= 300
##$TEG= 300
##$TL= (0..7)
120 120 120 120 120 120 120 120 
##$TP= (0..7)
150 150 150 150 150 150 150 150 
##$TP07= 0
##$TPNAME0= <>
##$TPNAME1= <>
##$TPNAME2= <>
##$TPNAME3= <>
##$TPNAME4= <>
##$TPNAME5= <>
##$TPNAME6= <>
##$TPNAME7= <>
##$TPOAL= (0..7)
0.5 0.5 0.5 0.5 0.5 0.5 0.5 0.5 
##$TPOFFS= (0..7)
0 0 0 0 0 0 0 0 
##$TUNHIN= 0
##$TUNHOUT= 0
##$TUNXOUT= 0
##$USERA1= <user>
##$USERA2= <user>
##$USERA3= <user>
##$USERA4= <user>
##$USERA5= <user>
##$V9= 5
##$VALIST= <valist>
##$VCLIST= <CCCCCCCCCCCCCCC>
##$VD= 0
##$VDLIST= <DDDDDDDDDDDDDDD>
##$VPLIST= <PPPPPPPPPPPPPPP>
##$VTLIST= <TTTTTTTTTTTTTTT>
##$WBST= 1024
##$WBSW= 4
##$XGAIN= (0..3)
0 0 0 0 
##$XL= 0
##$YL= 0
##$YMAX_a= 1965090
##$YMIN_a= -7932313
##$ZGOPTNS= <>
##$ZL1= 120
##$ZL2= 120
##$ZL3= 120
##$ZL4= 120
##$ABSF1= 222.624
##$ABSF2= -17.3728
##$ABSG= 5
##$ABSL= 3
##$ALPHA= 0
##$AQORDER= 0
##$ASSFAC= 0
##$ASSFACI= 0
##$ASSFACX= 0
##$ASSWID= 0
##$AUNMP= <proc_1d>
##$AZFE= 0.1
##$AZFW= 0.5
##$BCFW= 0
##$BC_mod= 2
##$BYTORDP= 0
##$COROFFS= 0
##$CY= -3
##$DATMOD= 1
##$DC= 0
##$DFILT= <>
##$DTYPP= 0
##$F1P= 0
##$F2P= 0
##$FCOR= 0.5
##$FTSIZE= 32768
##$FT_mod= 6
##$GAMMA= 0
##$GB= 0
##$INTBC= 1
##$INTSCL= 4.134877e-10
##$ISEN= 128
##$LB= 1
##$LEV0= 0
##$LPBIN= 0
##$MAXI= 10000
##$MC2= 0
##$MEAN= 0
##$ME_mod= 0
##$MI= 0.1934396
##$NCOEF= 0
##$NC_proc= -2
##$NLEV= 6
##$NOISF1= 120.0001
##$NOISF2= 80.00006
##$NSP= 0
##$NTH_PI= 0
##$NZP= 0
##$OFFSET= 222.624
##$PC= 1.4
##$PHC0= -206.5268
##$PHC1= 11.60638
##$PH_mod= 1
##$PKNL= yes
##$PPARMOD= 0
##$PSCAL= 0
##$PSIGN= 0
##$REVERSE= no
##$SF= 50.3227315989248
##$SI= 32768
##$SIGF1= 140
##$SIGF2= 120
##$SINO= 11.81781
##$SIOLD= 32768
##$SREGLST= <13C.CDCl3>
##$SSB= 0
##$STSI= 32768
##$STSR= 0
##$SW_p= 12077.2946859903
##$SYMM= 0
##$S_DEV= 0
##$TDeff= 32768
##$TDoff= 0
##$TI= <>
##$TILT= no
##$TM1= 0
##$TM2= 0
##$TOPLEV= 0
##$USERP1= <user>
##$USERP2= <user>
##$USERP3= <user>
##$USERP4= <user>
##$USERP5= <user>
##$WDW= 1
##$XDIM= 32768
##$YMAX_p= 401409298
##$YMIN_p= -17472914
$$ End of Bruker specific parameters
$$ ---------------------------------
##NTUPLES= NMR SPECTRUM
##VAR_NAME=  FREQUENCY,     SPECTRUM/REAL,   SPECTRUM/IMAG
##SYMBOL=    X,             R,               I
##VAR_TYPE=  INDEPENDENT,   DEPENDENT,       DEPENDENT
##VAR_FORM=  AFFN,          ASDF,            ASDF
##VAR_DIM=   32768,         32768,           32768
##UNITS=     HZ,            ARBITRARY UNITS, ARBITRARY UNITS
##FACTOR=    0.368581032318806, 1,           1
##FIRST=     11203.0474431902, 0,            0
##LAST=      -874.247242800138, 0,           0
##MIN=       -874.247242800138, -17472914,   0
##MAX=       11203.0474431902, 401409298,    0
$$ Real data points
##PAGE= N=1
##DATA TABLE= (X++(R..R)), XYDATA
$$ [...]
15479a422363j645716r32401J706159J460064Q47161L32264j004781j234328q462
15470a902403J849710K13312n38172l82275j76600J47789J048724N01087j583831
15461h22659j524112o86770K686486K639156r14512k154227k334978P7946J226297
15452a807373M10645l40696j172149r05207Q34447K048301N68440N21130P8668
15443B36206m98697P06538J510851J318893J48005q02311K99525k636786k752756
15434b470532k14264P6093k83565M44655R93888M22776o03078m56484k65255j13562
15424b469328J050747L336345J697444J62401k740751k638958J19725P38171J3622
15415g30582o47459J26705M99007n8966J044355J332704r96943k265465j0755
$$ y = [-1422363, -3068079, -4000480, -2294321, -834257, 12904, 345168, -659613, -1893941, -1902403, -52693, 160619, -377553, -759828, -936428, -788639, 260085, 761172, -822659, -2346771, -3033541, -347055, 2292101, 1377589, -776638, -3111616, -3033670, -1807373, -1396728, -1737424, -2909573, -3814780, -2980333, -932032, -363592, 157538, 236206, -262491, 444047, 1954898, 3273791, 3421796, 2619485, 2919010, 282224, -2470532, -2684796, -2608703, -2892268, -2447613, -1453725, -1030949, -1634027, -2090511, -2355766, -2469328, -1418581, 1917764, 3615208, 3777609, 1036858, -1602100, -1482375, -744204, -730582, -1378041, -1251336, -752329, -811295, 233060, 1565764, 568821, -1696644, -1707399]
15406a707399J935377J243156o98974j449118J037204M5334r76697P36614R52045
15397A117542J729171L17209k157400q77955R67832P19007j338721k408458k149522
15388d081295l72518J090402N45191r36761j541484k97585J133073K187025P50949
15379a523003L33317J129960j30668j773755n66192K68434n49713o60146Q70213
15370b601553J886385J72470o36152j26398J97059P370J82674m07262l99992P97405
15360i27994m75759j551275j067713m36965R82652R61119J128388O28427R39357
15351A80237J555873J083556R19288q41186r4764L91990r00483N41465K158113
15342D994089K73000j354715k300007q84803o2745O61548J497286R39004m55660
$$ y = [-1707399, 227978, 1471134, 772160, -676958, 360246, 405580, -571117, 165497, 1117542, 2846713, 3163922, 1006522, 128567, 1096399, 1815406, 476685, -1931773, -4081295, -4453813, -3363411, -2818220, -3754981, -5296465, -5594050, -4460977, -2273952, -1523003, -1189686, -59726, -190394, -1964149, -2530341, -2261907, -2811620, -3471766, -2601553, -715168, -542698, -1178850, -1305248, -1108189, -1100819, -918145, -1325407, -1725399, -927994, -1403753, -2955028, -4022741, -4459706, -3477054, -2515935, -1387547, -759120, 180237, 1736110, 2819666, 3738954, 2897768, 2803004, 3194994, 2294511, 2835976, 4994089, 5267089, 3912374, 1612367, 727564, 664819, 1326367, 2823653, 3762657, 3306997]
15333C306997l45802p4846Q0386q27988j076771j39896R43879N96374j199059
15324A263274k078127p67366J91713J387547Q33999j311939k054503j013011N09913
15315c038500j5530J057744R41695k95924n41164R20215P93760J592616J563096
15306B978008J429410n54577j209816q6717p87481j427206k359071k070360j197726
15297e285536K73394K19115M01948M13141p30839J02744J209469K593481L89604
15288d13479j451697n99615n17287J06311j14380m33885O91800P22642L25350
15279a684240L77299L67242j291028j076914n11769R21154L9890j93352r1319
15270c143037Q19376J625690J333305m63398p77322j325532j332652P4338M73354
$$ y = [3306997, 2961195, 2886349, 2966735, 2138747, 1061976, 922080, 1865959, 2462333, 1263274, -814853, -1582219, -1390506, -2959, 831040, -480899, -2535402, -3548413, -3038500, -3054030, -1996286, -1054591, -1350515, -1891679, -971464, -177704, 1414912, 2978008, 4407418, 3852841, 2643025, 2556308, 1768827, 341621, -2017450, -4087810, -5285536, -5012142, -4793027, -4391079, -3977938, -4708777, -4606033, -3396564, -803083, -413479, -1865176, -2464791, -2982078, -2875767, -2990147, -3424032, -2732232, -2009590, -1684240, -1306941, -939699, -2230727, -3307641, -3819410, -2898256, -2858366, -3051718, -3143037, -2323661, -697971, 635334, 171936, -605386, -1930918, -3263570, -3189232, -2715878]
15261b715878J51289j87359L99924O50703L82276j491452j114107M67507r17972
15252d375069j116653M4776L85900J351657J622640J338525J545985J007731L34702
15243B140194o13698m10628N49335N11724J98526o32176j196747o04685K06074
15234A47919O17450J31896o64660q16029j524285j467138J243768R25028K21535
15225a184516q07801j610396J462308L373297J648589j069818j462801J29768
15217D78630R82180m99092k83303K04384J312424O80601P38366o7742q56077j066815
15207A623556j779536j232758l18557l45609n90672J216981K988459J952279j012156
15198B501987k281559j546734p83438J118475J528169p9213q88198M80987J072603
$$ y = [-2715878, -2564589, -2751948, -2352024, -1701321, -1319045, -2810497, -3924604, -3457097, -4375069, -5491722, -5446946, -5061046, -3709389, -2086749, -748224, 797761, 1805492, 2140194, 1526496, 1115868, 1665203, 2176927, 2375453, 1743277, 546530, -58155, 147919, 765369, 897265, 232605, -583424, -2107709, -3574847, -2331079, -1406051, -1184516, -1992317, -3602713, -2140405, 1232892, 2881481, 1811663, 348862, 478630, 1460810, 961718, 678415, 882799, 2195223, 2875824, 3614190, 3546448, 2690371, 1623556, -155980, -1388738, -1707295, -2052904, -2643576, -1426595, 1561864, 3514143, 2501987, 220428, -1326306, -2109744, -991269, 536900, 457687, -430511, 50476, 1123079]
15189A123079r3796M95899J51145M20069j181345k395077p60213q23518j414445
15180d478202r9171M60417L61710O3071R59227J972882J454964O00310M59757
15171A754965R7625L23337J653066o02675k877602j332337j427404j922803j603804
15162e937632k89395J012660J265326M03644K06121J173446P83245q51723r32424
15153c166732l76191N13962J451804R98991m32352p33828O88598K37819J175646
15144C57717K179054Q8018m53073j387040p64559q39568j775853j258990m31582
15135d285876J069350l68569j55894m58180J704393J458314j038731p5642R46057
15126a204778J577626J412725m12627j245713j397182j004307j53668J145770
$$ y = [1123079, 1029283, 1525182, 1676327, 2096396, 915051, -1480026, -2240239, -3063757, -4478202, -4577373, -4116956, -3755246, -3692175, -2732948, -760066, 694898, 1295208, 1754965, 1852590, 2175927, 3828993, 3226318, 348716, -983621, -2411025, -4333828, -5937632, -6227027, -5214367, -3949041, -3545397, -3339276, -2165830, -1382585, -2234308, -3166732, -3542923, -3028961, -1577157, -578166, -1010518, -1744346, -1055748, -817929, 357717, 2536771, 2624789, 2171716, 784676, 20117, -819451, -2595304, -3854294, -4285876, -3216526, -3585095, -3740989, -4199169, -2494776, -1036462, -2075193, -2150835, -1204778, 372848, 1785573, 1372946, 127233, -1269949, -2274256, -2427924, -1282154]
15118a282154L11819K72351r38582l5622J096639R54841o36721p31312p9642j19143
15108a187526J090984N35674Q48600J85302j137892m75000j09284K80043m21840
15099c90939L44213J206593R20388o46043j524289j527715j761564o19933J923826
15090b075463J989629Q05838Q26345J762511J437210Q8854j742360o04655O09823
15081C097732p46612j880900k214381n16262J217449M09303P67523n01912j031309
15072a399369P43280K82219r51950O19526J305001M25650L33108j13158j314446
15063g0139j481527l11115K24555O70615J400163K456353K68614j303421j411013
15054D43085q61994j637047q06218r3077m8567J672859K355927N06128n06091
$$ y = [-1282154, -970335, -697984, -1636566, -1672188, -575549, 379292, -257429, -988741, -1068383, -1187526, -96542, 439132, 1287732, 1473034, 335142, -139858, -249142, 30901, -390939, -46726, 1159867, 2080255, 1434212, -90077, -1617792, -3379356, -3999289, -2075463, -85834, 720004, 1546349, 3308860, 4746070, 4834924, 3092564, 2487909, 3097732, 2351120, 470220, -1744161, -2260423, -1042974, -633671, 133852, -368060, -1399369, -656089, -373870, -1325820, -706294, 598707, 1024357, 1357465, 1244307, -70139, -1551666, -1862781, -1638226, -967611, 432552, 2888905, 3157519, 1854098, 443085, -418909, -2055956, -2862174, -2955251, -3003818, -1330959, 1024968, 1531096, 1025005]
15045A025005j012718n70862n70529k18237l90415O656j560684j977493J73329
15036e095948J66764O31447K614370J037568n37639m36651Q04497L6689p39127
15027a518030k29444N37075R47473J754343J502212J878474M85618k335547k692994
15018C29180J38685k91045r85423k82287l15601J28243j096100p49877m34333
15009c558558Q0064K2320R9072k14053m84625j32375J007433J965898l18604n82739
14999b116167M2471P50220k84916r17409p45802l25314N24618J47673Q56378K111429
14989D3181J002561j197293o80562P04947l89857r60706o7816R66312K511925
14980A932692J987598J35915J65735J272481n01197k403503k69669O85754o29105
$$ y = [1025005, 12287, -558575, -1129104, -1347341, -1737756, -1731100, -3291784, -5269277, -5095948, -4929184, -4297737, -1683367, -645799, -1183438, -1620089, -815592, -778903, -1518030, -1747474, -1210399, -262926, 1491417, 2993629, 4872103, 5357721, 3022174, 329180, 467865, 176820, -808603, -1090890, -1406491, -1278248, -2374348, -3124225, -3558558, -3478494, -3456174, -3357102, -3571155, -4055780, -4188155, -3180722, -1214824, -1533428, -2116167, -2073696, -1323476, -1608392, -2525801, -3271603, -3596917, -3072299, -2924626, -2068248, 43181, 1045742, -151551, -832113, -127166, -517023, -1477729, -1545545, -579233, 1932692, 3920290, 4056205, 4221940, 5494421, 4993224, 2589721, 2320052, 3005806, 2376701]
14971B376701j561385j898279j032433j119830P03185K096379K096576R675j792420
14962a21831r82382J81906J142390P58700m63073l15401n39396j205668j813534
14953c358289j859106K61197K238795K384068O36267p93346O50802q03332j394569
14944b037513q06046p68907p52833m00917K42660J075572N88849N76538J171770
14935a110827K30805j815127j576668o33702L44730R73910J78516K15116O36708
14926b556539J072820R03579R81932j22532j926129j461507P1245J095323J857989
14917h3819J270245j008667k098838O85306J891187Q65698l1241o45200j149502
14908c04831m47899n64888p69953k66831j52136P60417P0777q20533p79118j323916
$$ y = [2376701, 815316, -1082963, -2115396, -3235226, -2532041, -435662, 1660914, 1670589, -121831, -1104213, -922307, 220083, 978783, 515710, 200309, -339087, -1544755, -3358289, -5217395, -4956198, -2717403, -333335, 302932, -490414, 160388, -642944, -2037513, -2843559, -3612466, -4365299, -4766216, -4523556, -3447984, -2859135, -2282597, -1110827, -880022, -2695149, -4271817, -4905519, -4560789, -3586879, -3408363, -3193247, -2556539, -1483719, -580140, 401792, 279260, -1646869, -3108376, -3037131, -1941808, -83819, 1186426, 177759, -1921079, -1235773, 655414, 1521112, 1489871, 844671, -304831, -752730, -1317618, -2087571, -2354402, -2506538, -1746121, -1675344, -2495877, -3274995, -4598911]
14898d598911M9453K274130L35731K5983P64537J59511N60244m33429o16615j865964
14888c345330n49144J858298J407186J191938J425051P68351j310490n72188k58059
14879F15613j11439n69075r68712j456725r21515J133054O91973K39644j28791
14870a475973j19535L19675R28089J813534J231116j349369k222017r17017j267086
14861c058583l66979O34252L66900L003605L282384l75848j860060j051325m66745
14852A07601o70398j420971o78556R83829N52773o57306n18865J260577J280849
14843B39533q40944j81797M48968j01905r89773R6044K80770K2955o80105j966168
14833c672422m10891J120602J024100J6122l05711J151977K769057J370838q69491
$$ y = [-4598911, -4549458, -2275328, -1939597, -1913614, -1149077, -989566, -429322, -862751, -1479366, -3345330, -3894474, -2036176, -628990, 562948, 1987999, 2756350, 1445860, 873672, 615613, 504174, -64901, -1033613, -2490338, -3411853, -2278799, -1586826, -1347182, -1475973, -1595508, -1275833, -347744, 1465790, 2696906, 1347537, -874480, -1791497, -3058583, -3425562, -2791310, -2424410, 579195, 3861579, 3485731, 1625671, 574346, 107601, -562797, -1983768, -2662324, -1678495, -1125722, -1783028, -2301893, -1041316, 239533, -601411, -783208, -334240, -436145, -1425918, -1329874, -1049104, -1026149, -1706254, -3672422, -4083313, -2962711, -1938611, -1922489, -2228200, -1076223, 1692834, 3063672, 2194181]
14824B194181j565464j038802J63904O52404k488087k400905j136619N869K531284
14815c082235K190464J524035L45796M97829M05384l5128j958896k298375j014977
14806c426103P18125J261938P38419N90590J536093o01129j885405j480031r35225
14797c482728K306225P98193l79542R01886O57914q88311p37277r30986m78535
14788b233161o6128L66197N7501k75269L30763J080766N75084l1747L13955M50882
14778E68843Q13302L65124Q4599M87151Q78461q99934j916465j399261j945837
14769b964017j478002r83472K78125N84222J246342K503483J549121q56955q02891
14760i24044N94524m45794j337215j534668j705827n51244K554844K279072Q13752
$$ y = [2194181, 628717, -410085, -246181, 406223, -2081864, -4482769, -5619388, -5613519, -3082235, -891771, 632264, 978060, 1475889, 1881273, 1846145, -112751, -2411126, -3426103, -2707978, -1446040, -707621, -117031, 1419062, 817933, -1067472, -2547503, -3482728, -1176503, -378310, -757852, 144034, 801948, -86363, -823640, -1754626, -2233161, -2299289, -1933092, -1875591, -2150860, -1820097, -739331, -164247, -195994, 117961, 568843, 1382145, 1747269, 1831868, 2319019, 3197480, 2297546, 381081, -1018180, -2964017, -4442019, -5425491, -5147366, -4563144, -3316802, -813319, 735802, -121153, -924044, -329520, -775314, -2112529, -3647197, -5353024, -5904268, -3349424, -1070352, -256600]
14751b56600k54252M77066K76282l2668O05747m77550j11406N71914N50123r76407
14741C72249k21872R06067q35732j699629L86126J407983N00151j32603m36616
14732B46124p12587k60373L77839O00336L9431m18705q31162k36590J215041j97076
14722a77722j329594j78736O60025J249395r0409n51594N00162J075372J509236
14713B666135O48199j174471j108806j006745k01006K80170j17309O76229M68515
14704A130911m01535k12181P67908Q05425R92991L50433k50930r23405n00158
14695A759459P04760J862778n45075k157574p81494J275447O77488j152907k40161
14686A402721O68959k06295j50333n57128j246900j671859o17196R38177J175730
$$ y = [-256600, -510852, -33786, 242496, 209828, 815575, 338025, 226619, 798533, 1348656, 372249, 150377, 1056444, 220712, -1478917, -1092791, 315192, 815343, 682740, 246124, -466463, -726836, -348997, 251339, 290770, -127935, -959097, -1195687, 19354, -177722, -1507316, -1686052, -1026027, 223368, 132959, -418635, 81527, 1156899, 2666135, 3314334, 2139863, 1031057, 24312, -176694, 103476, -13833, 662396, 1130911, 729376, 517195, 1285103, 2090528, 3083519, 3433952, 3183022, 2259617, 1759459, 2464219, 4326997, 3781922, 1624348, 842854, 2118301, 2795789, 1642882, 1402721, 2071680, 1865385, 1715052, 1157924, -88976, -1760835, -2378031, -1439854, -264124]
14677b64124J254340K54029K83556Q15560N39798J37991o36344J41398J090283
14668C616487p13883j478625j936018r40219O57437K813277K537870J364811r25538
14659D995599l573740j968877k11978l49722J380298l4439k204431o79454L17275
14650b329469K251217J880732P6951l02497l43422M28355M70967l52892n91499
14641A188443k614766k179749J40049L71951O18664O11605J132034L59544P0996
14632c01229p15690q56896O8273j345914M63788J218315k99987o1481J764692
14623f6129J967261N49283q89979j355568r14018j59008J133617J54104R7123
14614E16686N93375L95647m30621j502499k38497l36401K54659J85586L66581
$$ y = [-264124, 990216, 1244245, 1527801, 2343361, 2883159, 3021150, 2384806, 2526204, 3616487, 2902604, 1423979, -512039, -1452258, -794821, 2018456, 4556326, 5921137, 4995599, 1421859, -547018, -758996, -1108718, 271580, 237141, -1967290, -2646744, -2329469, -78252, 1802480, 1879431, 1576934, 1233512, 1661867, 2132834, 1779942, 1188443, -1426323, -3606072, -3466023, -3094072, -2475408, -1863803, -731769, -372225, -301229, -1016919, -1873815, -1805542, -3151456, -2687668, -1469353, -1769340, -1830821, -66129, 1901132, 2450415, 1560436, 204868, -709150, -868158, 265459, 419563, 516686, 1110061, 1505708, 1075087, -427412, -665909, -1002310, -747651, -562065, -195484]
14605a95484J342324Q42872J0208l74484n65114K98164m63111q07367j231634
14596a143626q74121n11405P4746K498058J032138m85447j15341M11435R18944
14587A805381P8644J82217m32637l4107O70151r90197j438988j360702o82213
14578b202451m94276q00622P14642Q12214K25694R73403r84750j094768o9637
14569b920551K74823K3276J076527k52170o95074r26771l80543M17191M30118
14560b953174P52031P82041J469910N00915j633499k210160n16323O81931j4230
14551c140558K141858J386222j24869N3853L99002l7892j72512P36445K00013
14542A441562M12952J098679K32084p16043K9739j419651k199493n80781J163043
$$ y = [-195484, 1146840, 1989712, 1999920, 1625436, 1060322, 1358486, 895375, 88008, -1143626, -2017747, -2529152, -2454406, 43652, 1075790, 590343, 475002, 886437, 1805381, 1884025, 2066242, 1633605, 1599498, 2269649, 1279452, -159536, -1520238, -2202451, -2696727, -3497349, -2782707, -1970493, -1744799, -771396, -1756146, -2850914, -2920551, -2645728, -2622452, -1545925, -1798095, -2493169, -3419940, -3800483, -3383292, -2953174, -2201143, -1419102, 50808, 551723, -1081776, -3291936, -3808259, -3126328, -3140558, -998700, 387522, 262653, 316506, 715508, 677616, 505104, 1241549, 1441562, 1854514, 2953193, 3185277, 2469234, 2498973, 1079322, -1120171, -1700952, -537909]
14533e37909M05560M70527k8914l05091j358334j626536n53252j633990j290684
14524f458623K143061K441950J196490K08056j21460p94453J66835R89538J11697
14515a16909k80035j79249j842526m94753O77302N27356N69661L3013L64080J056414
14505C14354M51974J51857J07378o24995L74064P93735K18740j88645J071464
14496B669926Q2419m29601m224l09584K30797j320449j685478j78204J59286k59378
14486a044490m3556M54466L12251p77014K15938J043241l530P00232J063906K458700
14476D380144n68168k001005m1813J93686o56404j045397j219172o89666J04250
14467a543545L8433O76055k76628j46792j86635k40031J433796J41522k13737
$$ y = [-537909, -132349, 338178, 309264, 4173, -1354161, -2980697, -3533949, -5167939, -6458623, -4315562, -1873612, -677122, -469066, -590526, -1384979, -1218144, -228606, -116909, -396944, -576193, -2418719, -2913472, -2236170, -1708814, -1139153, -1106140, -742060, 314354, 766328, 918185, 1025563, 400568, 774632, 1568367, 1787107, 1598462, 2669926, 2752345, 2322744, 2318520, 2008936, 2239733, 919284, -766194, -944398, -785112, -1044490, -1088046, -633580, -321329, -1098343, -882405, 160836, 157306, 857538, 1921444, 4380144, 3811976, 1810971, 1769158, 1962844, 1306440, 261043, -958129, -1647795, -1543545, -1505112, -829057, -1105685, -1252477, -1439112, -1679143, -245347, -103825, -317562]
14458c17562K403730K633074L09628j414361j349689P2578K43505M45520J192703
14449D219126P20381j020863q95828q45536j492004k071966p97563k31256K1961
14440b393548J095698K096673K60598J0053K49544r88622j622519l88755J879773
14431A98895K64633p97582r34536m23250p88357O51725J881565k86086o98858
14422i31851n25152M3833R71372k02396j063652k56730m07014k71990R93627J657158
14412G205N80307p64525n37034L70168M13704p23596j380967j471702J57815P83866
14402b564759k39076p01133J98105K537221K688258P84262J97853o71335j114354
14393A115042m00995q410o28336q77103j495267J141356O35782k496034j249091
$$ y = [-317562, 2086168, 4719242, 5028870, 3614509, 2264820, 2337398, 2580903, 3026423, 4219126, 4939507, 3918644, 3022816, 2177280, 685276, -1386690, -2184253, -2415509, -2393548, -1297850, 798823, 1059421, 1069474, 1319018, 330396, -1292123, -1680878, 198895, 463528, -334054, -1268590, -1691840, -2480197, -1828472, 53093, -232993, -931851, -1457003, -1413170, -441798, -644194, -1707846, -1964576, -2371590, -2643580, -1649953, 7205, 587512, -177013, -714047, -343879, 69825, -653771, -2034738, -3506440, -3348625, -2564759, -2803835, -3504968, -3306863, -769642, 1918616, 2702878, 2900731, 2229396, 1115042, 714047, 705637, 77301, -799802, -2295069, -1153713, -517931, -3013965, -4263056]
14384d263056n09661J109750O45203m4795J177740J393301J019371m17025O77366
14375G88194P27848j242170J23723J889407l75974j332482J549671K068617n13549
14366C683285j908104K66126Q00170j079851k115368q51236P67103J082181l96034
14357B48272j84389K650276R64119r31607k882966j694285k27346j953081j360276
14348e371283J98895Q08840J323437R04370J409800N88739J445746J280186m59154
14339B129576Q63208M36830j015621n05413r35332N87597J464323M63160O31803
14330D120131J241128L61431j895644k769630j044175J02094k179146j039302
14322c103113R12529K23066p37929l25363O3501Q43497J137857R72072R90821
$$ y = [-4263056, -4772717, -3662967, -3017764, -3062559, -1884819, -491518, 527853, 110828, 788194, 1516042, 273872, 397595, 2287002, 1911028, 578546, 2128217, 4196834, 3683285, 1775181, 2041307, 2841477, 1761626, -353742, -1204978, -437875, 644306, 248272, 63883, 2714159, 3678278, 2746671, -136295, -1830580, -2057926, -4011007, -5371283, -5172388, -4363548, -3040111, -2135741, -725941, -137202, 1308544, 2588730, 2129576, 2992784, 3429614, 2413993, 1908580, 973248, 1560845, 3025168, 3488328, 4120131, 5361259, 5722690, 3827046, 1057416, 13241, 115335, -2063811, -3103113, -2190584, -1967518, -2705447, -3030810, -2967309, -2123812, -985955, -13883, 976938]
14313I76938k59130j196251p11767l35656J40743k06533J190424J932061M57142
14304A987971L59384L89630j38808m93103n26867j523033j760567j613632j197383
14295d516408M36347J407344J270875J480383L86790r29168p24893p49512p50616
14286b688858N70216N38764j28475j180073o7984Q57605J460306R52388o60559
14277c46670P46652P74763J545701O53138j145870k232451q86551M94704k32691
14268f29275K13103J049296L80270q18795j148101J10860o35927L82116J356308
14259B59855J726283P30529j076884m54007K3648j594625j150675j90208q97311
14250b623395l67274P700M03359J041818O51895n77117J391780K309910O0971
$$ y = [976938, 717808, -478443, -1190210, -1525866, -1385123, -1591656, -401232, 1530829, 1987971, 2347355, 2736985, 2598177, 2105074, 1578207, 55174, -1705393, -3319025, -4516408, -4080061, -2672717, -1401842, 78541, 465331, -463837, -1188730, -1938242, -2688858, -2118642, -1579878, -1708353, -2888426, -2956410, -2098805, -638499, 313889, -346670, 399982, 1174745, 2720446, 3373584, 2227714, -4737, -891288, -396584, -629275, -416172, 633124, 1013394, 194599, -953502, -842642, -1478569, -1096453, 259855, 1986138, 2716667, 1639783, 1185776, 1209424, -385201, -1535876, -1726084, -2623395, -2990669, -2982969, -2579610, -1537792, -885897, -1463014, -71234, 2238676, 2299647]
14241B299647j806913j466005L56576N20874l82940m34307L05017J475871K343308
14232C211128J506090j040944k003733q30708n11827j749941j611105K04729Q70857
14223a955454M44614K05836J185780L39446J48404N48564R7551j35292l92359
14214D87090m23513K07585j97627J083743O39964j805274j342866P25402J044816
14205D19320N71323Q43198L46997J48103j066868o80803Q5229n8355r09662q95087
14195a196605j04007Q51284J175429o38731O96844J266945j012830k508338k81139
14186a751148J619973L63269j54966Q12486N70168l02839j594534j437245O52910
14177a221926J187456K009983J181788j533767j292764r5861j107310m88516N67852
$$ y = [2299647, 492734, -973271, -616695, -95821, -478761, -913068, -608051, 867820, 3211128, 4717218, 3676274, 1672541, 841833, 330006, -1419935, -3031040, -2826311, -1955454, -1510840, -1305004, -119224, 220222, 368626, 917190, 1014741, 879449, 487090, 63577, 271162, 73535, 1157278, 1797242, -8032, -1350898, -625496, 419320, 990643, 1833841, 2180838, 2328941, 1262073, 581270, 666499, 608144, -301518, -1196605, -1300612, -449328, 726101, 87370, 784214, 2051159, 1038329, -1470009, -1751148, -131175, 232094, 77128, 889614, 1459782, 1156943, -437591, -1874836, -1221926, -34470, 1975513, 3157301, 1623534, 330770, 234909, -872401, -1360917, -793065]
14168g93065n03687L50735L90299n29890j322467Q48482K372763J34041q50397
14159I6814n34478J171246K68624j603986k060820j54107R69251J302017N41794
14150c645M33198N07207q06900j661178q59038k56767M30485k98069n65266J922414
14140a157559J049006R62142Q91044j898801j293573L16621M80937k70048N42376
14131c77855K31824J75278O55014m50965k034295j212628M00067O74117n19857
14122b459300q48493k14047J433505J687999J112890m1077m77776P22845o90993
14113B25553m88113J020560N90539k47912k72064m55472P40842m7781k674601
14104a608449j80591J340589Q36008q70333k474897j35448P88173P87404j37331
$$ y = [-793065, -1296752, -946017, -555718, -1085608, -2408075, -1559593, 813170, 947211, 96814, -437664, 733582, 1002206, -601780, -2662600, -2816707, -1847456, -545439, -3645, 429553, 936760, 129860, -1531318, -2390356, -2647123, -2216638, -2514707, -3079973, -1157559, -108553, 853589, 1744633, -154168, -1447741, -1131120, -650183, -920231, -377855, -146031, 29247, 684261, 233296, -1800999, -3013627, -2613560, -1939443, -2459300, -3307793, -3521840, -2088335, -400336, 712554, 671477, 193701, 916546, 225553, -262560, 758000, 1348539, 1100627, 828563, 373091, 1113933, 1066152, -1608449, -1789040, -448451, 387557, -482776, -2957673, -3093121, -2304948, -1517544, -1654875]
14095a654875n91164J478700J046106l88958J810546K598835R62773k01238j291817
14086C768908k148187r20451Q7071j660055j05212Q87569N31446K82218J240002
14077A963309O81959L85464K082062J77397k012278j397511l31493J23912m46176
14068A226645r91526N60155N06650J23688J57467L39690o48585j084214l58681
14059a68711J721908J444784J03889o66977r04003j81331P75157Q03591k86953
14050B641354k44712L13084n65542n24078L86178k44870q18249j049067p00955
14041h06857Q1935K76604j259408j676201k43216O91133J70421p15955j10273
14032c591817K586786J38946p99590j27763J278519M49098l85487r2827j341232
$$ y = [-1654875, -2246039, -767339, 278767, -110191, 1700355, 4299190, 5261963, 5060725, 3768908, 1620721, 700270, 787341, -872714, -977926, -90357, 441089, 723307, 1963309, 2645268, 3030732, 5112794, 5290191, 3277913, 1880402, 1548909, 1672821, 1226645, 235119, 795274, 1301924, 1425612, 1583079, 1922769, 1274184, 189970, -168711, 1553197, 2997981, 3101870, 2434893, 1530890, 1349559, 2124716, 2928307, 2641354, 2396642, 2709726, 2144184, 1620106, 2006284, 1761414, 943165, -105902, -806857, -724922, -448318, -1707726, -3383927, -3627143, -2936010, -2765589, -3481544, -3591817, -1005031, -866085, -1665675, -1793438, -514919, -65821, -451308, -544135, -1885367]
14023a885367m74164J116890J637205O66607o07412q54470P29473K240305K122911
14014D691978o2276q47792n76372M79946m33285j455157l138590j764879L89040
14005b717387J352303J560732J64530J90173L60074q22365j351310r31572O41124
13996a553698J838717M83400p46251n6509K52762n17632j10853K46720p57266
13987i20610q19204k21663O58157J808105J620396Q56935K03217k54485K07146
13978C137994j845541j893272N19340J268019J222365L55062l31232p2132J237000
13969C597603P99473j74331k79963j692765j775273p87434J58219J537647N36404
13960A919580o80635j493796j025060L75478M39587j01107L0944O78178R51411
$$ y = [-1885367, -2359531, -1242641, 394564, 1061171, 453759, -400711, 328762, 2569067, 4691978, 4629702, 3781910, 3205538, 3685484, 3252199, 1797042, -1341548, -3106427, -2717387, -1365084, 195648, 360178, 550351, 910425, 88060, -1263250, -2194822, -1553698, 285019, 768419, 22168, -34341, 218421, -299211, -410064, -163344, -920610, -1739814, -1961477, -1303320, 504785, 2125181, 2982116, 3185333, 2930848, 3137994, 1292453, -600819, -81479, 1186540, 2408905, 2763967, 2432735, 2360603, 3597603, 4397076, 4222745, 3942782, 2250017, 474744, -312690, -154471, 1383176, 1919580, 1238945, -254851, -1279911, -904433, -464846, -565953, -535009, 143169, 1094580]
13951A094580K57512o73709k021033j320854K19573J895629J103014j390415R9781
13942g35922Q99348Q48115K2265j82147L89769L35602K19027M70483P51370n42477
13932B475433j416505m62374M74847M91382q11460k38426M26290M00774j064602
13923B75359j647205l42550J122891J729974O79026r65234j820586r14414R05438
13914i77301N19469J37837J13590N79976K73593r81867N72575J753115R86341
13905B977328N75292P80566r5688n584J169547r950k510357k688550j517041q02082
13895b126519j033244j439169J99139K077523J444749P10090K56294j609028j554831
13886c074996M77278R97671J450674J015723K41461k68952q08055o83764r10034
$$ y = [1094580, 1352092, 678383, -1342650, -2663504, -2443931, -548302, 554712, -835703, -735922, 163426, 1011541, 1033806, 851659, 1241428, 1577030, 1796057, 2266540, 3017910, 2475433, 1058928, 596554, 1071401, 1562783, 751323, 512897, 939187, 1339961, 275359, -1371846, -1714396, -591505, 1138469, 1817495, 852261, -968325, -1882739, -977301, -457832, -319995, -206405, 373571, 647164, -334703, 237872, 1990987, 2977328, 3552620, 4333186, 4237498, 4231914, 5401461, 5391511, 2881154, 192604, -1324437, -2126519, -3159763, -4598932, -4399793, -2322270, -877521, -167431, 88863, -1520165, -3074996, -2597718, -1600047, -149373, 866350, 1107811, 838859, 30804, -652960, -1562994]
13877a562994j488682L87761K377585J233670L27493J26434p45902p75275q52063
13868i71973K12874J316641J086492q72898r23813j021665j490799k56847o05051
13859c527039j71565O85066P15889J905075L26651q81740K23228J050870J73500
13850D99935n38350q75779Q46141M94105K33969M06220N48927K47062l33339k17778
13840A311113P37007J134456O33856J87049k215853k262394j022054O19228Q91285
13831A3693q38334q06335m05244o09548J017746Q81434J039616N43255K70857
13822A107140J77007R8553o78525L14213J463735O89776o27345o70865m99569
13813A374120r31511j191345k24633k30114O99744J058368p98947k486084j374516
$$ y = [-1562994, -3051676, -2663915, -286330, 947340, 1274833, 1401267, 655365, -119910, -971973, -759099, 557542, 1644034, 771136, -152677, -1174342, -2665141, -2921988, -3527039, -3698604, -3013538, -2297649, -392574, -65923, -947663, -724435, 326435, 499935, -38415, -914194, -68053, 426052, 660021, 1066241, 1615168, 1862230, 1528891, 1311113, 2048120, 3182576, 3816432, 4003481, 1787628, -474766, -1496820, -877592, 13693, -824641, -1630976, -2036220, -2645768, -1628022, -746588, 293028, 836283, 1107140, 1284147, 1382700, 704175, 1018388, 2482123, 3171899, 2544554, 1873689, 1374120, 442609, -748736, -973369, -1203483, -503739, 554629, -244318, -2730402, -4104918]
13804d104918R08435K683753J083077l82236l31939p2241M899M45927L57546J148778
13794A741081Q96363r74737j61572j31511r35294j420041j061078n82223M74827
13785b154185l40734j850443q0225J356317j35729J009904J583133J77649N2663
13776c81650N90082l05481k08014n39525k31970L54318P5773p91450j686627k8501
13766c153045l27754J158976Q82635o72443r83371l71945O5895n12439l09492
13757d222983j0783K205967K181327N92547N46232L27083l19025k2406l14454
13748I63505q77687l07829J212439K113676K7308j196945r32310j564915R864
13739e52894n56555j915877j85150J994799K142940O65062n41645Q21636L48857
$$ y = [-4104918, -3196483, -512730, 570347, 188111, -143828, -216069, -211170, 234757, 592303, 1741081, 2637444, 1662707, 1501135, 1369624, 434330, -985711, -2046789, -2629012, -2154185, -2494919, -4345362, -4425587, -3069270, -3204999, -2195095, -611962, -434313, -381650, 208432, -97049, -305063, -844588, -1076558, -722240, -646467, -1437917, -3124544, -3153045, -3480799, -2321823, -1439188, -2111631, -3095002, -3466947, -3401052, -3913491, -4222983, -4233766, -2027799, 153528, 746075, 1292307, 1619390, 1300365, 1277959, 963505, 85818, -222011, 990428, 3104104, 3131412, 1934467, 1002157, -562758, -552894, -1109449, -3025326, -3210476, -1215677, 927263, 1592325, 1050680, 1872316, 2221173]
13730B221173J7438r3433l82787j436671j275068p18785J019693J056190J369885
13721A777635J356449M62818P51288P6541r43639j258786j175051O32814M67852
13712B147921j502267m77321J31350k39828M04725j9977m37316j11743J106968
13703A002512O43406J82406k18323j002570q67195K30368q4408q85759k53891
13694a253454R73483P30243k98902q4462j98379j54218j383218k24507R27529
13685i65885j002020j517027M5320J418289R38672k51971j29823J145466J492884
13676A173905o68876p62718q82806l41893L99640K507150L587852P35780j961611
13667C786423j798529j73491J77461o14789j832195j446129O66368J575766J038973
$$ y = [2221173, 2238611, 2145178, 1762391, 325720, -949348, -1668133, -648440, 407750, 1777635, 3134084, 3596902, 4348190, 4424731, 3481092, 2222306, 1047255, 1680069, 2147921, 645654, 168333, 299683, 59855, 464580, 444603, 7287, -104456, 1002512, 1645918, 1828324, 1610001, 607431, -259764, -29396, -113804, -999563, -1253454, -279971, 450272, 151370, 66908, -131471, -285689, -1668907, -1893414, -965885, -1967905, -3484932, -3439612, -2021323, -1082651, -1334622, -1464445, -318979, 1173905, 505029, -257689, -1140495, -1482388, -1082748, 1424402, 5012254, 5748034, 3786423, 1987894, 1814403, 1991864, 1377075, -455120, -1901249, -1234881, 340885, 1379858]
13658A379858J41641k39875j162072k298356k021570L55334K59233Q99429K094738
13649e91640K481758P48115p50708q10903k221464o24141K339695J893358J35006
13640B599076p98570n75313K34134j17188j216971k683808q76115K595368K106996
13631A267609L86839j004740N92239Q5581j091159k1653K42695K95848J746371
13622B499630J322009R17617o00438j441284j774019r08901r75725j151962R21793
13613a191280M86128k251240l009328J0991Q93131K208455J137221m59742K4645
13604b151019L61057m99065j260982j404381r16893J134431K116925J226223k86641
13595a680345K18931R63915N27388r5324r81909k051031q95286J709790J451832
$$ y = [1379858, 1521499, 1281624, 119552, -2178804, -4200374, -3845040, -3585807, -2686378, -591640, 1890118, 2638233, 1887525, 1076622, -1144842, -1768983, 570712, 2464070, 2599076, 1800506, 1225193, 1459327, 1342139, 125168, -2558640, -3434755, -839387, 1267609, 1654448, 649708, 1241947, 1327528, 236369, 214716, 457411, 753259, 2499630, 3821639, 4739256, 4138818, 2697534, 923515, 14614, -961111, -2113073, -1191280, -705152, -2956392, -5965720, -5954729, -5061598, -2853143, -1715922, -2175664, -2151019, -1789962, -2289027, -3550009, -4954390, -5871283, -4736852, -2619927, -1393704, -1680345, -1461414, -497499, 29889, -65435, -1047344, -3098375, -3993661, -2283871, -832039]
13586h32039P52140M24151O35598j028288k850340R8523J179938k03578j4913
13577a838808R40024J811517M84585j179173j098969o74062l97552M08030J78572
13568a365836l4801N33983O20877Q17875l19172j169204j764748K43324J029430
13559a408272q69021j714770P9512J686178K013222J515549k136546k839270j566401
13550e239819Q97529J218320k60182j032629o68032J173152J634271k07443M40392
13541b044441P93205J555189K332044J354664J06513l8431j73297j760616j158163
13532I66667J269510P65477J91178L0403j972456j850271M23928N41122J473506
13523A839064P1476k176661j562797Q09399P77105J99380p61501l86529R95575
$$ y = [-832039, -79899, 344252, 979850, -48438, -2898778, -2800255, -1620317, -1823895, -1838808, -898784, 912733, 1397318, 218145, -880824, -1554886, -1952438, -1544408, -1365836, -1400637, -866654, -245777, 572098, 252926, -916278, -2681026, -2437702, -1408272, -2277293, -3992063, -3912551, -2226373, -213151, 1302398, -834148, -3673418, -5239819, -4342290, -3123970, -3384152, -4416781, -5084813, -3911661, -2277390, -2484833, -2044441, -1251236, 303953, 2635997, 3990661, 4097174, 4058743, 3885446, 2124830, 966667, 2236177, 3001654, 3192832, 3223235, 1250779, -599492, -175564, 365558, 1839064, 1910540, -266121, -1828918, -1019519, -242414, -43034, -804535, -1191064, -195489]
13514a95489L28764l63535K69593J450507k76155r85662J9929M55225R52628N97405
13504B253210l619j249808k313296M07957N10935L2931j34580o48995P20284K242647
13494A817666J548136R08548Q80860k83350k588576j851718P14625J231356K8335
13485B405882k60126j240682r87695j150276o33985P57406J000022j65909j309585
13476a584948k424087j909002o29438J105694K962781K153744O01118P3726L59171
13467G08759M69267J49308l37245j76352o70090m74193J656284Q36207k301540
13458a39595k533052r26300q94061j220531M06397J988213J685268R16080N69735
13449a47846Q50958q59303K90759K59417j269617m25802r84755P29365J355510
$$ y = [-195489, 133275, -230260, 39333, 1489840, 1213685, 228023, 247952, 703177, 1655805, 2253210, 2249591, 999783, -1313513, -905556, -394621, -361690, -496270, -1145265, -424981, 1817666, 3365802, 4274350, 5155210, 4871860, 2283284, 431566, 1146191, 2377547, 2405882, 2145756, 905074, -82621, -1232897, -1866882, -1109476, -109454, -275363, -1584948, -4009035, -5918037, -6547475, -5441781, -2479000, -325256, 275862, 349588, 708759, 1178026, 1327334, 990089, 813737, 143647, -330546, 1325738, 2161945, -139595, -2672647, -3598947, -4493008, -5713539, -5307142, -3318929, -1633661, -717581, -147846, 703112, -156191, 134568, 393985, -875632, -1301434, -2286189, -1556824, -201314]
13440b01314m98494j489413j086684o19958q22486k42751j71850j58078K4892
13431e266136j02361r48131M85967K607609J802564J031190J569072J206469N97451
13422B983694o52871J72201Q9916j104498j818817j270573K40888j50232Q46354
13413f63938m56730o88369j62581M49232J363165J431075k066072j935114j29048
13404b858380K99553N99703J063876J112179j82896p10960N25436J056605l99536
13395E05580j267691o15167J235359J3947j408837k8598J106896J021642O46451
13386A209582M65123N49335M31476L72716q33790k900554j611080K85280M37294
13377a594618q75630j12190J234314J370024K59500o73587n88929J104097J747312
$$ y = [-201314, -699808, -2189221, -3275905, -3895863, -4718349, -4961100, -5132950, -5291028, -5266136, -5368497, -6316628, -5830661, -3223052, -1420488, -389298, 1179774, 2386243, 2983694, 2330823, 2503024, 2592940, 1488442, -330375, -1600948, -1360060, -1510292, -663938, -1120668, -1809037, -1971618, -1522386, -159221, 1271854, -794218, -2729332, -2858380, -2558827, -1959124, -895248, 216931, 34035, -676925, -151489, 905116, 505580, -762111, -1377278, -141919, -127972, -1536809, -1565407, -458511, 563131, 1209582, 1674705, 2224040, 2655516, 3028232, 2194442, -706112, -2317192, -2031912, -1594618, -2470248, -2582438, -1348124, 21900, 281400, -392187, -981116, 122981, 1870293]
13368A870293J095175j159617j858872j307873o88228L49725q77470p21024K090708
13359a207183L77950j824954j586156j267378l93236L84691n6706K73021Q97437
13350d402514J751033J253141p4627J31188J632931J818810k43322j150000J57102
13341H73742K80806n26078N89452p80651j242173J812000J732593j20159j237334
13332A382198Q1247P82887K13278N33762j181189j543783j160864j171472Q27063
13323a236873J201743j00987o16524O7919J824930N77750o6509Q20981J514267
13314C986697j341514j668669n77873m84006n24194O59885K058502k14415k65759
13305A628654L01534j89833j288603j116604n3293K86024O86728J288463J359332
$$ y = [1870293, 2965468, 1805851, -53021, -1360894, -2049122, -1699397, -2576867, -3297891, -1207183, -829233, -2654187, -4240343, -5507721, -5900957, -5516266, -5572972, -5299951, -4402514, -2651481, -1398340, -1472967, -1341779, 291152, 2109962, 1866640, 716640, 873742, 1154548, 628470, 1217922, 437271, -804902, 1007098, 2739691, 2619532, 1382198, 1463445, 2246332, 2459610, 2993372, 1812183, 268400, -892464, -2063936, -1236873, -35130, -136117, -752641, -684722, 1140208, 1717958, 1651449, 2472430, 3986697, 2645183, 976514, 398641, -85365, -609559, 50326, 2108828, 1894413, 1628654, 1930188, 1740355, 451752, -664852, -718145, -432121, 254607, 1543070, 2902402]
13296B902402n28371N36081J091170J72843r08366j207656o72435j928616n78868
13287a121816k09064j052845P65083Q21322l30504J27010K53577N88075M24175
13278B65013J241809J260500j04054j75385R147m46260k94656k0906j074545p14360
13268e3697j02667K23062k51862k77949j005140O538L64564O21194O35090j364832
13258a205699j855838L52452K81395r58345K12153N06543L7389J155835J411515
13249f2600Q4625K78253K3947n05766m01148j471809l95805J181911J117900N77007
13239D26515N04625O46175R6231K18877r66016q71640K57620J440930J168348
13230B921665l5315K4809N76918m7560j713443j070151k151405j421768K672517
$$ y = [2902402, 2374031, 2910112, 4001282, 4174125, 3265759, 2058103, 1385668, -542948, -1121816, -1330880, -2383725, -1618642, -797320, -1127824, -1000814, -747237, -159162, 265013, 1506822, 2767322, 2663268, 2487883, 2497030, 2050770, 1756114, 1735208, 660663, -53697, -156364, 66698, -185164, -463113, -1468253, -1461715, -1097151, -475957, 159133, -1205699, -3061537, -2709085, -2427690, -3386035, -3173882, -2667339, -2629950, -1474115, -62600, 22025, 300278, 324225, -181541, -582689, -2054498, -2450303, -1268392, -150492, 426515, 931140, 1577315, 1673546, 1892423, 926407, 54767, 312387, 1753317, 2921665, 2886350, 2911159, 3488077, 3440517, 1727074, 656923, -1494482, -2916250, -243733]
13221b43733J534411n2833K78614M76360l82443o37296j041672j410943m23073
13212a902608N03528Q20680Q4841q28192j30078K144888J459051J108153K94922
13203C555185j394655j090527q19200j17718Q15189J015941m32724p77591l60711
13194C93189o35738p12583r60006j027998p09522N70131J375136L1682l28912
13185b004621P99179j281178j851626K2178Q68649J71066P45434K067440K310269
13176A846790N47379n57693O48909J307388K39147j823816j939156j151O26184
13167H93981r26138j239336L18240M46736M76248R7937N28068J106793P47214
13158B449743p16201q71230n47738p99137m2570J684619K025444M76077j463011
$$ y = [-243733, 1290678, 1237845, 1516459, 1992819, 1610376, 973080, -68592, -1479535, -1902608, -1399080, -578400, -493559, -1321751, -1451829, 693059, 2152110, 3260263, 3555185, 2160530, 1070003, 250803, 133085, 948274, 1964215, 1531491, 753900, 393189, -242549, -955132, -1915138, -2943136, -3652658, -3082527, -1707391, -1675709, -2004621, -1205442, -2486620, -4338246, -4316068, -3447419, -3276353, -2530919, -463479, 1846790, 2394169, 1836476, 2485385, 3792773, 4031920, 2208104, 268948, 267797, 893981, -32157, -1271493, -953253, -506517, -30269, 67668, 595736, 1702529, 2449743, 1733542, 862312, 314574, -484563, -527133, 1157486, 3182930, 3659007, 2195996]
13149B195996j986145o31077R86627L27909j0717n72232p02163R5000J141334
13140H44532k30109L38840J068295O65923L30453r8466K55920j522194q82622
13131G70572R10985K30672J88211P85454o70730k075489j220602J528599J805050
13122B252722o99742l28836N7157K65885q5711k00290J43893j38420L13418J67362
13112A747438j007126j961700o11222J673462J743197q2138j323781o46049J185250
13103G17331J802298Q92831J708830N83910l33551o57708j227665m72815j72439
13094B841022r89605k341494j353992q0092O13801j00292K85760m25448O00984
13085i49356J205312P794J458462J677544r6960j331926j692452j219675N57415
$$ y = [2195996, 209851, -421226, 565401, 893310, 882593, 310361, -391802, -296802, 844532, 614423, 953263, 2021558, 2687481, 3017934, 2919468, 3175388, 1653194, 770572, 1681557, 1912229, 2100440, 2885894, 2215164, 139675, -1080927, 447672, 2252722, 1552980, 1224144, 1281301, 1547186, 1461475, 1261185, 1405078, 1266658, 1580076, 1747438, 740312, -1221388, -1832610, -159148, 1584049, 1501911, 178130, -467919, 717331, 2519629, 3412460, 5121290, 5705200, 5371649, 4713941, 3486276, 3013461, 2841022, 1851417, -490077, -1844069, -1924161, -1310360, -1410652, -1124892, -1550340, -949356, 255956, 263750, 1722212, 3399756, 3302796, 1970870, 278418, -941257, -383842]
13076c83842J158894Q10542J92193K61082o857L18045P41757m40166q99742o67091
13066A084815R23973K67223q45638j232896J36743J352442Q95620o26180l50740
13057A605362K93164m19012L39600N79349J08643J404780J336878l91986p3898
13048D782880J199548Q26861j61492r91048L33934O26346k40625n23390L83239
13039F236253J72458n19834N0981l93951p52601r93699o67077p6988j138821j197983
13029G18738k67291J380932J554931R43230l48467r7970l85973J0761l09541j05642
13019C093708J829668J039762q4617J522286K32645r82737p90282k94451k497
13010E563485O88838J740852J486653l69329o97993Q67454O20567j046192j206626
$$ y = [-383842, 775052, 1585594, 1777787, 2038869, 2032012, 2350057, 3091814, 2651648, 1751906, 1084815, 2008788, 2276011, 1430373, 197477, 334220, 1686662, 2582282, 1956102, 1605362, 1898526, 1479514, 1819114, 2398463, 2507106, 3911886, 5248764, 4856778, 4782880, 5982428, 6809289, 6647797, 5656749, 5990683, 6617029, 6376404, 5853014, 6236253, 6408711, 5888877, 5939858, 5545907, 4793306, 3799607, 3132530, 3055542, 1916721, 718738, 451447, 1832379, 3387310, 4330540, 3982073, 3884103, 3498130, 3508891, 3199350, 3093708, 4923376, 5963138, 5878521, 7400807, 7633452, 6650715, 5860433, 5565982, 5563485, 6252323, 7993175, 9479828, 9110499, 8412506, 9279960, 9900527, 8854335, 7647709]
13001G647709p30379K26011R95850J094674K086952J600206R50094J113992N01278
12992A5486387O35678M44182l30601Q58394K133785K999402L357191M219185O275441
12983C6079044O846179P679898J0170408J5872366K0441423K5564905L5381798
12976A58036021N0512145O5265262P1022697M6832965n168987n0138292o5388230
12969B70973581n7949291m4875528l4479790k5019111j8335545j4707102r828718
12962F5778496q532646q079725o756363n364897n001751m124738k701227j835963
12954B3381186j354578r9149N31536j743035k357932j693000j236871q9058N42679
12945A5881778R17031l36756k202165j255861p2511K48965r76050k097262k096637
$$ y = [7647709, 6917330, 7143341, 8139191, 9233865, 11320817, 12921023, 13871117, 14985109, 15486387, 16122065, 16566247, 16235646, 17094040, 19227825, 22227227, 25584418, 29803603, 36079044, 42925223, 50605121, 60775529, 76647895, 97089318, 122654223, 158036021, 208548166, 273813428, 344836125, 391669090, 386500103, 336361811, 270973581, 213024290, 168148762, 133668972, 108649861, 90314316, 75607214, 65778496, 57245850, 49166125, 42409762, 37044865, 32043114, 27918376, 25217149, 23381186, 22026608, 21927459, 22458995, 20715960, 18358028, 16665028, 15428157, 15339099, 15881778, 16798809, 16462053, 14259888, 13004027, 12931516, 13180481, 12204431, 10107169, 8010532]
12936H010532j121026J102374J704720o99011j585381J39055q5965N1465l2638
12927G484125q0441J069600Q48772q0911P61473J697839L416699L453874L312994
12918B1884024O868420J0765702J2979509J5374219J6219030K186639j5663271
12911G0614272j6136450j0929555p701107n417807l080477k106417j048007m45081
12903B3749371J009592O44594Q48900K536607K263071L236745M314456N908477
12895D4511813R247689J1378750J4929785K1685070K9795452M1463948N6470177
12888B29482684P0051591O8167407L3707616k2865190o1570847o6418558n3604617
12881A96950086l9712995k9842241k3403253j7893928j2818846j0085530o891967
$$ y = [8010532, 6889506, 7991880, 9696600, 8997589, 7412208, 7551263, 7465298, 7516763, 7484125, 7403684, 8473284, 9322056, 9241145, 10002618, 11700457, 15117156, 18571030, 21884024, 28752444, 39518146, 52497655, 67871874, 84090904, 86277543, 70614272, 54477822, 43548267, 35847160, 30429353, 27348876, 25242459, 24194452, 23749371, 24758963, 25403557, 26252457, 28789064, 31052135, 34288880, 38603336, 44511813, 53759502, 65138252, 80068037, 101753107, 131548559, 173012507, 229482684, 299534275, 367701682, 401409298, 378544108, 316973261, 250554703, 196950086, 157237091, 127394850, 103991597, 86097669, 73278823, 63193293, 56301326]
12874E6301326o007176n231611n504905m882517l574250k755900k792305k462710
12866B3089952n44833M02464r68103k745988k990692O24383J172227o97522k100140
12857A5241748j472018j053532j052556r67645r82010k768417j622806P73456
12849F096220R64292m3022p43020j100102p17271n99489J51953J255123J576660
12840F841344Q09224Q1592l82460J00938J197814J060400J73728n67035q30522
12831H485023m05062j69348n85513L24983j10227K6024J397457R63600j82259
12822I744678J526501J383449P26529K57436K38586L94258J758490K833604K575002
12813B1438533L544139N960737N967407N879805O030228O784052J0877108J7824252
$$ y = [56301326, 50294150, 45062539, 39557634, 34675117, 31100867, 28344967, 25552662, 23089952, 22545119, 22947583, 21979480, 19233492, 16242800, 16867183, 18039410, 17341888, 15241748, 13769730, 12716198, 11663642, 10695997, 9713987, 6945570, 5322764, 6096220, 7060512, 7017490, 6274470, 5174368, 4457097, 3857608, 4009561, 5264684, 6841344, 7650568, 7732160, 7349700, 7450638, 8648452, 9708852, 9882580, 9315545, 8485023, 8079961, 7910613, 7325100, 7650083, 7539856, 7565880, 8963337, 9926937, 9744678, 11271179, 12654628, 13381157, 13638593, 13877179, 14271437, 16029927, 18863531, 21438533, 24982672, 30943409, 36910816, 42790621, 48820849, 55604901, 66482009, 84306261]
12805H4306261K4553612L3074009M5733133O0557358P1215042O0213186J5860380
12798C95512981l7098172o2844505o2543961m9466588l6704531k8618901k1500141
12791I6736182j6285956j2489939j0270720q089224n547558l080568m632866n680512
12783C0658839m471678m050254k779549j490589j964649p71542L28346q34044
12775A4624880k455632j637325r27140j336697j572293R40860J953985p88963
12767H801675j506210j338404k014329j367381j246023j331793j670930j7118
12759a690513K444782L395796K450035J71503l04261p99510j259304j506001k024544
12750H77983R51209J602373k065228j459355Q0060J471388j77075j765087j133035
$$ y = [84306261, 108859873, 141933882, 187667015, 248224373, 319439415, 379652601, 395512981, 358414809, 295570304, 233026343, 183559755, 146855224, 118236323, 96736182, 80450226, 67960287, 57689567, 49600343, 44052785, 40972217, 36339351, 30658839, 26187161, 22136907, 19357358, 17866769, 15902120, 15130578, 15458924, 14624880, 12169248, 10531923, 9604783, 8268086, 6695793, 7636653, 9590638, 8801675, 7295465, 5957061, 3942732, 2575351, 1329328, -2465, -1673395, -1690513, 754269, 4150065, 6600100, 6771603, 6467342, 5667832, 4408528, 2902527, 877983, 1829192, 3431565, 1366337, -93018, -12958, 1458430, 1281355, -483732, -1616767]
12741a616767P61708L97453K24384J720442J576576m6340J200242J277771p24780
12732D770689j803365r13943n26148q60649O2143K64915L81218m77086m74074
12723D23700J198336M67500k27695Q26687O51507Q82122R97631j335480j529420
12714B354888j132925r33947n64204j437175n33187J805564K686644J183428j31099
12705C297987k64982k20651M03426J793664J065640j04950r48884j363175n87166
12696C070909J82253K42614m15415l54766r9712l92119j39042j20760k53741p906
12686A712315j52849J81187o99207P55742K115172L6975k178260j360948N38662
12677I48789Q8398J292902J937534l5853j005418j098518m22320m04653r57766
$$ y = [-1616767, -855059, -457606, -233222, 1487220, 3063796, 3017456, 4217698, 5495469, 4770689, 2967324, 2053381, 1527233, 666584, 728727, 993642, 1374860, 897774, 423700, 1622036, 2089536, 1861841, 2688528, 3340035, 4222157, 5219788, 3884308, 2354888, 1221963, 288016, -276188, -1713363, -2246550, -440986, 2245658, 3429086, 3297987, 3033005, 2812354, 3215780, 5009444, 6075084, 5970134, 5021250, 3658075, 3070909, 3253162, 3495776, 3080361, 2725595, 2625883, 2233764, 2094722, 1973962, 1720221, 1712315, 1559466, 1740653, 1041446, 1797188, 3912360, 3949335, 1771075, 410127, 948789, 1037187, 2330089, 4267623, 4231770, 3226352, 2127834, 1705514, 1300861, 343095]
12668C43095j066859q07230J81218j74063n29237j78271q9705o7962J493978K660801
12658A765765R36213j238526j380869K38928L29407j3029J36405L33368J573938
12649B681600j190411l432008j274382J78866J127961J785116J551526J216729
12641B644997O81053J87393l42784j470336o51954K53717r17779j95999k04863
12632a6555J451565K324545P41029m71322P4523m1350o2650m92455j09761K025973
12622E423542k9528k133267j531840K44709P42147j12858j245368j612747k97117
12613e52327n1809J97161N07309P83396N17698j075428j632502n21720N03351
12604a324871j40668m57512k97549n87369J515000K698928J007260n41475o89886
$$ y = [343095, -723764, -1530994, -1349776, -1523839, -2053076, -2231347, -2321052, -2389014, -895036, 1765765, 2701978, 1463452, 82583, 321511, 650918, 637889, 774294, 1107662, 2681600, 1491189, -1940819, -3215201, -3036335, -1908374, -123258, 1428268, 2644997, 3326050, 3513443, 3170659, 1700323, 1048369, 1302086, 384307, 188308, -16555, 1435010, 3759555, 4500584, 4029262, 4103785, 4062435, 3999785, 3507330, 3397569, 5423542, 5394014, 3260747, 1728907, 1973616, 2715763, 2602905, 1357537, -255210, -552327, -604136, -406975, 100334, 883730, 1401428, 326000, -1306502, -1828222, -1324871, -1465539, -1923051, -2220600, -2807969, -1292969, 1405959, 2413219, 1871744, 1181858]
12595A181858r38672j063251k239666q09703K243109J203730j181894q54073N32711
12586a925851K036483J633440k85020j739754k525583r36779J612698J288346
12578h42020M4154P69826K10269j47817R74256N95225m25805p86014m19047k87885
12568c14858P19477M14048l85172l30853K97006P09814j01566l12703L87413K17120
12558A299726O03027K81154j502968j041364m63780J502J856344K037082O33946
12549C704669j083188r6604n83754j592483N10862L69524J33018m32078j843781
12540i13815j392111k76489O98633J068153o2635J3138J113957O78936J09709
12531A037476O07618q6201j363127p86514L40866Q63444P94947J394226J217201
$$ y = [1181858, 243186, -820065, -3059731, -3869434, -1626325, -422595, -1604489, -2458562, -1925851, 110632, 1744072, 1459052, -280702, -2806285, -3743064, -2130366, -842020, -797866, -28040, 182229, 34412, 1008668, 1603893, 1178088, 392074, -26973, -314858, 404619, 818667, 433495, 102642, 399648, 1109462, 1007896, 695193, 1082606, 1299726, 1902753, 2183907, 680939, -360425, -824205, -822703, 1033641, 3070723, 3704669, 2621481, 2524877, 1941123, 348640, 859502, 1229026, 1362044, 929966, -913815, -2305926, -2582415, -1883782, -815629, -878264, -865126, 248831, 927767, 1037476, 1645094, 1558893, 195766, -590748, -249882, 613562, 1408509, 2802735, 4019936]
12522D019936m45830k076173k386003o36251P16426l19877j063537m35972L07365
12513b319916R32151J184870l92544j742716m22042R43971J013849N55316Q13240
12504E66179L31601J10181L80386N19366P74249L27172n20178n03053j416145
12495E69758j142449o5602K227308J695920j432632k895156j762993J219814J30912
12486a455120m91676J599714J211247l47094k8031k13090j48530m32537j76096
12477d81213R34199J41548j155296r8732J320977K80302r01930l49505q34050
12468a143700K84911M15347j41008M03984j05843n16324j278147m93181J288940
12459a285021J816164L51900M5224J241090q47585j920023j262149J04018J258859
$$ y = [4019936, 3574106, 1497933, -888070, -1524321, -807895, -1127772, -2191309, -2627281, -2319916, -1387765, -202895, -595439, -2338155, -2760197, -1816226, -802377, -247061, 566179, 897780, 1007961, 1388347, 1907713, 2681962, 3009134, 2488956, 1985903, 569758, -572691, -638293, 1589015, 3284935, 1852303, -1042853, -2805846, -1586032, -1455120, -1946796, -347082, 864165, 517071, 489040, 275950, 127420, -305117, -481213, 452986, 594534, -560762, -659494, 661483, 941785, 39855, -309650, -1143700, -858789, -443442, -584450, -180466, -286309, -802633, -2080780, -2573961, -1285021, 531143, 883043, 928267, 2169357, 1321772, -598251, -1860400, -1756382, -497523]
12450d97523K09384j64748K17825J187171J038148O49550O75176j920106k790777
12441a395900j253726p3456R39277K09398Q17958Q51760n67215j935397j339517
12432c746818K646047K943702J5083j309787k339051l74330M12103j27978N18429
12423a362600J232173Q58722p69843j671696J92349R40693l64682N41237J420199
12414A016552O20254q53338m29222j65064m93772j34984m32025j686075k2478
12405b580152J782827n72646m37383Q00910O10773J283500R36497k59783P2145
12396A636688j027540j532808o37313j93509k56000m55405R03773Q66755q4772
12387g80131n30624m54298L24303q7647j84047k17803O44145k5964j216049j77031
$$ y = [-497523, -288139, -452887, -235062, 952109, 1990257, 2639807, 3314983, 1394877, -1395900, -2649626, -2723082, -1783805, -1574407, -756449, 95311, -471904, -2407301, -3746818, -1100771, 1842931, 1858014, 548227, -1790824, -2165154, -1753051, -1881029, -1362600, -130427, 728295, -41548, -1713244, -1520895, -580202, -944884, -403647, 1016552, 1636806, 783468, 354246, 189182, -304590, -439574, -871599, -2557674, -2580152, -797325, -1369971, -1807354, -1006444, -395671, 887829, 1824326, 1564543, 1636688, 609148, -923660, -1560973, -1754482, -2010482, -2465887, -1562114, -695359, -780131, -1310755, -1765053, -1440750, -1528397, -1712444, -1930247, -1286102, -1312066, -2528115, -2705146]
12377b705146j85319o32544J82333N33544m17059j38442J351214K474642J233375
12368A696598j143170k130316k354972l85844J211232J181248O98513p49430O14004
12359a362137J220859K40772M10180Q65672m2890j177116L42202O01980j221823
12350a22301j274470p48153o64115N31024k23864r35751o62441J68389N12708
12341c418974J181565R14594L85107L00694k28072j089847j25348O6043M7495
12332a966743M31328K470k62968K38039K39098Q92782J699277n52586j519736
12323g99039m95608P94150J752466K96555j496117j245708K0195K024195K459044
12314C310133Q67867o89806j409650p71237r15880r77342L60245m18717p50305
$$ y = [-2705146, -2890465, -3523009, -3340676, -2807132, -3224191, -3362633, -2011419, 463223, 1696598, 553428, -1576888, -3931860, -4317704, -3106472, -1925224, -1226711, -1976141, -1362137, -141278, 99494, 509674, 1375346, 1332456, 155340, 497542, 1099522, -122301, -1396771, -2144924, -2809039, -2278015, -2501879, -3437630, -4100071, -3931682, -3418974, -2237409, -1322815, -937708, -637014, -865086, -1954933, -2080281, -2014238, -1966743, -1535415, -1532945, -1795913, -1557874, -1318776, -425994, 1273283, 720697, -799039, -1294647, -500497, 1251969, 1548524, 52407, -1193301, -1173106, 851089, 3310133, 4178000, 3488194, 2078544, 1307307, 391427, -585915, -225670, -644387, -1394692]
12305a394692J190470J481985J097786M93352m32742l10744P8775p49165m11734
12296A043291P20926p76453k807591j484948J015998Q82048P17602M17488k52962
12287e24601o34305k47077P34773J552165J373964K1536N56378j30502j023000
12278A679331q45718k40598q36290j548459k19241J04518o20963j04949j574560
12269d206929k21781Q37684j103733L63786J471671L21081k37144K88645N87892
12260a898828J441764J826193N00946j121903J42388Q87706j151947o94092K66068
12251A98295M49063K78096l20470m78198p06854j37497M6697O57857K01344P3209
12241B61542j124397j749602j110942J69430J702186J94345q32198P09116J425570
$$ y = [-1394692, -204222, 1277763, 2375549, 2868901, 2436159, 2125415, 2204190, 1455025, 1043291, 1764217, 987764, -1819827, -3304775, -2288777, -1406729, -689127, -271639, -524601, -1158906, -1405983, -671210, 880955, 2254919, 2276455, 2832833, 2702331, 1679331, 833613, 593015, -243275, -1791734, -2010975, -1906457, -2527420, -2632369, -4206929, -4428710, -3591026, -4694759, -4330973, -2859302, -2538221, -2775365, -2486720, -1898828, -457064, 1369129, 1870075, 748172, 890560, 1778266, 626319, -67773, 198295, 647358, 925454, 604984, 126786, -580068, -717565, -670868, -13011, 188333, 261542, -862855, -2612457, -3723399, -3553969, -1851783, -1657438, -2489636, -1780520, -354950]
12232c54950N69313n14783l49097N77120P87763j424623N04879K872431J688669
12223D356722k70058j298095o85327j211825q32928J59996r21240j086288J076459
12214g12584J303404J197970K04913k44475n89521j270575j1502N83849J670087
12205B131566N89243k27018J600459J159537k182359k926782j679193n68285l25409
12196b428241q37680J5776O40259r74346o22949J584440O48994j341509j466276
12187d781532N00537Q85037m67665j039468K84512N16748N83627J096587J112537
12178a309080J258756q18430q99873m85425Q78203P6897l19395J34004N30122
12169i54221L18834q2755J45391m74870O03169L47433m49386j430214j365672
$$ y = [-354950, 214363, -300420, -649517, -72397, 715366, -709257, -204378, 2668053, 4356722, 4086664, 2788569, 2103242, 891417, 58489, 218485, -702755, -1789043, -712584, 590820, 1788790, 1993703, 1749228, 1159707, -110868, -122370, 461479, 2131566, 2720809, 2493791, 4094250, 5253787, 3071428, 144646, -1534547, -2102832, -2428241, -3265921, -3250145, -2609886, -3584232, -4207181, -2622741, -1973747, -3315256, -4781532, -4280995, -3395958, -3863623, -4903091, -4618579, -4101831, -3518204, -2421617, -1309080, -50324, -868754, -1768627, -2254052, -1375849, -1298952, -1618347, -1484343, -954221, -635387, -718142, -572751, -1047621, -444452, -97019, -546405, -1976619, -3342291]
12160c342291Q17073K362189K108792L21559q50912k18929k1817Q401J098176
12151B282241N07307m76773M01075m52471j313544j645141p67173r24818j084337
12142c473634o30219R88437K039796O23440L76011J666650R3973j593518j474399
12133a383463o4610J335685J050013M9916m99194m95185j083602k543264p22179
12124d355883J332029K474527J951646p10681j983333L26091J832335M54860P26604
12115B048195N61881P56951P45597m90712j722706j297635J125218L58151o74702
12106A410238l99966R2147L06285k024J329571L692242L979355j404667n087459
12097C915722l332021j013579r93756K09609L6214P82798R33879k89027n80422
$$ y = [-3342291, -2525218, -163029, 1945763, 2267322, 1416410, 1197481, 1175664, 1184065, 2282241, 2789548, 2312775, 2713850, 2261379, 947835, -697306, -1464479, -2389297, -3473634, -4103853, -3115416, -1075620, -452180, -76169, 1590481, 1684454, 90936, -1383463, -1448073, -112388, 937625, 987541, 488347, -6838, -1090440, -3633704, -4355883, -3023854, -549327, 1402319, 691638, -1291695, -965604, 866731, 1321591, 2048195, 2610076, 3367027, 4112624, 3621912, 1899206, 601571, 1726789, 2084940, 1410238, 1010272, 1102419, 1408704, 1406680, 2736251, 6428493, 10407848, 9003181, 3915722, 583701, -429878, -1423634, -1214025, -1177811, -395013, 538866, 249839, -330583]
12088c30583R96862J170487J16714j66843p17719o3691k364j61059L58949L71611
12078A572364l63098j69456l50346l74875k53436j117958p10641K64304M35687
12069a067455K75359N85196k95064O97373J028037r85248P14798K450375K044134
12060E447505N03071j307260k556757l051939m83929K32743l17178O70443r18829
12051a782130j789181n95766J320433J516653O9094j181354O93180J438575J218264
12042I07768Q85652P2798j41354r08386J708M40366R11686j4873j440845l12161
12032D02359Q63190p461j73862m92587Q02162Q19452M63022O05184k45868r62243
12022B073348k079849j388330J118655R64612N03211J87754l48455K77425J582108
$$ y = [-330583, 666279, 1836766, 1953480, 1786637, 1068918, 1005227, 1002863, 841804, 1200753, 1572364, 1209266, 1039810, 689464, 314589, 61153, -1056805, -1767446, -1503142, -1067455, -792096, -206900, -501964, 195409, 1223446, 238198, 952996, 3403371, 5447505, 5950576, 4643316, 2086559, -965380, -1449309, -1216566, -1533744, -863301, -1782130, -3571311, -4167077, -2846644, -1329991, -1260897, -2442251, -1749071, -310496, 907768, 1793420, 1866218, 1724864, 816478, 818186, 1258552, 2170238, 2155365, 714520, 402359, 1265549, 1258088, 1084226, 591639, 1393801, 2213253, 2676275, 3281459, 3035591, 2073348, -6501, -1394831, -276176, 688436, 1191647, 1379401, 1030946, 1308371, 2890479]
12013B890479R07332J680176P38622q80708k112027o72986K56966J65422L60633
12004C333909q6649n05463n52614o1510r29530j833384j920013q37138O33017
11995b759375J280562O67806L54240N22265O65531R15753N27503l69839J69272
11986A973718o01069j595321M98720R90485K1068J201389J398159M97075k25000
11977D159224j510491j784468O29943K14007m07413j236328j360602n71181l8423
11968a905732J179583O05234n89907j931411j868754M3961N35108J19869R53828
11959b858221Q11560n41585j138328l6719J435061J280926N24115j1827M97421
11950c7597K95493J035664M40371o68359R07744J582660j085120k299495k022934
$$ y = [2890479, 3797811, 5477987, 6216609, 5335901, 3223874, 2550888, 2807854, 2973276, 3333909, 3247260, 2741797, 2189183, 2127673, 1198143, -635241, -2555254, -3392392, -2759375, -1478813, -811007, -456767, 65498, 731029, 1646782, 2174285, 1804446, 1973718, 1372649, -222672, 276048, 1266533, 1287601, 2488990, 3887149, 4384224, 4159224, 2648733, 864265, 1494208, 1708215, 1300802, 64474, -1296128, -1867309, -1905732, -726149, -120915, -710822, -2642233, -4510987, -4467026, -3931918, -3812049, -2858221, -2046661, -2588246, -3726574, -3763293, -2328232, -1047306, -523191, -535018, -37597, 257896, 1293560, 1733931, 1065572, 1973316, 3555976, 2470856, 171361, -1851573]
11941a851573j227408n10055L28136K779608K542795k54246r28725m21441j733916
11932a276825j824267j396922j989955j419283l2252J663765K267556l16118r98129
11923e322430m49243J076175K934200J402703j223709j786005J82753J488744
11915a696812J509726K677300J579525m47314j799563j201644M6646n02620j293187
11906a127943j25246M54504P59824K317310K738027K547759q43669m046915l233840
11897e60189j727113r6764L274235K331891j961402o34851J865299J054533j21761
11888C423878r34199l91474r7153J708186N66894j612212m10375J007735n70829
11879B690451k42220q17162n33637p41710l72378L53837R46699P89505l34101
$$ y = [-1851573, -3078981, -3589036, -3260900, -481292, 2061503, 1807257, 878532, 457091, -1276825, -3101092, -4498014, -6487969, -7907252, -7939504, -6275739, -4008183, -4324301, -5322430, -5771673, -4695498, -1761298, -358595, -1582304, -3368309, -3185556, -1696812, -187086, 2490214, 4069739, 3622425, 1822862, 621218, 667864, 165244, -1127943, -1253189, -798685, -38861, 2278449, 5016476, 7564235, 6720566, 2673651, -560189, -2287302, -2384066, 890169, 3222060, 1260658, 625807, 2491106, 3545639, 3423878, 2489679, 2098205, 2001052, 3709238, 4276132, 2663920, 2253545, 3261280, 2690451, 2448231, 1631069, 1097432, 355722, -16656, 337181, 1283880, 2073385, 1739284]
11870A739284q04763j186359o23704R84199R25781k67670j656010j042307k01060
11861b132609J92174J615691J061703L71570K21744L99000r50821j784280M97417
11852e08411K305019K640638J38238r87890q70721j015164j184884j973562p81103
11843b237840q37631j338149j49380J361697J905073J898687J409624q68125j446464
11834c02508o92414O51835J337288M946p02038n48790P21158K015961J141137
11825C626575k53196j73355M74956j269262k211969j76137P7638p0888n83179
11816e58817p81831o40606L1424J323070J763970J923169J745546M19552j505237
11807C720240j397010l72299l38584l89558O88511p512m14239j52555L15778P17669
$$ y = [1739284, 934521, -251838, -875542, 108657, 1034438, 766768, -889242, -1931549, -2132609, -1940435, -324744, 736959, 1108529, 1330273, 1729273, 778452, -1005828, -508411, 1796608, 4437246, 4575484, 3587594, 2716873, 1701709, 516825, -1456737, -2237840, -3075471, -4413620, -4563000, -3201303, -1296230, 602457, 2012081, 1143956, -302508, -994922, -343087, 994201, 999147, 297109, -251681, 469477, 2485438, 3626575, 3373379, 3200024, 3674980, 2405718, 193749, 17612, 95250, 24362, -558817, -1340648, -1981254, -1949830, -626760, 1137210, 3060379, 4805925, 5225477, 3720240, 2323230, 1950931, 1612347, 1222789, 1911300, 1903788, 1489549, 1336994, 1652772, 2370441]
11797B370441R60132q60561k198300k02855j29348K40975J176508N33628o30047
11788A260573r26738j350307j590609p17815K29597P66207J951792K243662N86905
11779B453267M13278K73388j177452k291986k194975k80716N92046M70925Q56614
11770h85611P92545q22647l61069M00979O8111j108743n20347j216604r61467
11761d614853O51383J585365R46645L33959O49408K03460L20212m91914J84952
11752b31383K38398l96392m36137j72554P65440J063022q39348k025677k85405
11743b320036Q59204R51039J49084M48572R83960M5991j203046o48314j552453
11734b285999j724770q96419Q27391J107593l80745r86477J69837J191055K241771
$$ y = [2370441, 3330573, 2470012, 271712, 68857, -60491, 180484, 1356992, 1890620, 1260573, 333835, -1016472, -2607081, -3324896, -3095299, -2329092, -377300, 1866362, 2453267, 2866545, 3139933, 1962481, -329505, -2524480, -2805196, -2213150, -1742225, -885611, -93066, -915713, -1276782, -875803, -807692, -1916435, -2436782, -3653386, -4614853, -3963470, -2378105, -1431460, -1097501, -448093, -244633, 75579, -416335, -231383, 7015, -389377, -825514, -998068, -232628, 830394, -8954, -2034631, -2320036, -1460832, -509793, -360709, 87863, 1071823, 1117814, -85232, -733546, -2285999, -4010769, -4907188, -4079797, -2972204, -3352949, -4339426, -4169589, -2978534, -736763]
11725g36763J846962L63918l96255l02775P27365M33073O23719O71481M62723
11716C693448j037072j043847N2463M65062K35993J12462k280012j652764K01839
11707a252428K419185L759760K817559j077027l243040k00957l18513r54481n95848
11698A354210J498093O97278r94841P64475R45362j329372k007776r69438O98800
11689F56791L05313j246422j395991N75072J707514N69863j623696j026175j667383
11680c145114r61626J185074J520498L21877J30647M23341P75506j28725n33444
11671d11966j75993k006141j484412l77742l22193K570108K557839r57745j400613
11662b008858L07587R34410O01825M98213l84053j275915J73287l59712j946364
$$ y = [-736763, 1110199, 1474117, 1077862, 775087, 1502452, 1935525, 2559244, 3230725, 3693448, 2656376, 1612529, 1664992, 2130054, 2366047, 2478509, 198497, -1454267, -1252428, 1166757, 4926517, 7744076, 6667049, 3424009, 3223052, 2904539, 1950058, 1354210, 2852303, 3549581, 2554740, 3319215, 4264577, 2935205, 927429, -42009, 656791, 962104, -284318, -1680309, -1105237, 602277, 1172140, -451556, -1477731, -3145114, -4106740, -2921666, -1401168, -1079291, -948644, -525303, 250203, 121478, -411966, -587959, -2594100, -4078512, -4456254, -4778447, -2208339, 349500, -608245, -2008858, -1701271, -766861, -165036, 333177, -50876, -1326791, -1153504, -1513216, -3459580]
11653c459580M84633K539774J344400n70125L34181K21794o25120k392801n8532
11644b181376J533208p0676R2002n88133j331494K39043q81574j411704m93336
11635e094040J749241J853302K94008N5619J4648N01367R99368Q14801R04053
11626B092367P56312j321528q61681J8105j7967L76075j44731r78615p50113N33914
11616b97862J447438K00635j160531j501588j157631m44649M31076P36830P83464
11607i62818K45005k21384k98236K78574J934073M33015r64682q29866M18334
11598C2015p81041j190799q17136M68568R91815q6306j082812r57955j54496P00810
11588b877337J414270L52972n4149J34355Q54748J307256K76565l70547P49734
$$ y = [-3459580, -2974947, -435173, 909227, 339102, 673283, 895077, 269957, -2122844, -2181376, -648168, -718844, -626842, -1214975, -2546469, -2307426, -3189000, -4600704, -5094040, -3344799, -1491497, -1197489, -1141870, -1127222, -625855, 373513, 1188314, 2092367, 2848679, 1527151, 665470, 683575, 665608, 1041683, 896952, -81663, -831776, -297862, 1149576, 1350211, 189680, -1311908, -2469539, -2914188, -2483112, -1746282, -962818, -717813, -939197, -1237433, -958859, 975214, 1408229, 443547, -386319, 32015, -749026, -1939825, -2756961, -2288393, -1296578, -1382884, -2465696, -3423651, -3578147, -2877337, -1463067, -1110095, -1164244, -1029889, -175141, 1132115, 1408680, 1038133, 1787867]
11579A787867J132942K0244J153765J953235L47877q98787j145850j962841j252712
11570A135740j032523n63618N3945O97144K003393J926173L21894j745747j038996
11561A757405K66214J284858M79383l99418p30289j780829j380473n59517r90924
11552b053590j89320P90958O76810o15572j051835q54342p04113r8716J796991
11543b302729R16627r45193J62489P71218J529683J587679R88410P9133n52250
11534B235067k58275j159474j367197j248774j404293N38012R74178o01327N37645
11525a754438Q21944J172205K12353O2040L94431O64571L72614k65579j88273
11516A491868j001589j969831N8101J315810j6756j197189k11143J31094j526019
$$ y = [1787867, 2920809, 2941053, 4094818, 6048053, 6395930, 5497143, 4351293, 2388452, 1135740, 103217, -460401, -406456, 290688, 2294081, 4220254, 4542148, 2796401, 1757405, 2023619, 3308477, 3787860, 3388442, 2658153, 877324, -503149, -1062666, -2053590, -2242910, -1451952, -775142, -1390714, -2442549, -3296891, -4001004, -4099720, -2302729, -1386102, -2331295, -2168806, -1397588, 132095, 1719774, 2708184, 2787317, 2235067, 1976792, 817318, -549879, -1798653, -3202946, -2664934, -1690756, -2292083, -1754438, -932494, 239711, 452064, 514104, 908535, 1573106, 1945720, 1680141, 1491868, 490279, -1479552, -1421451, -105641, -122397, -1319586, -1530729, -1399635, -2925654]
11507b925654o41002m56841J15826O83985N25219K81257q38622l78461P27771
11498b906522J235112J221729J227089L30130J268839L12418n77053k001688k696565
11489b586511r77681L04762K5398O68703K177594J748125J338300J843617K29218
11480D771525k704427j355473J709966Q43970j348571k705704j870678Q48299
11472a811093J141384N52371q8673O0371j109811j341810l1422N55058l39951
11463b413576l72843J751102K434150M78135j112898Q4430J12350R94509J446839
11454C402198n78061k464489k152224l39917N22702P77390P00336Q87488R66913
11445A722336m04581j066570j67800k47857J161550K377319k83877j739979q97832
$$ y = [-2925654, -3566656, -4023497, -3907671, -3223686, -2698467, -2417210, -3255832, -3634293, -2906522, -1671410, -449681, 777408, 1107538, 2376377, 2688795, 2111742, 110054, -2586511, -3564192, -3259430, -3234032, -2565329, -387735, 1360390, 2698690, 4542307, 4771525, 2067098, 711625, 2421591, 3265561, 1916990, -788714, -2659392, -1811093, -669709, -117338, -206011, -145640, -1255451, -2597261, -2628683, -2073625, -2413576, -2786419, -1035317, 1398833, 1876968, 764070, 848500, 960850, 1955359, 3402198, 2824137, 359648, -1792576, -2132493, -1609791, -832401, -132065, 755423, 1722336, 1317755, 251185, 83385, -164472, 997078, 3374397, 3090520, 1350541, 452709]
11436D52709k68751J462362J107995n68631r70471j076126j369412m16385K39409
11427a407301M20399K05042n19364j30379o86163P58827K314827K383737Q17624
11418D157249L18157k37120r85226m26826r80163j009600j67412m17827o82065
11409d30833m06303J354600K65389j343128k31302j85884n60230j671877m45513
11400c655081J053522P22382r66421q12335N72906l03028j955982l263083m729106
11391a3336226m136688O57664O959933P085729K925814J103805n5358j330816
11383a26143j39365q92742K51308N41142K37725L79624N25854N42268R54049P68788
11373C042508L59222j88702k47494j173684q56122m14094J51756M17459p90740
$$ y = [452709, 183958, 1646320, 2754315, 2185684, 1215213, 139087, -1230325, -1646710, -1407301, -986902, -781860, -1301224, -1431603, -2117766, -1358939, 955888, 3339625, 4157249, 4475406, 4238286, 3253060, 2826234, 1846071, 836471, 669059, 251232, -430833, -837136, 517464, 782853, -560275, -791577, -977461, -1537691, -3209568, -3655081, -2601559, -1879177, -2845598, -3657933, -3085027, -3388055, -5344037, -8607120, -13336226, -17472914, -16815250, -9855317, -2769588, 156226, 1260031, 1204673, -126143, -265508, -1158250, -906942, -365800, -128075, 251549, 777403, 1319671, 2273720, 3042508, 3401730, 3213028, 2965534, 1791850, 935728, 521634, 673390, 1090849, 300109]
11364C00109j087395j370474j62827J851475J813627L05618K28003o19414j942784
11355f84062r09124L24336L3780k61958k24941J17322K16081J122247J080018
11346H13699r42592p19707Q34396M61506o06625K19286N43113r90940o94156L71791
11336g10229N33123j62606j043462J110955K199411q739m94768j980559j667299
11327b224173m7341L92894L42096Q47621j226772r83425L53380N08838j40562
11318b177444p9342R85544K16120p6618J364643J94756j495288p96637J3956K89083
11308a561227p35017L6975N45694l21698j39701N07493R69483Q53941O75856m40662
11298C91137n50253J244816J332878r01384k041158j403086N01460J293440M08262
$$ y = [300109, -787286, -2157760, -2320587, -469112, 1344515, 1650133, 1878136, 1258722, -684062, -1593186, -1268850, -1235070, -1497028, -1721969, -1604647, -1388566, -266319, 813699, -128893, -848600, -14204, 447302, -159323, 59963, 603076, -387864, -1082020, -710229, -177106, -339712, -1383174, -272219, 1927192, 1918453, 1423685, -556874, -2224173, -2271514, -1878620, -1536524, -688903, -1915675, -2899100, -2545720, -2036882, -2177444, -2256786, -1271242, -1055122, -1131740, 232903, 427659, -1067629, -1864266, -1850310, -1561227, -2296244, -2259269, -1713575, -2035273, -2174974, -1667481, -697998, 155943, 831799, 391137, -159116, 1085700, 2418578, 1517194, -523964, -1927050, -1425590, -132150, 276112]
11289B76112q00625r23722j144498p17568M98567J363468O43659j028602Q10596
11280a022613J210212L00077l23288L85760Q34052P61234R58087J090502j002952
11271C191071j631105r25541l75122O10674N02078K9777L75813j008577J4852
11262G83920J077212L57223M20505o20704o98921q1428j90590j73762L74535M65729
11252A713719p66952j647411l46122M51945p02187P331J186220m88420p71526
11243a363403K98578N45404J394987J416078k68208j076532j179026r31337J139481
11234b3978R41927K34807n33618j3653N42073R43256p94267j578392j071271j55131
11224a508247k08688j60573l17945K61043Q50220K186218Q55993L28354Q45525
$$ y = [276112, -524513, -1448235, -2592733, -3310301, -2811734, -1448266, -804607, -1833209, -1022613, 187599, 487676, 164388, 550148, 1384200, 2145434, 3103521, 4194023, 3191071, 1559966, 634425, 259303, 869977, 1372055, 1401832, 1777645, 769068, 783920, 1861132, 2218355, 2638860, 2018156, 1319235, 1237807, 1047217, 873455, 1247990, 1713719, 946767, -700644, -1046766, -594821, -1297008, -1289677, -103457, -591877, -1363403, -1064825, -519421, 875566, 2291644, 2023436, 946904, -232122, -1163459, -23978, 917949, 1152756, 619138, 605485, 1147558, 2090814, 1296547, -281845, -1353116, -1508247, -1716935, -1877508, -2195453, -1934410, -1084190, 1102028, 1958021, 2286375, 3131900]
11215C131900N63665k902733l445365M5141J280455J858948Q58791r13674p56205
11206b79077q79781j786500p27650K92815P85884M47626K50917k0211L27868O39595
11196i48514O58607O39183p25169m23518J978180J387669j529072j518537M29938
11187e1233M58834L46851m82612p55146j014400j068540j76621R79243K16128
11178a547496n77131o43571n98149j555919O81164K381565K764812R78370m98576
11169A385069m23770K03077L26504K45729n43375K6266r9200K45518J49667p20978
11159G94507j68337K55102O0349M02759M84416l61825J73253N65462m24104k146540
11149c64958j042873J054624J412233J81498r28273J059371P35978J34614m29108
$$ y = [3131900, 3695565, 792832, -2652533, -2607392, -1326937, 532011, 1390802, 477128, -279077, -1158858, -2945358, -3673008, -3380193, -2594309, -2146683, -1895766, -1915977, -1588109, -948514, -289907, 349276, -375893, -799411, 1178769, 2566438, 1037366, -481171, -51233, 407601, 754452, 271840, -483306, -1497706, -2566246, -2742867, -1763624, -1547496, -2124627, -2768198, -3366347, -4922266, -4241102, -1859537, 905275, 1883645, 1385069, 961299, 1164376, 1490880, 1736609, 1193234, 1219500, 1120300, 1365818, 1515485, 794507, 626170, 881272, 941621, 1344380, 1828796, 1466971, 1640224, 2205686, 1781582, -364958, -1407831, -353207, 1059026, 1240524, 312251, 1371622, 2107600, 2242214, 1813106]
11140A813106p80007n24597j173573j9904J72885j495938j232500q17813q34262
11131d892603j074223n11902N95210J759451J658948Q44152N3922J98688J512122
11122A43765J348403j890321k721334l75904Q87128J185092L965054K410737o14287
11113D338333o06195m59569j294683j937934r97564Q55853K099530K096897R44615
11104E039283j351240L38302J681879o65609n52336k2854j000955m92080j245049
11095A729341j127606P55564L21537P0429n10298j346341L00755J601287J813418
11086C608086M24329o11123j132027j295760n33044Q03043J240155P67974j72749
11077C098884o30667j202784n30211J489700K18347p44397R6723p28917r57469
$$ y = [1813106, 1033099, 508502, -665071, -684975, -512090, -2008028, -3240528, -4058341, -4892603, -5966826, -6478728, -5883518, -4124067, -2465119, -1620967, -1567045, -1368357, 143765, 1492168, -398153, -3119487, -3495391, -2608263, -1423171, 2541883, 4952620, 4338333, 3732138, 3272569, 1977886, 39952, -957612, -101759, 1997771, 4094668, 5039283, 3688043, 4026345, 5708224, 5042615, 4490279, 4467425, 3466470, 2974390, 1729341, 601735, 1357299, 1678836, 1749265, 1238967, -107374, 193381, 1794668, 3608086, 4032415, 3421292, 2289265, 993505, 460461, 1263504, 2503659, 3271633, 3098884, 2468217, 1265433, 735222, 2224922, 2443269, 1698872, 1795595, 1066678, 109209]
11068A09209j104235M26557J474265J064805J199196L54036j391590j97140J446904
11059C382007J28768o953j72947r30489k381791r77621k48559J58397J052052
11050B864J013687j70147l19663m59723j888561j608201J860481K287353M07524
11041A125614N17053J438546l62055j579772j240099j942531n15229R52135J570608
11032c5730J003184L34128L14151J389459K08347l321308k686399j053768j83145
11023d031081J758104Q94524k104051j240847j15403p99918R44960J807917K423753
11014d62042J853398J96902M15793J61883k175270k741491p28416J340229K284780
11005A45766R00310q80528j383439j471373j098493O54367K688953K117687J012285
$$ y = [109209, -995026, -568469, 905796, 1970601, 3169797, 3523833, 2132243, 1935103, 3382007, 3510775, 3503822, 3330875, 2400386, 18595, -959026, -1207585, -1049188, 2864, 1016551, 846404, 526741, 67018, -1821543, -3429744, -1569263, 718090, 1125614, 1642667, 3081213, 2719158, 1139386, -100713, -2043244, -2558473, -1606338, -35730, 967454, 1301582, 1615733, 3005192, 3213539, -107769, -2794168, -3847936, -4031081, -2272977, -1378453, -3482504, -4723351, -4838754, -5638672, -4693712, -2885795, -462042, 1391356, 1588258, 2004051, 2165934, -9336, -2750827, -3479243, -2139014, 145766, 1046076, 165548, -1217891, -2689264, -3787757, -3133390, -444437, 1673250, 2685535]
10996B685535j045452p53624P48696L43779k65000j169008k44440J60181P10471
10987A171138J48774o75636m81477p4505N14854N64447K44982r0965p19043q68205
10977b65636q58969J294129J49002j206622m14229J61348N02335L47734M92027
10968B01119k72488N50463k60882L3002j07930Q0325l96073n2959P56433k06715
10958C24295j29868P99506k51653k80674O97661J032237L85324N34495q71058
10949B240265l231382l453961K01323R83775l99805O76402J171547K41006l02126
10940a872956j365804q34226O12756J324034P62597M96416P14385K14460R061
10931F0723j385240l239038j568738K400626K823751N35500Q78776j83291j826985
$$ y = [2685535, 1640083, 886459, 1635155, 1978934, 1713934, 544926, 300486, 460667, 1171138, 1319912, 644276, 162799, 88294, 603148, 1167595, 1412577, 1321612, 602569, -265636, -1124605, 169524, 318526, -888096, -1302325, -1140977, -638642, -290908, 201119, -71369, 479094, 218212, 251214, 143284, 223609, -172464, -225423, 531010, 324295, 194427, 993933, 742280, 461606, 1159267, 2191504, 2576828, 3111323, 2240265, -991117, -4445078, -4243755, -3259980, -3659785, -2983383, -1811836, -1570830, -1872956, -3238760, -4072986, -3460230, -2136196, -1373599, -877183, -162798, 51662, 60723, -1324517, -4563555, -6132293, -3731667, -907916, -372416, 506360, 323069, -1503916]
10922a503916j187080j3354O94403J246368R98146O23612K61851J155032J583817
10913C858879r67344L0696j814644l698941j437420l85594o1735L83776K85960
10904c806367Q76034Q49639L80319J75610J06220m85667L21212J763170q70262
10895f90092j02218J038141n58579J62436n28435J88808K006690J61917j050872
10886F27796m7228Q24910l72209j241199j247210K43981L83254p85774l66084
10877a979763J468531J359520Q50883n39575j99140J133599Q40479p21750j109219
10868A103565o53819m47505j3459M27302K62577J708522J952127O81162o57380
10859D363092j486588q87765j307318j391972L4691J054576Q87932J02272r65401
$$ y = [-1503916, -2690996, -2704350, -2009947, -763579, 234567, 858179, 1120030, 2275062, 3858879, 2891535, 2922231, 1107587, -2591354, -4028774, -4414368, -4476103, -4092327, -3806367, -2930333, -2080694, -1700375, -1524765, -1418545, -1904212, -1583000, 180170, -690092, -792310, 245831, -312748, -150312, -678747, -489939, 1516751, 1678668, 627796, 580568, 1405478, 1033269, -207930, -1455140, -1211159, -827905, -1613679, -1979763, -511232, 848288, 1699171, 1159596, 960456, 2094055, 2934534, 2212784, 1103565, 449746, 2241, -11218, 416084, 678661, 2387183, 4339310, 5020472, 4363092, 2876504, 1988739, 681421, -710551, -675860, 378716, 1266648, 1368920, 403519]
10850D03519j544943l6249P49920j77440L41449J19324q08254o37262q56635k2234
10840b468805K38738J272230Q54043n97224J203765J768209J814565J059679m52653
10831D692547l18627j61942k191560j666316Q18370O59668K64275N77269q71552
10822A802132j307908j744730j385483N13674R60384j07427l98749N07722J97001
10813i63384l63135K096409O05579j650063r09192K16393j579223p00748M92525
10804b754839J42585R69233P91560p66634m82223k7370K38835J3523R15424K923266
10794A963360J292446N14j90613r94677j313770k146812j429948j005220N69720
10785c255000J330071m40240j596242j061133n48695j31033P93158J614955M35633
$$ y = [403519, -1141424, -1177673, -427753, -605193, -263744, -144420, -952674, -1589936, -2446571, -2468805, -2230067, -957837, -103794, -701018, 502747, 2270956, 4085521, 5145200, 4692547, 4373920, 4211978, 2020418, 354102, 1172472, 1832140, 2096415, 2673684, 1802132, 494224, -1250506, -2635989, -2122315, -1161931, -1269358, -1668107, -1160385, -963384, -1326519, 769890, 1375469, -274594, -1183786, -967393, -2546616, -3247364, -2754839, -2612254, -1643021, -851461, -1618095, -2100318, -2127688, -1888853, -1875330, -959906, 1963360, 3255806, 3256320, 3065707, 2071030, 757260, -1389552, -2819500, -3824720, -3255000, -1924929, -2365169, -3961411, -5022544, -5571239, -5702272, -4909114, -3294159, -2858526]
10776b858526O44946J357732R78889J253017M14989j712271k054519n37974K78909
10767b234808J162745O48758j623827j174233k72515J008491J113727O6295j799
10758a307166Q79716N1744n65286o14106r13007j7060J548075J07566M45344P79804
10748C95624K38725O23298M69520O87822l67970j338942j691737j340311p42960
10739c066931N65438P44569q1719m97783q20308k12742J113400M30139j056489
10730b882426O4506K94636j307579r19666O27722K182034K133420J245349J961694
10721C399690J428278l48130k22151j546999k085004r35910M97914O18930l26173
10712D80445p67159k23584m56917n19759q083M21307N22556R01912r83364m77654
$$ y = [-2858526, -2213580, -855848, 123041, 1376058, 1791047, 78776, -1975743, -2513717, -2234808, -1072063, -423305, -2047132, -3221365, -3493880, -2485389, -1371662, -1305367, -1307166, -427450, -375706, -940992, -1555098, -2468105, -2485165, -937090, -829524, -384180, 395624, 634349, 1257647, 1727167, 2414989, 2047019, 708077, -983660, -2323971, -3066931, -2501493, -1756924, -1838643, -2336426, -3156734, -3369476, -2256076, -1825937, -2882426, -2817920, -2523284, -3830863, -4750529, -4122807, -1940773, 192647, 1437996, 3399690, 4827968, 4479838, 4257687, 2710688, 625684, -310226, 187688, 806618, 480445, -286714, -510298, -967215, -1486974, -1495057, -1073750, -551194, 350718, -632646, -1110300]
10702a110300n8195j918550j485836J83640O53148L76756J023606m00558n93111
10693c329400n29983p74045J35755j22372L216J975768K653038N13489n21589
10684C877k46729k52537O44108J420819P54524j40185k006226p91951J885791
10675A271491J190145j766980j216369N17554J836175R79948q2701k061572j075058
10666d07367m44316j230895J385185K439208J238427j177334M87233J22961k392458
10657B0644q79204J92090j004717q34850Q9059K8610j39977R24849J133287O89202
10647B18993J169233J3249K78551J046448L51407p77761j300218j247850j43629
10638c91577K50252j8469R26778J156360l56966m25806N13685N76453m87987m20041
$$ y = [-1110300, -1168495, -3087045, -4572881, -4389241, -3736093, -3359337, -2335731, -2736289, -3329400, -3859383, -4633428, -4497673, -4620045, -4616829, -2641061, 11977, 525466, 3877, -242852, -495389, 148719, 1569538, 2324062, 2183877, 177651, -614300, 1271491, 2461636, 694656, -521713, -4159, 1832016, 2811964, 2729263, 667691, -407367, -851683, -2082578, -697393, 1741815, 2980242, 1802908, 2290141, 2413102, 20644, -858560, -666470, -1671187, -2506037, -2416978, -2388368, -2528345, -1603496, -470209, 218993, 1388226, 1401475, 1680026, 2726474, 3077881, 2300120, 999902, -247948, -391577, -141325, -159794, 766984, 1923344, 1566378, 1140572, 1654257, 2230710, 1742723, 1322682]
10628A322682m91926J0009j347785k016906j014679j409875J02960K813810J369934
10619f61776m23701p00412n15468M3632N26346j76628J194153j96792k439316
10610c349962k011841j049277j73209L92182J076850J983062J271192M89544J065713
10601c05746J020128N18509k045041j557594J11180L02564R6580l41825L52277
10592a848968J335298J303091O1504j214126r18933r7159J67492N92909J132844
10583E13952l560j24164J84984O32936J407004k98002j681751k145042m68959
10574a982602J31145p4236m16916R4577J698774J212820O08824o85963o99513
10565a13090j908159j243561J600607P21000j392303p39744m09512m74761n02579
$$ y = [1322682, 830756, 840765, -507020, -2523926, -3538605, -4948480, -4845520, -2031710, -661776, -1085477, -1785889, -2301357, -2257725, -1731379, -1908007, -713854, -910646, -3349962, -5361803, -6411080, -6584289, -6192107, -5115257, -3132195, -1861003, -1371459, -305746, 714382, 1232891, -812150, -2369744, -2258564, -1956000, -1859420, -2201245, -1848968, -513670, 789421, 850925, -363201, -1282134, -1379293, -1211801, -618892, 513952, 510392, 386228, 571212, 1204148, 2611152, 2313150, 631399, -1513643, -1982602, -1851457, -1925693, -2342609, -2248032, -549258, 663562, 1272386, 586423, -113090, -2021249, -3264810, -1664203, -943203, -2335506, -3075250, -3484762, -3959523, -4462102]
10556d462102K66461R01574J583647J791731J227449K73668m12789j058365k88912
10547a77638R27348J641555M00641k89790Q06958M34916k488077l259271j817295
10538c820653Q69339J052654O27368J474375J673877n0052p62703n28835J61274
10529F96644J200720K208692N68007j762811k104365j41971k80248j534013r35318
10520b084663O09576K16817r89898p23945p12680q69321L35188P61799P79556
10511b677571O60438j71472K61769j390347j352876j28146Q1101J753533J290252
10502a673319P46392K012839J613044P5441m74346j539136j875200j041764O53543
10493a502506O99844Q83250J212913p29617j209876J23542L58157p99567k448000
$$ y = [-4462102, -4195641, -3294067, -1710420, 81311, 1308760, 1582428, 1169639, 111274, -177638, 749710, 2391265, 2791906, 2502116, 3309074, 3743990, 1255913, -2003358, -3820653, -2951314, -1898660, -1271292, 203083, 1876960, 1826908, 1064205, 535370, 696644, 1897364, 4106056, 4674063, 2911252, 806887, 664916, 384668, -1149345, -2084663, -1475087, -1258270, -2248168, -2972113, -3684793, -4554114, -4218926, -3457127, -2677571, -2017133, -2188605, -1926836, -3317183, -4670059, -4798205, -4717104, -2963571, -1673319, -926927, 1085912, 2698956, 2774397, 2300051, 760915, -1114285, -2156049, -1502506, -802662, 80588, 1293501, 563884, -645992, -522450, -164293, -963860, -3411860]
10484c411860j164895J613373J968388J500939J219383J277949j303583k723886
10476a024192k97959M60551k97841q57928K58856J132546J89117P97171J075153
10467A435474j207785p53303P92792Q78240Q61237M96927k13110j12308J044796
10458C222960l39508o72897m84346n80618p13192j144031k98228J442864J266449
10449A699453L93074n59083J029234J567677j55878j691160j231481l85176j83852
10440D82808r61790p99880Q61242L88370m73277l65473p81774M25762p17789L41136
10430a600665J682877M5345l39188o74080m71797j35743J240236L95824P7039
10421B19848M13098j028559o74847J136846Q10024r73264o18320R72727J181833
$$ y = [-3411860, -4576755, -2963382, -994994, 505945, 1725328, 3003277, 1699694, -1024192, -1322151, -861600, -1159441, -2017369, -1758513, -625967, -436850, 360321, 1435474, 227689, -525614, 267178, 1145418, 2006655, 2503582, 2290472, 2178164, 3222960, 2883452, 2210555, 1726209, 1145591, 432399, -711632, -1009860, 433004, 1699453, 2092527, 1533444, 2562678, 4130355, 3974477, 2283317, 1051836, 666660, 482808, -478982, -1278862, -417620, -29250, -502527, -868000, -1649774, -1224012, -1941801, -1600665, 82212, 127557, -211631, -885711, -1357508, -1493251, -253015, 142809, 219848, 632946, -395613, -1070460, 66386, 876410, -96854, -715174, 257553, 1439386]
10412A439386M09274j269717j607557O66571K044667J53350k676833r23102Q33224
10403i30737K49677p44039p73117m28452o3204N5965R42799R87390K72035N56183
10393A24500p73225j499747M01441K622980K751541L41069j385743j837335q09419
10384f3938P24676Q26743r92867k21763L65698J214319r5394P27896J908535Q28650
10374E222555J9620m49810j610915j517414J300182P23328q86596k157945k601144
10365a958139j258199L61859l94660R8041J724423J420651j15156q66234k72376
10356a259790L30420J215855M87487j254397q78188L99670L27821p81498j004954
10347b417574r49748L81662J182039j17374q72310M9936J102444J84289r73618
$$ y = [1439386, 1848660, 578943, -1028614, -362043, 1682624, 1835974, -840859, -1763961, -930737, -681060, -1425099, -2198216, -2626668, -2689872, -2633907, -1691108, -703718, -431683, 124500, -648725, -2148472, -1747031, 875949, 3627490, 3968559, 2582816, 745481, -63938, 660738, 1487481, 494614, 272851, 638549, 1852868, 1757474, 2485370, 4393905, 5222555, 5242175, 4792365, 3181450, 1664036, 2964218, 3687546, 2800950, 643005, -1958139, -3216338, -2854479, -3249139, -3151098, -1426675, -6024, -121180, -987414, -1259790, -929370, 286485, 773972, -480425, -1358613, -958943, -631122, -1412620, -2417574, -3367322, -2985660, -1803621, -1920995, -2793305, -2743369, -1640925, -1456636, -2430254]
10338b430254R11539J582658k63629q17256p09921k29500J525620m4049k020663
10329b495455n52827N60270K258269J482929j112358L14111J101104O58396k46791
10320A967648k03757q07010r97491j031265p91905N35774Q87557L20714k41012
10311c60747O12818N09681P61871Q8041j371453p07069l93732Q58408j33003l61297
10301d96482p27663j050436O212r6972J83171j30554r90910M61712J659313J695483
10291E12874J118865R26439p078k222053k653399j04593K784443J556824J42688
10282B055010j186987j459796o37625j286676k476108j53477L145700J903592
10274i6367J62666j077551j243896p48254l64162K15732J15622k89459N56505
$$ y = [-2430254, -1518715, 63943, -199686, -1016942, -1726863, -1956363, -430743, -474792, -2495455, -3048282, -2488012, -229743, 1253186, 140828, 454939, 1556043, 2214439, 1967648, 1763891, 956881, -40610, -1071875, -1863780, -1328006, -440449, -119735, -360747, 252071, 761752, 1523623, 1611664, 240211, -466858, -860590, -2182, -135185, -496482, -1224145, -2274581, -2268369, -2365341, -2182170, -2312724, -3303634, -2841922, -1182609, 512874, 1631739, 2558178, 2551100, 329047, -2324352, -2428945, 355498, 1912322, 2055010, 868023, -591773, -1229398, -2516074, -4992182, -5145659, -1999959, -96367, 66299, -1011252, -2255148, -3003402, -3367564, -3151832, -3036210, -3325669, -2769164]
10265b769164k44525j447573j15905J287950R48911o58754o17338R36481J362114
10256a317803J350119l7240k50237k003650q70893K090426K588963P63593k252759
10247F0519j741894J108554P78024N28938J358524n4052n12523l47006p63615
10238D15469p50562K5767l41683n96328r05984j08765J43830J336204K207286
10229A425234J922361J351289j200102k321785j605862j084602K91678P32005
10221d89784M84622L22363p74446l10019J072630K31897m83376j597944j146844
10212b690901K950502J682481L41407J441083P33910j291421k004971l69382m07644
10203C85064p33829Q64554J508496j36740R01079J213921k83644k9812M39059
$$ y = [-2769164, -3013689, -4461262, -4577167, -3289217, -2340306, -2999060, -3616398, -2679917, -1317803, 32316, -4924, -255161, -2258811, -3129704, -1039278, 1549685, 2313278, 60519, -1681375, -572821, 205203, 734141, 2092665, 2038613, 1526090, 1179084, 415469, -335093, -309326, -651009, -1247337, -2153321, -2262086, -2118256, -782052, 1425234, 3347595, 4698884, 3498782, 1176997, -428865, -1513467, -1221789, -489784, -5162, 317201, -457245, -767264, 305366, 537263, 53887, -1544057, -2690901, 259601, 1942082, 2283489, 3724572, 4458482, 3167061, 1162090, 792708, 385064, -348765, 515789, 2024285, 1887545, 2788624, 4002545, 3718901, 3689089, 4128148]
10194D128148j176162j871402m13985N93075N21929q8815r26622j762496k287318
10185c283648m23110j67212J32541J382380R05458k28572M88817J26980q12134
10176a878500k08425Q08787P07726K92450M76933q37874j623469J65147R58339
10167a138886K846n58671J86502J067165l97456j421724Q00666L83755p15267
10158a791070O07101J274068Q53734J644754j76631j813172j135095k79009J384595
10149E69275k9612j046245P05847j84411j170063j094743r51550j34403O30293
10140b705612R17623R45045o56388m19871L11372J063448Q4292k05783J58769
10131e07105k02540O12593N99204m27108k75279P25554J168231K069334Q64759
$$ y = [4128148, 2951986, 1080584, 666599, 1259674, 1781603, 1692788, 766166, -996330, -3283648, -3706758, -3873970, -3741429, -2359049, -1453591, -1682163, -1193346, -1066366, -1878500, -2086925, -1278138, -570412, -277962, 198971, -638903, -2262372, -2097225, -1138886, -1136040, -1694711, -1508209, -441044, -838500, -2260224, -1459558, -1075803, -1791070, -1183969, 90099, 943833, 2588587, 2411956, 598784, -536311, -815320, 569275, 539663, -506582, 199265, 14854, -1155209, -2249952, -3201502, -3335905, -2705612, -1787989, -842944, -1499332, -1919203, -1607831, -544383, -460091, -665874, -507105, -709645, -97052, 502152, 75044, -200235, 525319, 1693550, 3762884, 4627643]
10122D627643l85113j284874k462900j153093q37294j062438J40923J941908O95165
10113B19927R70928Q10847j359867p903J56416Q12550J771534j20163k684565
10104E69704l528005j026321N44555J527482Q73845k03156j87438j918446k264587
10095e612367J45290J461716J727669J447864N78282l04531P78237J757480n05736
$$ y = [4627643, 4242530, 2957656, 494756, -658337, -1495631, -2558069, -2417146, -475238, 219927, 1190855, 2001702, 641835, 633932, 790348, 1602898, 3374432, 3254269, 569704, -2958301, -3984622, -3440067, -1912585, -1038740, -1241896, -1429334, -3347780, -5612367, -5467077, -4005361, -2277692, -829828, -251546, -556077, 222160, 1979640, 1473904]
$$ [...]
##END NTUPLES=NMR SPECTRUM
##END=
