##TITLE=C13_SAV-39-NaOH
 Py-d5, 24300 sc

 21.10.2019
##JCAMPDX= 6.0         $$ Bruker NMR JCAMP-DX V2.0
##DATA TYPE= NMR SPECTRUM
##DATA CLASS= NTUPLES
##ORIGIN= UXNMR, Bruker Analytische Messtechnik GmbH
##OWNER= root
$$ XWIN-NMR		Version 3.5
$$ Tue Oct 22 13:38:52 2019 Russian Standard Time (UT+4h)  she@DPX200
##.OBSERVE FREQUENCY= 50.327896
##.OBSERVE NUCLEUS= ^13C
##.ACQUISITION MODE= SIMULTANEOUS
##.ACQUISITION SCHEME= undefined
##.AVERAGES= 24300
##.DIGITISER RES= 17
##SPECTROMETER/DATA SYSTEM= spect
##.PULSE SEQUENCE= zgpg30
##.SOLVENT NAME= CDCl3
##.SHIFT REFERENCE= (INTERNAL, CDCl3, 0, 222.624)
##AUDIT TRAIL= $$ (NUMBER, WHEN, WHO, WHERE, WHAT)
$$ ##TITLE= Audit trail, XWIN-NMR		Version 3.5
$$ ##JCAMPDX= 5.01
$$ ##ORIGIN= Bruker BioSpin GmbH
$$ ##OWNER= she
$$ F:/spectra/data/she/nmr/c13/1/pdata/1/auditp.txt
$$ ##AUDIT TRAIL=  $$ (NUMBER, WHEN, WHO, WHERE, WHAT)
(   1,<2019-10-22 13:36:46.60 +0400>,<she>,<DPX200>,
      <created by zg, POWCHK disabled, PULCHK disabled
       terminated by command 'halt'
       configuration hash MD5:
       00 E9 B6 7A A2 85 ED C7 34 08 36 98 17 FE 4E 26
       data hash MD5: 32K
       86 42 1B 4C 1E C8 CC 83 6F AB 08 50 30 84 F2 90>)
(   2,<2019-10-22 13:36:50.89 +0400>,<she>,<DPX200>,
      <Start of raw data processing
       efp BC_mod = 2 LB = 1 FT_mod = 6 PKNL = 1 PHC0 = -383.2927 PHC1 = 25.60636 SI = 32K 
       data hash MD5: 32K
       12 EE 88 27 1A EF 8C 54 34 A1 89 73 A8 35 7A F1>)
(   3,<2019-10-22 13:36:53.59 +0400>,<she>,<DPX200>,
      <abs ABSG = 5 
       data hash MD5: 32K
       B7 D8 1C 28 BF C7 EF 2E D1 EB A6 BC B9 D6 18 8C>)
(   4,<2019-10-22 13:37:40.64 +0400>,<she>,<DPX200>,
      <pk PHC0 = 2.488384 PHC1 = 0.7999997 
       data hash MD5: 32K
       8F D9 86 31 7A E8 6E C2 29 40 DB 26 97 89 D1 0B>)
(   5,<2019-10-22 13:37:44.12 +0400>,<she>,<DPX200>,
      <abs ABSG = 5 
       data hash MD5: 32K
       7E 7F F1 DF 6E F7 1E 2C 8D D9 36 DC 98 01 B1 CF>)
$$ ##END=
$$ 
$$ hash MD5
$$ DC 2C 3D CC A2 B3 3A 68 D5 F5 79 D7 E2 55 36 38
##$RELAX= 
##$RELAX= 
##$RELAX= 
##$RELAX= 
##$RELAX= 
##$RELAX= 
##$RELAX= 
##$RELAX= 
$$ Bruker specific parameters
$$ --------------------------
##$DU= <F:/spectra>
##$EXPNO= 1
##$NAME= <c13>
##$PROCNO= 1
##$TYPE= <nmr>
##$USER= <she>
##$AMP= (0..31)
100 100 100 100 100 100 100 100 100 100 100 100 100 100 100 100 100 100 
100 100 100 100 100 100 100 100 100 100 100 100 100 100 
##$AQSEQ= 0
##$AQ_mod= 1
##$AUNM= <au_zg>
##$AUTOPOS= <>
##$BF1= 50.322709
##$BF2= 200.13
##$BF3= 50.322709
##$BF4= 500.13
##$BF5= 500.13
##$BF6= 500.13
##$BF7= 500.13
##$BF8= 500.13
##$BYTORDA= 1
##$CFDGTYP= 0
##$CFRGTYP= 5
##$CHEMSTR= <none>
##$CNST= (0..31)
1 1 145 1 1 1 1 1 1 1 1 1 1 1 1 1 1 1 1 1 1 1 1 1 1 1 1 1 1 1 1 1 
##$CPDPRG= <waltz16>
##$CPDPRG1= <>
##$CPDPRG2= <waltz16>
##$CPDPRG3= <>
##$CPDPRG4= <mlev>
##$CPDPRG5= <mlev>
##$CPDPRG6= <mlev>
##$CPDPRG7= <mlev>
##$CPDPRG8= <mlev>
##$CPDPRGB= <>
##$CPDPRGT= <>
##$D= (0..31)
$$ [...]
##$SUBNAM4= <"">
##$SUBNAM5= <"">
##$SUBNAM6= <"">
##$SUBNAM7= <"">
##$SUBNAM8= <"">
##$SUBNAM9= <"">
##$SW= 239.972175391363
##$SWIBOX= (0..15)
0 1 3 0 0 0 0 0 0 0 0 0 0 0 0 0 
##$SW_h= 12077.2946859903
##$TD= 32768
##$TD0= 1
##$TE= 0
##$TE2= 300
##$TE3= 300
##$TEG= 300
##$TL= (0..7)
120 120 120 120 120 120 120 120 
##$TP= (0..7)
150 150 150 150 150 150 150 150 
##$TP07= 0
##$TPNAME0= <>
##$TPNAME1= <>
##$TPNAME2= <>
##$TPNAME3= <>
##$TPNAME4= <>
##$TPNAME5= <>
##$TPNAME6= <>
##$TPNAME7= <>
##$TPOAL= (0..7)
0.5 0.5 0.5 0.5 0.5 0.5 0.5 0.5 
##$TPOFFS= (0..7)
0 0 0 0 0 0 0 0 
##$TUNHIN= 0
##$TUNHOUT= 0
##$TUNXOUT= 0
##$USERA1= <user>
##$USERA2= <user>
##$USERA3= <user>
##$USERA4= <user>
##$USERA5= <user>
##$V9= 5
##$VALIST= <valist>
##$VCLIST= <CCCCCCCCCCCCCCC>
##$VD= 0
##$VDLIST= <DDDDDDDDDDDDDDD>
##$VPLIST= <PPPPPPPPPPPPPPP>
##$VTLIST= <TTTTTTTTTTTTTTT>
##$WBST= 1024
##$WBSW= 4
##$XGAIN= (0..3)
0 0 0 0 
##$XL= 0
##$YL= 0
##$YMAX_a= 136538628
##$YMIN_a= -90097610
##$ZGOPTNS= <>
##$ZL1= 120
##$ZL2= 120
##$ZL3= 120
##$ZL4= 120
##$ABSF1= 222.624
##$ABSF2= -17.3728
##$ABSG= 5
##$ABSL= 3
##$ALPHA= 0
##$AQORDER= 0
##$ASSFAC= 0
##$ASSFACI= 0
##$ASSFACX= 0
##$ASSWID= 0
##$AUNMP= <proc_1d>
##$AZFE= 0.1
##$AZFW= 0.5
##$BCFW= 0
##$BC_mod= 2
##$BYTORDP= 0
##$COROFFS= 0
##$CY= -3
##$DATMOD= 1
##$DC= 0
##$DFILT= <>
##$DTYPP= 0
##$F1P= 0
##$F2P= 0
##$FCOR= 0.5
##$FTSIZE= 32768
##$FT_mod= 6
##$GAMMA= 0
##$GB= 0
##$INTBC= 1
##$INTSCL= 4.134877e-10
##$ISEN= 128
##$LB= 1
##$LEV0= 0
##$LPBIN= 0
##$MAXI= 10000
##$MC2= 0
##$MEAN= 0
##$ME_mod= 0
##$MI= 0.1934396
##$NCOEF= 0
##$NC_proc= 3
##$NLEV= 6
##$NOISF1= 120.0001
##$NOISF2= 80.00006
##$NSP= 0
##$NTH_PI= 0
##$NZP= 0
##$OFFSET= 222.624
##$PC= 1.4
##$PHC0= -380.8043
##$PHC1= 26.40636
##$PH_mod= 1
##$PKNL= yes
##$PPARMOD= 0
##$PSCAL= 0
##$PSIGN= 0
##$REVERSE= no
##$SF= 50.3227315989248
##$SI= 32768
##$SIGF1= 140
##$SIGF2= 120
##$SINO= 11.81781
##$SIOLD= 32768
##$SREGLST= <13C.CDCl3>
##$SSB= 0
##$STSI= 32768
##$STSR= 0
##$SW_p= 12077.2946859903
##$SYMM= 0
##$S_DEV= 0
##$TDeff= 32768
##$TDoff= 0
##$TI= <>
##$TILT= no
##$TM1= 0
##$TM2= 0
##$TOPLEV= 0
##$USERP1= <user>
##$USERP2= <user>
##$USERP3= <user>
##$USERP4= <user>
##$USERP5= <user>
##$WDW= 1
##$XDIM= 32768
##$YMAX_p= 424155711
##$YMIN_p= -1438464
$$ End of Bruker specific parameters
$$ ---------------------------------
##NTUPLES= NMR SPECTRUM
##VAR_NAME=  FREQUENCY,     SPECTRUM/REAL,   SPECTRUM/IMAG
##SYMBOL=    X,             R,               I
##VAR_TYPE=  INDEPENDENT,   DEPENDENT,       DEPENDENT
##VAR_FORM=  AFFN,          ASDF,            ASDF
##VAR_DIM=   32768,         32768,           32768
##UNITS=     HZ,            ARBITRARY UNITS, ARBITRARY UNITS
##FACTOR=    0.368581032318806, 1,           1
##FIRST=     11203.0474431902, 0,            0
##LAST=      -874.247242800138, 0,           0
##MIN=       -874.247242800138, -1438464,    0
##MAX=       11203.0474431902, 424155711,    0
$$ Real data points
##PAGE= N=1
##DATA TABLE= (X++(R..R)), XYDATA
$$ [...]
$$ plain form
22099 -658598 -777506 -581204 -161197 28080 -71436 38396 66173 115697 311962 275820
22089 275820 212053 140064 81338 78395 49023 68089 88144 93594 264853 378302 484144
22078 484144 504948 340376 141303 65755 8784 48055 -57224 -408392 -655756 -418175
22068 -418175 -87410 29826 -13638 98109 332859 376273 175073 -70260 -265134 -269534
22058 -269534 -226967 -206850 -237595 -366648 -349869 -155500 70684 216447 365972 291650
22048 291650 76155 -71362 -214734 -157717 -116398 -241078 -96396 307826 478724 261865
22038 261865 103301 89667 167290 109686 290585 412204 380361 313473 344925 307867 145811
22027 145811 124926 351897 551024 431254 329512 219130 190729 313435 301040 53558
$$ packed form
22099f58598j18908J96302M20007J89277r9516J09832K7777M9524J96265l6142
22089B75820o3767p1989n8726k943k9372J9066K0055N450J71259J13449J05842
22078D84144K0804j64572j99073p5548n6971L9271j05279l51168k47364K37581
22068d18175L30765J17236m3464J11747K34750M3414k01200k45333j94874m400
22058b69534M2567K0117l0745j29053J6779J94369K26184J45763J49525p4322
22048B91650k15495j47517j43372N7017M1319j24680J44682M04222J70898k16859
22038B61865j58564j3634P7623n7604J80899J21619l1843o6888L1452l7058j62056
22027A45811k0885K26971J99127j19770j01742j10382k8401J22706j2395k47482
$$ plain form
22017 53558 -51950 -99920 -275587 -513973 -574956 -546198 -319388 -168169 -315129 -251559
22007 -251559 88434 349790 455557 543325 409652 26537 -269070 -214941 -142128 -112790
21997 -112790 83703 333114 170806 -244084 -433492 -354795 -309773 -123654 -35358 47241
21987 47241 -7555 -157913 -68666 263231 510039 597542 513606 390714 277286 321977 359555
21976 359555 248172 231733 138813 -111535 -117443 15205 139300 95441 1981 89297 132609
21965 132609 92971 41825 207017 342460 497201 619428 666057 675621 632610 571396 562484
21954 562484 631816 672911 697732 838612 751070 494003 192621 -120387 -357719 -292644
21944 -292644 -124225 -109690 -122559 -37525 2860 -38655 32219 151416 -19418 -189016 -357986
$$ packed form
22017E3558j05508m7970j75667k38386o0983K8758K26810J51219j46960O3570
22007b51559L39993K61356J05767Q7768j33673l83115k95607N4129P2813K9338
21997a12790J96493K49411j62308m14890j89408P8697M5022J86119Q8296Q2599
21987D7241n4796j50358Q9247L31897K46808Q7503q3936j22892j13428M4691L7578
21976C59555j11383j6439r2920k50348n908J32648J24095m3859r3460Q7316M3312
21965A32609l9638n1146J65192J35443J54741J22227M6629R564m3011o1214q912
21954E62484O9332M1095K4821J40880q7542k57067l01382l13008k37332O5075
21944b92644J68419J4535j2869Q5034M0385m1515P0874J19197j70834j69598j68970
$$ plain form
21933 -357986 -264658 5684 235109 191639 110416 320179 394493 412879 316443 194276 194397
21922 194397 171556 51046 -84257 16673 144347 210680 197648 -60545 -252858 -206638
21912 -206638 -176804 -201002 -376688 -475967 -469766 -448657 -479772 -441941 -431170 -397410 -241151
21901 -241151 -109036 -43071 107619 76185 -154862 -181046 -259891 -290923 -354005 -300934 -217216
21890 -217216 -215524 -233637 -109550 -90997 -306496 -386741 -366999 -484967 -588640 -777480 -891453
21879 -891453 -706984 -422040 -354944 -207253 88068 25520 -23741 100654 228488 177103
21869 177103 189628 215279 3934 -298264 -295141 -242996 -373861 -452361 -497910 -448608 -192116
21858 -192116 3280 183597 124407 -146373 -344268 -349760 -97472 138104 230020 167150
$$ packed form
21933c57986R3328K70342K29425m3470q1223K09763P4314J8386r6436j22167J21
21922A94397k2841j20510j35303J00930J27674O6333j3032k58193j92313M6220
21912b06638K9834k4198j75686r9279O201K1109l1115L7831J0771L3760J56259
21901b41151J32115O5965J50690l1434k31047k6184p8845l1032o3082N3071Q3718
21890b17216J692j8113J24087J8553k15499q0245J9742j17968j03673j88840j13973
21879h91453J84469K84944O7096J47691K95321o2548m9261J24395J27834n1385
21869A77103J2525K5651k11345l02198L123N2145j30865p8500m5549M9302K56492
21858a92116J95396J80317n9190k70780j97895n492K52288K35576R1916o2870
$$ plain form
21848 167150 197569 217378 175239 221588 298620 169685 9449 71929 256083 103292 -150658
21837 -150658 -227112 -147586 -114612 -77768 100719 86866 106768 387782 498378 422093 166907
21826 166907 4516 -87929 -79807 -64065 23185 -69404 -363422 -531382 -313444 -184580 -282082
21815 -282082 -232685 -243082 -201778 -68537 -149384 -264718 -218175 -193214 -164632 -112537 27581
21804 27581 144893 5384 -6305 304887 490130 577240 919900 1194019 1229910 1107520
21794 1107520 866163 876597 913345 609804 247902 49968 84883 226126 288069 187049
21784 187049 228110 468087 687993 824192 800995 754319 750300 669996 391589 -35488 -317186
21773 -317186 -456974 -290307 -78473 -146240 -365463 -604709 -596373 -550804 -598071 -617232 -495229
$$ packed form
21848A67150L0419J9809m2139M6349P7032j28935j60236O2480J84154j52791k53950
21837a50658p6454P9526L2974L6844J78487j3853J9902K81014J10596p6285k55186
21826A66907j62391r2445Q122J5742Q7250r2589k94018j67960K17938J28864r7502
21815b82082M9397j0397M1304J33241q0847j15334M6543K4961K8582N2095J40118
21804B7581J17312j39509j1689L11192J85243Q7110L42660K74119L5891j22390
21794A107520k41357J0434L6748l03541l61902j97934L4915J41243O1943j01020
21784A87049M1061K39977K19906J36199k3197m6676m019q0304k78407m27077k81698
21773c17186j39788J66667K11834o7767k19223k39246Q336M5569m7267j9161J22003
$$ plain form
21762 -495229 -525061 -514415 -312634 -115973 -74318 -87198 -48052 -46876 -114417 25225 237568
21751 237568 465728 377657 193201 88087 -2808 49502 146268 279222 327064 466838
21741 466838 562596 268307 66614 105797 377892 523665 608063 577462 464074 319223
21731 319223 111560 681 -220803 -449051 -525041 -573988 -736148 -768294 -555049 -349932
21721 -349932 -223029 -143094 25496 -52956 -225194 -24452 259409 397522 241211 48699
21711 48699 -254612 -418295 -361374 -112746 11401 162412 228402 -59540 -385937 -223005
21701 -223005 92062 108227 59644 45682 135365 288114 410600 377888 27048 -156935
21691 -156935 15989 79595 -71922 -262462 -398483 -249973 -12338 140401 41053 -230326
$$ packed form
21762d95229k9832J0646K01781J96661M1655j2880L9146J176o7541J39642K12343
21751B37568K28160q8071j84456j05114r0895N2310R6766J32954M7842J39774
21741D66838R5758k94289k01693L9183K72095J45773Q4398l0601j13388j44851
21731C19223k07663j10879k21484k28248p5990m8947j62160l2146K13245K05117
21721c49932J26903P9935J68590p8452j72238K00742K83861J38113j56311j92512
21711D8699l03311j63683N6921K48628J24147J51011O5990k87942l26397J62932
21701b23005L15067J6165m8583j3962Q9683J52749J22486l2712l50840j83983
21691a56935J72924O3606j51517j90540j36021J48510K37635J52739r9348k71379
$$ plain form
21681 -230326 -245661 -216869 -141776 125465 365727 291017 162890 278980 182593 81335
21671 81335 136254 58189 56570 105190 -66972 -152899 -254515 -482048 -267394 35287 151569
21660 151569 183132 95291 76691 47528 198127 321152 262363 110605 14715 138926 321442
21649 321442 465588 437807 237907 69663 24942 1802 30201 36812 197166 523568 431860
21638 431860 225691 127069 -99734 -196704 -119133 633 257106 835440 1146233 1043979
21628 1043979 840164 795220 815173 941130 1361305 1577995 1501620 1613610 1822426 2120432
21618 2120432 2867554 4159828 5675162 7435841 9902190 13696361 18833089 25412731
21610 25412731 32926950 37082638 33917701 26623538 19783472 14710589 11120308 8693868
$$ packed form
21681b30326j5335K8792P5093K67241K40262p4710j28127J16090r6387j01258
21671H1335N4919p8065j619M8620j72162q5927j01616k27533K14654L02681J16282
21660A51569L1563q7841j8600k9163J50599J23025n8789j51758r5890J24211J82516
21649C21442J44146k7781j99900j68244m4721k3140K8399O611J60354L26402r1708
21638D31860k06169r8622k26803r6970P7571J19766K56473N78334L10793j02254
21628A043979k03815m4944J9953J25957M20175K16690p6375J11990K08816K98006
21618B120432P47122J292274J515334J760679K466349L794171N136728O579642
21610B5412731P514219M155688l164937p294163o840066n072883l590281k426440
$$ plain form
21602 8693868 7016208 5814850 4789374 4065178 3397716 2967671 2744539 2402405 2251447
21593 2251447 2169119 1973412 1828849 1788104 1626681 1440852 1167884 671515 344506 392925
21583 392925 499726 440804 361901 331722 54245 -142528 -42592 86520 123674 112153 236538
21572 236538 177090 115050 185562 298931 275471 234060 204132 24419 -30573 -35351 91377
21561 91377 53220 -179010 -81945 180632 407442 525740 582487 707090 688763 512610
21551 512610 517287 469672 390374 391599 153764 -153767 -351604 -287148 -221877 -333343 -406539
21540 -406539 -193204 36080 121579 141587 205502 211419 20239 21160 333946 554432 429938
21529 429938 185837 160888 72058 -32211 21204 103268 164386 222134 99369 38629 39029
$$ packed form
21602H693868j677660j201358j025476p24196o67462m30045k23132l42134j50958
21593B251447q2328j95707j44563m0745j61423j85829k72968m96369l27009M8419
21583C92925J06801n8922p8903l0179k77477j96773R9936J29112L7154j1521J24385
21572B36538n9448o2040P0512J13369k3460m1411k9928j79713n4992m778J26728
21561I1377l8157k32230R7065K62577K26810J18298N6747J24603j8327j76153
21551E12610M677m7615p9298J225k37835l07531j97837O4456O5271j11466p3196
21540d06539K13335K29284Q5499K0008O3915N917j91180R21L12786K20486j24494
21529D29938k44101k4949q8830j04269N3415Q2064O1118N7748j22765o0740M00
$$ plain form
21518 39029 25284 -11893 -93442 -5990 82546 269703 310370 204051 127900 82619 46714
21507 46714 154791 162786 -22222 -201294 -351108 -395271 -285928 -147615 40981 201571
21497 201571 244986 149562 -98230 -210030 -162602 -65789 -106349 -317625 -387144 -215056 -105347
21486 -105347 2768 109656 232994 383181 274554 159466 115389 -75339 -301621 -567850
21476 -567850 -553622 -314361 -96658 24426 88054 223946 238415 143959 5096 41989
21466 41989 160628 291741 254464 38235 22909 171124 407708 434435 396459 426345 327056
21455 327056 5617 -280032 -257112 -50995 137103 231059 222512 384085 450040 434243 567816
21444 567816 634834 536855 504582 595959 775490 788508 756408 687013 457661 301539 248059
$$ packed form
21518C9029j3745l7177q1549Q7452Q8536J87157M0667j06319p6151m5281l5905
21507D6714J08077P995j85008j79072j49814m4163J09343J38313J88596J60590
21497B01571M3415r5424k47792j11800M7428R6813m0560k11276o9519J72088J09709
21486a05347J08115J06888J23338J50187j08627j15088m4077j90728k26282k66229
21476e67850J4228K39261K17703J21084O3628J35892J4469r4456j38863L6893
21466D1989J18639J31113l7277k16229j5326J48215K36584K6727l7976K9886r9289
21455C27056l21439k85649K2920K06117J88098R3956q547J61573O5955j5797J33573
21444E67816O7018r7979l2273R1377J79531J3018l2100o9395k29352j56122n3480
$$ plain form
21433 248059 392977 592788 601913 503443 350187 260747 315953 388109 238304 8211 -24684
21422 -24684 130333 112875 122709 320362 643043 775827 727256 698669 726770 749785 654675
21411 654675 548417 462364 573494 472899 247675 25827 -78020 -222963 -304804 -275288
21401 -275288 -216628 -73830 202792 333471 190369 86199 85751 191333 286890 205625 16148
21390 16148 106076 186194 90168 -20815 17406 38207 -118842 -289629 -293693 -54886 37387
21379 37387 -64646 -27877 137721 223553 130193 -31594 -162833 -301083 -451664 -428548
21369 -428548 -130720 216380 482615 661742 518029 404184 344194 317975 102735 62523
21359 62523 49235 -212010 -269412 -199945 -241272 -116080 -10866 60785 182174 268182 180282
$$ packed form
21433B48059J44918J99811R125r8470j53256q9440N5206P2156j49805k30093l2895
21422b4684J55017j7458R834J97653L22681J32784m8571k8587K8101K3015r5110
21411F54675j06258q6053J11130j00595k25224k21848j03847j44943q1841K9516
21401b75288N8660J42798K76622J30679j43102j04170m48J05582R5557q1265j89477
21390A6148Q9928Q0118r6026j10983L8221K0801j57049j70787m064K38807R2273
21379C7387j02033L6769J65598Q5832r3360j61787j31239j38250j50581K3116
21369d28548K97828L47100K66235J79127j43713j13845n9990k6219k15240m0212
21359F2523j3288k61245n7402O9467m1327J25192J05214P1651J21389Q6008q7900
$$ plain form
21348 180282 316132 269250 212009 505131 585510 442613 278337 251154 -132746 -177871
21338 -177871 227738 447377 439806 275128 22931 -110457 -59179 -176104 -61221 183785
21328 183785 143339 226996 409273 325025 186695 155055 8947 -234303 -449455 -270091
21318 -270091 132050 172183 119376 368039 630977 791531 812989 651213 509598 336697
21308 336697 65955 122343 318887 395934 350584 394580 450814 390293 61321 -62330 -2648
21297 -2648 -7695 -90470 -13989 90703 -18249 88514 185337 155751 -15033 -95412 -69945
21286 -69945 -258179 -387915 -304840 -266807 -89027 -490 -54810 -131443 -65536 -111165 -129318
21275 -129318 -174323 -190860 -7008 347301 438760 11797 -370261 -441636 -266175 -189364
$$ packed form
21348A80282J35850m6882n7241K93122Q0379j42897j64276k7183l83900m5125
21338a77871M05609K19639p571j64678k52197j33388N1278j16925J14883K45006
21328A83785m0446Q3657J82277q4248j38330l1640j46108k43250k15152J79364
21318b70091M02141M0133n2807K48663K62938J60554K1458j61776j41615j72901
21308C36697k70742N6388J96544P7047m5350M3996N6234o0521l28972j23651N9682
21297b648n047q2775P6481J04692j08952J06763R6823k9586j70784q0379K5467
21286f9945j88234j29736Q3075L8033J77780Q8537n4320p6633O5907m5629j8153
21275a29318m5005j6537J83852L54309R1459m26963l82058p1375J75461P6811
$$ plain form
21265 -189364 -108190 116730 104935 59262 -46521 -175920 -213123 -198999 -202199 -58941 274005
21254 274005 346570 274754 156660 70503 -107060 -207143 -249723 -257951 -252955 31422 297622
21243 297622 358403 364854 386786 295278 232217 210934 155736 -4918 1779 249091 326075
21232 326075 151960 40838 121348 169965 4694 -249275 -314748 -316093 -257174 -103824 18913
21221 18913 86980 -127006 -416463 -484485 -413510 -419604 -444298 -316866 -74911 -30483 -60476
21210 -60476 -53487 35468 -8864 57677 -8265 -307955 -337143 -105988 59715 152750 211992
21199 211992 264736 473000 497132 385615 212329 -1631 98288 366724 506765 444044
21189 444044 349288 199499 254588 325700 344756 522564 441153 393101 287701 170674 251921
$$ packed form
21265a89364Q1174K24920j1795m5673j05783j29399l7203J4124l200J43258L32946
21254B74005P2565p1816j18094q6157j77563j00083m2580q228M996K84377K66200
21243B97622O0781O451K1932r1508o3061k1283n5198j60654O697K47312P6984
21232C26075j74115j11122Q0510M8617j65271k53969o5473j345N8919J53350J22737
21221A8913O8067k13986k89457o8022P0975o094k4694J27432K41955M4428k9993
21210f0476O989Q8955m4332O6541o5942k99690k9188K31155J65703R3035N9242
21199B11992N2744K08264K4132j11517j73286k13960R9919K68436J40041o2721
21189D44044r4756j49789N5089P1112J9056J77808q1411m8052j05400j17027Q1247
$$ plain form
21178 251921 452057 674013 714036 683176 585400 259244 -61250 -220397 -49057 46593
21168 46593 8492 7103 -61326 -111926 -23536 122287 338137 682932 1013910 1213648 1183391
21157 1183391 1057178 1070324 969717 706970 554422 461349 277710 162383 6695 16598
21147 16598 131169 61310 -97764 -147446 -31168 237638 594514 567707 438349 562969
21137 562969 588915 710801 1013434 1016786 669756 226039 53265 96915 132071 24171
21127 24171 172502 525880 620684 629191 511286 447917 550331 719119 768477 500267 302000
21116 302000 338496 623143 857281 847483 639514 703581 675123 671661 653510 703775 790245
21105 790245 745383 773863 806115 772315 961079 1096908 1184970 1216894 1455495 1747256 2061073
$$ packed form
21178B51921K00136K21956M0023l0860r7776l26156l20494j59147J71340R5650
21168D6593l8101j389o8429n0600Q8390J45823K15850L44795L30978J99738l0257
21157A183391j26213J3146j00607k62747j52548r3073j83639j15327j55688R903
21147A6598J14571o9859j59074m9682J16278K68806L56876k6807j29358J24620
21137E62969K5946J21886L02633L352l47030m43717j72774M3650L5156j07900
21127B4171J48331L53378R4804Q507j17905o3369J02414J68788M9358k68210j98267
21116C02000L6496K84647K34138r798k07969O4067k8458l462j8151N0265Q6470
21105G90245m4862K8480L2252l3800J88764J35829Q8062L1924K38601K91761L13817
$$ plain form
21094 2061073 2507900 3255138 4378114 6689512 10047233 15666095 24533018 35271099
21086 35271099 35905517 26127816 18184609 13106534 9939957 7709566 6325778 5362508
21078 5362508 4841247 4395155 4029008 3525197 3189897 2796087 2429443 2083116 1970397
21069 1970397 1813975 1683310 1384089 1001010 838879 806468 807399 882103 667717 662278 1054187
21058 1054187 1288678 1219405 1036717 765371 544858 584445 757866 919227 851254 737322
21048 737322 671084 539218 291611 284816 580290 792973 891419 1017935 845374 685453
21038 685453 651138 647944 572553 469823 253346 4046 62135 557460 1131219 1227273 1154480
21027 1154480 927971 673943 500521 301996 90595 -6319 -16825 229577 592909 825070
$$ packed form
21094B061073M46827P47238J122976K311398L357721N618862Q866923J0738081
21086C5271099O34418r777701p943207n078075l166577k230391j383788r63270
21078E362508n21261m46092l66147n03811l35300l93810l66644l46327j12719
21069A970397j56422j30665k99221l83079j62131l2411R31P4704k14386n439L91909
21058A054187K34491o9273j82688k71346k20513L9587J73421J61361o7973j13932
21048G37322o6238j31866k47607o795K95474K12683R8446J26516j72561j59921
21038F85453l4315l194p5391j02730k16477k49300N8089M95325N73759R6054p2793
21027A154480k26509k54028j73422j98525k11401r6914j0506K46402L63332K32161
$$ plain form
21017 825070 964261 1116115 1180346 1057744 1002538 1081105 1280710 1597702 1692273 1348460
21007 1348460 1128715 1089575 1102104 996331 798070 799796 969598 907002 714953 757173
20997 757173 949549 1255055 1616712 1745069 1885115 2375117 2947088 3479946 3829119 3897891
20987 3897891 3726855 3574167 3342834 3119360 2754446 2454293 2318038 2249240 2261603 2267947
20977 2267947 2377787 2407518 2249206 2118139 2051539 1941388 2069488 2443251 2429401 2180744
20967 2180744 2165952 2208520 2231506 2130097 1904314 1800037 1758643 1890535 1919210 1945978
20957 1945978 2203670 2392602 2503658 2335731 1916971 1781378 1733783 1817714 1942218 2032863
20947 2032863 2263133 2838163 3429079 3863380 4190221 4495314 4924534 5082839 5192444
$$ packed form
21017H25070J39191J51854O4231j22602n5206P8567J99605L16992R4571l43813
21007A348460k19745l9140J2529j05773j98261J726J69802o2596j92049M2220
20997G57173J92376L05506L61657J28357J40046M90002N71971N32858L49173O8772
20987C897891j71036j52688k31333k23474l64914l00153j36255o8798J2363O344
20977B267947J09840K9731j58312j31067o6600j10151J28100L73763j3850k48657
20967B180744j4792M2568K2986j01409k25783j04277m1394J31892K8675K6768
20957A945978K57692J88932J11056j67927m18760j35593m7595Q3931J24504R0645
20947B032863K30270N75030N90916M34301L26841L05093M29220J58305J09605
$$ plain form
20938 5192444 5473023 5616218 5906776 6845437 8018681 9045244 10277512 11876526 13553580
20929 13553580 15426759 17607979 19942750 22634490 26233263 31105716 37681215 47321181
20921 47321181 61634094 81752774 107087761 135173060 165112755 193951107 216598548
20914 216598548 232085812 236194144 227779904 211616043 188085836 160732707 133372678
20907 133372678 107361406 85488508 68887720 56326230 46981799 40073245 34717521
20900 34717521 30498453 27135116 24740169 22949912 21400763 20480896 20312705 21054295
20892 21054295 23095988 25927549 29029714 32535533 35867342 38327746 39944683 39288539
20884 39288539 36953107 33694334 29344747 25162447 21314771 17749540 15013051 13271357
$$ packed form
20938E192444K80579J43195K90558R38661J173244J026563J232268J599014J677054
20929A3553580J873179K181220K334771K691740L598773M872453O575499R639966
20921D7321181J4312913K0118680K5334987K8085299K9939695K8838352K2647441
20914B16598548J5487264M108332q414240j6163861k3530207k7353129k7360029
20907A33372678k6011272k1872898j6600788j2561490r344431o908554n355724
20900C4717521m219068l363337k394947j790257j549149r19867j68191P41590
20892B1054295K041693K831561L102165L505819L331809K460404J616937o56144
20884C9288539k335432l258773m349587m182300l847676l565231k736489j741694
$$ plain form
20876 13271357 12024971 10989029 10306301 9724669 9518909 9693976 9997883 10236042 10595992
20867 10595992 11271323 12085175 13078585 14211160 15421258 16865026 18791801 21048369
20859 21048369 23219832 25940432 29991316 35837553 44458591 56799320 74337526 98124205
20851 98124205 126050242 155683645 186639131 213365205 233104140 244160280 240761379
20844 240761379 227384328 206536113 178933272 150051556 121948032 96739233 76887799
20837 76887799 62149748 50994871 42463807 35825691 30697649 26876241 23937408 21351002
20829 21351002 18958660 16903820 15230211 13787900 12759986 11823749 11094328 10617205
20821 10617205 10262279 9850413 9359743 8938683 8522774 8082238 7670313 7306920 7210591
$$ packed form
20876A3271357j246386j035942o82728n81632k05760J75067L03907K38159L59950
20867A0595992O75331Q13852R93410J132575J210098J443768J926775K256568
20859B1048369K171463K720600M050884N846237Q621038J2340729J7538206K3786679
20851I8124205K7926037K9633403L0955486K6726074J9738935J1056140l398901
20844B40761379j3377051k0848215k7602841k8881716k8103524k5208799j9851434
20837G6887799j4738051j1154877q531064o638116n128042l821408k938833k586406
20829B1351002k392342k054840j673609j442311j027914r36237p29421m77123
20821A0617205l54926m11866m90670m21060m15909m40536m11925l63393r6329
$$ plain form
20812 7210591 7135592 6941105 6722487 6691508 6984412 7149829 7151105 7203456 7577687 8030231
20802 8030231 8458857 9047375 9841935 10866319 11819409 12914666 14318214 15808081 17460758
20793 17460758 19547167 21696997 24186739 27563730 32518422 39666983 50013388 64903328
20785 64903328 85386562 111042741 139649864 169577983 198034903 220247618 235173784
20778 235173784 238638446 228918636 211181085 186590656 158477712 130773089 104819877
20771 104819877 82901038 66285495 53973910 44605988 37371962 31554433 26977163
20764 26977163 23353385 20341582 17844121 15857138 14334028 13143729 12032054 11018802
20756 11018802 10184101 9441330 8776068 7860739 6773848 5948618 5446254 5101434 4913627
$$ packed form
20812G210591p4999j94487k18618l0979K92904J65417J276N2351L74231M52544
20802H030231M28626N88518P94560J024384R53090J095257J403548J489867J652677
20793A7460758K086409K149830K489742L376991M954692P148561J0346405J4889940
20785F4903328K0483234K5656179K8607123K9928119K8456920K2212715J4926166
20778B35173784L464662r719810j7737551k4590429k8112944k7704623k5953212
20771A04819877k1918839j6615543j2311585r367922p234026n817529m577270
20764B6977163l623778l011803k497461j986983j523110j190299j111675j013252
20756A1018802q34701p42771o65262r15329j086891q25230n02364l44820j87807
$$ plain form
20747 4913627 4755191 4405803 4235942 4106891 3970525 3843891 3550820 3339708 3149290
20738 3149290 3090849 3194276 3283445 3386477 3183781 3090032 3046522 2851922 2521478 2290785
20728 2290785 2279813 2289937 2189352 2113752 2033447 2163223 2384089 2066108 1850248 2021766
20718 2021766 2114858 2039428 1923658 1847912 1769606 1818477 2229930 2870249 2972823 3082604
20708 3082604 3413920 3816460 4147633 4231809 4028095 3463134 2860370 2466457 2095478 1883457
20698 1883457 1917580 1994774 1874141 1649183 1527545 1638776 1707343 1630971 1419094 1306435
20688 1306435 1156174 775905 416159 405743 522422 661539 987439 1061099 900434 759730
20678 759730 989092 1040016 942023 858787 774505 805050 832187 861026 785859 753027 911624
$$ packed form
20747D913627j58436l49388j69861j29051j36366j26634k93071k11112j90418
20738C149290n8441J03427Q9169J03032k02696r3749m3510j94600l30444k30693
20728B290785j0972J0124j00585p5600q0305J29776K20866l17981k15860J71518
20718B021766R3092p5430j15770p5746p8306M8871M11453O40319J02574J09781
20708C082604L31316M02540L31173Q4176k03714n64961o02764l93913l70979k12021
20698A883457L4123P7194j20633k24958j21638J11231O8567p6372k11877j12659
20688A306435j50261l80269l59746j0416J16679J39117L25900P3660j60665j40704
20678G59730K29362N0924r7993q3236q4282L0545K7137K8839p5167l2832J58597
$$ plain form
20667 911624 972653 955605 957001 1001701 1112572 1415038 1456787 1069394 650731 352208 599705
20656 599705 1061694 973285 811624 871481 1008824 1058047 1268812 1266076 1042238 775159
20646 775159 594018 518616 516676 435439 323371 166731 -10923 -105902 3824 118756
20636 118756 148535 192960 220818 138171 189911 229534 110959 -138772 -315534 -370261 -517875
20625 -517875 -474207 -311229 16884 172797 151653 -16407 -38248 -120460 -252103 -122869
20615 -122869 -8279 -11657 -26729 307488 632066 654975 509816 429387 335571 474085 666221
20604 666221 781159 611651 309202 311644 438157 495283 511057 506622 204778 -168825 -244962
20593 -244962 -139199 232453 370941 233462 204502 85441 7765 -32491 132132 263312
$$ packed form
20667I11624O1029j7048J396M4700J10871L02466M1749l87393m18663k98523K47497
20656E99705M61989q8409j61661N9857J37343M9223K10765k736k23838k67079
20646G75159j81141p5402j940q1237j12068j56640j77654r4979J09726J14932
20636A18756K9779M4425K7858q2647N1740L9623j18575k49731j76762n4727j47614
20625e17875M3668J62978L28113J55913k1144j68060k1841q2212j31643J29234
20615a22869J14590l378j5072L34217L24578K2909j45159q0429r3816J38514J92136
20604F66221J14938j69508l02449K442J26513N7126J5774m435l01844l73603p6137
20593b44962J05763L71652J38488j37479k8960j19061p7676m0256J64623J31180
$$ plain form
20583 263312 248960 394855 638459 727128 443657 254457 407434 668426 906939 834759
20573 834759 592767 523861 512284 292225 74133 -144447 -326656 -132521 230341 345243
20563 345243 453013 502408 226578 84865 53519 45690 134181 176332 203699 301220 365803
20552 365803 593696 721936 576400 479132 520144 616365 901999 1162364 1236624 919293
20542 919293 658548 457712 193899 -35142 47034 232436 260310 157030 -124685 -286515
20532 -286515 -163866 -105477 -95246 160463 389167 480721 433362 320891 204302 275808
20522 275808 359010 101442 11074 135499 213751 272953 353227 343455 86035 121157 305906
20511 305906 325037 389620 491205 268452 106035 9223 202980 424247 437298 283480
$$ packed form
20583B63312j4352J45895K43604Q8669k83471j89200J52977K60992K38513p2180
20573H34759k41992o8906j1577k20059k18092k18580j82209J94135L62862J14902
20563C45243J07770M9395k75830j41713l1346p829Q8491M2151K7367R7521O4583
20552C65803K27893J28240j45536r7268M1012R6221K85634K60365P4260l17331
20542I19293k60745k00836k63813k29041Q2176J85402K7874j03280k81715j61830
20532b86515J22649N8389J0231K55709K28704R1554m7359j12471j16589P1506
20522B75808Q3202k57568r0368J24425P8252N9202Q0274r772k57420L5122J84749
20511C05906J9131O4583J01585k22753j62417r6812J93757K21267J3051j53818
$$ plain form
20501 283480 124211 131539 80007 -36007 23645 27388 -331477 -666536 -584582 -371998 -235633
20490 -235633 -89213 7955 76538 116721 -14920 60831 473785 802213 870662 502645
20480 502645 83797 -40141 -151180 -252724 -285801 -379209 -233561 166759 307723 421594
20470 421594 436363 258577 -34225 -287191 -282293 -177301 -165958 -104908 -220647 -335521
20460 -335521 -282904 -12738 311802 333334 56810 -238361 -438886 -481140 -541644 -655371
20450 -655371 -399001 -114647 52587 -66300 -352095 -578433 -643333 -556572 -225735 -128497
20440 -128497 -360190 -259001 21432 194278 190385 116222 -91983 -290401 -343137 -250268
20430 -250268 -18070 257668 217386 -71402 -146749 -77402 -47367 -158370 -314169 -617805
$$ packed form
20501B83480j59269P328n1532j16014N9652L743l58865l35059Q1954K12584J36365
20490b35633J46420R7168O8583M0183j31641P5751M12954L28428O8449l68017
20480E02645m18848j23938j11039j01544l3077r3408J45648M00320J40964J13871
20470D21594J4769j77786k92802k52966M898J04992J1343O1050j15739j14874
20460c35521N2617K70166L24540K1532k76524k95171k00525m2254o0504j13727
20450f55371K56370K84354J67234j18887k85795k26338o4900Q6761L30837R7238
20440a28497k31693J01189K80433J72846l893p4163k08205j98418n2736R2869
20430b50268K32198K75738m0282k88788p5347O9347L0035j11003j55799l03636
$$ plain form
20420 -617805 -667730 -667932 -582804 -424976 -312229 -176972 -157007 -275108 -218511 -197943 -118141
20409 -118141 65574 193020 339064 425697 316954 266329 301136 278735 234598 126910
20399 126910 250749 537300 716101 601710 413778 283518 88722 -96885 -313392 -388470
20389 -388470 -179440 5240 -29564 -17319 -61376 -71199 83633 221327 261625 159685 219857
20378 219857 128374 -166669 -332572 -419332 -459714 -514106 -546978 -323819 10348 -171671
20368 -171671 -498498 -485890 -341419 -217854 -68227 150125 194039 1818 -288098 -324267
20358 -324267 -343235 -440189 -595490 -564151 -292097 -219131 -218907 -229851 -216078 -183835 -149594
20347 -149594 -158919 -162283 12712 271544 290052 -118932 -255156 -141689 -199723 -222053 -285543
$$ packed form
20420f17805m9925k02Q5128J57828J12747J35257J9965j18101N6597K0568P9802
20409a18141J83715J27446J46044Q6633j08743n0625L4807k2401m4137j07688
20399A26910J23839K86551J78801j14391j87932j30260j94796j85607k16507p5078
20389c88470K09030J84680l4804J2245m4057r823J54832J37694M0298j01940O0172
20378B19857r1483k95043j65903q6760m0382n4392l2872K23159L34167j82019
20368a71671l26827J2608J44471J23565J49627K18352M3914j92221k89916l6169
20358c24267j8968r6954j55301L1339K72054P2966K24j0944J3773L2243L4241
20347a49594r325l364J74995K58832J8508m08984j36224J13467n8034k2330o3490
$$ plain form
20336 -285543 -282998 -335763 -626891 -710956 -401708 23782 253666 366690 590229 576416
20326 576416 445248 340139 337625 333254 171901 -77686 -158558 -63148 -85980 -30833 -175582
20315 -175582 -274993 -280992 -253390 -300385 -439000 -707525 -1024821 -930267 -514917 -157051 -108917
20304 -108917 -89883 -150213 -392448 -531570 -484172 -321590 -301574 -390908 -381392 -124815 -100621
20293 -100621 -340812 -605687 -540209 -414540 -362598 -348620 -173411 -89313 -319362 -443601
20283 -443601 -101691 351548 490283 344653 152164 -13442 -106750 11226 204051 191284
20273 191284 66951 1285 -139813 -280994 -310741 -235948 -12223 222825 441305 476438
20263 476438 151757 -277403 -531015 -536334 -374536 -203892 -273693 -510918 -450308 -175661
$$ packed form
20336b85543K545n2765k91128q4065L09248M25490K29884J13024K23539j3813
20326E76416j31168j05109k514m371j61353k49587q0872R5410k2832N5147j44749
20315a75582r9411n999K7602m6995j38615k68525l17296R4554M15350L57866M8134
20304a08917J9034o0330k42235j39122M7398J62582K0016q9334R516K56577K4194
20293a00621k40191k64875O5478J25669N1942J3978J75209Q4098k30049j24239
20283d43601L41910M53239J38735j45630j92489j65606r3308J17976J92825j2767
20273A91284j24333o5666j41098j41181k9747P4793K23725K35048K18480L5133
20263D76438l24681m29160k53612n319J61798J70644o9801k37225O0610K74647
$$ plain form
20253 -175661 -28954 59297 123124 18264 -112341 -55307 -108533 -257079 -230240 -209154 -142678
20242 -142678 106399 303365 305891 263961 76482 -188978 -323601 -327667 -376234 -407691 -510807
20231 -510807 -537120 -225107 78156 339377 208974 107780 187341 370771 405237 203691
20221 203691 52318 -153381 -334930 -257430 -45190 -52563 -191159 -178340 -160072 -113343 -91379
20210 -91379 12946 37841 -115044 6330 149023 25861 -180819 -476583 -404514 -303091
20200 -303091 -214153 -1148 296194 456751 522950 615680 586452 372940 123018 77232
20190 77232 75540 -19652 -219381 -323353 -331767 -330001 -189761 -123571 -92122 -97843 -243356 -377840
20178 -377840 -299515 -268959 -214744 -216464 -20009 199428 215934 397277 421697 396251 420585
$$ packed form
20253a75661J46707Q8251O3827j04860j30605N7034n3226j48546K6839K1086O6476
20242a42678K49077J96966K526m1930j87479k65460j34623m066m8567l1457j03116
20231e10807k6313L12013L03263K61221j30403j01194P9561J83430L4466k01546
20221B03691j51373k05699j81549P7500K12240p373j38596J2819J8268M6729K1964
20210i1379J04325K4895j52885J21374J42693j23162k06680k95764P2069J01423
20200c03091Q8938K13005K97342J60557O6199R2730k9228k13512k49922m5786
20190G7232j692r5192j99729j03972q414J766J40240O6190L1449n721j45513j34484
20178c77840P8325L0556N4215j720J96455K19437J6506J81343K4420k5446K4334
$$ plain form
20167 420585 67397 -298951 -350177 -197133 -42101 141620 140475 -68675 -276769 -414903
20157 -414903 -406610 -547727 -574627 -332105 -303140 -422412 -251003 202776 334155 131837
20147 131837 5686 -99968 -25232 134999 380552 408162 242951 680 -253813 -283979
20137 -283979 -114246 124649 150557 59122 -32211 -84355 63925 130451 178518 28021 -142645
20126 -142645 -221893 -374129 -535054 -543351 -368942 -388537 -492861 -426812 -437211 -425514 -414186
20115 -414186 -393267 -471490 -582812 -590461 -432332 -506777 -578129 -488112 -329822 -274973 -573605
20104 -573605 -682514 -557359 -450509 -501252 -334072 29170 175763 -54402 -174052 -142673
20094 -142673 -249394 -406309 -365834 -439602 -573465 -316127 -227569 -370124 -456458 -331201
$$ packed form
20167D20585l53188l66348n1226J53044J55032J83721j145k09150k08094j38134
20157d14903Q293j41117k6900K42522K8965j19272J71409M53779J31379k02318
20147A31837j26151j05654P4736J60231K45553K7610j65211k42271k54493l0166
20137b83979J69733K38895K5908r1435r1333n2144J48280O6526M8067j50497j70666
20126a42645p9248j52236j60925q297J74409j9595j04324O6049j0399J1697J1328
20115d14186K0919p8223j11322p649J58129p4445p1352R0017J58290N4849k98632
20104e73605j08909J25155J06850n0743J67180L63242J46593k30165j19650L1379
20094a42673j06721j56915M0475p3768j33863K57338Q8558j42555q6334J25257
$$ plain form
20084 -331201 52654 446679 446416 242859 90108 68920 182547 93267 59954 142424 215207
20073 215207 -80079 -476991 -596644 -553406 -402030 -331720 -395849 -383238 -140581 -46816
20063 -46816 -140659 48900 311535 485336 434603 261885 80264 161626 225250 -14676
20053 -14676 -191321 -205882 -87716 38761 290771 417646 200664 26376 -4600 -2602
20043 -2602 18814 -111293 -31766 -32308 -222218 -349533 -160732 -242050 -335511 -90843 84154
20032 84154 88174 -129332 -296163 -327554 -430460 -520504 -518939 -483821 -547846 -563812 -530446
20021 -530446 -532232 -425250 -282543 -237 104406 -111753 -231957 -345937 -480092 -422710
20011 -422710 -279536 -443216 -523949 -551221 -531965 -343567 -107813 107862 96746 -2618
$$ packed form
20084c31201L83855L94025k63k03557j52751k1188J13627q9280l3313Q2470P2783
20073B15207k95286l96912j19653M3238J51376P0310o4129J2611K42657R3765
20063d6816r3843J89559K62635J73801n0733j72718j81621Q1362O3624k39926
20053a4676j76645j4561J18166J26477K52010J26875k16982j74288l0976J998
20043b602K1416j30107P9527n42j89910j27315J88801q1318r3461K44668J74997
20032H4154M020k17506j66831l1391j02906r0044J565L5118o4025j5966L3366
20021e30446j786J06982J42707K82306J04643k16159j20204j13980j34155N7382
20011d22710J43174j63680q0733k7272J9256J88398K35754K15675j1116r9364
$$ plain form
20001 -2618 -22584 120137 289389 392726 572701 527043 405457 313277 239069 -14459 -422510
19990 -422510 -497231 -443499 -324060 -4304 95207 -117190 -135907 3018 63111 -69274
19980 -69274 -244172 -208927 -156548 -115411 -229847 -164042 92100 78567 130458 315240 376787
19969 376787 229020 74535 21581 26048 195412 692655 936314 823777 671946 702344
19959 702344 608591 211709 -72573 -132607 -119211 183353 357106 106949 -291332 -504621
19949 -504621 -623731 -721426 -717893 -590016 -159782 299909 819167 1060248 923495 761152
19939 761152 674082 716800 493010 270923 245165 85529 97061 239975 266545 267541 262929
19928 262929 187289 75313 11927 -88290 -120029 7513 211799 331204 383824 323743
$$ packed form
20001b618j9966J42721J69252J03337J79975m5658j21586r2180p4208k53528m08051
19990d22510p4721N3732J19439L19756R9511k12397j8717J38925O0093j32385
19980f9274j74898L5245N2379M1137j14436O5805K56142j3533N1891J84782O1547
19969C76787j47767j54485n2954M467J69364M97243K43659j12537j51831L0398
19959G02344r3753l96882k84282o0034J3396L02564J73753k50157l98281k13289
19949e04621j19110r7695L533J27877M30234M59691N19258K41081j36753j62343
19939G61152q7070M2718k23790k22087k5758j59636J1532J42914K6570R96m612
19928B62929p5640j11976o3386j00217l1739J27542K04286J19405N2620o0081
$$ plain form
19918 323743 184311 -5220 -58793 -98494 -17670 147438 164242 -29105 -222049 -327149
19908 -327149 -255179 5725 454318 643864 431563 113618 -59595 -47797 -32697 -58901
19898 -58901 -53339 33268 134971 355128 440148 445208 555364 611118 369110 253163 35661
19887 35661 -40856 182456 216603 -122629 -311849 -65965 235835 343391 257712 181083
19877 181083 90463 -53266 -106261 73726 155102 77055 146293 229175 155126 100616 177761
19866 177761 170400 259421 307805 269055 346358 373936 400031 266845 -87615 -304770 -372327
19855 -372327 -396593 -128505 29653 93515 87984 -28031 -172204 -234495 -62525 309939
19845 309939 523686 362524 270017 267720 117377 171756 237965 412161 478955 406816 488702
$$ packed form
19918C23743j39432j89531n3573l9701Q0824J65108J6804j93347j92944j05100
19908c27149P1970K60904M48593J89546k12301l17945j73213J1798J5100k6204
19898e8901N562Q6607J01703K20157Q5020N060J10156N5754k42008j15947k17502
19887C5661p6517K23312L4147l39232j89220K45884L01800J07556q5679p6629
19877A81083r0620j43729n2995J79987Q1376p8047O9238Q2882p4049n4510P7145
19866A77761p361Q9021M8384l8750P7303K7578K6095j33186l54460k17155o7557
19855c72327k4266K68088J58158O3862n531j16015j44173o2291J71970L72464
19845C09939K13747j61162r2507k297j50343N4379O6209J74196O6794p2139Q1886
$$ plain form
19834 488702 357445 -50171 -283500 -284859 -115252 8586 227143 346043 280011 348848
19824 348848 495951 570212 592630 447048 324522 192939 78149 258333 491664 757288
19814 757288 874511 854583 628221 548410 597613 459457 344759 192311 200685 433685
19804 433685 397721 141696 -9912 109603 135500 126023 259239 378740 428852 337686 304691
19793 304691 241700 229639 -103758 -357168 -358872 -178860 188269 315856 309751 154815 -27655
19782 -27655 -25720 -48947 -13381 42237 -117613 -336737 -451175 -343330 -263273 -218214 -143910
19771 -143910 -59738 100044 109128 46127 260121 196647 20074 86931 132556 70462 -23338
19760 -23338 -135022 -210517 -117654 -114107 -63071 342614 584089 590537 497748 331502 163930
$$ packed form
19834D88702j31257m07616k33329j359J69607J23838K18557J18900o6032O8837
19824C48848J47103P4261K2418j45582j22526j31583j14790J80184K33331K65624
19814G57288J17223j9928k26362p9811M9203j38156j14698j52448Q374K33000
19804D33685l5964k56025j51608J19515K5897r477J33216J19501N0112r1166l2995
19793C04691o2991j2061l33397k53410j704J80012L67129J27587o105j54936j82470
19782b7655J935k3227L5566N5618j59850k19124j14438J07845Q0057M5059P4304
19771a43910Q4172J59782R084o3001K13994o3474j76573O6857M5625o2094r3800
19760b3338j11684p5495R2863L547N1036M05685K41475O448r2789j66246j67572
$$ plain form
19749 163930 233250 383317 275381 275609 374818 333805 376850 538627 617101 584533 521716
19738 521716 604457 577714 405951 457982 369157 259295 355132 481062 479466 339078 164954
19727 164954 309307 555565 503611 352606 377395 583258 638685 660981 822007 786037
19717 786037 626563 594142 623272 760680 785342 604194 522439 535589 352782 -74983
19707 -74983 -469450 -634568 -514996 -339373 -107666 195039 119418 -61352 90415 163822
19697 163822 173422 93139 204015 402093 425403 422551 365529 410653 528116 429338 187811
19686 187811 45236 32367 7078 39916 149655 169815 -123604 -328450 -172823 -35502
19676 -35502 128347 291413 301737 234592 212705 237380 284390 326316 356798 366785 384136
$$ packed form
19749A63930O9320J50067j07936K28R9209m1013M3045J61777P8474l2568o2817
19738E21716Q2741k6743j71763N2031q8825j09862R5837J25930j596j40388j74124
19727A64954J44353K46258n1954j51005K4789K05863N5427K2296J61026l5970
19717G86037j59474l2421K9130J37408K4662j81148q1755J3150j82807m27765
19707g4983l94467j65118J19572J75623K31707L02705p5621j80770J51767P3407
19697A63822R600q0283J10876J98078K3310k852n7022M5124J17463r8778k41527
19686A87811j42575j2869k5289L2838J09739K0160k93419k04846J55627J37321
19676c5502J63849J63066J0324o7145k1887K4675M7010M1926L0482R987J7351
$$ plain form
19665 384136 487885 558268 460478 293674 282315 299542 283816 253016 331303 533761 425306
19654 425306 307504 564532 965997 1161462 1052213 920190 857106 760769 802169 927718
19644 927718 1054138 1112542 975267 636936 416696 466344 487390 514668 648464 690393
19634 690393 490393 490803 436598 534233 676494 518443 585927 705978 678528 705929 635865
19623 635865 404255 151945 178410 387747 432634 163125 -41624 -28836 68205 80198
19613 80198 -67813 64672 267738 424046 278177 33712 106945 364351 567546 595514
19603 595514 530350 429848 299161 209367 166728 212660 244314 217282 344483 560924 646824
19592 646824 662196 736633 842458 955615 842016 685430 413190 304347 405219 359883
$$ packed form
19665C84136J03749P0383r7790j66804j1359J7227j5726l0800P8287K02458j08455
19654D25306j17802K57028M01465J95465j09249j32023o3084r6337M1400J25549
19644I27718J26420N8404j37275l38331k20240M9648K1046K7278J33796M1929
19634F90393k00000M10n4205R7635J42261j58051O7484J20051k7450K7401p0064
19623F35865k31610k52310K6465K09337M4887k69509k04749J2788R7041J1993
19613H0198j48011J32485K03066J56308j45869k44465P3233K57406K03195K7968
19603E95514o5164j00502j30687q9794m2639M5932L1654k7032J27201K16441Q5900
19592F46824J5372P4437J05825J13157j13599j56586k72240j08843J00872m5336
$$ plain form
19582 359883 286529 308907 482381 584196 589249 550728 613460 800213 909299 933084 853161
19571 853161 797246 887631 964850 916805 719275 677377 860799 963039 875155 703626 526021
19560 526021 698666 926292 826843 626954 471883 362311 516238 753634 792344 615154
19550 615154 410276 425318 497150 617899 654768 798371 966910 1090092 1106534 1145187
19540 1145187 1059059 775952 788017 916418 995260 757612 478961 499827 619296 790833
19530 790833 1052089 1076537 812318 749669 923549 1138602 1224508 891716 626417 748895
19520 748895 846910 1018644 1233435 1130548 979988 807464 895965 1179753 1305452 1244026
19510 1244026 996358 819859 782556 838383 790790 782313 955062 1167061 1270239 1473182
$$ packed form
19582C59883p3354K2378J73474J01815N053l8521O2732J86753J09086K3785p9923
19571H53161n5915R0385P7219m8045j97530m1898J83422J02240q7884j71529j77605
19560E26021J72645K27626r9449j99889j55071j09572J53927K37396L8710j77190
19550F15154k04878J5042P1832J20749L6869J43603J68539J23182J6442L8653
19540A145187q6128k83107J2065J28401P8842k37648k78651K0866J19469J71537
19530G90833K61256K4448k64219o2649J73880K15053Q5906l32792k65299J22478
19520G48895R8015J71734K14791j02887j50560j72524Q8501K83788J25699o1426
19510A244026k47668j76499l7303N5827m7593q477J72749K11999J03178K02943
$$ plain form
19500 1473182 1782714 1700628 1533348 1586344 1586279 1756264 1745306 1578601 1497370 1230743 877240
19489 877240 863916 940203 746997 766556 935081 1060100 1055513 1054422 821602 695021 901251
19478 901251 1201878 1206910 942373 930667 889603 604584 435697 445499 376714 269966 290154
19467 290154 454947 624982 715167 882522 804047 730731 817332 937462 1320799 1451710
19457 1451710 1412166 1312658 1046562 858367 654076 409068 358929 254788 309242 654480
19447 654480 764669 797663 774736 760954 904775 956846 1051299 1258211 1202938 1165400 1147872
19436 1147872 887080 738566 741718 698179 580537 507893 619105 725555 792326 919402
19426 919402 924085 755378 785445 807091 893848 957094 867259 830744 753572 865480 859555
$$ packed form
19500A473182L09532q2086j67280N2996o5J69985j0958j66705q1231k66627l53503
19489H77240j3324P6287j93206J9559J68525J25019m587j091k32820j26581K06230
19478I01251L00627N032k64537j1706m1064k85019j68887R802o8785j06748K0188
19467B90154J64793J70035R0185J67355p8475p3316Q6601J20130L83337J30911
19457A451710l9544r9508k66096j88195k04291k45008n0139j04141N4454L45238
19447F54480J10189L2994k2927j3782J43821N2071R4453K06912n5273l7538j7528
19436A147872k60792j48514L152m3539j17642p2644J11212J06450O6771J27076
19426I19402M683j68707L0067K1646Q6757O3246q9835l6515p7172J11908n925
$$ plain form
19415 859555 887479 1020513 1073108 995554 986084 869077 547821 546948 631121 813751 921273
19404 921273 852896 827477 837047 1008835 1148398 1105580 972813 856375 735888 851548
19394 851548 1012243 1212023 1340003 1268605 1276133 1369902 1557084 1714856 1748751 1486029
19384 1486029 1162689 1111310 1312466 1458949 1518549 1436792 1418304 1521200 1457213 1393522
19374 1393522 1354030 1494952 1630744 1600916 1535960 1567934 1855649 2151618 2316354 2231710
19364 2231710 2035533 2015593 1985577 1720008 1537859 1665092 1869377 2079556 2015285 1951065
19354 1951065 2054205 1974035 2076673 2193211 2237410 2316341 2451575 2868224 3456517 4198015
19344 4198015 4912682 5448597 5702571 5898406 6257681 6796951 7392154 7566995 7314850
$$ packed form
19415H59555K7924J33034N2595p7554r470j17007l21256q73Q4173J82630J07522
19404I21273o8377k5419R570J71788J39563m2818j32767j16438j20487J15660
19394H51548J60695J99780J27980p1398P528R3769J87182J57772L3895k62722
19384A486029l23340n1379K01156J46483N9600q1757j8488J02896o3987o3691
19374A393522l9492J40922J35792k9828o4956L1974K87715K95969J64736q4644
19364B231710j96177j9940l0016k65569j82149J27233K04285K10179o4271o4220
19354A951065J03140q0170J02638J16538M4199P8931J35234M16649N88293P41498
19344D198015P14667N35915K53974J95835L59275N39270N95203J74841k52145
$$ plain form
19335 7314850 6887439 6532876 6164130 5679402 5211551 4920349 4767814 4606990 4372628
19326 4372628 4052693 3833023 3809845 3876961 4108708 4213355 4405701 4623284 4683181 4789634
19316 4789634 4843735 4862557 4891755 4914420 5004695 5037676 5213855 5712161 6173218 6353194
19306 6353194 6570245 6767493 6955164 6949933 7035752 7162993 7201250 7462668 8044635 8736222
19296 8736222 9602972 10697086 12046322 13947759 16220842 18354780 20400298 22386322
19288 22386322 24211855 26069331 27746988 29176402 31336433 34992334 40639585 49060351
19280 49060351 60999046 78756673 104858224 140649825 183398502 228401610 275809626
19273 275809626 323492160 362909498 392422840 412092192 415230812 402562105 379412773
$$ packed form
19335G314850m27411l54563l68746m84728m67851k91202j52535j60824k34362
19326D372628l19935k19670k3178O7116K31747J04647J92346K17583N9897J06453
19316D789634N4101J8822K9198K2665R0275L2981J76179M98306M61057J79976
19306F353194K17051J97248J87671n231Q5819J27241L8257K61418N81967O91587
19296H736222Q66750J094114J349236J901437K273083K133938K045518J986024
19288B2386322J825533J857476J677657J429414K160031L655901N647251Q420766
19280D9060351J1938695J7757627K6101551L5791601M2748677M5003108M7408016
19273B75809626M7682534L9417338K9513342J9669352L138620j2668707k3149332
$$ plain form
19266 379412773 344458129 301306592 257905336 215151437 174022745 139350999 112852833
19259 112852833 93116132 78490930 67670432 59542190 53262595 48496268 44868693
19252 44868693 42479812 41474232 42082338 44595260 48497180 52829763 57763194 62931442
19244 62931442 66814499 69702079 71460015 70611621 67695713 63638042 57905313 51153025
19236 51153025 44772892 38601047 32668311 28014601 24839481 22884192 21632479 20999520
19228 20999520 20880355 21049002 21582448 22680742 24207690 25813299 27387153 29094568
19220 29094568 30566411 31770497 33056197 34904583 37322948 40845486 46614083 55578607
19212 55578607 68921688 88510156 117215057 156177219 200799613 246698235 295702480
$$ packed form
19266C79412773l4954644m3151537m3401256m2753899m1128692l4671746k6498166
19259A12852833j9736701j4625202j0820498q128242o279595m766327l627575
19252D4868693k388881j005580O08106K512922L901920M332583M933431N168248
19244F2931442L883057K887580J757936q48394k915908m057671n732729o752288
19236E1153025o380133o171845n932736m653710l175120j955289j251713o32959
19228B0999520j19165J68647N33446J098294J526948J605609J573854J707415
19220B9094568J471843J204086J285700J848386K418365L522538N768597Q964524
19212E5578607J3343081J9588468K8704901L8962162M4622394M5898622M9004245
$$ plain form
19205 295702480 343544357 380904028 408214816 424155711 421997422 405046743 378213116
19198 378213116 339065470 293746520 249952979 206341357 165348040 132412485 107987576
19191 107987576 89749195 76125040 65919852 57819676 51155829 45627586 41143768
19184 41143768 37274241 33721260 30711297 28025885 25375781 23222365 21495007 20029918
19176 20029918 18852763 17697797 16715142 15975075 15514277 15154001 14824840 14716626 14568035
19167 14568035 14474207 14414595 14318390 14390822 14569536 14790250 15186330 15919775 16974632 18306398
19157 18306398 20004225 21849573 23445248 24995064 26785160 28564217 30167395 31891777
19149 31891777 34200112 37342482 41712488 48702145 59026168 73696393 95267648 125944252
$$ packed form
19205B95702480M7841877L7359671K7310788J5940895k158289j6950679k6833627
19198C78213116l9147646m5318950m3793541m3611622m0993317l2935555k4424909
19191A07987576j8238381j3624155j0205188q100176o663847n528243m483818
19184D1143768l869527l552981l009963k685412k650104k153416j727358j465089
19176B0029918j177155j154966r82655p40067m60798l60276l29161j08214j48591
19167A4568035r3828n9612r6205P2432J78714K20714L96080P33445J054857J331766
19157A8306398J697827J845348J595675J549816J790096J779057J603178J724382
19149C1891777K308335L142370M370006O989657J0324023J4670225K1571255L0676604
$$ plain form
19141 125944252 165337474 208949470 254190758 301738726 345481726 378873935 402845823
19134 402845823 414031281 407735907 388411371 358839613 318612891 274733681 232048003
19127 232048003 189722222 151151106 120746931 98469139 82080294 69783036 60127108
19120 60127108 52254025 45885100 40700083 36379165 32622083 29331141 26444322 23921969
19112 23921969 21610705 19488964 17541444 15997387 14795888 13612541 12374966 11458259
19104 11458259 10799196 10221900 9686762 9207789 8651595 8071491 7592132 6924599 6332980
19095 6332980 5951567 5689118 5599845 5566079 5395298 5045186 4842775 4799239 4686844 4442991
19085 4442991 3959682 3602808 3572041 3743285 3865313 3773054 3500202 3320077 3273234 3395137
$$ packed form
19141A25944252L9393222M3611996M5241288M7547968M3743000L3392209K3971888
19134D02845823J1185458o295374j9324536k9571758m0226722m3879210m2685678
19127B32048003m2325781l8571116l0404175k2277792j6388845j2297258r655928
19120F0127108p873083o368925n185017m320918l757082l290942k886819k522353
19112B3921969k311264k121741j947520j544057j201499j183347j237575r16707
19104A1458259o59063n77296n35138m78973n56194n80104m79359o67533n91619
19095F332980l81413k62449q9273l3766j70781l50112k02411m3536j12395k43853
19085D442991m83309l56874l0767J71244J22028r2259k72852j80125m6843J21903
$$ plain form
19075 3395137 3598223 3805363 3772352 3632993 3524565 3435868 3363358 3429641 3460753 3725028
19065 3725028 4010330 4287716 4615605 4971715 5327186 5664608 5797081 5951527 6207742
19056 6207742 6327575 6226632 5953340 5674777 5461268 5172301 4627151 3946064 3356526
19047 3356526 3098282 2937768 2865264 2857823 2883117 2712068 2562544 2454402 2377827 2362302
19037 2362302 2278506 2147095 1993956 1955989 1954455 1907629 1964965 2016560 1965318 1865594 1816502
19026 1816502 1692909 1579309 1688788 1663307 1631044 1766611 1901595 1990327 1831069 1620530
19016 1620530 1632792 1540395 1399096 1308779 1303090 1349483 1230322 992665 956043 1018945 1186726
19005 1186726 1336203 1540778 1744152 1740775 1353329 989631 1017039 1147778 978789 950482
$$ packed form
19075C395137K03086K07140l3011j39359j08428q8697p2510O6283L1112K64275
19065C725028K85302K77386L27889L56110L55471L37422J32473J54446K56215
19056F207742J19833j00943k73292k78563k13509k88967n45150o81087n89538
19047C356526k58244j60514p2504p441K5294j71049j49524j08142p6575j5525
19037B362302q3796j31411j53139l7967j534m6826N7336N1595n1242r9724m9092
19026A816502j23593j13600J09479k5481l2263J35567J34984Q8732j59258k10539
19016A620530J2262r2397j41299r0317n689M6393j19161k37657l6622O2902J67781
19005A186726J49477K04575K03374l377l87446l63698K7408J30739j68989k8307
$$ plain form
18995 950482 1063888 1195961 1177921 1079554 1030653 1034400 1094302 964668 1007583 1185039 1398408
18984 1398408 1566797 1529009 1443985 1470370 1734235 1659863 1367947 1211346 1034319 913788
18974 913788 761670 688066 692174 791668 1061897 1272723 1338994 1152070 916349 760614
18964 760614 693232 767774 684510 669610 688149 566679 627098 1048456 1160094 1044183 1131366
18953 1131366 1135781 1018587 994502 950299 941985 882699 604707 397365 494454 709934 874996
18942 874996 902669 799918 604862 394964 365018 551793 471606 387677 483923 614244
18932 614244 819692 645726 171948 6471 159767 368824 313186 229615 227395 393631
18922 393631 655225 646169 561726 621266 684942 793876 744249 579415 602868 703069 743769
$$ packed form
18995I50482J13406J32073j8040r8367m8901L747N9902j29634M2915J77456K13369
18984A398408J68389l7788q5024K6385K63865p4372k91916j56601j77027j20531
18974I13788j52118p3604M108R9494K70229K10826O6271j86924k35721j55735
18964G60614o7382P4542q3264j4900J8539j21470O0419M21358J11638j15911Q7183
18953A131366M415j17194k4085m4203q314n9286k77992k07342R7089K15480J65062
18942H74996K7673j02751j95056k09898k9946J86775q0187q3929R6246J30321
18932F14244K05448j73966m73778j65477J53296K09057n5638q3571k220J66236
18922C93631K61594r056q4443N9540O3676J08934m9627j64834K3453J00201M0700
$$ plain form
18911 743769 602305 630515 773117 916887 742820 409347 325129 550278 739646 624502
18901 624502 355150 236377 350892 392861 271836 239415 218167 348783 604457 616013
18891 616013 572976 446223 253173 452831 507742 487248 427227 409099 537599 477433 401731
18880 401731 588165 838931 732222 755610 790135 646609 479389 352728 261542 349893
18870 349893 504607 388402 88519 -44983 -43386 39650 25514 268237 378139 259213
18860 259213 132837 -13549 -129306 -96705 38397 126998 219111 358580 553487 568737
18850 568737 513507 658696 744939 556445 450452 627427 743539 667901 521776 341232
18840 341232 52831 -136678 39914 202316 126925 129763 241001 400770 582426 476185
$$ packed form
18911G43769j41464K8210J42602J43770j74067l33473q4218K25149J89368j15144
18901F24502k69352j18773J14515M1969j21025l2421k1248J30616K55674J1556
18891F16013m3037j26753j93050J99658N4911k0494o0021j8128J28500o0166p5702
18880D01731J86434K50766j06709K3388L4525j43526j67220j26661r1186Q8351
18870C49893J54714j16205k99883j33502J597Q3036j4136K42723J09902j18926
18860B59213j26376j46386j15757L2601J35102Q8601R2113J39469J94907J5250
18850E68737n5230J45189Q6243j88494j05993J76975J16112p5638j46125j80544
18840C41232k88401j89509J76592J62402p5391K838J11238J59769J81656j06241
$$ plain form
18830 476185 456243 468221 275001 148424 -42450 -291959 -346404 -375564 -330749 -376014 -436184
18819 -436184 -279486 136398 497709 573789 529251 565007 628193 726680 749638 590097 419598
18808 419598 205576 185140 207236 106892 81293 133983 253087 308180 208253 178240 462068
18797 462068 789497 804351 758389 766018 761455 790893 828846 709237 281060 -173007 -391
18786 -391 409944 622927 511134 405953 382406 209518 -60576 -194208 -190483 -304809 -377593
18775 -377593 -325640 -230216 -172805 -71930 7740 33702 116379 348182 632845 695780 646657
18764 646657 624830 854201 702668 301297 70369 213409 331304 223472 228835 353285
18754 353285 251473 -56156 -48737 -23180 -68501 -223393 -290878 -34282 -27355 -353048 -273760
$$ packed form
18830D76185j9942J1978j93220j26577j90874k49509n4445k9160M4815m5265o0170
18819d36184J56698M15884L61311P6080m4538L5756O3186R8487K2958j59541j70499
18808D19598k14022k0436K2096j00344k5599N2690J19104N5093r9927l0013K83828
18797D62068L27429J4854m5962P629m563K9438L7953j19609m28177m54067J72616
18786c91M10335K12983j11793j05181k3547j72888k70094j33632L725j14326p2784
18775c77593N1953R5424N7411J00875P9670K5962Q2677K31803K84663O2935m9123
18764F46657k1827K29371j51533m01371k30928J43040J17895j07832N363J24450
18754C53285j01812l07629P419K5557m5321j54892o7485K56596O927l25693P9288
$$ plain form
18743 -273760 116027 337491 311211 279096 186609 177269 236924 202860 352272 474125 553156
18732 553156 532144 762544 1020851 928910 760334 475909 206144 152646 308380 432016
18722 432016 418661 199710 129915 120645 132402 231842 181309 73338 107371 112053 50849
18711 50849 67463 325287 499303 491835 398479 395959 423038 544293 494576 519488 807669
18700 807669 918993 675675 390554 231904 81622 76462 175961 243434 524528 617209
18690 617209 257112 -30573 -314177 -550354 -494692 -228193 152423 389346 445865 536320
18680 536320 518696 407925 215265 78183 62566 193985 301649 438448 632691 462683
18670 462683 236220 177523 175367 74404 -87317 -45206 137137 314322 420246 429319 407792
$$ packed form
18743b73760L89787K21464k6280l2115r2487r340N9655l4064J49412J21853P9031
18732E53156k1012K30400K58307r1941j68576k84425k69765n3498J55734J23636
18722D32016j3355k18951o9795r270J1757R9440n0533j07971L4033M682o1204
18711E0849J6614K57824J74016p468r3356k520K7079J21255m9717K4912K88181
18700H07669J11324k43318k85121j58650j50282n160R9499O7473K81094R2681
18690F17209l60097k87685k83604k36177N5662K66499L80616K36923N6519R0455
18680E36320j7624j10771j92660j37082j5617J31419J07664J36799J94243j70008
18670D62683k26463n8697k156j00963j61721M2111J82343J77185J05924R073k1527
$$ plain form
18659 407792 302907 76056 55896 190910 444662 547498 354340 301069 329990 389999
18649 389999 523014 531486 467193 549353 564863 735428 790857 490473 237644 173962 139368
18638 139368 80642 -8018 66319 298739 407347 521725 511908 458493 400273 266755 303268
18627 303268 626835 745061 620601 437486 419785 625351 716047 805050 789450 692098
18617 692098 843620 938130 1059667 1209871 927560 534833 406506 279562 193296 100300
18607 100300 215115 464554 631803 727226 677087 730655 820267 934852 1058811 881345
18597 881345 658906 715738 863089 896318 732473 380151 26439 -52681 137335 421199
18587 421199 322754 322827 382742 187133 223322 27977 -272326 -157514 82859 76837 109811
$$ packed form
18659D07792j04885k26851k0160J35014K53752J02836j93158n3271K8921O0009
18649C89999J33015Q472o4293Q2160J5510J70565N5429l00384k52829o3682l4594
18638A39368n8726q8660P4337K32420J08608J14378r817n3415n8220j33518L6513
18627C03268L23567J18226j24460j83115j7701K05566R0696Q9003j5600r7352
18617F92098J51522R4510J21537J50204k82311l92727j28327j26944q6266r2996
18607A00300J14815K49439J67249R5423n0139N3568Q9612J14585J23959j77466
18597H81345k22439N6832J47351L3229j63845l52322l53712p9120J90016K83864
18587D21199r8445P3N9915j95609L6189j95345l00303J14812K40373o022L2974
$$ plain form
18576 109811 398957 730536 707158 481541 400182 405989 497910 298467 -22679 -53024 99936
18565 99936 141644 96625 158247 286975 450450 463056 555567 579225 345639 130261 -179101
18554 -179101 -339144 -381848 -276169 -120230 29608 231237 386004 276598 -147302 -197167
18544 -197167 66916 211954 308413 282448 203499 255362 219910 159052 469538 691428 726532
18533 726532 682548 516274 312707 300035 329133 277683 192002 135154 187858 290462 219923
18522 219923 248228 297998 163376 117669 183501 289630 513873 527603 350487 160316
18512 160316 155145 224270 -23659 -19273 85011 318188 528397 484653 404921 114006 -117111
18501 -117111 -22986 237267 398202 406181 541920 646856 515752 268033 241146 233997 243278
$$ packed form
18576A09811K89146L31579k3378k25617q1359N807R1921j99443l21146l0345J52960
18565I9936M1708m5019O1622J28728J63475J2606R2511K3658k33586k15378l09362
18554a79101j60043m2704J05679J55939J49838K01629J54767j09406m23900m9865
18544a97167K64083J45038R6459k5965p8949N1863l5452o0858L10486K21890L5104
18533G26532m3984j66274k03567j2672K9098n1450q5681n6848N2704J02604p0539
18522B19923K8305M9770j34622m5707O5832J06129K24243J3730j77116j90171
18512A60316n171O9125k47929M386J04284K33177K10209m3744p9732k90915k31117
18501a17111R4125K60253J60935P979J35739J04936j31104k47719k6887p149R281
$$ plain form
18490 243278 342443 393246 440963 358398 188145 241537 218245 154884 104395 84121 -22567
18479 -22567 -33979 -155545 -330407 -146925 239045 640514 741061 631821 606637 415478
18469 415478 308981 180732 225052 126316 -84593 -178895 -66875 22477 116780 246450
18459 246450 224943 265859 325369 220594 177939 347969 901362 1191727 1199872 1125539 1054133
18448 1054133 955059 718355 554206 384594 430825 238027 -106550 -203276 5752 159558
18438 159558 130514 158049 333265 347432 322995 251272 62687 -18882 -39173 -46503 -29116
18427 -29116 191999 606811 842928 829407 717345 484032 32134 -284132 -350801 -393435
18417 -393435 -257112 66870 84401 28722 200003 419279 357472 111412 87133 316415
$$ packed form
18490B43278R9165N0803M7717q2565j70253N3392k3292o3361n0489k0274j06688
18479b2567j1412j21566j74862J83482L85970M01469J00547j09240k5184j91159
18469D15478j06497j28249M4320r8736k10909r4302J12020Q9352R4303J29670
18459B46450k1507M0916N9510j04775m2655J70030N53393K90365Q145p4333p1406
18448A054133r9074k36704j64149j69612M6231j92798l44577r6726K09028J53806
18438A59558k9044K7535J75216J4167k4437p1723j88585q1569k0291p330J7387
18427b9116K21115M14812K36117j3521j12062k33313m51898l16266o6669m2634
18417c93435J36323L23982J7531n5679J71281K19276o1807k46060k4279K29282
$$ plain form
18407 316415 659803 770883 559473 297579 91500 -72918 -216818 -377481 -646255 -739475
18397 -739475 -805231 -997452 -1002717 -626353 -445902 -460390 -454592 -400519 -205098 108711 401503
18386 401503 379332 367417 558457 439929 226026 267782 267747 139777 29668 -170635 -262509
18375 -262509 -209287 46064 -31349 -194925 -50017 209263 273532 129913 -103592 -336513
18365 -336513 -424690 -574274 -469218 -199850 -32045 67372 248716 112647 -159702 -244257
18355 -244257 -299760 -318480 -340517 -131813 289853 607649 751618 732247 560112 401282
18345 401282 269551 280026 264098 203043 144044 215949 251523 193476 156346 31273 -57939
18334 -57939 -121210 -221205 -294008 -182886 7662 214412 322129 571934 658185 509072
$$ packed form
18407C16415L43388J11080k11410k61894k06079j64418j43900j60663k68774r3220
18397g39475o5756j92221n265L76364J80451j4488N798N4073J95421L13809K92792
18386D01503k2171j1915J91040j18528k13903M1756l5j27970j10109k00303r1874
18375b62509N3222K55351p7413j63576J44908K59280O4269j43619k33505k32921
18365c36513q8177j49584J05056K69368J67805R9417J81344j36069k72349q4555
18355b44257n5503j8720k2037K08704M21666L17796J43969j9371j72135j58830
18345D01282j31731J0475j5928o1055n8999P1905L5574n8047l7130j25073q9212
18334e7939o3271r9995p2803J11122J90548K06750J07717K49805Q6251j49113
$$ plain form
18324 509072 608427 684108 494764 267464 197312 209985 130393 -8103 -171031 -135550 -15999
18313 -15999 -119373 -161558 -183296 -161845 86340 382454 445753 418494 554907 943371 904813
18302 904813 730853 663026 593184 414123 166853 -84164 -210382 -108933 109070 306101
18292 306101 382715 303103 46875 -313389 -316341 -73871 124609 194434 198451 89234 -158646
18281 -158646 -284337 -254553 -170992 21890 309970 370086 284543 253679 75860 137399 337851
18270 337851 282295 298350 359387 295569 173785 153387 243581 279460 310108 335804 58491
18259 58491 -92304 185675 341553 325946 338658 257250 205520 96603 -206915 -353633
18249 -353633 -323567 -188220 -139803 -228068 -268448 -227759 -46981 182686 232169 283975 373107
$$ packed form
18324E09072R9355P5681j89344k27300p0152J2673p9592j38496j62928L5481J19551
18313a5999j03374m2185k1738K1451K48185K96114O3299k7259J36413L88464l8558
18302I04813j73960o7827o9842j79061k47270k51017j26218J01449K18003J97031
18292C06101P6614p9612k56228l60264k952K42470J98480O9825M017j09217k47880
18281a58646j25691K9784Q3561J92882K88080O0116q5543l0864j77819O1539K00452
18270C37851n5556J6055O1037o3818j21784k0398R0194L5879L0648K5696k77313
18259E8491j50795K77979J55878j5607J2712q1408n1730j08917l03518j46718
18249c53633L0066J35347M8417q8265m0380M0689J80778K29667M9483N1806Q9132
$$ plain form
18238 373107 419364 179817 -96988 -89734 55335 192636 111704 113857 100105 126412 214993
18227 214993 375581 517686 482768 279022 15732 -26471 198741 346577 370010 338004
18217 338004 689705 926845 705696 414718 432732 401523 192397 -11549 -184552 -137988
18207 -137988 27942 171820 226814 318722 284508 128211 226926 451077 354234 173209
18197 173209 77459 -127642 -291977 -204601 16297 39062 6814 46563 151545 239453 332719
18186 332719 95533 -170690 -404606 -513083 -433150 -179057 146775 302748 408783 478582
18176 478582 297841 28677 -101616 -25103 74288 215411 44043 -84984 47580 -45756
18166 -45756 -156285 63348 208390 157736 -29564 -368069 -446098 -278513 -196450 -195238 -187179
$$ packed form
18238C73107M6257k39547k76805P254J45069J37301q0932K153j3752K6307Q8581
18227B14993J60588J42105l4918k03746k63290m2203K25212J47836K3433l2006
18217C38004L51701K37140k21149k90978J8014l1209k09126k03946j73003M6564
18207a37988J65930J43878N4994R1908l4214j56297R8715K24151r6843j81025
18197A73209r5750k05101j64335Q7376K20898K2765l2248L9749J04982Q7908R3266
18186C32719k37186k66223k33916j08477P9933K54093L25832J55973J06035O9799
18176D78582j80741k69164j30293P6513R9391J41123j71368j29027J32564r3336
18166d5756j10529K19633J45042n0654j87300l38505p8029J67585Q2063J212Q059
$$ plain form
18155 -187179 -151417 142288 426412 384705 266452 332360 308857 183131 63232 -292585
18145 -292585 -591617 -450711 15277 280288 271523 136894 192887 436620 321181 -19659
18135 -19659 -194626 -140724 31300 52137 -22323 162196 359293 238825 29939 4563
18125 4563 233623 557589 542088 283147 202721 294819 520549 677944 326158 21936
18115 21936 -236112 -261634 -187649 -21634 161660 111386 5446 60570 351613 231121
18105 231121 -73 -201506 -390649 -351906 -127475 -45532 -382329 -335948 -164674 -232024
18095 -232024 -346704 -454216 -369022 -272026 -272701 -379628 -567791 -542448 -466388 -580165 -563995
18084 -563995 -634068 -688553 -504420 -298894 -185747 -67475 27042 38164 293314 466298
$$ packed form
18155a87179L5762K93705K84124m1707j18253O5908k3503j25726j19899l55817
18145b92585k99032J40906M65988K65011q765j34629N5993K43733j15439l40840
18135a9659j74967N3902J72024K0837p4460J84519J97097j20468k08886k5376
18125D563K29060L23966j5501k58941q0426R2098K25730J57395l51786l04222
18115B1936k58048k5522P3985J66015J83294n0274j05940N5124K91043j20492
18105B31121k31194k01433j89143L8743K24431Q1943l36797M6381J71274o7350
18095b32024j14680j07512Q5194R6996o75j06927j88163K5343P6060j13777J6170
18084e63995p0073n4485J84133K05526J13147J18272R4517J1122K55150J72984
$$ plain form
18074 466298 280953 394765 591750 508986 211893 -23208 -158951 -202650 -56106 41519
18064 41519 50236 -4484 -180707 -269787 -208589 -98780 -90098 -138606 -106809 -262739 -206501
18053 -206501 -113942 42837 234193 400975 638604 691062 632062 624393 659821 562684 266681
18042 266681 70109 153241 237959 477612 522208 249959 -15897 -105406 -157038 -86158 71016
18031 71016 185778 256694 236391 97561 -18661 54983 156820 167217 -11093 -107774 -237279
18020 -237279 -358296 -116849 8665 51158 58901 102469 92254 85225 -132103 -318844 -388238
18009 -388238 -452931 -370169 -298324 -175749 -432206 -642436 -557302 -506167 -420376 -387747 -333579
17998 -333579 -373773 -306930 -132776 -14650 249573 264461 87629 149792 200595 109952 140220
$$ packed form
18074D66298j85345J13812J96985q2764k97093k35101j35743m3699J46544R7625
18064D1519Q717n4720j76223q9080O1198J09809Q682m8508L1797j55930N6238
18053b06501R2559J56779J91356J66782K37629N2458n9000p669L5428r7137k96003
18042B66681j96572Q3132Q4718K39653M4596k72249k65856q9509n1632P0880J57174
18031G1016J14762P0916k0303j38830j16222P3644J01837J0397j78310r6681j29505
18020b37279j21017K41447J25514M2493P743M3568j0215p029k17328j86741o9394
18009c88238o4693Q2762P1845J22575k56457k10230Q5134N1135Q5791L2629N4168
17998c33579m0194O6843J74154J18126K64223J4888j76832O2163N0803r0643L0268
$$ plain form
17987 140220 215124 157063 -19845 -140441 -188301 5232 99653 162431 69394 7848 -131611
17976 -131611 -121160 -271512 -624216 -769207 -631856 -398853 -308809 -349907 -340410 -268483 -171585
17965 -171585 1397 50001 118482 255578 177755 -94902 -272759 -367028 -476621 -340207
17955 -340207 -35593 52562 63523 127033 153882 389007 513661 606326 640462 448595 49741
17944 49741 -307267 -352881 -184259 -73006 -90370 36826 5246 -271357 -476354 -597027
17934 -597027 -592457 -411903 -386266 -506315 -546497 -444228 -421608 -301546 -191169 -83569
17924 -83569 -22645 41723 258115 222684 -110894 -276540 -224164 -18659 21394 -30621 -62597
17913 -62597 37294 171834 42142 -137053 -228413 -197811 -175646 -77863 156023 211726 140268
$$ packed form
17987A40220P4904n8061j76908j20596m7860J93533R4421O2778r3037o1546j39459
17976a31611J0451j50352l52704j44991J37351K33003R0044m1098R497P1927R6898
17965a71585J72982M8604O8481J37096p7823k72657j77857r4269j09593J36414
17955c40207L04614Q8155J0961O3510K6849K35125J24654R2665L4136j91867l98854
17944D9741l57008m5614J68622J11253j7364J27196l1580k76603k04997j20673
17934e97027M570J80554K5637j20049m0182J02269K2620J20062J10377J07600
17924h3569O0924O4368K16392l5431l33578j65646N2376K05505M0053n2015l1976
17913f2597R9891J34540j29692j79195r1360L0602K2165R7783K33886N5703p1458
$$ plain form
17902 140268 139627 147578 -40164 -376058 -606875 -599366 -429055 -238390 -7740 189194 124958
17891 124958 -110 -60625 -186782 -221683 -125135 -146912 -183784 -78482 112816 335431
17881 335431 457776 470308 248235 -24442 -251886 -583098 -541979 -360422 -218631 -122145
17871 -122145 -84413 -155423 -174894 -333647 -420165 -360086 -519560 -828574 -974906 -874027
17861 -874027 -683562 -222270 116992 294358 385837 349587 215994 73863 -120055 -40688
17851 -40688 -191082 -391625 -460706 -543277 -415354 -100372 110220 212532 343737 197791
17841 197791 -37557 -82178 26307 249922 490295 230138 -12999 74641 53749 -15411
17831 -15411 -8744 265042 360279 59110 -285322 -377696 -311802 -185808 -201240 -357210 -354352
$$ packed form
17902A40268o41P951j87742l35894k30817P509J70311J90665K30650J96934o4236
17891A24958j25068o0515j26157l4901R6548k1777l6872J05302J91298K22615
17881C35431J22345J2532k22073k72677k27444l31212M1119J81557J41791R6486
17871a22145L7732p1010j9471j58753q6518O0079j59474l09014j46332J00879
17861h74027J90465M61292L39262J77366R1479l6250j33593j42131j93918P9367
17851d0688j50394k00543o9081q2571J27923L14982K10592J02312J31205j45946
17841A97791k35348m4621J08485K23615K40373k60157k43137Q7640k0892o9160
17831a5411O667K73786R5237l01169l44432r2374O5894J25994j5432j55970K858
$$ plain form
17820 -354352 -186125 -83455 -124942 -102119 -57382 -30641 221872 386911 400262 392622 347856
17809 347856 435137 529435 511014 360892 252203 428700 483413 401547 331563 309825 381642
17798 381642 466494 500709 378271 340432 426347 521179 505509 354201 70200 -72853 -77301
17787 -77301 -155455 -58525 126851 267906 450261 415659 110177 -107940 -26845 -152669
17777 -152669 -315557 -195579 78053 148525 191680 100523 -28695 44192 210389 207602 91295
17766 91295 -12295 -89657 -271502 -376170 -248826 -3295 266273 245829 -18962 -148032
17756 -148032 -224388 -237147 -22198 134253 335543 386180 467033 416895 201780 172924 383333
17745 383333 493118 572678 690020 666855 385923 181737 72258 -37760 -107311 -5082
$$ packed form
17820c54352J68227J02670m1487K2823M4737K6741K52513J65039J3351p640m4766
17809C47856Q7281R4298j8421j50122j08689J76497N4713q1866o9984k1738P1817
17798C81642Q4852L4215j22438l7839Q5915R4832j5670j51308k84001j43053m448
17787g7301p8154R6930J85376J41055J82355l4602l05482k18117Q1095j25824
17777a52669j62888J19978K73632P0472M3155r1157j29218P2887J66197k787j16307
17766I1295j03590p7362j81845j04668J27344K45531K69568k0444k64791j29070
17756a48032p6356j2759K14949J56451K01290N0637Q0853n0138k15115k8856K10409
17745C83333J09785P9560J17342k3165k80932k04186j09479j10018o9551J02229
$$ plain form
17735 -5082 226931 242150 127020 67520 61380 16261 -6168 41674 129589 156611 316842
17724 316842 282313 303222 403316 321352 277334 15908 -428805 -555691 -629494 -584804 -532952
17713 -532952 -604800 -601018 -643426 -622738 -540572 -470618 -393080 -416536 -442310 -444089 -418243 -163022
17701 -163022 30839 174805 375247 329511 243297 109631 -21188 62592 76941 46409
17691 46409 -27318 -20248 282227 436194 220447 -61211 -419556 -597958 -661068 -757476 -635732
17680 -635732 -383026 -70547 8000 -103024 -157868 -149470 26803 159708 233753 358845
17670 358845 314626 70689 -2146 -118541 -66491 153445 229142 314997 499629 379840
17660 379840 190822 30511 -76146 -21709 -19722 118503 329179 359409 243608 158027
$$ packed form
17735e082K32013J5219j15130n9500o140m5119k2429M7842Q7915K7022J60231
17724C16842l4529K0909J00094q1964m4018k61426m44713j26886p3803M4690N1852
17713e32952p1848L782m2408K0688Q2166O9954P7538k3456k5774j779K5846K55221
17701a63022J93861J43966K00442m5736q6214j33666j30819Q3780J4349l0532
17691D6409p3727P070L02475J53967k15747k81658l58345j78402o3110r6408J21744
17680f35732K52706L12479P8547j11024n4844Q398J76273J32905P4045J25092
17670C58845m4219k43937p2835j16395N2050K19936P5697Q5855J84632j19789
17660C79840j89018j60311j06657N4437J987J38225K10676L0230j15801q5581
$$ plain form
17650 158027 156632 152262 158670 250087 428957 455267 264151 -132952 -287727 -147426 -157457
17639 -157457 -176486 -38358 -6625 -77174 101895 164601 160862 33175 -193186 -92619 206984
17628 206984 230908 141294 59488 6892 -3058 -58506 -205091 -63048 149063 168494 197519
17617 197519 370411 534792 679804 919504 879956 738256 680503 585650 543165 562073
17607 562073 371715 197478 295199 278602 -90703 -361743 -383097 -209703 215478 447674
17597 447674 415883 328517 184337 125951 167620 98406 21113 -116206 -51439 288539 601298
17586 601298 720245 607093 454074 242767 112239 75903 -84946 -152234 -69834 224153
17576 224153 231018 -53165 -175231 -19291 -83513 -240077 -227949 -446543 -631048 -602916
$$ packed form
17650A58027j395m370O408R1417J78870K6310j91116l97103j54775J40301j0031
17639a57457j9029J38128L1733p0549J79069O2706l739j27687k26361J00567K99603
17628B06984K3924q9614q1806n2596r950n5448j46585J42043K12111J9431K9025
17617A97519J72892J64381J45012K39700l9548j41700n7753r4853m2485J8908
17607E62073j90358j74237R7721j6597l69305k71040k1354J73394M25181K32196
17597D47674l1791q7366j44180n8386M1669o9214p7293j37319O4767L39978L12759
17586F01298J18947j13152j53019k11307j30528l6336j60849o7288Q2400K93987
17576B24153O865k84183j22066J55940o4222j56564J2128k18594j84505K8132
$$ plain form
17566 -602916 -584175 -699329 -727198 -702517 -458391 -234647 -45623 157413 341816 463286
17556 463286 425401 336797 151365 -54264 -216204 -142567 76586 166711 256544 274801 313646
17545 313646 488638 451631 466012 462287 335528 271403 314216 460786 606086 547058 373362
17534 373362 320835 398046 457177 358548 139910 -27171 10361 157266 130379 72640 65524
17523 65524 96998 141122 242997 341610 547822 688221 616657 388876 77391 -6016 85591
17512 85591 -107430 -471347 -323686 34288 258095 224684 96014 -168490 -595606 -704963
17502 -704963 -441855 -160595 -93480 -169474 -178062 -131111 -187755 -264581 -185491 -145903 -207424
17491 -207424 -81911 117568 125425 93661 3530 -84169 -129178 76943 170151 260977 378366
$$ packed form
17566f02916J8741j15154k7869K4681K44126K23744J89024K03036J84403J21470
17556D63286l7885q8604j85432k05629j61940P3637K19153R0125Q9833J8257L8845
17545C13646J74992l7007J4381l725j26759o4125M2813J46570J45300n9028j73696
17534C73362n2527P7211N9131r8629k18638j67081L7532J46905k6887n7739p116
17523F5524L1474M4124J01875R8613K06212J40399p1564k27781l11485q3407R1607
17512H5591j93021l63917J47661L57974K23807l3411j28670k64504m27116j09357
17502g04963K63108K81260O7115p5994q588M6951n6644p6826P9090L9588o1521
17491b07424J25513J99479P857l1764r0131q7699m5009K06121R3208R0826J17389
$$ plain form
17480 378366 181976 -182658 -373156 -312122 -197314 30773 74242 -42691 -277813 -417506
17470 -417506 -368394 -152585 32503 -42399 -156723 -274906 -415749 -417722 -386030 -377810 -285527
17459 -285527 -131628 20489 -53493 -350851 -278604 83466 283164 138480 -113229 -236254
17449 -236254 -220048 -297749 -231736 -27360 174161 240131 183541 88395 -74302 9020 250976
17438 250976 372520 357575 138617 -283108 -371399 -320057 -198270 8315 272131 419831
17428 419831 430799 390179 150655 26923 -9834 29365 63970 255217 417680 344792 241691
17417 241691 273851 453684 415568 124179 13324 -16511 -199824 -363987 -274575 -51094
17407 -51094 51567 -27197 -153798 -93192 1608 -73593 -182496 -164516 -37213 42406 -88814
$$ packed form
17480C78366j96390l64634j90498O1034J14808K28087M3469j16933k35122j39693
17470d17506M9112K15809J85088p4902j14324j18183j40843j973L1692Q220R2283
17459b85527J53899J52117p3982k97358P2247L62070J99698j44684k51709j23025
17449b36254J6206p7701O6013K04376K01521O5970n6590r5146j62697Q3322K41956
17438B50976J21544j4945k18958m21725q8291N1342J21787K06585K63816J47700
17428D19831J0968m0620k39524j23732l6757L9199L4605J91247J62463p2888j03101
17417B41691L2160J79833l8116k91389j10855k9835j83313j64163Q9412K23481
17407e1094J02661p8764j26601O0606R4800p5201j08903J7980J27303P9619j31220
$$ plain form
17396 -88814 -22980 -70357 -106343 -187870 -192725 -45461 -55996 -88453 -61285 -90930 101284
17385 101284 235467 110344 14602 -37433 100507 288791 295935 375748 472546 341751 265866
17374 265866 392657 312330 9477 -20302 232247 379480 291853 112586 229317 384287
17364 384287 385947 431777 407489 106389 32728 123094 275523 328385 84397 -65248 8254
17353 8254 -5644 17698 -148523 -447001 -746638 -712214 -561671 -450654 -201153 -68993
17343 -68993 -124503 -66034 209119 227426 169178 68123 -172080 -418948 -315491 -174259
17333 -174259 -185875 -249664 -252417 -307963 -113785 108700 248428 245133 105153 144468 303604
17322 303604 508654 590725 273146 -264185 -386017 -430913 -509624 -474055 -344169 -177969
$$ packed form
17396h8814O5834m7377l5986q1527m855J47264j0535l2457K7168k9645J92214
17385A01284J34183j25123r5742n2035J37940J88284P144P9813R6798j30795p5885
17374B65866J26791q0327l02853k9779K52549J47233q7627j79267J16731J54970
17364C84287J660M5830k4288l01100p3661R0366J52429N2862k43988j49645P3502
17353H254j3898K3342j66221k98478k99637L4424J50543J11017K49501J32160
17343f8993n5510N8469K75153J8307n8248j01055k40203k46868J03457J41232
17333a74259j1616o3789k753n5546J94178K22485J39728l295j39980L9315J59136
17322C03604K05050Q2071l17579n37331j21832m4896p8711L5569J29886J66200
$$ plain form
17312 -177969 -112825 -78457 126832 244361 264725 350455 240427 -190115 -498886 -540788
17302 -540788 -402159 -36410 190045 196592 35313 -103423 -278624 -466964 -410884 -354500
17292 -354500 -300467 -171092 -192083 -370228 -482715 -318361 -303710 -366210 -219017 -96498
17282 -96498 -139705 -376612 -690837 -745937 -722558 -630661 -298441 -48014 37287 209144 280195
17271 280195 330108 470731 540447 567022 253915 -52947 -177595 -311972 -398679 -753779
17261 -753779 -838715 -738904 -854563 -877996 -750233 -644370 -418292 -170745 -143850 37977
17251 37977 204736 159938 122446 101011 136980 209980 315845 372524 261205 85310 175681
17240 175681 210583 188938 122998 176116 316982 544884 729197 729782 647221 585599 484442
$$ packed form
17312a77969O5144L4368K05289J17529K0364Q5730j10028m30542l08771m1902
17302e40788J38629L65749K26455O547j61279j38736j75201j88340N6080N6384
17292c54500N4033J29375k0991j78145j12487J64354J4651o2500J47193J22519
17282i6498m3207k36907l14225n5100K3379R1897L32220K50427Q5301J71857P1051
17271B80195M9913J40623O9716K6575l13107l06862j24648j34377q6707l55100
17261g53779q4936R9811j15659k3433J27763J05863K26078K47547K6895J81827
17251C7977J66759m4798l7492k1435L5969P3000J05865N6679j11319j75895R0371
17240A75681L4902k1645o5940N3118J40866K27902J84313N85q2561o1622j01157
$$ plain form
17229 484442 102790 -117161 -156935 -280074 -367058 -302880 -220858 34853 131896 -8068
17219 -8068 -211249 -303705 -232157 18743 244998 197984 211164 262372 428461 356149 84200
17208 84200 54541 230864 357157 405612 152680 -88053 -217103 -319428 -385437 -434933
17198 -434933 -291334 -236730 -186919 -189355 -206926 -271228 -228542 -138725 -70286 -115678 -450164
17187 -450164 -727556 -677943 -607380 -436468 -168814 32073 -131590 -326706 -526960 -587196
17177 -587196 -451632 -361892 -120037 -76535 36322 286723 314574 95243 38983 167800
17167 167800 224256 -43513 -360009 -549957 -500348 -309294 -178108 -54326 108617 124316
17157 124316 -5331 -91687 -16294 268723 330771 318466 217570 158137 241304 261636 303809
$$ packed form
17229D84442l81652k19951l9774j23139q6984O4178Q2022K55711R7043j39964
17219h068k03181r2456P1548K50900K26255m7014J3180N1208J66089p2312k71949
17208H4200k9659J76323J26293M8455k52932k40733j29050j02325o6009m9496
17198d34933J43599N4604M9811k436j7571o4302M2686Q9817O8439m5392l34486
17187d50164k77392M9613P0563J70912K67654K00887j63663j95116k00254o0236
17177e87196J35564Q9740K41855M3502J12857K50401K7851k19331n6260J28817
17167A67800N6456k67769l16496j89948M9609J91054J31186J23782J62943J5699
17157A24316j29647q6356P5393K85017O2048j2305j00896n9433Q3167K0332M2173
$$ plain form
17146 303809 217337 139645 353516 535055 347788 54586 -110710 -105743 62073 246509
17136 246509 220891 210836 391068 375433 203769 81909 -129213 -161637 -3540 39445
17126 39445 -25846 -4616 -76554 -115911 -108962 9330 -404 -33588 87726 27544 -83261
17115 -83261 -18187 24231 -147110 -319155 -333330 -340101 -346399 -206526 -69827 -252669 -341360
17104 -341360 -445819 -557723 -418640 -509154 -605134 -700032 -540812 -326177 -165912 -3973
17094 -3973 429042 544760 347729 316041 212445 -62023 -188864 -411707 -535079 -389700
17084 -389700 -322325 -307194 -475211 -500504 -245677 -110282 -179582 -256460 -308226 -179591 -50912
17073 -50912 73514 275796 233253 188177 266774 453997 560393 408466 -34733 -630759
$$ packed form
17146C03809q6472p7692K13871J81539j87267k93202j65296M967J67816J84436
17136B46509k5618j0055J80232j5635j71664j21860k11122l2424J58097M2985
17126C9445o5291K1230p1938l9357O949J18292r734l3184J21314o0182j10805
17115h3261O5074M2418j71341j72045j4175o771o298J39873J36699j82842q8691
17104c41360j04459j11904J39083r0514r5980r4898J59220K14635J60265J61939
17094c973M33015J15718j97031l1688j03596k74468j26841k22843j23372J45379
17084c89700O7375J5131j68017k5293K54827J35395o9300p6878n1766J28635J28679
17073e0912J24426K02282m2543m5076P8597J87223J06396j51927m43199n96026
$$ plain form
17063 -630759 -671358 -391680 -219489 -94384 -162134 -468887 -532559 -286385 -164579 -88455
17053 -88455 182293 227664 -5924 -129354 -225802 -298993 -236008 -8904 109323 80243 -164843
17042 -164843 -389137 -444798 -511011 -635436 -441392 -266036 -182116 -154919 -121535 -133233 -415045
17031 -415045 -493693 -335025 -176726 -133987 -74801 -25132 65829 69784 -140893 -509697 -817068
17020 -817068 -934656 -806029 -515167 -131400 -88773 -349655 -476903 -387689 -301068 -328995
17010 -328995 -395903 -341825 -110636 135856 213280 118013 6658 167106 283023 91140
17000 91140 -148764 -179281 -277724 -478314 -636771 -571501 -519310 -490855 -342893 -285508 -171712
16989 -171712 -196333 -417506 -239589 -51675 -290816 -409462 -298887 -35957 116493 -4975
$$ packed form
17063f30759m0599K79678J72191J25105o7750l06753o3672K46174J21806P6124
17053h8455K70748M5371k33588j23430r6448p3191O2985K27104J18227k9080k45086
17042a64843k24294n5661o6213j24425J94044J75356Q3920K7197L3384j1698k81812
17031d15045p8648J58668J58299M2739N9186M9669R0961L955k10677l68804l07371
17020h17068j17588J28627K90862L83767M2627k60882j27248Q9214Q6621k7927
17010c28995o6908N4078K31189K46492P7424r5267j11355J60448J15917j91883
17000I1140k39904l0517r8443k00590j58457O5270N2191K8455J47962N7385J13796
16989a71712k4621k21173J77917J87914k39141j18646J10575K62930J52450j21468
$$ plain form
16979 -4975 -119493 -201810 -240618 -381391 -284333 62709 274363 396121 339598 344969 308779
16968 308779 161269 203832 252511 255244 144789 41370 -194252 -376444 -380287 -344464 -230875
16957 -230875 -228192 -397316 -482219 -74173 296452 340510 506266 697608 638782 487934
16947 487934 342485 152470 42855 -32420 -178238 -138944 16348 -7933 -75115 -162987
16937 -162987 -211040 -303829 -296856 -135084 -255848 -277125 -11467 -65924 -220373 -164257 -3722
16926 -3722 -106476 -447688 -491953 -358657 -81305 126845 80720 114778 20013 -176135 -110893
16915 -110893 -24920 -194542 -218092 -148329 -185640 -223430 -221063 -161796 -69760 -206408 -356249
16904 -356249 -314748 -193775 -191810 -323395 -358043 -393770 -433356 -516458 -526715 -483943 -364071
$$ packed form
16979d975j14518q2317l8808j40773R7058L47042K11654J21758n6523N371l6190
16968C08779j47510M2563M8679K733j10455j03419k35622j82192l843L5823J13589
16957b30875K683j69124q4903M08046L70625M4058J65756J91342n8826j50848
16947D87934j45449j90015j09615p5275j45818L9294J55292k4281o7182q7872
16937a62987m8053r2789O973J61772j20764k1277K65658n4457j54449N6116J60535
16926c722j02754l41212m4265J33296K77352K08150m6125L4058r4765j96148O5242
16915a10893Q5973j69622k3550O9763l7311l7790K367N9267R2036j36648j49841
16904c56249M1501J20973J965j31585l4648l5727l9586q3102j0257M2772J19872
$$ plain form
16893 -364071 -362726 -456453 -452096 -152459 20212 16808 -27396 -122674 -324590 -436402 -321748
16882 -321748 -251700 -324648 -263467 71994 226712 10978 -155797 -89860 -73646 -73830 -78860
16871 -78860 -148703 -71295 -46178 35971 101382 104206 214443 174118 -39365 -122494 51086
16860 51086 174968 346446 441659 239080 330776 438112 301018 115518 -223059 -365470
16850 -365470 -373619 -439207 -462086 -561102 -408040 -61251 52506 8213 -38074 -222066 -216956
16839 -216956 -99534 -44843 -219031 -405529 -456309 -369374 -108183 -51045 -142811 -158956 33031
16828 33031 -2112 -296662 -516313 -250329 -54719 -160775 -146992 119406 408631 503168
16818 503168 464237 319851 243792 69979 -138454 -177976 -113981 -129167 -293551 -585663
$$ packed form
16893c64071J345r3727M357K99637J72671l404m4204r5278k01916j11812J14654
16882c21748P0048p2948O1181L35461J54718k15734j66775O5937J6214j84n030
16871g8860o9843P7408K5117Q2149O5411K824J10237m0325k13483q3129J73580
16860E1086J23882J71478R5213k02579R1696J07336j37094j85500l38577j42411
16850c65470q149o5588k2879r9016J53062L46789J13757m4293m6287j83992N110
16839b16956J17422N4691j74188j86498n0780Q6935K61191N7138r1766j6145J91987
16828C3031l5143k94550k19651K65984J95610j06056J3783K66398K89225R4537
16818E03168l8931j44386p6059j73813k08433l9522O3995j5186j64384k92112
$$ plain form
16808 -585663 -761873 -741004 -745574 -724997 -642110 -523405 -276984 -103887 50753 107131 42750
16797 42750 101885 223369 230431 86533 -192129 -514556 -428788 -162017 253953 438799
16787 438799 351635 298377 330776 183421 -28660 -156609 -355107 -297273 -199593 -313957
16777 -313957 -462770 -342143 -32831 89999 174902 351895 365584 306759 408055 494430
16767 494430 517146 501377 96052 -213399 -202202 111398 264531 108267 -274129 -415922
16757 -415922 -242565 -186555 -422372 -567333 -427304 -140899 -163967 -351401 -350083 -285620
16747 -285620 -195341 -131623 -117541 -147890 -107617 -18198 31517 70567 74539 190336 456771
16736 456771 592348 334467 190437 214599 321584 332989 483855 769440 1062220 1427889
$$ packed form
16808e85663j76210K0869m570K0577Q2887J18705K46421J73097J54640N6378o4381
16797D2750N9135J21484P062j43898k78662l22427Q5768K66771M15970J84846
16787D38799q7164n3258L2399j47355k12081j27949j98498N7834R7680j14364
16777c13957j48813J20627L09312J22830Q4903J76993J3689n8825J01296Q6375
16767D94430K2716j5769m05325l09451J1197L13600J53133j56264l82396j41793
16757d15922J73357N6010k35817j44961J40029K86405k3068j87434J318O4463
16747b85620R0279O3718J4082l0349M0273Q9419M9715L9050L972J15797K66435
16736D56771J35577k57881j44030K4162J06985J1405J50866K85585K92780L65669
$$ plain form
16726 1427889 1736696 1813794 1614830 1351890 1085005 868097 827030 878907 656922 452410
16716 452410 496946 343265 -21670 -229850 -174080 -52017 -58468 -258798 -370577 -315255
16706 -315255 -141413 76604 88970 -40400 -190850 -254129 -496484 -692744 -430710 -197379
16696 -197379 -106236 -24885 -78049 -119686 -30342 -66189 -121757 18801 172650 188089 218181
16685 218181 300855 391524 338640 151593 39616 -97350 -41995 67834 16867 -100683
16675 -100683 -38072 44319 50443 22930 47604 -35974 -130488 -314949 -461751 -525734 -491600
16664 -491600 -414785 -302779 -350535 -490726 -508999 -402792 -289562 -280924 -328071 -458362 -460081
16653 -460081 -340382 -132278 89644 100025 101903 87373 -61991 -347457 -318600 -225462 -157464
$$ packed form
16726A427889L08807P7098j98964k62940k66885k16908m1067N1877k21985k04512
16716D52410M4536j53681l64935k08180N5770J22063o451k00330j11779N5322
16706c15255J73842K18017J2366j29370j50450o3279k42355j96260K62034K33331
16696a97379R1143Q1351n3164m1637Q9344l5847n5568J40558J53849J5439L0092
16685B18181Q2674R0669n2884j87047j11977j36966N5355J09829n0967j17550
16675a00683O2611Q2391O124k7513K4674q3578r4514j84461j46802o3983L4134
16664d91600P6815J12006m7756j40191j8273J06207J13230Q638m7147j30291j719
16653d60081J19699K08104K21922J0381J878j4530j49364k85466K8857R3138O7998
$$ plain form
16642 -157464 -167921 -314116 -332860 -302408 -371908 -327090 -347307 -248034 -121861 -196855 -225392
16631 -225392 -180654 -70354 150321 348969 372388 124089 -242144 -396058 -222036 141823
16621 141823 376870 424074 539873 515801 418675 166262 -291375 -519830 -498024 -621957
16611 -621957 -779973 -680397 -565440 -595464 -511224 -392989 -388845 -434962 -480278 -360690 2465
16600 2465 287468 300948 279621 455043 348453 141876 36422 -90120 -116930 -148301 -227125
16589 -227125 -261222 -77763 -28436 -77290 88602 267598 298446 417341 246053 -24511
16579 -24511 93574 49665 -351447 -541561 -529305 -454353 -424468 -272028 -251464 -113887 338543
16568 338543 568992 463587 207862 -13404 -98497 -22495 155162 369594 587697 734342
$$ packed form
16642a57464j0457j46195j8744L0452o9500M4818k0217R9273J26173p4994k8537
16631b25392M4738J10300K20675J98648K3419k48299l66233j53914J74022L63859
16621A41823K35047M7204J15799k4072r7126k52413m57637k28455K1806j23933
16611f21957j58016R9576J14957l0024Q4240J18235M144m6117m5316J19588L63155
16600B465K85003J3480k1327J75422j06590k06577j05454j26542k6810l1371p8824
16589b27125l4097J83459M9327m8854J65892J78996L0848J18895j71288k70564
16579b4511J18085m3909m01112j90114J2256P4952K9885J52440K0564J37577M52430
16568C38543K30449j05405k55725k21266q5093P6002J77657K14432K18103J46645
$$ plain form
16558 734342 753931 559272 274751 226504 381399 415252 510566 504835 279438 258724 238665
16547 238665 218979 102748 -80393 -88021 -86424 -154898 68310 252547 274742 224092 220444
16536 220444 293236 302054 169866 -68294 -222954 -342522 -317686 124229 518745 547819
16526 547819 462765 385304 279210 256885 108179 -78488 -261841 -267209 -179353 -167360 -203510
16515 -203510 -248912 -155021 -130719 -154975 -368976 -448502 -299254 -207280 -250657 -319359 -314672
16504 -314672 -295275 -286708 -253869 -149371 -14605 -143601 -396581 -343240 -208032 -31426
16494 -31426 167037 265483 265757 263023 377692 521005 400184 154616 190182 446587 556605
16483 556605 461224 162537 -52254 51318 194980 126602 -10974 5917 188633 236001
$$ packed form
16558G34342J9589j94659k84521m8247J54895L3853R5314n731k25397k0714k0059
16547B38665j9686j16231j83141p628J597o8474K23208J84237K2195n0650l648
16536B20444P2792Q818j32188k38160j54660j19568K4836M41915L94516K9074
16526E47819q5054p7461j06094k2325j48706j86667j83353n368Q7856J1993l6150
16515b03510m5402R3891K4302k4256k14001p9526J49248R1974m3377o8702M687
16504c14672J9397Q567L2839J04498J34766j28996k52980N3341J35208J76606
16494c1426J98463R8446K74k734J14669J43313j20821k45568L5566K56405J10018
16483E56605r5381k98687k14791J03572J43662o8378j37576J6891J82716M7368
$$ plain form
16473 236001 67036 -30141 -95685 -36903 -72374 -132594 -115147 -137934 14253 247504 338760
16462 338760 237842 114305 -122305 -511746 -410538 -126159 112631 170507 91634 41414
16452 41414 -200477 -524211 -728953 -832587 -904835 -932919 -986179 -915919 -611189 -288598
16442 -288598 -96004 16488 84259 39420 71011 278181 344383 129729 -12790 -25107
16432 -25107 23674 59795 139906 141204 180581 288793 285369 500461 611515 358597 140465
16421 140465 118249 230422 151125 24438 -100142 -252505 -417588 -512827 -535199 -421658
16411 -421658 -338870 -346680 -384768 -345886 -431949 -536690 -579441 -612799 -669584 -520218 -339111
16400 -339111 -377951 -613384 -757150 -550007 -421909 -468339 -395749 -256385 -229306 -292042
$$ packed form
16473B36001j68965r7177o5544N8782l5471o0220J7447k2787J52187K33251R1256
16462C38760j00918j23537k36610l89441J01208K84379K38790N7876p8873n0220
16452D1414k41891l23734k04742j03634p2248k8084n3260P0260L04730L22591
16442b88598J92594J12492O7771m4839L1591K07170O6202k14654j42519j2317
16432b5107M8781L6121Q0111J298L9377J08212l424K15092J11054k52918k18132
16421A40465k2216J12173p9297j26687j24580j52363j65083r5239k2372J13541
16411d21658Q2788p810l8088L8882q6063j04741m2751l3358n6785J49366J81107
16400c39111l8840k35433j43766K07143J28098m6430P2590J39364K7079o2736
$$ plain form
16390 -292042 -439394 -492345 -559215 -568271 -499615 -405084 -26982 373563 283713 95484 119587
16379 119587 119277 21464 38366 148280 28688 -250509 -467270 -405298 -383454 -160666 169814
16368 169814 247318 186481 247499 86488 -114938 -112243 -33015 -68473 -329372 -468925 -576743
16357 -576743 -522706 -331757 33006 406658 448985 232349 148764 76787 -107042 -196286
16347 -196286 -329699 -108513 16812 -138780 -335212 -405549 -376119 -419837 -618167 -620287
16337 -620287 -482552 -487018 -613260 -606213 -483194 -497473 -487980 -515487 -620862 -690980 -658574
16326 -658574 -796883 -935755 -785926 -714760 -853551 -745671 -546888 -287784 -52757 -35797
16316 -35797 -164900 -230791 -247456 -260967 -332417 -372756 -405369 -242611 -253 -45831 -64722
$$ packed form
16390b92042j47352n2951o6870r056O8656R4531L78102M00545q9850j88229K4103
16379A19587l10r7813J6902J09914j19592k79197k16761O1972K1844K22788L30480
16368A69814P7504o0837O1018j61011k01426K695P9228l5458k60899j39553j07818
16357e76743N4037J90949L64763L73652M2327k16636q3585p1977j83829q9244
16347a96286j33413K21186J25325j55592j96432p0337K9430m3718j98330k120
16337f20287J37735m466j26242P047J23019j4279R493k7507j05375p0118L2406
16326f58574j38309j38872J49829P1166j38791J07880J98783K59104K35027J6960
16316c5797j29103o5891j6665j3511p1450m0339l2613J62758K42358m5578j8891
$$ plain form
16305 -64722 130376 225661 -26853 -229018 -464770 -769370 -592041 -114399 191742 75853
16295 75853 -181278 -412473 -517555 -495335 -305402 -202813 -220234 -272110 -277317 -108793 -126545
16284 -126545 -132200 -127215 -230169 -103059 -33290 -24076 48822 288625 440100 258314 42463
16273 42463 22231 84956 175808 146790 -23205 -253597 -361954 -220002 -184744 -291705 -268521
16262 -268521 -281943 -275622 -26958 196829 330261 379169 409150 277752 83849 -95547
16252 -95547 -175703 31549 269502 -58235 -327724 -297937 -210256 58736 398311 648480
16242 648480 571268 266037 79193 212734 320645 72584 -176801 -211452 -208000 -58380
16232 -58380 17935 -228692 -377776 -149152 180803 143797 58018 157036 224640 191662 137769
$$ packed form
16305f4722J95098R5285k52514k02165k35752l04600J77329M77642L06141j15889
16295G5853k57131k31195j05082K2220J89933J02589j7421n1876n207J68524j7752
16284a26545n655M985j02954J27110O9769R214P2898K39803J51475j81786k15851
16273D2463k0232O2725R0852k9018j69995k30392j08357J41952L5258j06961K3184
16262b68521j3422O321K48664K23787J33432M8908K9981j31398j93903j79396
16252i5547q0156K07252K37953l27737k69489K9787Q7681K68992L39575K50169
16242F48480p7212l05231j86844J33541J07911k48061k49385l4651L452J49620
16232e8380P6315k46627j49084K28624L29955l7006q5779R9018O7604l2978n3893
$$ plain form
16221 137769 81629 -26963 27426 172326 242688 143410 24032 -292665 -379608 -307962 -337617
16210 -337617 -357611 -268954 -330897 -255537 -353538 -510159 -463316 -308867 -260441 -327725 -474760
16199 -474760 -398876 -251608 -247938 -295895 -243404 -178942 -140807 -251484 -359316 -361863 -357761
16188 -357761 -207271 -188956 -124134 -28902 -82298 -257537 -257560 -94476 -83994 -128475 -189896
16177 -189896 -296821 -448806 -414742 -105774 155036 104885 -226583 -501679 -477167 -384691
16167 -384691 -269674 -229814 -190540 21896 305194 308756 40026 -67885 -27705 -89542 34116
16156 34116 218364 361832 547860 475686 334256 166139 -59210 -151923 -92289 -51600
16146 -51600 43146 63492 -28331 -116965 -305871 -458481 -341188 -454407 -468811 -278979 -301469
$$ packed form
16221A37769n6140j08592N4389J44900P0362r9278j19378l16697q6943P1646k9655
16210c37617j9994Q8657o1943P5360r8001j56621M6843J54449M8426o7284j47035
16199d74760P5884J47268L670m7957N2491O4462L8135j10677j07832k547M102
16188c57761J50490J8315O4822R5232n3396j75239k3J63084J0482m4481o1421
16177a89896j06925j51985L4064L08968K60810n0151l31468k75096K4512R2476
16167c84691J15017L9860L9274K12436K83298L562k68730j07911M0180o1837J23658
16156C4116J84248J43468J86028p2174j41430j68117k25349r2713N9634M0689
16146e1600R4746K0346r1823q8634j88906j52610J17293j13219j4404J89832k2490
$$ plain form
16135 -301469 -486297 -500366 -418794 -247628 6957 119502 -140194 -500873 -590888 -704823
16125 -704823 -531548 83710 264040 357801 505584 571387 465113 257788 74646 -6527
16115 -6527 -168206 -249486 -304708 -295503 -180277 -55314 3666 -219566 -248972 -112288 -39953
16104 -39953 -1851 -105475 -159119 -124792 -144422 -150239 -150550 -109397 16282 15549 46058 -34197
16092 -34197 -332877 -614399 -440742 -273280 -256326 -398901 -475084 -502102 -375833 -189049
16082 -189049 -282872 -267287 -290029 -274559 -357711 -462256 -179404 -946 -158380 -143408 -6880
16071 -6880 -55456 15934 134865 196258 299734 114111 -118978 -198201 -151127 -346649 -352161
16060 -352161 -230278 -256977 -178403 -20378 2609 -144182 -151340 -115398 -99185 -175454 -326832
$$ packed form
16135c01469j84828j4069Q1572J71166K54585J12545k59696l60679r0015j13935
16125g04823J73275O15258J80330R3761J47783O5803j06274k07325j83142q1173
16115f527j61679q1280n5222R205J15226J24963N8980k23232k9406J36684P2335
16104c9953L8102j03624n3644L4327j9630n817l11M1153J25679p33L0509q0255
16092c4197k98680k81522J73657J67462J6954j42575p6183k7018J26269J86784
16082a89049r3823J5585k2742J5470q3152j04545K82852J78458j57434J4972J36528
16071f880m8576P1390J18931O1393J03476j85623k33089p9223M7074j95522n512
16060c52161J21883k6699P8574J58025K2987j46791p158L5942J6213p6269j51378
$$ plain form
16049 -326832 -455183 -403614 -328683 -275738 -198690 33205 253095 252113 225374 227942 71317
16038 71317 65187 234872 33933 -275410 -458769 -345221 -335728 -341781 -59741 120395 93237
16027 93237 104222 87319 171227 282227 228237 77903 226583 254453 -83227 -387098 -379054
$$ packed form
16049c26832j28351N1569P4931N2945P7048K31895K19890r82k6739K568j56625
16038G1317o130J69685k00939l09343j83359J13548R493o053K82040J80136k7158
16027I3237J0985j6903Q3908J11000n3990j50334J48680K7870l37680l03871Q044
$$ [...]
##END NTUPLES=NMR SPECTRUM
##END=
