##TITLE=C13_LacDMe-C-19-B-14
 CDCl3, 22300 sc

 11.11.2019
##JCAMPDX= 6.0         $$ Bruker NMR JCAMP-DX V2.0
##DATA TYPE= NMR SPECTRUM
##DATA CLASS= NTUPLES
##ORIGIN= UXNMR, Bruker Analytische Messtechnik GmbH
##OWNER= root
$$ XWIN-NMR		Version 3.5
$$ Tue Nov 12 13:46:27 2019 Russian Standard Time (UT+4h)  she@DPX200
##.OBSERVE FREQUENCY= 50.327896
##.OBSERVE NUCLEUS= ^13C
##.ACQUISITION MODE= SIMULTANEOUS
##.ACQUISITION SCHEME= undefined
##.AVERAGES= 18820
##.DIGITISER RES= 17
##SPECTROMETER/DATA SYSTEM= spect
##.PULSE SEQUENCE= zgpg30
##.SOLVENT NAME= CDCl3
##.SHIFT REFERENCE= (INTERNAL, CDCl3, 0, 222.624)
##AUDIT TRAIL= $$ (NUMBER, WHEN, WHO, WHERE, WHAT)
$$ ##TITLE= Audit trail, XWIN-NMR		Version 3.5
$$ ##JCAMPDX= 5.01
$$ ##ORIGIN= Bruker BioSpin GmbH
$$ ##OWNER= she
$$ F:/spectra/data/she/nmr/c13/1/pdata/1/auditp.txt
$$ ##AUDIT TRAIL=  $$ (NUMBER, WHEN, WHO, WHERE, WHAT)
(   1,<2019-11-12 10:35:36.12 +0400>,<she>,<DPX200>,
      <created by zg, POWCHK disabled, PULCHK disabled
       terminated by command 'halt'
       configuration hash MD5:
       00 E9 B6 7A A2 85 ED C7 34 08 36 98 17 FE 4E 26
       data hash MD5: 32K
       1B BB 93 A5 80 F2 CF 64 72 47 74 E3 4F B4 2B 1F>)
(   2,<2019-11-12 13:44:03.18 +0400>,<she>,<DPX200>,
      <Start of raw data processing
       efp BC_mod = 2 LB = 1 FT_mod = 6 PKNL = 1 PHC0 = -240.2492 PHC1 = 34.80636 SI = 32K 
       data hash MD5: 32K
       02 9A F9 AB 74 60 A6 F4 B8 A5 04 5E 4B 79 24 2C>)
(   3,<2019-11-12 13:44:26.04 +0400>,<she>,<DPX200>,
      <pk PHC0 = 0.05901492 PHC1 = 9.6 
       data hash MD5: 32K
       C2 47 BE 25 62 FC 04 16 99 31 AB 47 D9 5B 6D 11>)
(   4,<2019-11-12 13:44:29.29 +0400>,<she>,<DPX200>,
      <abs ABSG = 5 
       data hash MD5: 32K
       6C 4B 96 D6 38 6B B5 CD 42 EA 39 7B 4D E2 46 E0>)
(   5,<2019-11-12 13:45:13.65 +0400>,<she>,<DPX200>,
      <pk PHC0 = 7.706285 PHC1 = -13.6 
       data hash MD5: 32K
       22 62 76 7C C0 90 F7 2B 0B 01 D8 DE 81 61 64 13>)
(   6,<2019-11-12 13:45:17.03 +0400>,<she>,<DPX200>,
      <abs ABSG = 5 
       data hash MD5: 32K
       39 C1 B0 21 E2 29 BB 8D 2E 86 91 79 8F CE 1B 6E>)
$$ ##END=
$$ 
$$ hash MD5
$$ EF 79 3C C1 AC 5E 7D 95 3B 1D 8D A1 16 10 A8 EF
##$RELAX= 
##$RELAX= 
##$RELAX= 
##$RELAX= 
##$RELAX= 
##$RELAX= 
##$RELAX= 
##$RELAX= 
$$ Bruker specific parameters
$$ --------------------------
##$DU= <F:/spectra>
##$EXPNO= 1
##$NAME= <c13>
##$PROCNO= 1
##$TYPE= <nmr>
##$USER= <she>
##$AMP= (0..31)
100 100 100 100 100 100 100 100 100 100 100 100 100 100 100 100 100 100 
100 100 100 100 100 100 100 100 100 100 100 100 100 100 
##$AQSEQ= 0
##$AQ_mod= 1
##$AUNM= <au_zg>
##$AUTOPOS= <>
##$BF1= 50.322709
##$BF2= 200.13
##$BF3= 50.322709
##$BF4= 500.13
##$BF5= 500.13
##$BF6= 500.13
##$BF7= 500.13
##$BF8= 500.13
##$BYTORDA= 1
##$CFDGTYP= 0
##$CFRGTYP= 5
##$CHEMSTR= <none>
##$CNST= (0..31)
1 1 145 1 1 1 1 1 1 1 1 1 1 1 1 1 1 1 1 1 1 1 1 1 1 1 1 1 1 1 1 1 
##$CPDPRG= <waltz16>
##$CPDPRG1= <>
##$CPDPRG2= <waltz16>
##$CPDPRG3= <>
$$ [...]
##$SUBNAM4= <"">
##$SUBNAM5= <"">
##$SUBNAM6= <"">
##$SUBNAM7= <"">
##$SUBNAM8= <"">
##$SUBNAM9= <"">
##$SW= 239.972175391363
##$SWIBOX= (0..15)
0 1 3 0 0 0 0 0 0 0 0 0 0 0 0 0 
##$SW_h= 12077.2946859903
##$TD= 32768
##$TD0= 1
##$TE= 0
##$TE2= 300
##$TE3= 300
##$TEG= 300
##$TL= (0..7)
120 120 120 120 120 120 120 120 
##$TP= (0..7)
150 150 150 150 150 150 150 150 
##$TP07= 0
##$TPNAME0= <>
##$TPNAME1= <>
##$TPNAME2= <>
##$TPNAME3= <>
##$TPNAME4= <>
##$TPNAME5= <>
##$TPNAME6= <>
##$TPNAME7= <>
##$TPOAL= (0..7)
0.5 0.5 0.5 0.5 0.5 0.5 0.5 0.5 
##$TPOFFS= (0..7)
0 0 0 0 0 0 0 0 
##$TUNHIN= 0
##$TUNHOUT= 0
##$TUNXOUT= 0
##$USERA1= <user>
##$USERA2= <user>
##$USERA3= <user>
##$USERA4= <user>
##$USERA5= <user>
##$V9= 5
##$VALIST= <valist>
##$VCLIST= <CCCCCCCCCCCCCCC>
##$VD= 0
##$VDLIST= <DDDDDDDDDDDDDDD>
##$VPLIST= <PPPPPPPPPPPPPPP>
##$VTLIST= <TTTTTTTTTTTTTTT>
##$WBST= 1024
##$WBSW= 4
##$XGAIN= (0..3)
0 0 0 0 
##$XL= 0
##$YL= 0
##$YMAX_a= 76702993
##$YMIN_a= -132774068
##$ZGOPTNS= <>
##$ZL1= 120
##$ZL2= 120
##$ZL3= 120
##$ZL4= 120
##$ABSF1= 222.624
##$ABSF2= -17.3728
##$ABSG= 5
##$ABSL= 3
##$ALPHA= 0
##$AQORDER= 0
##$ASSFAC= 0
##$ASSFACI= 0
##$ASSFACX= 0
##$ASSWID= 0
##$AUNMP= <proc_1d>
##$AZFE= 0.1
##$AZFW= 0.5
##$BCFW= 0
##$BC_mod= 2
##$BYTORDP= 0
##$COROFFS= 0
##$CY= -3
##$DATMOD= 1
##$DC= 0
##$DFILT= <>
##$DTYPP= 0
##$F1P= 0
##$F2P= 0
##$FCOR= 0.5
##$FTSIZE= 32768
##$FT_mod= 6
##$GAMMA= 0
##$GB= 0
##$INTBC= 1
##$INTSCL= 4.134877e-10
##$ISEN= 128
##$LB= 1
##$LEV0= 0
##$LPBIN= 0
##$MAXI= 10000
##$MC2= 0
##$MEAN= 0
##$ME_mod= 0
##$MI= 0.1934396
##$NCOEF= 0
##$NC_proc= 2
##$NLEV= 6
##$NOISF1= 120.0001
##$NOISF2= 80.00006
##$NSP= 0
##$NTH_PI= 0
##$NZP= 0
##$OFFSET= 222.624
##$PC= 1.4
##$PHC0= -232.4839
##$PHC1= 30.80636
##$PH_mod= 1
##$PKNL= yes
##$PPARMOD= 0
##$PSCAL= 0
##$PSIGN= 0
##$REVERSE= no
##$SF= 50.3227315989248
##$SI= 32768
##$SIGF1= 140
##$SIGF2= 120
##$SINO= 11.81781
##$SIOLD= 32768
##$SREGLST= <13C.CDCl3>
##$SSB= 0
##$STSI= 32768
##$STSR= 0
##$SW_p= 12077.2946859903
##$SYMM= 0
##$S_DEV= 0
##$TDeff= 32768
##$TDoff= 0
##$TI= <>
##$TILT= no
##$TM1= 0
##$TM2= 0
##$TOPLEV= 0
##$USERP1= <user>
##$USERP2= <user>
##$USERP3= <user>
##$USERP4= <user>
##$USERP5= <user>
##$WDW= 1
##$XDIM= 32768
##$YMAX_p= 521006972
##$YMIN_p= -2293185
$$ End of Bruker specific parameters
$$ ---------------------------------
##NTUPLES= NMR SPECTRUM
##VAR_NAME=  FREQUENCY,     SPECTRUM/REAL,   SPECTRUM/IMAG
##SYMBOL=    X,             R,               I
##VAR_TYPE=  INDEPENDENT,   DEPENDENT,       DEPENDENT
##VAR_FORM=  AFFN,          ASDF,            ASDF
##VAR_DIM=   32768,         32768,           32768
##UNITS=     HZ,            ARBITRARY UNITS, ARBITRARY UNITS
##FACTOR=    0.368581032318806, 1,           1
##FIRST=     11203.0474431902, 0,            0
##LAST=      -874.247242800138, 0,           0
##MIN=       -874.247242800138, -2293185,    0
##MAX=       11203.0474431902, 521006972,    0
$$ Real data points
##PAGE= N=1
##DATA TABLE= (X++(R..R)), XYDATA
$$ [...]
18183 207488 184515 -42585 -242027 118656 158710 -59557 -84083 108600 409881 204758
18173 204758 281929 627165 886843 958858 412192 -136709 -410830 -542827 -520399 -144606
18163 -144606 34169 -126677 -337274 -445734 -413782 -124967 99412 8240 -205314 -399009
18153 -399009 -587404 -908045 -710361 -405280 -338201 -284549 -228952 -36191 429546 322711
18143 322711 -231107 -443746 -383632 -170352 44513 -192186 -414332 -235278 -103072 -40279
18133 -40279 284540 696061 796967 678508 706539 351955 -69182 -198383 -285448 34456
18123 34456 323964 411679 68696 -296833 -290743 -375659 -204909 89101 -203741 -413087
18113 -413087 -99550 218990 387103 207520 255544 708869 1227633 1150451 629361 282706
18103 282706 102997 197112 570831 958526 761195 369515 -27805 -486380 -393534 -279125
18093 -279125 -294487 -401423 -665921 -703152 -327492 91747 255737 173113 -216373 -530005
18083 -530005 -719876 -585905 -334568 -390825 -656387 -1129109 -1281151 -982638 -539209 -151046
18073 -151046 166318 289370 291411 215143 -125960 -295218 -162112 177542 606229 636442
18063 636442 631085 783720 747833 603091 295303 -80408 -142366 -319410 -634339 -993906
18053 -993906 -796269 -287034 -114225 -232980 -404809 -340066 -308455 -539235 -736680 -848773
18043 -848773 -663586 -637057 -795321 -946770 -1217724 -1318720 -637073 118974 143060 -125586
18033 -125586 -101965 219150 603941 935251 760732 246673 -138638 -375252 -696849 -794040
18023 -794040 -881881 -483480 -615616 -893957 -594473 -192037 93089 71002 11988 75447
18013 75447 -109414 -447512 -453055 -350446 -297408 -381188 -512893 -309505 49452 12956 -315722
18002 -315722 -490887 -513646 -452286 -425242 -165504 112846 71900 -87621 -3530 422941
17992 422941 828899 923463 875409 372959 -17689 50406 -171352 -309852 -27006 117734
17982 117734 156770 118334 203510 408049 303616 199512 397408 603690 601933 505297 270238
17971 270238 53502 21311 -10221 -81320 -303225 -599413 -532879 -331787 -156617 12973
17961 12973 219607 360687 164386 -186007 -385175 -216879 53196 533137 698427 438766
17951 438766 337365 296980 189671 261045 538937 250401 73959 -20678 -316041 -403145
17941 -403145 -460326 -447040 -301593 99948 764244 928708 296551 -97279 64025 58507
17931 58507 -160412 -304694 -193276 17319 -331311 -774391 -590400 -358820 -295054 -292740
17921 -292740 -187760 -223156 -423769 -455053 -196478 150432 -22268 -345989 -441203 -584649
17911 -584649 -645885 -741190 -1033958 -888063 -378945 -237644 -386035 -598579 -285159 187781
17901 187781 149365 -162531 -409248 -498154 -269381 -321277 -601492 -255736 -71766 -216293
17891 -216293 -55854 189946 218929 -178525 -434778 -516604 -221838 449730 795322 405895
17881 405895 -98991 -285480 -462986 -587990 -495763 -534213 -707746 -610424 -483504 -245889
17871 -245889 -401333 -867100 -841421 -360341 -179114 -37851 -2224 -209155 -469408 -226907
17861 -226907 131430 299225 350120 302563 193982 -95349 -451357 -468438 -280475 -458692
17851 -458692 -712332 -496021 -258795 -210974 -392764 -589259 -630738 -577774 -644442 -861587
17841 -861587 -727422 -680836 -703382 -539451 -340468 -137696 -511437 -745591 -448881 -35416
17831 -35416 226659 -37116 -384412 -704729 -760148 -375408 -190742 -306639 -556319 -672407
17821 -672407 -617057 -336520 59477 179885 23636 -32885 288590 787449 921801 712946
17811 712946 286793 84649 385951 440330 489484 37293 -295544 -233739 -208140 -242213
17801 -242213 -266194 -384592 -111035 419579 797635 732359 515886 482990 390191 232712
17791 232712 15975 -481605 -709236 -909823 -597721 49503 239960 226251 465769 479818
17781 479818 395824 364389 37011 -69534 -40420 -67578 117068 322234 322765 317303 379367
17770 379367 504924 529250 294766 203763 -113001 -468915 -429127 -355266 -490879 -720265
17760 -720265 -714423 -486952 -257393 -182852 -360643 -536221 -689068 -693835 -881913 -1086748
17750 -1086748 -906982 -716392 -344634 -214333 -655597 -1212634 -1061286 -354433 265673
17741 265673 632588 679735 334762 615288 693541 272873 204607 348378 48966 -438496
17731 -438496 -506476 -363597 -153312 -50121 182089 192898 35325 -112850 -358776 -480992
17721 -480992 -206639 135807 -141778 -206902 152235 450185 154415 106828 506620 429779
17711 429779 109939 17109 86861 150429 417892 405325 242721 243527 267093 214501 -19777
17700 -19777 -193895 -557237 -854484 -594075 -502846 -473021 -244931 6701 249832 -3687
17690 -3687 -288431 -118433 161512 500077 266786 -232425 -165624 -243103 -191233 309003
17680 309003 686907 656087 546367 351081 -62299 -474924 -517078 -576118 -508152 -274634
17670 -274634 -355768 -614399 -565854 -399997 -550646 -621962 -352537 47117 251909 215932
17660 215932 166508 -252385 -169122 348893 689546 488439 93706 89321 344996 566262
17650 566262 675911 671053 519374 483553 404787 545483 649626 495386 474773 196101
17640 196101 -441750 -790477 -854420 -757492 -752042 -723654 -746474 -610472 -372141 -197229 -81482
17629 -81482 -303562 -262008 -263140 -225284 -285227 143228 780303 921831 637147 223537 -35314
17618 -35314 -259478 -566665 -475687 -66575 344876 332593 -144108 -238207 154352 225744
17608 225744 29150 -100835 -166638 -151667 64460 386172 605335 902048 798090 537559
17598 537559 654621 438517 -198693 -752774 -935438 -657350 -84177 241238 334920 317245
17588 317245 484238 647275 568607 289674 -457399 -989863 -1149626 -1017078 -927863 -822026
17578 -822026 -638769 -688743 -844338 -856504 -870710 -788323 -642659 -578831 -503415 -237110 -308414
17567 -308414 -364305 -446150 -442203 -378304 -271477 -222378 -337461 -512233 -652030 -353027 10199
17556 10199 101481 -78972 -2015 345692 365199 419234 361575 112333 -322907 -585011 -933553
17545 -933553 -1120175 -848701 -487856 -333855 -178975 -119965 268174 738286 1156768 1091378
17535 1091378 863901 724561 265350 -149460 -242963 -269158 -573376 -658911 -475518 -488742
17525 -488742 -436426 80095 576444 701297 636576 698695 600570 329172 -400119 -846572
17515 -846572 -728673 -485592 -551145 -626408 -484313 -89790 69704 -16863 -287195 -182303
17505 -182303 -181074 -75515 -21687 -128142 -60279 -314601 -550602 -317958 256227 294737
17495 294737 51158 -147622 -68867 390623 697285 504628 486753 550740 630170 401809
17485 401809 156701 573223 1074751 1134800 844714 466477 460846 685394 804084 500710
17475 500710 256000 4937 -292816 -618181 -562431 -247539 -96381 -14379 -149659 -454465
17465 -454465 -756443 -1026465 -1060043 -1036921 -787399 -305295 -35813 -160511 -509187 -582451
17455 -582451 -501472 -269000 96601 345358 353690 67177 -408749 -304581 260378 810603
17445 810603 1198150 1332205 1112432 719791 413232 -320441 -865472 -289232 246180 121950
17435 121950 -288307 -343867 -72823 477990 1227658 1608111 1537097 1423266 1054082 486526
17425 486526 -108597 -406372 -194663 39530 -185327 -143379 5580 191609 414451 531931
17415 531931 621886 793545 992462 949723 972695 1219770 1257311 1005887 693774 227306
17405 227306 -199771 -686279 -741434 -509863 -411261 -356248 -213169 44355 -135917 -711888
17395 -711888 -1017641 -1098850 -1245728 -1512091 -1240181 -815101 -380060 -327731 -547403 -306116
17385 -306116 21339 161410 180087 -64110 -515650 -745166 -569791 -521992 -550039 -372682
17375 -372682 -139007 209529 196037 -31414 -302673 -622328 -749443 -371576 -38618 137860
17365 137860 303646 330262 115839 3097 -174672 -190731 -5137 306846 202434 -251058
17355 -251058 -163901 81399 14406 -104602 101394 57531 -141328 -190807 -62975 -47886
17345 -47886 122478 -15659 -108080 -60695 -243547 -506291 -605644 -435091 -37798 -109648
17335 -109648 -352259 -249933 -127159 134871 846629 1364653 1025306 632331 929669 873257
17325 873257 193785 -230260 -305917 -126505 277510 385857 -188925 -510672 -477061 -419287
17315 -419287 -18732 132243 -33646 -151452 -274295 -378582 -735421 -739561 -643558 -940644
17305 -940644 -1360792 -1267305 -869642 -507667 -214793 -90562 103819 153885 11005 -371363
17295 -371363 -617298 -515509 -428769 -527065 -548214 -522552 -249048 32244 244758 571910
17285 571910 696220 759518 1020550 933661 615418 588102 652975 508640 247374 274419
17275 274419 658314 736279 714112 671494 325657 -253394 -498042 -158040 202604 373857
17265 373857 184980 -172647 -376706 -142037 44210 251816 471941 666776 529769 93670
17255 93670 134057 264872 406854 613185 603142 418577 245444 163200 357695 619322
17245 619322 403860 227265 440612 587318 645485 613538 718419 737542 481913 236451
17235 236451 -7396 -55340 -193648 -232981 -273650 -405608 -557176 -646383 -163310 355917
17225 355917 436280 346344 169987 54401 81438 -134708 -288918 -360758 -394383 -487623 -428985
17214 -428985 -198193 -147467 -3928 30725 110982 153028 373694 302108 124535 122504 208590
17203 208590 429692 231628 -516041 -984492 -1094800 -1004717 -805024 -866932 -955911 -1096340
17193 -1096340 -757704 -333889 -76274 -322209 -635525 -727886 -589621 -437740 -749520 -918528
17183 -918528 -791062 -655351 -328152 142364 -12136 20596 291694 650647 755415 542853
17173 542853 336946 -159689 -359781 -527616 -864279 -749464 -565866 -469369 -571458 -652233
17163 -652233 -409204 -112799 111102 144265 -561271 -1203597 -1418299 -1382126 -878992 -557077
17153 -557077 -580666 -455435 -312894 -208196 -279304 -22409 321628 464785 428490 235238
17143 235238 -140659 -472837 -773755 -480383 106098 680359 942009 807762 663873 554680
17133 554680 441426 361851 485277 538343 69052 -558920 -721715 -585807 -494581 -347577
17123 -347577 -236416 -562982 -939039 -1222499 -1306761 -1245699 -1159810 -1020745 -980018 -1094886
17113 -1094886 -1118592 -1173262 -1008194 -679521 -218155 -35816 -216807 -478978 -471633 -155434
17103 -155434 27842 159843 65834 -99558 -10782 -35997 -34144 105216 235574 236341 268173
17092 268173 459032 923590 743355 339814 294627 406545 349204 417342 573889 384426
17082 384426 482067 565390 466977 441657 554727 278507 -324868 -720273 -453594 209358
17072 209358 847518 1350289 1408745 957452 591409 600903 738184 508822 3399 93415
17062 93415 363791 342534 316345 405506 365243 -159158 -671364 -671516 -643485 -764250 -1001523
17051 -1001523 -973466 -772471 -743614 -621689 -394991 -305322 -84840 43559 -145108 -286537
17041 -286537 -432903 -309789 32292 242979 150386 -164043 -2242 499255 815201 775522
17031 775522 399435 -31404 -296394 -550782 -611759 -636495 -527277 -311369 -391269 -439248
17021 -439248 -131526 141991 287013 488851 361166 340286 64571 -117851 -60712 -76679
17011 -76679 151091 531247 294321 -9617 84840 258889 7306 -412056 -576243 -357812
17001 -357812 -159043 -253631 -236140 -18266 180399 84783 85123 -103933 -177058 -79484 -55593
16990 -55593 21027 140874 581493 954028 1041095 824840 734423 521440 -29167 74171
16980 74171 231654 386197 215712 -179158 -190602 -42152 -113686 -259270 -87921 -99011
16970 -99011 -445092 -597533 -445396 -103362 297804 88456 -591180 -1170816 -1276278 -716370
16960 -716370 -98778 -212857 -662370 -476586 -206088 -45033 30163 -76929 24447 162636
16950 162636 162711 228013 247303 537730 704732 382966 21778 -42517 -104774 78817 241231
16939 241231 470213 372647 195995 243359 96472 81608 76980 -24851 -357466 -282528 -40901
16928 -40901 -281958 -732164 -1015372 -943616 -715927 -363515 -196598 207736 591926 903884
16918 903884 856221 631938 557568 415984 330746 446402 310671 -584311 -1045163 -953035
16908 -953035 -568590 107634 452050 319328 142994 177742 316215 234226 126724 182820
16898 182820 115046 128621 288642 511833 614972 366645 -51327 -421929 -391279 -343884
16888 -343884 -93396 429269 656694 606203 99571 -482459 -465752 119801 472783 404048
16878 404048 323898 160772 -282935 -690180 -570204 -58222 407819 391316 299348 -17081
16868 -17081 -452862 -385810 -182719 -81645 317290 643819 585663 776554 843786 818878
16858 818878 623554 642892 677279 128943 65050 263079 597609 1020707 1408257 1533397
16848 1533397 1501595 1222377 665340 274747 233453 273183 111369 -69052 -294216 -337830
16838 -337830 -323911 -38599 145017 -32947 -175732 -169954 -161740 -459688 -438716 -440471 -439729
16827 -439729 121581 554655 713425 980619 1018322 673486 -165031 -1001118 -740873 -133499
16817 -133499 85914 74104 -235042 -485324 -761341 -700167 -537381 -527514 -786222 -915002
16807 -915002 -1071853 -1335765 -1102752 -753629 -518917 -577744 -491848 -193466 -184891 -557960
16797 -557960 -1108162 -1481439 -1493802 -1281140 -927064 -407428 -85653 -182812 -281309 -480416
16787 -480416 -312786 -42722 373483 393631 257611 36816 -226434 126714 151371 55538
16777 55538 185343 529485 419389 15064 -343989 35194 549068 676100 452413 167292
16767 167292 249420 427049 585720 1128571 1274662 995591 878271 431373 35739 -275923
16757 -275923 -395346 -370435 6539 140039 294143 555142 875193 1020814 485633 -289604
16747 -289604 -758983 -815023 -728562 -720264 -775332 -671338 -548438 -765965 -657829 -198770
16737 -198770 -190605 -176362 -6595 51836 -71871 -289623 -49364 327839 202161 103744
16727 103744 4202 110427 429806 471490 556664 433073 289871 177055 129302 255449
16717 255449 32207 -29465 114488 -505 -437715 -710286 -717819 -665387 -697787 -320046
16707 -320046 118235 215079 141728 -233688 -566173 -445926 -298508 -720657 -1142475 -1256954
16697 -1256954 -1246913 -1047357 -291491 238000 341231 316561 52364 -250440 -368459 -96723
16687 -96723 17193 -101705 -318025 -488807 -349280 -322682 -460582 -578632 -672097 -631044
16677 -631044 -240203 155001 339653 85847 -142821 313614 773270 863471 702336 462618
16667 462618 490021 360643 344629 646289 926849 1066501 1223356 1274516 1158895 1183579
16657 1183579 1429845 1631380 1587707 1268469 769673 382838 400344 344335 65651 62254
16647 62254 282255 578050 1035779 1491836 1356028 925835 942165 1233097 1126876 1144774
16637 1144774 1473457 1182345 1037750 1533561 1843312 1732032 1417736 1027986 937430 1058981
16627 1058981 1124667 1081514 787223 485064 346230 337505 128083 -274748 -585173 -597319
16617 -597319 -471338 2881 31948 -230458 -35857 270892 313020 410450 307191 325288
16607 325288 290696 -24234 106256 407805 415074 388512 492737 759065 850969 793613 525027
16596 525027 603046 781581 870927 892672 455915 188792 7129 -388101 -580036 -625778
16586 -625778 -388564 -53876 17770 -238004 -386401 -82678 349940 612339 533284 394692
16576 394692 269545 444595 976878 714381 270585 -173932 -485487 -336014 -196874 -217229
16566 -217229 -206793 119194 591884 1003286 806774 867315 1097538 859594 484390 172624
16556 172624 14285 76489 184867 225603 171170 33458 -282218 -365899 -395204 -142069
16546 -142069 -83447 -533262 -454905 109701 239403 166931 73838 -74612 -281528 -375184
16536 -375184 -89779 -144840 -275106 -437943 -532801 21422 177514 -188797 -273842 256126
16526 256126 802754 721170 202488 -174425 -484292 -615839 -521473 -341289 -381959 -413142
16516 -413142 -491781 -605703 -686745 -900651 -657093 -286779 -158899 -132915 66996 -97193
16506 -97193 -532871 -629612 -514093 -304992 -191015 -183087 -219484 -462780 -460575 -389467 -473599
16495 -473599 -517332 -142204 258268 182034 17900 78122 215691 174726 96827 277594
16485 277594 618441 675036 336062 -12433 164932 311588 268725 161979 47072 238165
16475 238165 435105 604524 682899 527190 -84687 -397000 -252587 136363 328178 390566
16465 390566 307477 64726 -148166 -71348 -200892 -56253 230216 148450 -433737 -846640
16455 -846640 -886475 -898768 -570937 -364740 -287694 -308290 -195155 -52917 11562 110097 183797
16444 183797 341884 443419 59131 -220564 -479889 -94393 335142 284210 309038 486458
16434 486458 637588 529699 183597 -174700 -758526 -861276 -511969 -99633 -131811 -343397
16424 -343397 -271264 -257285 -638720 -705547 -496564 -629526 -979400 -975648 -784607 -752209 -685811
16413 -685811 -271455 -104217 -462075 -334318 -46090 460190 586524 642006 890408 904349
16403 904349 720616 711898 1010758 1208888 1100804 876695 821114 846001 932350 837844 563789
16392 563789 441789 327660 -81663 -105913 -130766 -294695 -384883 -474029 -393891 -100968
16382 -100968 122771 235914 19542 -422219 -354800 74138 287134 418096 385171 458408
16372 458408 459967 311278 -38627 -253288 -165554 148150 163418 177805 310186 -3713
16362 -3713 -452966 -525837 -226485 -183650 -193060 -154285 169836 330388 252743 363907 344528
16351 344528 256943 454818 674440 684589 502837 12363 -440060 -732062 -763467 -727165
16341 -727165 -514563 -470467 -707959 -852911 -655612 -332096 -367602 -325297 -300724 -277389
16331 -277389 -109696 260966 568689 275268 -198468 -44029 165407 -416854 -978396 -1019613
16321 -1019613 -909169 -825417 -821768 -877372 -963351 -679129 -191565 147144 168744 266105 520497
16310 520497 419924 213910 446788 740514 623743 318927 243747 4512 -224727 -290688
16300 -290688 61848 363827 319081 67002 -119726 58375 175199 253048 217405 -128385
16290 -128385 -369302 -318208 -417762 -912050 -994006 -545196 59189 108441 -261903 -568924
16280 -568924 -238396 188624 497978 557958 428127 22339 -617138 -900175 -820216 -550272
16270 -550272 -110461 224496 275006 329330 127833 -170261 -348428 -649948 -940453 -705005
16260 -705005 -86977 361331 358223 448325 337704 236358 82362 -41829 -291639 -819388
16250 -819388 -1344213 -1341304 -1042061 -773749 -216970 57132 246410 386955 600761 915396
16240 915396 1001267 726246 46305 -51157 -19408 -261531 -85658 307128 464525 485702
16230 485702 623454 786562 817599 394614 185545 -81183 -420276 -399618 -198941 272346
16220 272346 453291 124240 13786 229752 279290 15593 -321163 -404488 -208459 -214659
16210 -214659 -644310 -642270 83787 911410 1123864 882536 416135 297995 318877 291785
16200 291785 179275 165507 299196 112446 38228 -87111 -403249 -605892 -297183 -130126
16190 -130126 -21899 -24919 -195495 -259070 -163875 89546 276242 485105 291037 -254370
16180 -254370 -800119 -508367 95935 40845 -325036 -400450 -297770 -102436 27562 -215623
16170 -215623 -784997 -1000572 -922825 -646923 -707496 -449792 64605 362149 303104 341593
16160 341593 177644 196941 611988 448728 136930 293723 171484 -161418 -234324 -494326
16150 -494326 -683856 -543771 -319884 -699184 -1256421 -1382343 -631006 253534 612537 494722
16140 494722 567686 847260 530295 60330 -27698 -362083 -663933 -706945 -813542 -799721
16130 -799721 -211684 175859 595885 483102 328941 422188 273241 207802 314977 595771
16120 595771 458408 202463 -138094 -703495 -692496 -257766 10349 56324 201380 251659
16110 251659 -100882 -511767 -435215 -144387 -66679 -329382 -395058 -194084 -25459 -255294
16100 -255294 -332189 -130397 49750 240540 90110 -504864 -646800 -549723 -646601 -666178
16090 -666178 -590614 -170382 142012 403634 378984 197383 150338 -60827 -319929 -407037
16080 -407037 -353088 32676 225016 150332 -14895 -189232 -317465 -520616 -447934 -157436
16070 -157436 -25212 -341866 -654144 -861023 -814301 -636982 -616542 -977336 -1101818 -615487
16060 -615487 -23363 64 -152777 -157701 -171137 -58970 -316706 -819799 -1113371 -1317737
16050 -1317737 -1552636 -1493429 -860565 -344133 151259 518131 549766 382111 180705 -425336
16040 -425336 -1366442 -1623728 -1327895 -1178441 -1117490 -1098160 -1154047 -905985 -845717 -688167
16030 -688167 -166352 284372 511091 464292 -46183 -223994 -246590 -489659 -867490 -862801
16020 -862801 -366133 140510 83830 -405399 -371071 -122845 39178 89989 107897 349975
16010 349975 642640 642646 49444 -695034 -1191934 -1188427 -668679 87720 491033 604931 525985
15999 525985 386077 210161 313823 552481 229956 1560 146674 188708 97551 96046
15989 96046 -104427 -267777 -320192 -471806 -471342 -687411 -705567 -909217 -1220601 -903690 -706173
15978 -706173 -973945 -1382277 -1239941 -769243 -580432 -626795 -372367 -460028 -688829 -506076
15968 -506076 -527343 -448397 -223991 77455 173076 265590 171736 -92610 -87719 -59414 146939
15957 146939 728264 939362 808937 551218 475233 455164 357622 249227 -162044 -365423
15947 -365423 -79907 34061 77234 160381 -242355 -464668 -206723 29702 105185 32641
15937 32641 -57686 489454 1126034 1413807 1436351 1333822 1410561 1075694 606138 509361
15927 509361 319276 60304 -215360 -693995 -844756 -520997 -444450 -614248 -621726 -427613
15917 -427613 -152731 -96564 -541445 -965288 -1001455 -623913 -189685 276233 518925 436831
15907 436831 518344 367430 451573 661280 935287 827805 454197 341477 369867 484418
15897 484418 509373 68532 -446099 -603877 -558873 -733678 -826857 -945624 -859321 -667880
15887 -667880 -611577 -521462 -265692 -130624 -163607 -584385 -848100 -704200 -535293 -168733
15877 -168733 165846 169757 108903 -117395 -191816 -273429 -397329 5731 524687 892022
15867 892022 1113978 1136302 358031 -755271 -1143140 -1160683 -1178205 -993883 -668217 -677601
15857 -677601 -1025993 -1103254 -767139 -461449 -380173 -614817 -521830 -274610 -319637 -278503
15847 -278503 -234508 -315158 56132 478146 405149 450772 554499 788616 948720 973410
15837 973410 513127 185954 -188975 -326078 -155985 -36498 149451 394647 297065 -29952
15827 -29952 -301870 -503162 -766453 -926496 -777300 -277801 161713 -30349 -231708 -51521
15817 -51521 124881 295110 189312 -42017 75605 134663 -378780 -658368 -282415 54102
15807 54102 111261 456346 346412 -18169 -239898 -396400 -31753 486068 435582 167354
15797 167354 -210370 -67693 257970 140717 3311 204704 693255 869345 614900 144565
15787 144565 -444654 -852876 -952161 -761896 -428293 -170655 -513083 -525470 -188986 -30646
15777 -30646 -357570 -839853 -993859 -1295479 -1410664 -1164925 -900225 -793066 -839901 -609141
15767 -609141 -219107 49860 16667 -70105 -164094 -409756 -563401 -382019 -134980 -69672
15757 -69672 -95374 -515139 -1001154 -1136646 -1109786 -903789 -602960 -421925 -219712 136428
15747 136428 699524 738370 518982 569787 421819 84795 -161405 -261910 -54610 -55012
15737 -55012 -239982 -213643 -54284 -244285 -9474 283452 467674 298020 38148 -54114
15727 -54114 260670 599010 745673 802394 906432 1029678 665559 301926 192652 188938
15717 188938 277262 375740 148644 -207124 44512 -208306 -723313 -706211 -447822 -222865
15707 -222865 -174510 -280308 -285485 -94888 -159587 -563728 -338642 10667 -97934 -315211
15697 -315211 -852782 -1034041 -824605 -629679 -665041 -851921 -565864 -386992 -433599 -514436
15687 -514436 -419531 -305437 -296412 -248771 -63792 -21864 -252309 -596834 -643784 -146484 61864
15676 61864 -264395 -457403 -41560 546303 703910 578327 274210 -160722 -182935 -179666
15666 -179666 362307 577452 421111 425368 65442 -533868 -749447 -603112 -177106 240337
15656 240337 674341 1165464 1087899 735298 407535 -26441 -350011 -521208 -735798 -916371
15646 -916371 -1001846 -560044 126592 719265 1230562 901571 462910 480160 233278 183506
15636 183506 277549 133106 -377144 -558382 -300276 -143386 -331666 -815612 -832795 -295649
15626 -295649 -95225 -479883 -641477 -917981 -1103448 -910409 -1114280 -1078150 -482446 -166293
15616 -166293 22674 116085 212791 30766 -36536 -65522 -134018 394406 928548 854115 383292
15605 383292 256901 35511 -274185 49298 379968 569368 236605 -367120 -685754 -579626
15595 -579626 9253 134867 -186903 -456899 -771872 -462065 4547 462402 381317 169933
15585 169933 150909 -209035 -225410 6983 -191704 -456056 -398494 -606530 -965955 -1592170
15575 -1592170 -1780233 -1369920 -1017951 -600502 -81647 77684 209372 72567 -387613
15566 -387613 -844926 -1037556 -1005684 -884816 -580658 -251739 -151410 -100294 -59592 148501
15556 148501 594654 241570 -357836 -662051 -435499 -144929 -296895 -334990 -253159 -332936
15546 -332936 -517576 -591852 -480788 -367306 -317720 -167462 -189542 -293687 -30329 145582
15536 145582 -194771 -528900 -569037 -444133 -137358 -37139 -393606 -353793 -51129 365780
15526 365780 528200 355259 138368 -356860 -642894 -395438 -393697 -535809 -390602 -66979
15516 -66979 -191985 -394777 -279216 154883 368751 333942 293283 146648 -236665 -291881
15506 -291881 422655 787802 667407 527343 518465 290575 -80038 -396946 -443404 -108096
15496 -108096 -137663 -401530 -486817 -550194 -720035 -1467733 -1608786 -1526948 -1525447 -1328402 -579875
15485 -579875 -170597 -113718 -158201 -447061 -705528 -628030 -616677 -953175 -1345271 -1413102
15475 -1413102 -1161646 -855110 -561120 -450513 -779791 -809593 -783197 -744208 -463545 -271719
15465 -271719 -15029 20033 17431 123686 248503 226652 224904 -143399 -968031 -1323544 -1350211
15454 -1350211 -1353228 -1177412 -991589 -655490 -578141 -451332 -267799 -144503 -93577 -34519
15444 -34519 -166384 -406680 -638743 -852318 -929021 -732476 -685483 -713229 -465074 183857
15434 183857 387787 -32474 -459332 -250314 181311 309524 148802 -190398 76916 143061
15424 143061 -214396 -541177 -624076 -546455 -386118 -318697 -616845 -778274 -888404 -956180
15414 -956180 -788736 -783032 -782336 -340347 73486 169779 -99839 -299920 -235614 202201 480864
15403 480864 578080 388039 96905 -43682 -206504 -429942 -543459 -489085 -369236 -316512
15393 -316512 -181856 5941 -309015 -456982 -444424 -360347 -141016 -130681 -388538 -415620
15383 -415620 -329429 -90439 34336 152397 -84360 -525590 -364561 111500 447888 697698
15373 697698 566612 -120340 -510605 -637416 -565745 -419017 -407613 -249146 39746 541035
15363 541035 503289 303382 174040 -46185 -395047 -683978 -571819 -371773 -449371 -841830
15353 -841830 -983069 -1120455 -1121126 -1002453 -990412 -1203782 -1408147 -1261579 -1133977 -1441923
15343 -1441923 -1572989 -1204596 -868961 -628538 -55693 296664 130716 -42366 -33425 55848
15333 55848 192200 118601 182423 425950 286187 49443 -43653 306865 427293 -155783
15323 -155783 -656382 -1211041 -1155978 -733034 -797024 -1034883 -627902 -187393 -192384 -253730
15313 -253730 24289 222448 288153 -118948 -660733 -968609 -1200901 -1072408 -877146 -880954
15303 -880954 -853416 -739464 -586525 -298974 193364 520841 239694 85044 113395 -145005
15293 -145005 -998363 -1589570 -1232482 -582544 -288158 -487389 -503400 -346102 -326155 -372503
15283 -372503 -742254 -971201 -857342 -363843 -11553 148176 332280 542840 728183 587293
15273 587293 63508 -2851 -175032 -688144 -1061079 -1142597 -703552 -378919 -71404 -21434
15263 -21434 -143277 121943 49827 -291498 -461822 -510457 -133530 49925 135543 458300
15253 458300 663073 613299 813742 829210 404326 103356 -161888 -551405 -734140 -685703
15243 -685703 -505320 -413192 -308070 -290851 -185517 -87988 -230587 -99400 230382 475044
15233 475044 571041 36921 -639207 -447656 -207756 -510461 -972801 -929248 -241728 461949
15223 461949 607511 855728 932187 604789 250620 93259 45340 69426 -143956 -767103
15213 -767103 -943795 -488661 -181257 55870 500346 790871 705328 551889 363507 307264
15203 307264 617083 651743 528868 472689 369766 57538 -464212 -725703 -1042880 -777743
15193 -777743 94245 541076 470641 317112 111743 -177386 -515736 -796380 -817703 -365481
15183 -365481 80491 155755 418336 640915 589255 400423 21400 -291744 -52403 368637
15173 368637 296347 78138 126853 22393 -65565 91247 66487 2859 -4370 -271980 -226976
15162 -226976 -19605 159793 -195103 -943673 -1043215 -785409 -662345 -709500 -924121 -970922
15152 -970922 -527831 -173454 -31930 -333069 -648111 -519268 -239427 40573 74814 -402929
15142 -402929 -987860 -1299828 -1048755 -872084 -822277 -693611 -615138 -615802 -822742 -821540 -580380
15131 -580380 -614482 -866057 -817435 -823924 -593406 -218805 -142917 -112815 -84025 -50173 19096
15120 19096 -165648 -562825 -1120240 -1491876 -1833008 -1505733 -664384 -363039 -293369 -416047
15110 -416047 -500303 -284689 189778 710023 1053071 994646 1069855 1100674 630936 291081
15100 291081 313732 469557 432300 447172 642127 497920 233220 -56828 -34424 529627
15090 529627 1070239 863700 536129 536056 564427 686330 1081655 987007 401557 137710 411527
15079 411527 672834 578680 289365 66254 408492 718283 596456 462206 192708 349
15069 349 207755 361658 473742 337269 127789 372976 586264 717690 668397 360524
15059 360524 -103403 -118498 -29375 -306598 -622172 -756570 -446436 -370649 -314375 -27433
15049 -27433 -55287 -267289 -431331 -513028 -670588 -866573 -693338 -426313 -223039 182338
15039 182338 529967 120152 -304456 -376629 -327262 -141107 -146899 -248996 25282 228072
15029 228072 158933 -87963 -191378 -121933 113180 310750 251972 464 -14026 303315
15019 303315 334536 247486 201836 -15638 -65361 78971 249530 255605 74072 -441678 -728182
15008 -728182 -430012 202083 512938 148652 -35501 -72067 -192794 -456532 -509697 -108906
14998 -108906 328821 170454 297093 -13113 -571391 -450277 -405812 -377485 38608 380208
14988 380208 438708 796882 896814 618098 633103 690781 178076 -199387 -121227 -159757 -196375
14977 -196375 35257 162142 407849 871001 1132255 596050 152408 147191 -60211 -244121
14967 -244121 -362276 -640230 -791996 -584516 -475020 -436611 -561681 -821598 -728378 -632073
14957 -632073 -387759 -216183 -422451 -853987 -949719 -1034025 -844847 -392961 -88105 352448
14947 352448 508668 41460 -489704 -804319 -930415 -803526 -825062 -971112 -957473 -1104277
14937 -1104277 -1261663 -906910 -222971 113963 -168136 -577107 -728384 -520148 -445571 -345777
14927 -345777 -408335 -539737 -375568 -252803 -131749 87072 117657 305867 514170 222342
14917 222342 -295470 -424268 -214693 518956 766273 590429 714038 834571 791476 585129
14907 585129 537092 272025 150372 -69473 -474859 -513137 -727738 -831860 -984823 -1052217
14897 -1052217 -1036006 -637326 -305612 -358548 -72670 444312 205081 -301107 -725248 -971665
14887 -971665 -757218 -61941 274180 3791 -650 -204575 -439485 -463787 -16841 446713
14877 446713 255631 -75978 -319912 -303435 -289509 -590061 -617001 -380229 -281932 -480985
14867 -480985 -514083 -649981 -710834 -647794 -670742 -645972 -502378 -141625 87847 231327
14857 231327 297291 235184 277339 -179669 -692433 -628908 -609329 -75319 602886 474532
14847 474532 19430 -358951 -311687 -235279 -339485 -418578 -109579 467251 551862 313718
14837 313718 151356 138379 -35464 -289334 -423213 -383584 -359221 -6550 224654 -264542
14827 -264542 -507244 -127073 286235 516051 -4870 -459809 -379554 -382770 -141024 -19837
14817 -19837 -254681 -348890 -259354 -690631 -914333 -879669 -797084 -670671 -760576 -799399 -848140
14806 -848140 -923491 -876324 -573298 358111 909852 1036203 908093 708364 528946 102267
14796 102267 -157326 43572 358004 550462 589114 643628 589981 582839 339534 -86407
14786 -86407 -379765 -403678 -326749 -371186 -452850 -429163 -653885 -930192 -707614 -257644 -22192
14775 -22192 -88269 -302267 -526567 -612496 -845448 -706846 -674606 -805336 -786781 -693181 -927847
14764 -927847 -1445892 -1585714 -1538154 -1312576 -954349 -559233 -105730 48701 54695 178972
14754 178972 343000 185017 -191346 -611677 -608122 -95573 -224172 -903463 -1292653 -1325379
14744 -1325379 -965897 -299828 -24004 18069 158815 -23862 -700593 -1100978 -1065959 -897602
14734 -897602 -834053 -567271 -348204 -179578 50380 -38132 101724 35151 -101488 -114918
14724 -114918 33932 38229 -79221 -29608 427735 642962 587539 339851 159574 291446
14714 291446 498254 433253 -712 -75344 156796 117101 -85848 -289187 -684641 -1109837
14704 -1109837 -1022498 -733382 -645789 -574774 -719505 -712929 -690929 -965272 -707005 -153151
14694 -153151 162554 584035 664154 498201 322914 -126479 -852763 -1292882 -1321369 -1047354
14684 -1047354 -808627 -828884 -1127721 -1383354 -1186768 -1001436 -801868 -558590 -309350 -387582
14674 -387582 -542595 -295490 -204597 -337265 -627875 -957061 -999985 -1024274 -826210 -721259
14664 -721259 -1051884 -990965 -800364 -533151 -649623 -703717 -462762 -358461 -648227 -539452
14654 -539452 128066 500456 532586 251394 149108 507739 915259 965361 621409 14553
14644 14553 -441889 -830152 -877763 -813538 -801290 -887453 -1035062 -928527 -657054 -577012 -824272
14633 -824272 -812395 -627751 -466934 -642579 -929526 -1004419 -970203 -470611 262807 720189
14623 720189 549882 272574 85563 -317994 -446113 -151539 115520 121543 127475 156590
14613 156590 217923 388341 463579 362124 179530 193125 439526 641385 609696 413304
14603 413304 60602 103607 501151 386294 -307774 -674719 -973036 -595823 -118908 22520
14593 22520 158061 113520 228157 451604 556483 504827 125311 -210602 -338679 -478252
14583 -478252 -852750 -1165532 -997778 -747485 -572492 -369749 -613964 -582523 -154654 -28463
14573 -28463 -199473 -83764 242549 464958 746954 660371 227963 -169789 -290084 -438051
14563 -438051 -565395 -461410 -412666 -184395 252901 450497 480325 470651 59173 -345330
14553 -345330 -300051 10120 -3495 -283480 -345963 -639652 -845039 -864846 -961899 -980183 -687862
14542 -687862 -570882 -502469 -746225 -780049 -613189 -451531 -274174 -243428 -485968 -512744
14532 -512744 -733800 -1065406 -1165153 -963030 -839279 -646591 -403284 -120332 182811 199884
14522 199884 252257 221226 107217 -95936 -498331 -994772 -1325498 -1328297 -1005461 -703651
14512 -703651 -319114 -348490 -709310 -580318 -76032 97733 -84900 -177284 128099 177022
14502 177022 -97133 -703895 -684074 -646438 -1219946 -1684868 -1770488 -1413268 -1144945 -992549
14492 -992549 -892509 -1112671 -1204240 -1119019 -1063153 -626952 -568026 -586594 -565012 -608645 -599876
14481 -599876 -444737 -158845 53837 99960 441018 487112 118660 153712 249723 -31111
14471 -31111 147808 604758 979226 1170079 1006073 1107749 1064420 738540 485905 162731
14461 162731 -231420 -722163 -1316608 -1229285 -718783 -585430 -546380 -283472 10872 -12899
14451 -12899 -182601 -411677 -408146 -197777 -339924 -784045 -865412 -626674 -278615 218235
14441 218235 618135 776330 325625 -174321 -504215 -690548 -780769 -99292 505109 580095
14431 580095 325751 -142737 -368610 -299638 68059 471280 652124 671658 782400 841737
14421 841737 854667 1243643 1093701 884932 1211883 1344988 1077514 903432 1339886 1541912
14411 1541912 1373148 1050506 663953 287105 -155026 -234281 -343170 -384396 -670654 -920812
14401 -920812 -703721 -316422 -71134 213447 543897 660777 590228 381223 127932 54916
14391 54916 239868 197858 57399 19468 -24533 -218117 -512362 -1025645 -1092243 -793196
14381 -793196 -774573 -602663 -206765 -191487 -318729 -64862 345600 425094 630114 806044
14371 806044 756327 470584 274946 356521 205459 -11113 -217468 -263983 -437850 -624315
14361 -624315 -728547 -762669 -740530 -795043 -452178 -70690 101038 -42696 -1745 180037
14351 180037 458008 689378 428356 39958 250462 89124 -391247 -213027 285760 661060
14341 661060 888961 768649 757130 908892 532908 322835 321997 235395 129338 -156317
14331 -156317 -226457 -227483 -858402 -1405998 -1676407 -1553640 -1042318 -586552 -35687 547502
14321 547502 450948 127240 80047 342195 354974 -71944 -100135 8937 117187 487559
14311 487559 417304 -133196 -362445 -564492 -713000 -326556 58389 -16421 -61202 -109057
14301 -109057 -67796 197320 393264 248542 -142559 -598445 -764618 -313101 157597 238420
14291 238420 173069 35989 -60366 -29513 45035 -317607 -538757 -226255 131901 135948 150159
14280 150159 357601 670388 801666 607085 316186 71812 66969 24970 -331584 -225860
14270 -225860 141070 336422 101832 -170857 -494355 -716973 -656496 -144376 276680 94716
14260 94716 68172 216841 164038 -38038 -174917 -210428 -37635 240769 429554 659647
14250 659647 697241 595460 547053 213248 -18532 -228959 -293440 -447076 -389864 -146148
14240 -146148 8802 99415 299767 454606 210057 -92074 -115286 -168594 -251744 -196436
14230 -196436 70213 170092 139363 -21719 -176924 147970 579774 471600 210474 -35746
14220 -35746 -439910 -602467 -659274 -581686 -451135 -249871 -134628 -337841 -510039 -508906
14210 -508906 -519635 -454182 -194083 131910 -26276 -744285 -1308029 -1501619 -1342415 -1083798
14200 -1083798 -954532 -784580 -387496 -34548 -80724 -164013 -98195 -9056 119063 -28846
14190 -28846 -291131 -524586 -139402 526496 892598 841149 368753 223549 -62066 -143537
14180 -143537 -69560 7559 -176887 -215167 -260912 -342222 35749 303820 512989 788735
14170 788735 844419 439612 127547 -200122 -689559 -733884 -244553 -2438 -180407 -381729
14160 -381729 -551865 -409761 -388226 -863560 -1260012 -1647743 -1717930 -1071870 -322610 -254271
14150 -254271 -350574 -477570 -259955 -65026 28875 200576 -17073 25318 37488 40496 322862
14139 322862 629696 790105 541505 578603 512324 5370 -35999 340933 433782 628682
14129 628682 505519 -63195 -499813 -546069 -703929 -1039112 -1257733 -1235793 -849093 -382907
14119 -382907 -14775 217479 84844 -51251 -202727 -316289 -521100 -796134 -740425 -869806
14109 -869806 -1237567 -1437186 -896293 -374661 -455296 -987203 -1233998 -919504 -241497 131572
14099 131572 -62357 -268736 -307807 -402264 -855365 -1236398 -1047029 -634554 -530936 -272424
14089 -272424 36424 196653 148680 -317140 -852174 -820129 -378238 23603 23352 -196507
14079 -196507 -137930 161826 405761 377923 315718 519847 539823 218318 200433 451343
14069 451343 419814 367258 57043 -585136 -834542 -755807 -619097 -481293 -796878 -1311365
14059 -1311365 -1590073 -1554785 -1229194 -686309 -840132 -1284798 -984021 -729664 -712945 -659505
14049 -659505 -643911 -769413 -676253 -521893 -447596 -443014 -661514 -971012 -860503 -396735
14039 -396735 -22725 103485 -66114 -441444 -416624 -512241 -692106 -712020 -645530 -717273
14029 -717273 -490918 5944 254108 32067 -400266 -573421 -452978 -285887 -665776 -1009949
14019 -1009949 -752014 -322563 -85582 -6240 12149 420699 752783 381255 -113243 -251622
14009 -251622 -342445 -260148 247234 -102404 -493816 -150464 -127016 -341439 -794526 -957168
13999 -957168 -669004 -291812 -10670 41884 72525 121448 145655 35598 -132702 -370517
13989 -370517 -739136 -1029059 -963011 -485353 -285418 -384422 135030 840431 941767 1036319
13979 1036319 1082043 1110867 1224023 1120486 750703 376510 191206 130188 109944 218900
13969 218900 -57445 -127729 208444 160448 -44960 -146881 -135603 455593 1043841 1000259
13959 1000259 939369 641454 233023 -234001 -412308 -601658 -660465 -367924 140875 251865
13949 251865 29025 -287504 -397268 -17015 190769 181357 367165 455328 433639 372988
13939 372988 227935 77442 202637 286691 18356 19871 309438 244854 84884 -5918
13929 -5918 -64489 -56732 71452 140479 409564 408898 -66813 -71205 311985 426410 -33626
13918 -33626 -448677 -306424 -314510 -765258 -1071288 -608768 21177 388432 455035 635977
13908 635977 717413 411320 263910 221783 234416 33766 -80286 -50480 44045 163807
13898 163807 291230 164136 177219 43723 -312002 -577615 -676557 -768685 -743468 -518680
13888 -518680 -179588 -57615 389319 593151 389387 268970 91369 -168827 -134484 17171
13878 17171 68729 -355490 -492980 -267639 -489007 -1029538 -1299272 -1030067 -708871 -570009
13868 -570009 -625617 -731550 -872315 -867321 -832688 -790308 -817667 -914851 -1174822 -1395282 -1179932
13857 -1179932 -905205 -967204 -828432 -573456 -498892 -337937 -416302 -761296 -559861 -205224
13847 -205224 -281258 -316972 -213107 -115292 262657 464289 416311 -29958 -554338 -892085
13837 -892085 -532746 -43979 -178033 -633725 -1008334 -1062328 -787468 -1191139 -1494420 -1186685
13827 -1186685 -817468 -443433 -346285 -320794 -504118 -830932 -989469 -864004 -720820 -612529
13817 -612529 -507297 -211309 -120565 -333015 -559815 -1015927 -1343160 -1143784 -922152 -754973
13807 -754973 -643511 -573113 -447273 -129787 -90746 -344446 -522905 -372805 -226980 111704
13797 111704 320875 399349 401553 132322 -196570 -258361 -95490 -223766 -232156 -197151 -97257
13786 -97257 -80463 -10504 330166 833821 797696 534253 296451 -80743 -356414 -643315
13776 -643315 -754270 -717656 -523728 -195166 -71638 8721 -17483 89830 67443 -149173
13766 -149173 -275464 -227587 53274 353932 601917 798874 1026097 998720 599188 36695
13756 36695 -356598 -533693 -487494 -650436 -712684 -391715 35014 149169 113357 53629
13746 53629 68898 318611 415575 149470 -93524 -425196 -767081 -497385 28351 399967
13736 399967 580023 550709 467056 586274 1011112 1460950 1529198 1316221 985211 938678
13726 938678 1229247 1245008 815852 657312 740681 907160 962325 933713 1063502 1105178
13716 1105178 1065019 1120248 953751 475060 -180601 -349142 58048 317267 543803 495492
13706 495492 27374 -593340 -870274 -849288 -541465 -174999 -179209 -318173 -347347 -520950
13696 -520950 -930888 -1298509 -1266972 -1320363 -1501484 -1426910 -1333810 -776148 -31649 501163
13686 501163 812956 759140 677510 647237 749238 767745 951654 971669 376598 -102529
13676 -102529 -211654 -325373 -429186 -44137 94168 -99370 -340966 -506627 -52910 605921
13666 605921 520005 61535 -394464 -565561 -559389 -872141 -691875 -663253 -725105 -277735
13656 -277735 33526 -213271 -442891 -391807 -9627 495801 549980 554359 700585 727501
13646 727501 628087 651669 755952 593567 120625 -182513 -301802 -442932 -289052 39082
13636 39082 360810 779508 1067536 1157659 1092182 961795 1022603 1006614 876361 684996
13626 684996 548203 816536 896871 865396 785359 650714 785075 764011 795837 925116
13616 925116 1141275 1680599 2144494 2479064 2524491 1994097 1738620 1420378 1033477 1107556
13606 1107556 1156198 844927 865570 747293 307339 288159 406898 170330 -110567 -165761
13596 -165761 -147578 -194328 -210484 -509903 -1202443 -1534127 -969023 -576640 -412988 -285861
13586 -285861 -179988 84140 157526 33927 -157492 -421254 -425900 -484565 -638054 -711184
13576 -711184 -923750 -914876 -735572 -641237 -505148 -473882 -451539 -311332 -182531 -706264
13566 -706264 -1023071 -316496 431910 832305 831886 829413 628741 570878 626653 389684 92288
13555 92288 138378 385051 499033 280084 282273 692307 1317128 2010002 2489272 2450231
13545 2450231 2116335 2177735 2307741 2100981 1873949 2213386 2578066 2490831 2564692 2462612
13535 2462612 1844475 986465 464131 106267 -66534 -207235 -446768 -216464 287224
13526 287224 218845 113373 162820 302304 204633 142206 372790 764948 1000619 965424
13516 965424 576144 461946 590785 603698 476871 -78335 -499825 -589491 -507072 -467699
13506 -467699 -728133 -804835 -327392 231535 538594 272523 31131 124378 -41865 -219411
13496 -219411 -143457 6527 206131 203339 320638 217482 142249 318250 -1890 -177729
13486 -177729 -279976 -429173 -377906 -320532 -344958 -243211 -658023 -1517996 -1894399 -1407667
13476 -1407667 -669117 -249497 -20227 -203770 -627270 -990419 -1001625 -765331 -708854 -844337
13466 -844337 -700192 -291519 -53513 238653 215721 101818 -5749 100153 374411 135332
13456 135332 -97934 -199811 -325403 -201047 -389813 -551129 -84523 123897 176430 211039
13446 211039 -58287 -192478 -29370 90450 140060 408423 196404 -193094 -553460 -754978
13436 -754978 -605571 -152467 507900 934108 811194 419894 314881 1469 -200941 -146238
13426 -146238 -72162 305219 788364 955930 1038104 902783 597047 420623 762520 1378480
13416 1378480 1535338 980329 688347 1014138 1160962 966074 627552 507822 437648 359643
13406 359643 175829 191224 721633 1319955 1626979 1984385 2285337 2782080 3306636 3526194
13396 3526194 3225895 2813499 2494096 1955933 1722850 1584230 1359106 1267592 1244829 1262522
13386 1262522 1453264 1392434 890365 771026 1000596 1069471 1072432 1121335 1355678 1263894
13376 1263894 1066652 1003645 1036622 1227476 1499044 1446534 1124577 1065147 1241833 1606832
13366 1606832 1959839 1730880 1359405 1124050 1139974 1487833 1745826 1786160 1680572 1818298
13356 1818298 2031279 1582006 1097584 638870 207095 125496 -32625 -76871 199008 805663
13346 805663 1282086 1396166 1087606 1204612 1574511 1673187 1685724 1156959 687880 444773
13336 444773 242536 115262 636926 1116615 1081021 886437 421489 -11187 -350532 -403274
13326 -403274 29141 290200 186345 6175 99906 275400 -90351 -595452 -889878 -599784
13316 -599784 -295247 -164390 -226166 132740 514793 396425 470975 644373 840043 953167
13306 953167 771565 584027 552970 506915 571825 934640 1442951 1789325 1825532 1283239
13296 1283239 1299706 1808857 1698456 1159707 754982 580686 424706 230177 137338 288351
13286 288351 673717 724571 795948 890082 729666 369613 533331 949649 988049 697288
13276 697288 338927 -125434 -159006 53458 355436 292148 -247301 -384977 -99852 300420
13266 300420 486544 508477 551210 517838 99447 -168771 -200183 -345555 -39657 491312
13256 491312 864470 1078761 1132531 1206950 1170352 1094233 1234422 886958 512215 394394
13246 394394 517724 835012 821032 576734 616996 763566 1015718 1611822 1819330 1200509
13236 1200509 450159 251492 301673 454534 448690 490254 871402 671980 303458 249500
13226 249500 587900 934954 838336 767412 849518 353143 -306064 -410404 -154291 543779
13216 543779 913777 1100192 958715 719296 714041 936294 998007 903644 1217218 1351860
13206 1351860 1225972 1228813 1186166 1253431 1593452 1754780 1806071 1585181 1363680 1134132
13196 1134132 1100039 1412901 1536115 1547725 1483888 1608440 1773805 1795762 1410632 697080
13186 697080 373763 284085 -36031 -74804 418588 992627 1005574 551627 365061 610290
13176 610290 560100 611430 1121080 1239280 1087093 1236784 1632491 1868430 1732030 1322322
13166 1322322 730349 396557 530974 770134 1098885 1584646 1816937 1502243 1026317
13157 1026317 1177795 1483712 1540777 1316966 952893 783847 966277 1255014 1342906 878008
13147 878008 454143 505625 1021435 1316754 1141842 996847 822514 597098 291075 -112553
13137 -112553 -240526 -124453 287674 606281 823998 1179181 1142514 1108278 1280042 1525493
13127 1525493 1914179 1906838 1561535 1070562 1135104 1274178 1255599 1158834 1010590 1031637
13117 1031637 688710 291534 525271 1132679 1675147 1611419 1233552 1185569 1251954 1536690
13107 1536690 1831875 1983237 2087855 2016143 1916087 2177773 2551067 2213327 1571415 1430017
13097 1430017 1679557 2252459 2890221 2956565 2166351 1650306 1739451 1881170 2103786 2357027
13087 2357027 2700860 2842574 2988836 3321901 3671484 3994693 3949674 3506710 3309430 3254040
13077 3254040 2959745 2601721 2457182 2504112 2607051 2753302 3010056 2981333 2862754 2820753
13067 2820753 2596863 2703548 2749060 2743784 2785104 2687767 2693491 2775735 3130493 3605248 3609546
13056 3609546 3048678 2280121 1987035 2043605 1980063 2242457 2838118 3098207 3083625 3518916
13046 3518916 3903727 3680435 3794164 3749681 3532294 3448689 3547971 3485094 3465395 3511308
13036 3511308 3787545 3842454 4002779 4296131 4581293 4768878 4668573 4699759 4484251 4673840
13026 4673840 5141559 5419099 5527776 5726279 5440513 4759397 4335114 4166160 4398261
13017 4398261 4886389 5772274 6480120 6554785 6670542 6678025 6835148 7137960 7199611 7605079
13007 7605079 7958096 8148329 8350557 8635013 9006226 9519937 10042644 10845022 12132561
12998 12132561 13076631 14120899 15262070 16314313 17216895 18382859 19787789 21295787
12990 21295787 23623905 25934520 28622488 32383432 36657077 42521109 50051782 60309077
12982 60309077 74399093 92913730 117830657 152614658 201215107 267661695 352824518
12975 352824518 444530750 505832605 498273922 430555962 344236785 268055464 209185489
12968 209185489 165808399 133873905 110134939 92343620 78594231 67376346 57910437
12961 57910437 50750058 44917819 39924633 35758862 32074900 28961111 26419070 24343432
12953 24343432 22417097 20600781 19316980 18217165 16721383 15383887 14230709 13926590
12945 13926590 13684834 13081626 12383809 11647611 10912459 10464412 10188064 9881453 9474231
12936 9474231 9012922 8765317 8887584 8950812 8999241 9181136 9484212 9633018 9408665 8973481
12926 8973481 8984778 9724426 10691775 11500045 11856932 12597971 14166146 16119442 18441804
12917 18441804 21577974 25039218 27564137 27894217 26296363 23847503 21862237 20799374
12909 20799374 20453771 20622154 20803673 21325652 22577168 24291391 26259420 28512758 31503615
12900 31503615 35115958 39523365 45650238 54276470 65371023 79544130 98790383 125679165
12892 125679165 163486981 216655100 289441062 381148501 473026548 521006972 493116704
12885 493116704 412570248 323932197 250879546 196133028 155639639 125738395 103592520
12878 103592520 87009662 74531499 64357681 56324581 50055810 44484417 39465100
12871 39465100 35273899 31723408 28513035 25860055 23780808 22225969 20631241 19147721
12863 19147721 17674318 16132549 15303190 14978893 14287359 13330491 12265181 11352720 10745195
12854 10745195 10187680 9858137 9804869 9792518 9452157 9031152 8922613 8818178 8984241 9096560
12844 9096560 9115959 9297453 9362945 9180710 8826881 8458855 7931978 7755521 7933528 8173053
12834 8173053 8702503 9379609 10020606 10621047 11111561 11460111 11581552 11936233 12674259
12825 12674259 13262591 13471279 13595388 14102428 15084317 16515831 18395498 20458605 22472281
12816 22472281 24677846 27305308 30569688 34854682 40769786 48325595 57156091 68350609
12808 68350609 83901551 105148854 134631390 175835344 233078418 309612106 400852232
12801 400852232 482337462 510458176 467069862 384141513 300611128 232745988 182238400
12794 182238400 145264379 117645352 96931501 80846736 68538851 59240300 51671028
12787 51671028 45348661 39778521 34824486 30770135 27281622 24307341 21975712 20168786
12779 20168786 18297348 16736739 15391106 14239044 13265517 12069445 10814445 9629816
12771 9629816 8572842 7904200 7497634 7076829 6788471 6670723 6478193 6074110 5590547
12762 5590547 5288540 4923194 4731900 4340239 3778742 3218350 2696841 2700094 2898038 2955779
12752 2955779 2731090 2522081 2530273 2515745 2452438 1981525 1746520 1382107 1343031 1549751
12742 1549751 1695167 1807295 1508714 1334810 1761334 2109573 1899634 1632698 1585510 1341215
12732 1341215 1081909 920600 745585 438938 553159 670940 485374 491812 710528 960355
12722 960355 1118761 1333379 1669052 1984402 1749771 1252260 652192 755734 1122713 1098701
12712 1098701 423041 -155826 132405 617521 1039498 1052020 1305369 1719924 1445327 1026940
12702 1026940 1060415 1260017 1578634 1938682 1844603 1546447 1360816 932081 530413 81811
12692 81811 10445 207092 432158 379295 204744 400878 507810 335277 226338 451835
12682 451835 737280 940100 598807 175929 -73361 -219629 -156545 -90353 -100279 -213179
12672 -213179 -593421 -766816 -274186 334163 542753 757161 913675 925757 645754 165328
12662 165328 122686 327809 573226 499697 599556 926660 1031693 847939 716789 894177
12652 894177 1041764 1051889 927837 1121182 1274089 850953 513703 488287 418520 524735
12642 524735 352626 -307074 -567277 -223615 -42988 -91970 -110058 -222668 -367157 -292931
12632 -292931 -480871 -142618 345928 441555 265889 -12980 -328000 -217598 153603 4086
12622 4086 -49017 228527 389161 421828 178832 -188522 -539123 -485353 -397032 -275094 -300045
12611 -300045 -542926 -829291 -696584 -406869 -404280 -138254 352757 652205 639432 446755
12601 446755 334025 -84476 -464214 -339189 77787 359440 340153 146767 -294062 -584408
12591 -584408 -787401 -659602 -246535 36642 189599 115786 -50239 -382350 -452356 -217497
12581 -217497 146762 158491 167736 446578 801367 1036837 754801 334412 167442 16083
12571 16083 -49376 456751 1385695 1513176 1257666 1194589 881500 593859 314186 452622
12561 452622 639888 431800 258560 246015 331932 595238 543251 273679 125632 279123
12551 279123 188959 139159 95784 68750 627941 1062446 1329933 1394915 1549906 1613620 1435394
12540 1435394 1314361 984212 760294 876679 1091333 1228292 1237671 942174 642463 735134
12530 735134 1016567 1148694 735481 476278 754978 1008426 705171 526161 652334 913995
12520 913995 804776 706118 607842 241948 134492 280614 299483 93344 224382 26440
12510 26440 -182592 -323696 -275581 -197448 -336757 -157540 -52373 1120 98149 75395 75507
12499 75507 132071 72325 -108820 -250532 -118776 256201 689799 918241 518692 374026
12489 374026 651414 1034365 614906 74151 -38309 -86486 -372838 -449283 -277656 -76249
12479 -76249 -92919 -242399 -101320 140203 382028 374408 680688 1126963 1336001 1138561
12469 1138561 1186977 1332400 1484287 1687364 1533087 1229454 694075 235164 122120 185648
12459 185648 280104 135300 158714 519599 978433 1130376 893534 636959 181142 91012
12449 91012 427649 737811 939524 1147543 1464437 1539544 1334424 1183398 1180297 1406933
12439 1406933 1593642 1582665 1738652 2196344 2522771 2742584 3198541 4171803 5286826
12430 5286826 6565128 8211497 9278004 10266449 11900880 14002005 16608501 20428424
12422 20428424 25564616 31952951 38742924 42566435 41079766 35345702 28558713 22616993
12414 22616993 17865504 14190425 11259356 9225230 7879833 6862713 6106470 5389632
12406 5389632 4548593 4139507 3792146 3402610 3179917 2852198 2460314 2237672 1997309
12397 1997309 1653045 1222179 1181781 1366499 1171703 1321484 1458706 1206908 903259 497977
12387 497977 381462 693558 817856 645637 442006 453390 675631 690376 931637 1447061
12377 1447061 1665294 1473142 1464663 1677342 1582656 1586456 1532186 895395 328893 363857 345537
12366 345537 189969 382469 645557 722116 470323 456717 18912 -155588 207577 54782
12356 54782 -219320 -91853 351791 525970 458388 370990 423232 700939 777453 852625 988689
12345 988689 748975 540765 326887 177424 -199294 -329872 72450 140561 -156432 -659411
12335 -659411 -908518 -493330 28269 598164 992277 1574624 2059545 2403824 2284566 1666535
12325 1666535 1326673 1048521 674857 444734 332705 131561 379196 876296 759999
12316 759999 366257 -11412 32440 249360 376109 590524 729850 356488 -186353 -391168
12306 -391168 -172107 -61358 91460 367208 810783 1406929 1652140 1317350 938244 691798
12296 691798 610244 350217 -165255 -881180 -1247882 -1067801 -1020965 -732687 -259846 -54225
12286 -54225 245613 389063 462954 505559 -32185 -631072 -888162 -741827 -692723 -732969
12276 -732969 -234992 478611 837962 970587 1141596 1283286 1395830 1012169 366430 294926
12266 294926 425304 512092 665714 483722 244096 493256 798419 813901 653260 445605
12256 445605 201222 133511 -4075 -259418 -314347 -143242 -258568 -423994 -591038 -356105
12246 -356105 43590 534446 804116 264029 -319484 -411417 -102410 361180 682321 607905
12236 607905 631755 883469 1181423 1209726 806987 375919 401384 648082 640706 546152 543713
12225 543713 453285 252838 240379 141813 -351822 -586263 -224376 83614 192746 357456
12215 357456 383971 397746 687839 995682 771115 499977 118459 -85698 -79614 -306458
12205 -306458 -351628 -51346 128264 843942 1738209 1883248 1877014 1992320 1722096 1677501
12195 1677501 1821504 1494608 1061473 1111081 1395492 1413423 1537569 1515253 1205349 894318
12185 894318 842966 739984 723232 622317 660516 1089638 1299755 1162438 1263801 1281791
12175 1281791 974457 1005843 1048472 1192274 1187884 983602 617224 275475 290077 401625
12165 401625 479550 556143 739063 556827 288806 163196 156657 -52083 -84635 -242077
12155 -242077 -145893 25799 -38218 -59469 186621 222415 -68599 -378653 -318839 -116756
12145 -116756 -75599 -132658 -154392 -388993 -703947 -1165754 -1300050 -1178798 -1215001 -984814
12135 -984814 -890606 -834702 -917412 -1080905 -1090019 -957319 -590156 -163957 -581943 -947497
12125 -947497 -1247087 -967958 -61670 542457 890838 860162 553072 756572 1341327 1570126
12115 1570126 1013055 213602 149990 451833 557871 69761 -279773 -59375 383380 539498
12105 539498 462458 281581 395790 664161 455712 -77004 -626468 -845627 -577078 -408704
12095 -408704 -611027 -760767 -595462 -604904 -470888 -150536 -62575 -294773 -698553 -617905
12085 -617905 -345944 -69793 202732 122499 -118462 -475392 -850545 -660852 -285413 -90312
12075 -90312 -16965 65396 139427 35189 -154735 -309741 100705 38398 -214176 -365213
12065 -365213 -439335 -473905 -203359 211856 121093 -49598 -59673 -105181 4215 329245
12055 329245 168353 210426 164913 -308387 -610850 -630243 -205373 194550 -14206 -508294
12045 -508294 -578328 -349719 40595 100937 -364315 -693149 -669437 -745200 -864891 -1006893
12035 -1006893 -1191615 -1036757 -626034 207044 519171 313488 400336 646636 779079 914943
12025 914943 863748 817184 471414 184775 62705 391603 792850 590486 97626 -90947
12015 -90947 -90199 -21456 -9008 -53861 -418024 -819488 -600694 -470308 -568573 -531869 -491739
12004 -491739 -559868 -582186 -760861 -969366 -1084954 -908496 -802937 -891826 -802261 -360387
11994 -360387 -61817 57480 129598 42897 -133665 -399583 -565001 -709245 -631908 -366230
11984 -366230 -329291 -720778 -971979 -796882 -874264 -1065425 -1075820 -992722 -523398 -285588
11974 -285588 -17404 476384 607889 479810 342887 7234 -65713 -71132 -143320 -126069
11964 -126069 -78020 161280 243285 196034 74942 69374 260900 365255 140087 -405534
11954 -405534 -233790 593928 1010000 833875 491209 251789 -20431 -74119 256619 705485
11944 705485 934276 851480 746753 616793 687189 811217 736466 789584 661717 325581
11934 325581 53661 62444 370841 740306 692175 83842 -742834 -1076111 -753220 -833473
11924 -833473 -962786 -580966 -295576 14348 297779 231193 10030 -72576 217884 383310
11914 383310 255355 -32758 -346892 -558307 -598207 -268008 -88571 -206557 -280420 -307751
11904 -307751 -380126 -466977 -783116 -817880 -520782 -400033 -450847 -136671 496019 756611
11894 756611 392506 77680 62112 96964 55864 -111887 38411 306221 471392 338106
11884 338106 274235 362754 149484 -10710 -226991 -188022 83418 579948 1077428 1121652
11874 1121652 816802 353405 99566 281308 352040 296773 -110520 -357149 -354756 -97383
11864 -97383 10176 -29518 149646 165741 -7348 37415 -11132 -8242 260888 559936 646772
11853 646772 514137 597258 692121 532048 395099 245360 465599 719460 688529 440963
11843 440963 82484 -308759 -459055 -84162 -1123 -4913 -146790 3929 431553 723625
11833 723625 973804 1127232 1352695 1188976 751941 740342 745804 625099 397219 494034
11823 494034 958629 1328591 1182202 1015770 1124978 1436382 1932532 2354680 2382319 2563637
11813 2563637 3020011 3455492 4246255 5408888 6465056 6891447 7352945 8117017 8848833
11804 8848833 9675818 10519372 11830646 13683894 16367117 19979954 24240739 29140469
11796 29140469 33560439 35886048 34993969 31211330 26558265 22357934 18819207 16036491
11788 16036491 13777587 11779533 9981548 8357803 7230076 6411477 5338705 4429221
11780 4429221 3868339 3813410 4049896 3678508 3027028 2954038 2816174 2761238 2310773 1508506
11770 1508506 796692 121982 -89487 95926 665253 1405816 1376173 1162655 883401 476777
11760 476777 385830 463414 579862 442851 31341 -418437 -616158 -597800 -531344 -432856
11750 -432856 -406524 -446653 -336344 -148618 -323879 -898447 -801658 -410481 -36450 -38107
11740 -38107 32741 235126 148015 76357 257190 447798 557570 222029 93363 246082
11730 246082 100383 -255931 -512494 -392652 -151104 -149032 -2593 257495 -120240 -255599
11720 -255599 376471 909139 777825 232952 -23276 152873 283928 424962 251532 56662
11710 56662 -42134 -32693 50409 -176120 -505496 -766956 -554193 -295994 -7886 253404
11700 253404 -101900 -508302 -497337 -473809 -424961 -317084 -553641 -897166 -850163 -586241
11690 -586241 -390480 -149910 -178961 -456602 -340911 -402579 -553212 -241260 -147175 -430052
11680 -430052 -452937 -292993 -413074 -682238 -548327 104132 510342 246591 52260 -6210
11670 -6210 -264113 -179204 227873 413352 188855 -103761 -57572 -171457 -268079 -107550
11660 -107550 112033 451991 703087 508128 109649 -188743 -436076 -769982 -980446 -1016372
11650 -1016372 -1085248 -1416791 -1452227 -1486987 -1384668 -1081516 -819752 -685787 -737094 -830110
11640 -830110 -853989 -944435 -639315 -601355 -659519 -713913 -257745 153436 -102645 -390668
11630 -390668 -681910 -949118 -956711 -573628 -207190 -119422 43873 310393 240544 362483
11620 362483 466966 567710 533383 171999 -207374 -386348 -405397 -352123 -799526 -855592
11610 -855592 -347951 392930 850941 1081218 1309148 1178187 1038644 865708 876984 638240
11600 638240 215506 815 -55772 42053 -59071 -285849 -580271 -893614 -912346 -867630
11590 -867630 -1096807 -1142617 -980106 -1008788 -780727 -523912 -409916 -413445 -745753 -1081130
11580 -1081130 -1490127 -1701653 -1505300 -1101768 -808868 -554057 -501985 -5744 512039 303251
11570 303251 147103 180868 403011 312366 29500 339092 447465 167755 207152 1275
11560 1275 -517967 -1015864 -1468441 -1420864 -1055248 -777058 -789172 -888722 -1058219 -1313391
11550 -1313391 -1581341 -1327775 -527517 138856 260693 195993 43464 160173 364803 158537
11540 158537 -245396 -298707 -242233 -436070 -442902 -451909 -480963 -565043 -742403 -560186 -248811
11529 -248811 101037 376111 183846 147586 428042 383081 360186 386183 554207 855075
11519 855075 608547 46077 -24186 16668 59118 236056 346402 6204 -851147 -1297585
11509 -1297585 -1280224 -1157559 -1085625 -849358 -889738 -955399 -774516 -397071 228154 442193
11499 442193 459002 475514 311119 -128324 -396259 -406711 198333 443988 115959 -239381
11489 -239381 -644087 -996133 -1032218 -924489 -1022455 -1140720 -1083526 -1070474 -1057493 -737817
11479 -737817 -62668 184978 178636 -68306 -337782 -410871 -261738 27212 460307 732454
11469 732454 881649 951522 492174 -41023 -26809 310759 623306 868890 1143501 1220773
11459 1220773 850863 520167 391691 199710 -311354 -780175 -906995 -621236 -368235
11450 -368235 -248969 -153153 -42484 -96417 -71475 146608 213917 295603 612839 644217 487607
11439 487607 564014 1071784 1325988 1119985 752441 701373 757814 571308 463287 290134
11429 290134 631126 1008819 850856 671710 535142 705061 961004 808572 981339 1099872
11419 1099872 547470 25166 -26806 116397 -64279 -159923 311369 525190 445364 147285
11409 147285 -187024 -339326 -814531 -690027 -161804 -17433 53072 470028 781810 597160
11399 597160 30403 -177600 -306246 -527657 -761657 -975676 -1075869 -1262664 -1264848 -1286277
11389 -1286277 -1242352 -876354 -776264 -975099 -950162 -1186071 -1148422 -886737 -697695 -319254
11379 -319254 14789 -1400 56350 97740 438146 563938 359235 150810 66228 -89755
11369 -89755 57398 271393 640211 1341099 1883405 2886236 4803509 8374286 12748131
11360 12748131 13225913 9450996 5983928 4096143 3230547 2443918 1517926 1056572 787939
11351 787939 349871 -45841 288733 874863 800772 10856 -391443 -338959 -401495 -314109
11341 -314109 115651 318559 40587 126598 498552 1322669 1526126 1233318 756907 -220498
11331 -220498 -1038756 -980724 -513612 -92752 -14534 -235012 -340426 -134736 -5769 133935
11321 133935 -113999 -514032 -440695 -228700 -110718 387962 737705 554954 55629 -352966
11311 -352966 -167100 239683 598893 541295 366545 360048 66882 -363761 -641205 -437544
11301 -437544 101808 460528 603661 361233 -54894 5029 355659 533511 1140439 1697595
11291 1697595 1570334 732461 -163849 -580459 -646548 -704918 -1088610 -1095477 -638296 -321569
11281 -321569 -210660 154219 302722 546735 487906 249597 114968 127887 19247 -121743
11271 -121743 -106964 -263469 -149808 160302 106638 92620 239663 418744 248967 84016
11261 84016 -292771 -488891 -127881 342139 831421 1230955 1385252 1287168 959285 353653
11251 353653 -35466 -93015 -48821 350296 791929 1003885 855538 440466 95695 -225022
11241 -225022 -615672 -671159 -529780 -472089 -161715 66570 -211136 -539479 -827388 -793184
11231 -793184 -508744 -327652 3898 23533 81186 179554 279535 455489 444859 85885
11221 85885 -160712 94566 346901 234468 -30774 -213721 -56062 148833 162382 -124951
11211 -124951 -354691 -343698 -278901 -330746 -514114 -313234 -97369 -395716 -279335 175573
11201 175573 477847 630482 747131 720631 428445 358150 389816 285086 188030 306553
11191 306553 522684 715834 702019 923944 908787 606407 490564 381511 -60370 -335054
11181 -335054 -136114 -87552 -136545 -645575 -889688 -745081 -521374 -146599 188561 291409
11171 291409 385192 964456 1243917 783073 257785 277933 762198 738137 150528 -200809
11161 -200809 -78958 25410 47323 -34674 146487 580674 888861 1273367 1459249 1458441
11151 1458441 1213543 1015159 974338 653988 444875 552545 221286 -79488 -249984 -552592
11141 -552592 -387675 -342636 -224084 -134150 -183402 19732 561788 727943 211992 -476635
11131 -476635 -1022630 -975203 -1079371 -1162961 -927700 -493367 86557 331591 354215 444948
11121 444948 680924 513839 367601 368512 380887 549544 828996 1283528 1695330 1830528
11111 1830528 1664435 1682563 1922297 1929919 1673044 1752960 1922216 1600162 1488531 1525116
11101 1525116 1240439 1161874 1179760 1517298 1610094 1678286 1785632 1304394 923986 694653
11091 694653 801350 922485 1096091 1392240 1525548 1680731 1744609 2160699 2743494 3036466
11081 3036466 3402990 3892686 4448887 5363834 6081048 6866186 7773995 9442386 12470223
11072 12470223 16181980 20526716 25948591 31457877 35107804 34671937 30205734 24287305
11064 24287305 19187371 15317976 12153052 9709520 7495739 5850261 4959058 4326695
11056 4326695 3904155 3491954 2965274 2735745 2526327 2191065 1822726 1412079 904574
11047 904574 714450 818801 567986 51873 -134609 8595 309644 698530 830431 551600
11037 551600 547892 369529 164226 309877 345296 151710 378287 406153 129733 420652
11027 420652 702737 528943 -141116 -429797 -307391 -412251 -449323 -626376 -788303 -618556
11017 -618556 -72382 372492 666583 908816 1112503 1055621 567965 -33027 -422555 -529924
11007 -529924 -312532 -74551 65633 212516 504518 462962 540620 553257 370151 491258
10997 491258 -54555 -764837 -1000340 -1061266 -840590 -842682 -702519 -290282 -204110 -494256
10987 -494256 -592943 -404453 -487598 -772791 -913962 -969898 -656654 -332111 -337571 -533731
10977 -533731 -529921 -434870 18078 831885 1220184 1081431 824747 873014 1101291 1074513
10967 1074513 897809 774011 873086 1120525 782929 183922 -98324 -38982 2196 209530
10957 209530 402660 529608 759134 1331218 1657190 1509542 1394896 1394286 1261471 1444271
10947 1444271 2026704 2523847 3082775 3805457 4548395 5308971 6333438 7019428 6820776
10938 6820776 6413310 5894923 5230716 4788316 4794124 4840708 4580248 4451000 4610576 4871852
10928 4871852 4289639 3549607 3242431 3122755 2672780 2091764 1653711 1286466 973948
10919 973948 643576 541190 450379 337599 702599 885962 888167 526555 239733 280417
10909 280417 531124 549350 438242 276362 226580 44018 -214050 -485749 -657316 -416088
10899 -416088 -229679 -53518 114174 137498 -188058 -256263 -9812 270711 151034 -102119
10889 -102119 72666 397869 608921 692274 314315 227401 143989 423906 391433 255427
10879 255427 55015 -244471 76819 386019 514564 541679 395783 325088 421676 567377
10869 567377 825871 889970 646393 400121 47497 -307662 -495020 -474634 -486813 -392535
10859 -392535 -38984 248814 -57958 -805262 -1174852 -1108912 -763252 -719247 -904681 -1401487
10849 -1401487 -1508749 -1536214 -1836532 -1589707 -1091649 -1007319 -987555 -591622 -319898 -151454
10839 -151454 -202147 -449932 -420186 -244178 -188876 -273756 -658220 -1057640 -1262785 -1338022
10829 -1338022 -1111607 -854427 -890363 -747071 -82148 537732 597857 296217 194476 -62735
10819 -62735 -188686 176168 201278 288817 406155 294846 367366 338966 -58398 -196277
10809 -196277 -201014 -163364 -236603 -796742 -1267308 -1271330 -1114043 -640268 -752602 -675800 -289117
10798 -289117 -388405 -699590 -820441 -859976 -1111733 -1356818 -987029 -308169 72065 136049
10788 136049 135639 3038 466231 808442 530339 420013 314883 -54063 -402778 -844775
10778 -844775 -1141581 -1305702 -1256665 -852122 -695432 -834550 -517281 -280390 -209138 88842
10768 88842 109900 -181644 -336432 -330288 -182424 -76152 -58341 142744 189094 -51497 -343759
10757 -343759 -656509 -816781 -576036 -212548 169679 403881 449948 643623 367072 -150925
10747 -150925 -417420 -778538 -978865 -585590 -28370 -132569 -403938 -738294 -1109903 -945976
10737 -945976 -375069 306893 508820 485300 818407 981227 784631 469326 327495 76527
10727 76527 -285530 -209749 194223 542647 657024 592277 463683 369623 538322 347653
10717 347653 93750 -372251 -1165914 -1398037 -903891 -111285 495493 311797 222411 323397
10707 323397 253508 190999 58287 11135 -117759 -238554 -196517 118762 155379 -90695
10697 -90695 -447900 -807211 -612892 -281601 -38643 -95871 -451871 -644369 -392985 -184339
10687 -184339 -255264 -324351 -359624 -531013 -707298 -667992 -685909 -686533 -764127 -765852 -710785 -522097
10675 -522097 -197355 36641 337081 463027 342385 489277 343861 -167720 -482363 -698986
10665 -698986 -704273 -668320 -560140 -897899 -1074684 -562316 -600107 -783231 -603190 -616747
10655 -616747 -649797 -618773 -182021 76927 -118175 -201327 -58740 278076 652740 534593
10645 534593 356636 163356 -28773 -333278 -638865 -745988 -618642 -119925 82776 -351332
10635 -351332 -578035 -439434 -498520 -168671 367900 564978 328786 64137 505115 1652543
10625 1652543 2731611 3633653 5292209 7101779 6852171 4868310 3074824 1986975
10617 1986975 1193416 719801 566030 550798 405293 -305269 -899109 -1112851 -1115643 -778858
10607 -778858 -293945 -32450 -240213 -654797 -888099 -656397 -178013 292574 164949 -408082
10597 -408082 -713621 -702945 -232366 331380 482289 442092 343594 316529 122297 -47762
10587 -47762 -34414 189678 651804 1013253 991926 726774 138763 -213035 -187008 -279613
10577 -279613 -109088 -117324 -384431 -563632 -540189 -324096 124250 753895 1107393 900618
10567 900618 828029 1057255 1420071 1494859 1389092 922729 392041 -229596 -696727 -1058713
10557 -1058713 -913968 -465243 -55359 4657 23815 -55408 -269140 -389301 -309769 -284168
10547 -284168 -223022 277168 541007 358247 151984 -18322 142084 145171 -40196 -88627
10537 -88627 -55525 32908 -62569 -319196 -607203 -833633 -656844 -270486 266317 515549
10527 515549 517704 327658 7360 47870 -18199 146567 456845 432840 203765 109189 177666
10516 177666 359081 66540 -359746 -661498 -597424 -355618 -260031 -343469 -212918 -217020
10506 -217020 -288803 78281 604969 422259 -259 48606 239309 192154 194516 165723 -2114
10495 -2114 387245 649057 407308 260108 211310 419261 398095 362717 136288 -206207
10485 -206207 -380526 -598356 -543694 -289264 39209 259540 158774 292295 502058 470170
10475 470170 320208 -13890 -466211 -319022 52605 441702 288650 139998 188807 347112
10465 347112 420536 408939 360279 198829 -257288 -126005 463671 1174931 1284220 949818
10455 949818 694425 409911 350625 553366 747800 1072936 1388821 1581319 1919615 2566584
10445 2566584 3426472 4717338 6389807 9578543 14101889 20966026 31694700 44894386
10437 44894386 46461749 34077413 22350026 14916269 10401856 7574414 6112560 5234875
10429 5234875 4335119 3111518 2316814 1807809 1423277 1374747 1525444 1254099 1243921 1266562
10419 1266562 1598156 1715438 1413658 866632 455826 -99335 -400457 -423869 -343184 -292115
10409 -292115 -375716 -519666 -433032 -435929 -164575 78079 244181 510688 578256 394034
10399 394034 -11252 -476733 -253413 -114919 -102559 -28294 -88900 -164786 -114243 -185465 -89025
10388 -89025 483456 788220 604715 782607 1142283 1743017 2469088 3423901 4392435 4772013
10378 4772013 4286301 3421337 3024082 2821550 2710342 2596310 2347952 1677034 1029786
10369 1029786 1115815 1387778 1485641 1504441 1435513 889965 166078 7574 187013 162552
10359 162552 -104535 -361502 -473852 -533588 -838930 -952526 -916516 -732766 -379439 -279369
10349 -279369 -498570 -758554 -483866 -183518 -354365 -735882 -549924 -326148 -763841 -919445
10339 -919445 -710110 -171225 162611 339418 214755 21057 -24930 -220201 -269636 1945
10329 1945 41100 132762 296536 21951 -589604 -834625 -647183 -612891 -715021 -515427
10319 -515427 -212128 -391016 -369979 -217280 147730 341714 322302 670175 1343077 1723463
10309 1723463 1516906 1178922 829169 521878 120592 -182687 -454368 -512395 -621872 -669710
10299 -669710 -259576 -171575 -332350 31220 346160 71589 -225693 -269578 -161352 100190
10289 100190 89019 341007 554680 530127 508259 239415 10223 -145812 -407330 -400023
10279 -400023 -93620 173827 542146 764859 436983 349853 294163 164614 260558 313568
10269 313568 134276 -92081 -39533 19906 -122178 -348770 -479464 -382183 -326918 -218732
10259 -218732 8944 -254186 -468832 -678492 -1185914 -1431018 -1259696 -880537 -855454 -795700
10249 -795700 -411826 -217458 -287804 -170169 -183175 -301335 -268089 -287118 -461936 -555479
10239 -555479 -427698 -244321 -19272 150870 12423 -218810 -353162 -191804 -166369 -1761
10229 -1761 441428 917936 709677 312783 372119 346111 125106 291361 448960 499535
10219 499535 134234 -307660 -218493 83520 379514 116173 -33573 -39109 -610702 -1213902
10209 -1213902 -1303034 -1153649 -880525 -1044547 -985601 -645462 -629370 -711662 -657541 -865436
10199 -865436 -758553 -472681 -436685 -649680 -790770 -843096 -771040 -772148 -509896 -176124
10189 -176124 -108573 -7724 64232 125506 178675 -48697 -640991 -504000 -223856 -360034
10179 -360034 -412537 -465891 -599655 -654877 -798020 -366279 -190627 -248334 -225620 -330344
10169 -330344 -861567 -1482247 -1476219 -1287125 -1416816 -1552425 -1357567 -1088049 -830769 -465090
10159 -465090 -144254 -29785 295591 629363 524803 223835 188955 140661 -124502 -249442
10149 -249442 -251786 -264205 -221050 -238641 -163877 -250299 -425281 -520492 -188953 272401 193230
10138 193230 -95793 -190714 -188486 -524139 -1124667 -1642667 -1704082 -1220597 -696115 -566883
10128 -566883 -619534 -829766 -948126 -1048238 -1312359 -1449533 -1262793 -1096933 -972116 -642004
10118 -642004 -459106 -360042 -225921 -441797 -503338 -208768 -82144 -169293 -212036 -103472
10108 -103472 135311 345474 332724 185351 -351135 -798400 -651129 -170712 187482 -117634
10098 -117634 -548759 -451322 -474466 -562762 -379966 3402 321134 470956 95910 -350900
10088 -350900 -826958 -1133458 -1227257 -1407965 -1261002 -798459 -591433 -671063 -787528 -1293045
10078 -1293045 -1326030 -1399930 -1474615 -1545584 -1485585 -1311896 -1262457 -1201128 -1273572 -1147018 -1128905
10067 -1128905 -1347875 -1427938 -1369536 -1222512 -1233333 -1064485 -590323 -285640 -70383 -109298
10057 -109298 -423135 -604174 -234484 -49641 -274049 -473735 -779662 -1156067 -1304378 -1246140
10047 -1246140 -1248336 -1297324 -1135011 -949332 -924914 -705662 -248837 -79659 -218930 -294980
10037 -294980 -412209 -864841 -1013371 -953494 -846425 -772007 -498672 107545 575794 352665
10027 352665 -104985 -370322 -523536 -241442 10444 -114242 -531056 -690575 -671336 -629890
10017 -629890 -152018 -42226 -651147 -847535 -713759 -240758 37742 -6353 -181570 -222860
10007 -222860 341831 941264 1146958 1071989 790391 379227 -140450 -392884 -316067 -152647
9997 -152647 -322252 -641358 -1169993 -1478199 -1104833 -533158 -237154 -553211 -693628 -523058
9987 -523058 -138568 383354 600068 460846 348888 294318 8886 -578507 -721433 -619061
9977 -619061 -600417 -853984 -1146673 -884370 -382642 -156503 -446113 -588287 -352706 -75093
9967 -75093 67328 287107 168125 -164668 -99580 340060 436534 173326 142329 60039 -282654
9956 -282654 -425587 -288063 -46916 206542 427711 649979 473410 185829 89717 427903
9946 427903 856944 957606 962543 487839 -158320 -49644 338860 414534 45502 -120541
9936 -120541 123236 296279 267322 230432 -128038 -701569 -1077749 -1028504 -717498 -354654
9926 -354654 -98147 -46615 271216 191980 17924 -11696 3799 25133 -179089 -46230 159537
9915 159537 331591 586386 445528 171619 59803 -410223 -746170 -971430 -1087852 -985839
9905 -985839 -621160 -402942 -377931 11571 441381 571532 351397 -37562 -94233 -59247
9895 -59247 -108423 -299128 -458808 -418493 109157 450245 257892 -42423 -427503 -784637
9885 -784637 -935006 -945602 -737889 -447730 -274359 34065 518659 1044445 1209051 809574
9875 809574 376603 101730 233532 139772 -332061 -383009 23939 133053 213972 493797
9865 493797 544578 432914 379333 -78074 -667942 -1120922 -725460 -251516 -1611 346374
9855 346374 225297 -175431 -318538 8773 241713 463834 895946 882295 480868 278997
9845 278997 -154974 -537063 -417731 -382964 -506789 -373071 -279012 -172208 -352502 -550584
9835 -550584 -369056 -287100 -420424 -164363 236652 -18167 -500594 -754293 -626938 -380981
9825 -380981 -332170 -741453 -914094 -785581 -375375 -175767 -154178 -90273 -72789 276949
9815 276949 820957 799841 650295 467294 -8436 -288640 -91846 99691 305847 158233
9805 158233 -209476 -357467 -467094 -552242 -618809 -305941 353458 725152 394049 89399
9795 89399 418718 663940 475361 321796 438798 -15799 -691474 -518856 -128408 -268805
9785 -268805 -519514 -494727 -200153 276736 316916 242102 -108717 -389972 -256966 -165669
9775 -165669 -188735 -193136 -300086 -185371 -322823 -540095 -419783 -115959 73915 -158055
9765 -158055 -596993 -445185 -83304 10753 147652 248962 -36842 -341389 -437072 -516758
9755 -516758 -461484 -74293 -198699 -579647 -454807 -95562 244095 431671 322013 67540
9745 67540 -4015 53006 97496 131720 -11505 -142806 5691 137328 406537 573651 46592
9734 46592 -270936 -154029 97048 -52068 -23611 210468 703046 1197137 1078505 765687
9724 765687 760342 1088727 1126590 925974 997943 867235 928236 949759 702787 431739 451637
9713 451637 861350 1162451 1661607 2309523 2193874 1593543 965704 394128 433859 788682
9703 788682 490623 655587 893757 1172950 1204358 903669 981508 1649710 2576473 3123228
9693 3123228 3480522 4209719 4944301 6210118 7842340 11075568 16432761 24566904 36726409
9684 36726409 49776684 47606891 33916749 23367558 16532338 12825304 10417592 8830368
9676 8830368 7771316 7435537 7666219 8717724 10021252 10968766 10437510 8695084 6873823
9667 6873823 5509138 4299314 3434135 2464260 1744264 1178851 788053 744428 819053 799569
9657 799569 757543 713282 370211 279946 702254 720949 510956 360343 -17142 -522537
9647 -522537 -719220 -763806 -456702 -8626 202245 261832 218407 386538 633738 766125
9637 766125 860546 657199 474158 312830 375853 245743 -60379 -253709 -160200 -100942
9627 -100942 -404064 -707095 -648818 -371209 -176300 -168379 -159203 11345 262300 -118746 -690638
9616 -690638 -606300 -438312 -351220 -449916 -155685 -45507 109397 165155 -24259 -21454 -22008
9605 -22008 89219 268575 331834 424953 417800 632971 990806 1046838 512382 -276615 -565033
9594 -565033 -655735 -370019 -101822 89009 267812 506907 565437 391946 345758 480906
9584 480906 561786 397488 -228021 -473227 -299223 -436853 -436732 68640 352424 533828
9574 533828 684841 479340 628188 808420 578650 440896 498623 754559 915524 874641
9564 874641 721780 841406 1150007 1341297 1500727 1488521 1441131 1618481 1938708 1855441
9554 1855441 1774384 1959873 2202325 2484697 3346889 3948265 4371018 4816700 6157332 8279260
9544 8279260 10661641 13451299 17182757 23033640 31565195 43669857 56679192 57736388
9536 57736388 45817675 33005560 23287792 17008398 12734549 9835366 7938564 6480220
9528 6480220 5542713 4812163 4447929 4493960 3811550 3084786 2525508 1720049 1218958 1269616
9518 1269616 1085236 962923 1251196 1624263 1750829 1590296 1314806 1133019 1290993 1114878
9508 1114878 1163509 1582666 1815271 1858874 1476627 745629 157601 293575 401204 463311
9498 463311 402198 496909 414107 696266 1124327 1189795 751361 343960 237447 463290
9488 463290 590538 549311 512717 53999 -221664 -119634 92633 302809 486569 918775
9478 918775 1038494 767463 783551 906817 995244 1221693 1446528 1314952 1072945 1056874
9468 1056874 1197958 1553609 1627130 1538482 1511768 1202363 889513 820564 970289 938506
9458 938506 963076 1117392 1286411 1362429 1205965 1061467 1084567 1289859 975304 372577
9448 372577 46717 281584 428476 207275 195019 350577 335594 103553 -14740 -226475
9438 -226475 -191463 202435 598657 1161482 1060021 518317 365985 649514 910276 859329
9428 859329 763064 618157 407485 96538 48235 303966 207320 63014 298267 853757
9418 853757 1138976 1339788 1395947 1481149 1359129 1453555 1744521 1964149 2305278 2880221
9408 2880221 3531595 4436461 5138871 6057706 7135601 7771402 7896280 6719950 4949280
9399 4949280 3481999 2788682 2519161 2024162 1432452 1165087 1121980 1162906 752626 205311
9389 205311 251116 485447 279894 -133194 -246996 -98291 86548 284306 158332 -58063
9379 -58063 -121167 -354502 -668764 -783264 -997466 -703053 -189967 123032 321937 634788
9369 634788 470048 -155526 -819383 -1207889 -1137285 -756486 -571924 -394571 -50165 211262
9359 211262 305791 65372 -87057 -327145 -488766 -137164 209803 525887 238657 -5904
9349 -5904 117304 251986 213697 131460 323328 316709 281567 337504 413112 340991 -147565
9338 -147565 -617358 -518862 -517754 -519373 -460457 -30117 326784 602487 570979 144289 -260202
9327 -260202 -231159 -309014 -421335 -101992 -2283 -144910 -248116 -171525 -102083 93358 79239
9316 79239 -91841 -645071 -1132814 -1231922 -1118789 -860450 -842179 -929225 -585587 -379550
9306 -379550 -674172 -1201527 -1258500 -839638 -275092 58705 14160 11152 61985 -248666 -502224
9295 -502224 -341883 -235307 -324923 -543673 -557216 -342717 -236250 -386105 -208814 217402
9285 217402 455465 562169 658211 717133 536140 368117 665109 1059629 1041635 958088
9275 958088 600244 147201 62454 180545 349421 119825 84221 414702 764053 485610
9265 485610 -28042 -173289 -154262 6777 193248 589170 780837 883391 764363 723276
9255 723276 723501 592381 506121 320151 -289367 -917050 -890717 -576450 -879971 -1067089 -972234
9244 -972234 -461609 -91877 120955 -18453 -294639 -161402 -163599 -15229 -124849 -718664
9234 -718664 -603353 -147536 -113572 -76130 4149 -188674 -358643 -515615 -681408 -635852
9224 -635852 -342946 -222770 -23504 264039 209808 112571 11852 -191874 -584960 -835493
9214 -835493 -1109703 -1040130 -820850 -765678 -627098 -463941 -406858 -568210 -345611 -289916
9204 -289916 -532804 -535890 -313195 -349011 -425938 -331367 -366874 -278942 -235628 -404188 -345989
9193 -345989 -9537 223394 -21531 -148962 -189521 -16934 392774 510786 370717 252335
9183 252335 49476 -157453 -131193 -79584 -161147 -584 115630 268376 547086 937203
9173 937203 869306 854786 771790 447206 -13427 -177886 79534 548554 1099754 1192006
9163 1192006 545711 -126544 -49174 -233296 -219408 -5430 -108110 -171282 -661951 -865295
9153 -865295 -566094 -316192 -267777 -328568 -314296 -124288 29928 -61828 -172812 -697791
9143 -697791 -1455968 -1742732 -1589349 -1140865 -600669 -192890 232630 257686 172950 317070
9133 317070 205003 -196403 -319471 -301491 -266018 -39394 335118 407812 -54399 -495217
9123 -495217 -321745 -1299 169624 -155604 -695761 -685461 -765329 -849459 -407422 -50636
9113 -50636 43774 143423 154646 115569 343986 299376 413752 525517 277394 166009 -182101
9102 -182101 -353554 -130013 239275 318050 -172857 -506002 -437559 -497564 -567297 -417188
9092 -417188 -348579 -211161 -168471 -282424 -417582 -304035 -7486 102179 -187037 -407780
9082 -407780 -630214 -709385 -883463 -867822 -457543 -335333 -677401 -774667 -773619 -928855 -773809
9071 -773809 -646629 -454678 -35208 13337 -163241 -227786 -152479 -193308 -281654 -482693 -643359
9060 -643359 -418790 37865 343442 228547 114654 76111 456905 953894 1273416 1047866
9050 1047866 376842 -153365 -334291 -8666 378512 620468 311657 -281557 -806563 -918927
9040 -918927 -806718 -980330 -1070749 -824323 -472144 -108794 -67815 -336246 -765783 -901890
9030 -901890 -975334 -1040445 -837342 -502650 -438566 -861256 -1395241 -1705068 -1627886 -1202142
9020 -1202142 -885834 -908455 -990887 -873133 -623327 -660559 -818470 -895373 -1073503 -935076
9010 -935076 -726245 -618738 -456844 93579 293501 145198 -32444 -140362 -120666 -180040
9000 -180040 -300006 -298873 -341872 -282390 -557182 -999208 -1210468 -986349 -839105 -689944
8990 -689944 -938884 -1389118 -1231322 -591691 -47361 250594 38881 -82433 -52875 -453946
8980 -453946 -902877 -757606 -455619 -326503 -463796 -293122 -139073 -214114 -445385 -807209
8970 -807209 -959993 -988271 -891180 -826838 -915473 -1119370 -1084568 -875113 -624643 -443470 -65319
8959 -65319 -208079 -538285 -825012 -1092857 -1320166 -1464233 -1375360 -1083771 -715241 -623305
8949 -623305 -621048 -639213 -317022 319097 593619 513612 425380 491403 377515 -165933 -676787
8938 -676787 -846508 -919085 -920470 -724165 -621810 -620319 -545202 -266531 -136512 317439 835885
8927 835885 700449 214791 75403 19956 -30450 23519 -168610 -128207 -24754 126512
8917 126512 472625 458514 335990 112651 40528 245953 248271 217903 413531 831569 971580
8906 971580 963344 735990 310757 237955 527219 687352 587190 636839 633478 361544 -263204
8895 -263204 -652209 -491029 -574939 -578581 -787746 -808840 -438369 -60368 235348 587732
8885 587732 566024 449535 566844 294106 -207475 -232279 14821 530364 1025026 1080713
8875 1080713 968435 518472 8954 -188047 -94237 236386 396906 306935 154280 298665
8865 298665 403038 442962 455458 641882 848977 1003684 904086 479709 -214210 -778797
8855 -778797 -1086955 -1114779 -655864 -306322 -238112 196376 566459 767955 622658 435614
8845 435614 162785 -351266 -468179 -125488 182521 561575 473373 18490 -440850 -35458
8835 -35458 491079 487103 417918 321039 -45118 -276598 -139931 80582 -7805 -369916 -487153
8824 -487153 -419586 -331011 204761 804497 785761 530699 473724 394628 790146 662623 114036
8813 114036 -191520 -212495 -147056 62982 593750 935612 1006701 884699 832265 740457 728639
8802 728639 701251 675168 560653 236543 -80362 -475210 -900130 -852082 -754998 -583514
8792 -583514 -336484 -270804 -289998 -77345 104541 -56469 -260995 -372707 -260967 -183023
8782 -183023 -50648 486164 840878 596533 326573 231967 46132 62800 290874 305045
8772 305045 324217 207185 3420 262306 233125 298260 623298 726767 973659 873916
8762 873916 -80084 -796789 -503966 -234578 -279568 -168117 -24785 -6502 214211 86329
8752 86329 -187791 -234637 -133596 135741 238349 531358 751341 689585 362790 165298
8742 165298 233788 453625 676738 889502 998621 1024540 1521799 2061770 2336720 2502917
8732 2502917 2780613 3086748 3171679 3622945 4772951 6128936 7289322 9182409 12333036
8723 12333036 16689840 22322129 29726322 37586970 41958052 39537850 32893554 25669305
8715 25669305 19879406 16159544 13626937 11807167 10386662 9543058 8802345 8623808 8810520
8706 8810520 8903874 8591357 8003647 7133592 5977264 5021293 4331544 3695056 3056906 2602762
8696 2602762 2708607 3143399 3091103 2377454 1461965 1188829 1132905 742135 591129 982457
8686 982457 1251921 920659 630976 271319 -50418 -310105 -349203 -67210 185230 373721
8676 373721 481198 768802 918797 738697 839197 808858 759157 1129247 1571682 1476331
8666 1476331 898155 845307 1060700 1302753 1059365 751560 563949 762484 864666 783705
8656 783705 1062415 1387919 1213780 688045 752898 1275000 1554533 1624450 1664316 1817265
8646 1817265 1651690 1286593 1020415 949589 464538 -463313 -558925 47640 546560 567900
8636 567900 609285 910963 1060375 846834 333214 357163 489372 465284 464822 462832 318363
8625 318363 284341 274119 150332 -58559 -195926 -55288 263825 451555 573493 829680
8615 829680 871201 719827 685658 953221 658408 226178 -44085 -374625 -70777 373210
8605 373210 267004 44612 -113053 -694653 -1212212 -1320345 -1144220 -1097646 -761229 -309825
8595 -309825 -204421 -308452 -372726 -262183 -141868 -57477 119375 335277 380423 112367
8585 112367 77103 147584 -45746 -63421 -268705 -687546 -912562 -528564 105122 689721
8575 689721 700846 255698 56274 240092 590991 493106 635423 863101 627369 272489
8565 272489 372751 317084 324700 339303 153150 220134 321294 144665 96373 496570 1012269
8554 1012269 976266 726344 482150 398578 158838 -421520 -707530 -528512 -421844 -558520
8544 -558520 -689760 -645846 -716754 -743447 -307141 -134543 -138094 94962 401471 422240 600291
8533 600291 585875 614511 741321 388126 -275464 -358537 -506701 -567979 -614129 -728186 -503835
8522 -503835 -428754 -562032 -425725 225582 675333 673483 980919 1085267 868944 841592
8512 841592 1167436 1332741 1069865 1168478 1212858 1111598 860064 875646 973831 737867
8502 737867 610521 830138 1020446 884155 754376 586476 580389 1080922 1673661 1946685
8492 1946685 2121125 2196985 2306294 2891525 3693729 4120496 4954912 6345654 7616524
8483 7616524 8524845 9384846 9437314 8820518 8799853 9062721 9735780 10882779 13010898 16440276
8473 16440276 20998932 27434683 34845101 40919902 42232118 37642148 30483583 24026630
8465 24026630 18957600 15476893 12979180 10880006 9139960 7638259 6217163 4851607
8457 4851607 3764569 3243274 3114531 3360922 3369880 3077790 2791191 2345334 2242403 2295375
8447 2295375 2130279 1874451 1751692 1299992 1058585 1053620 1007886 1258146 1435699 1241354
8437 1241354 1033081 1002159 1152865 1306514 969236 526900 422071 53818 103746 722442
8427 722442 1053555 939902 464458 282423 511262 811589 1162886 1334923 1230810 1473329
8417 1473329 1447946 1106271 806230 609140 367190 444090 269331 3678 245213 302799
8407 302799 256105 356122 277323 91086 448461 1019758 583572 -204570 -286588 -120662
8397 -120662 209348 568253 751834 861095 1483910 1848901 1636341 1351958 1153212 1084101
8387 1084101 868731 846786 762227 1019704 1261557 1125460 1237327 1232381 826194 615366
8377 615366 438849 55882 61107 153474 441522 1071250 1493594 1348887 1232029 1361646
8367 1361646 1695051 2217126 2499764 2627084 2722830 2599171 2476949 2398054 2119371 1809071
8357 1809071 1567392 1135604 1116837 1062345 586781 247449 173975 -150313 -360484 272363
8347 272363 754848 841189 701392 565169 467612 329724 383479 234293 -35178 -157374
8337 -157374 -111901 -222214 -268638 -175590 -155739 -141356 -209599 -264966 -650886 -1186198 -1656704
8326 -1656704 -1323248 -698957 -655740 -822690 -878772 -1003225 -926385 -686078 -396318 -451574
8316 -451574 -557646 -148550 -7337 102707 221784 714849 879482 719325 605351 306088
8306 306088 99279 179371 173761 -170167 -251810 -341561 -469786 -676231 -492911 3134 215346
8295 215346 2265 -160510 -165120 -335612 -635664 -361095 -78140 -304873 -536615 -566140
8285 -566140 -513100 -354770 -318672 28173 611613 390510 -31852 -220980 -587231 -842177
8275 -842177 -892913 -683286 -26599 401489 433999 194820 251221 372627 419488 756587
8265 756587 453068 -132502 57243 24654 -471548 -555300 -294796 331591 898075 1027499
8255 1027499 980701 989484 1569221 1814267 1675016 1125950 591195 427160 310930 228984
8245 228984 169122 337317 791966 1240976 1186811 848790 511996 175673 310774 507026
8235 507026 52895 -482019 -198918 140801 -60154 -310095 -114034 45133 222531 161511
8225 161511 187506 118123 88311 181356 282664 394463 420293 377762 237526 -104740 -199804
8214 -199804 -488835 -689724 -184265 504114 845148 419408 97517 -255578 -635720 -495049
8204 -495049 -180844 -1234 253145 531679 850777 1189992 1054177 575357 398072 332150
8194 332150 228892 48212 -117577 -68957 108932 197159 370436 519056 664667 1057790
8184 1057790 1170434 812024 122385 -242099 56806 213215 523154 553656 310008 413509
8174 413509 475150 441215 745644 972675 1029325 1026350 1040919 1235095 1717387 2161011 2586212
8163 2586212 3424192 4074266 4551393 5132100 5351855 6028982 7167311 8932584 12281987
8154 12281987 16998319 23180234 30312362 36802595 39068398 35384864 28889201 22401522
8146 22401522 17236284 13470736 10803919 8667411 6856073 5680995 4843806 4349857
8138 4349857 4003375 3331419 2599587 2050435 1300930 892625 993549 1231547 1563453 1694950
8128 1694950 1817480 1653306 1713908 1602315 1291469 1456165 1933072 2269702 1984554 1666779
8118 1666779 1268795 872688 1079372 1173543 1153297 632871 -40988 20340 408030 671694
8108 671694 583612 545320 185854 -246610 -132681 205766 706495 960801 787188 452272
8098 452272 19402 -193031 -127527 48440 -21953 -245437 -161935 139299 488843 587989
8088 587989 377451 216799 190289 3045 -465466 -700338 -302849 18394 25061 -3421
8078 -3421 123742 273860 550304 517336 383059 465411 548811 786585 733669 478987 303019
8067 303019 117480 167872 234129 -85323 -450714 -792250 -931746 -864005 -624219 -270741
8057 -270741 273274 167964 -397410 -355252 -97712 103771 93629 185238 359073 69843
8047 69843 -73818 275015 640102 470963 54450 -27993 94769 252084 358123 145906
8037 145906 -392494 -558344 -311928 46603 88291 -153578 -550168 -795259 -528932 -33405
8027 -33405 230016 570329 838852 591675 271929 2188 117287 269485 -13824 121336
8017 121336 832184 1224267 1206494 832660 534609 469938 782529 921664 593331 68632
8007 68632 -125794 -2030 -119603 -601798 -774450 -611770 -618334 -787328 -838675 -788464 -331373
7996 -331373 185293 554474 672646 431138 444006 446594 -44766 -729649 -984507 -918293
7986 -918293 -1093394 -807894 -191713 -247620 -190852 112045 225286 328816 107967 -204333
7976 -204333 -299878 -147026 95692 -114168 -411352 -311518 -96864 96764 374700 532974
7966 532974 340343 -48281 -213790 -277203 -421283 -212027 111581 250942 431051 494567
7956 494567 575167 397883 327237 7726 49703 172513 396568 442455 -57526 -446590
7946 -446590 -666311 -699093 -295812 -36019 -175756 -166073 200475 178677 -162715 -196909 -585100
7935 -585100 -1025189 -1066200 -702177 -380401 -226229 -427137 -510232 -499612 -504976 80270 291103
7924 291103 -72146 -254952 -244509 -174116 -17532 356039 468646 474375 523087 742610 773362
7913 773362 717834 776500 580946 220289 220742 221081 16269 -159161 68252 186949 158055
7902 158055 31324 32357 -138681 -552244 -693584 -526225 -403180 -211558 16825 -88233
7892 -88233 -387818 -206271 -143387 -332391 -233653 -218979 -176210 10050 20763 -170256 -507046
7881 -507046 -683757 -486580 -494415 -528334 -429590 -165335 158546 329035 213253 99050
7871 99050 291228 342952 467382 370607 -25480 233851 662154 545689 273372 93700
7861 93700 -112080 -271002 -278129 -182668 -12736 122088 -175331 -542585 -583305 -697815 -761814
7850 -761814 -753615 -814875 -341055 29934 359328 272582 -216816 -565766 -491222 -413170 -459589
7839 -459589 -812189 -929581 -573268 -250074 -237693 -471858 -157477 46928 -90462 72100
7829 72100 312167 108167 -366236 -369481 -448390 -652775 -613897 -898711 -1517980 -1620644 -1147913
7818 -1147913 -696557 -132420 275935 -3784 -339169 -503373 -462240 -189218 -284080 -924039
7808 -924039 -1381647 -943149 -343947 -447656 -565809 -578430 -691100 -390766 -65907 -58608
7798 -58608 64906 143410 -150807 -559962 -861689 -491608 -250721 -702354 -710178 -503170
7788 -503170 -595753 -868131 -1169005 -1351248 -1235959 -787208 -426581 -147083 -53627 -93084
7778 -93084 -442391 -696467 -663658 -854598 -983569 -608089 -112418 48881 -80115 193475
7768 193475 598339 690570 554591 198146 35442 -416317 -629336 -285165 69344 100073
7758 100073 -255050 -483646 -487335 -669879 -1091190 -1319245 -1214518 -647561 -31080 127776
7748 127776 106414 495746 728265 530030 223117 -167047 -66215 15658 -589186 -1072419
7738 -1072419 -947786 -706662 -741002 -833582 -806606 -738836 -648114 -410187 -200764 -263694 -85695
7727 -85695 176471 -78383 -579801 -670805 -328394 -126191 -440617 -421797 -6275 31104
7717 31104 -171758 -198462 -253164 -353570 -364747 -245898 -467122 -812459 -610060 -61775
7707 -61775 117659 -14916 -232362 -434239 -239918 207842 647830 709582 451032 424761
7697 424761 352829 -44282 -534349 -492124 -102508 93170 438245 427963 219921 106701
7687 106701 8721 -366360 -661807 -750020 -621605 -458565 -310668 -84192 146702 380678
7677 380678 446977 71853 -39418 138669 178762 87052 51064 -151799 -813675 -852502 -565218
7666 -565218 -409020 -197471 -120000 555 158646 526201 723527 712188 573306 83966
7656 83966 -403507 -612678 -406775 -454738 -616513 -474191 -381597 -253929 -157221 -582718
7646 -582718 -903753 -661180 -51196 616830 794588 553008 149132 6200 127959 176179
7636 176179 341785 482403 263522 106309 -264163 -745290 -994349 -887101 -682664 -215535
7626 -215535 491708 621943 2631 -463439 -736237 -1383844 -1544815 -1277795 -988777 -489347
7616 -489347 -458674 -875597 -1267096 -1339997 -1114692 -919041 -888060 -722837 -284300 -52501
$$ [...]
##END NTUPLES=NMR SPECTRUM
##END=
