##TITLE=C13_L8-SPh
 CDCl3, 1900 sc

 5.3.2020
##JCAMPDX= 6.0         $$ Bruker NMR JCAMP-DX V2.0
##DATA TYPE= NMR SPECTRUM
##DATA CLASS= NTUPLES
##ORIGIN= UXNMR, Bruker Analytische Messtechnik GmbH
##OWNER= root
$$ XWIN-NMR		Version 3.5
$$ Thu Mar  5 16:34:15 2020 Russian Standard Time (UT+4h)  she@DPX200
##.OBSERVE FREQUENCY= 50.327896
##.OBSERVE NUCLEUS= ^13C
##.ACQUISITION MODE= SIMULTANEOUS
##.ACQUISITION SCHEME= undefined
##.AVERAGES= 1900
##.DIGITISER RES= 17
##SPECTROMETER/DATA SYSTEM= spect
##.PULSE SEQUENCE= zgpg30
##.SOLVENT NAME= CDCl3
##.SHIFT REFERENCE= (INTERNAL, CDCl3, 0, 222.624)
##AUDIT TRAIL= $$ (NUMBER, WHEN, WHO, WHERE, WHAT)
$$ ##TITLE= Audit trail, XWIN-NMR		Version 3.5
$$ ##JCAMPDX= 5.01
$$ ##ORIGIN= Bruker BioSpin GmbH
$$ ##OWNER= she
$$ F:/spectra/data/she/nmr/c13/1/pdata/1/auditp.txt
$$ ##AUDIT TRAIL=  $$ (NUMBER, WHEN, WHO, WHERE, WHAT)
(   1,<2020-03-05 16:33:00.14 +0400>,<she>,<DPX200>,
      <created by zg, POWCHK disabled, PULCHK disabled
       terminated by command 'halt'
       configuration hash MD5:
       00 E9 B6 7A A2 85 ED C7 34 08 36 98 17 FE 4E 26
       data hash MD5: 32K
       9E A8 10 2F B1 6F 03 CF 26 72 3B 9B 89 1F 12 06>)
(   2,<2020-03-05 16:33:01.54 +0400>,<she>,<DPX200>,
      <Start of raw data processing
       efp BC_mod = 2 LB = 1 FT_mod = 6 PKNL = 1 PHC0 = -224.6368 PHC1 = 30.40638 SI = 32K 
       data hash MD5: 32K
       E8 30 81 97 C8 C2 79 CB 59 08 2E 43 9A A5 A0 BD>)
(   3,<2020-03-05 16:33:04.71 +0400>,<she>,<DPX200>,
      <abs ABSG = 5 
       data hash MD5: 32K
       65 84 16 F9 48 BE 97 9D 9E 82 D5 21 30 AF B9 1E>)
(   4,<2020-03-05 16:33:40.90 +0400>,<she>,<DPX200>,
      <pk PHC0 = -6.590054 PHC1 = 9.799999 
       data hash MD5: 32K
       81 01 2E ED FD 5E A5 C2 BC B6 10 DD 7E 20 9E C8>)
(   5,<2020-03-05 16:33:44.23 +0400>,<she>,<DPX200>,
      <abs ABSG = 5 
       data hash MD5: 32K
       31 45 06 7F 7C AB 6A A4 65 43 14 13 7C 3A F3 FE>)
$$ ##END=
$$ 
$$ hash MD5
$$ 2F 2F 1A D2 AC 7F B0 8F 86 01 5A 0A 7A 7F A1 DE
##$RELAX= 
##$RELAX= 
##$RELAX= 
##$RELAX= 
##$RELAX= 
##$RELAX= 
##$RELAX= 
##$RELAX= 
$$ Bruker specific parameters
$$ --------------------------
##$DU= <F:/spectra>
##$EXPNO= 1
##$NAME= <c13>
##$PROCNO= 1
##$TYPE= <nmr>
##$USER= <she>
##$AMP= (0..31)
100 100 100 100 100 100 100 100 100 100 100 100 100 100 100 100 100 100 
100 100 100 100 100 100 100 100 100 100 100 100 100 100 
##$AQSEQ= 0
##$AQ_mod= 1
##$AUNM= <au_zg>
##$AUTOPOS= <>
##$BF1= 50.322709
##$BF2= 200.13
##$BF3= 50.322709
##$BF4= 500.13
##$BF5= 500.13
##$BF6= 500.13
##$BF7= 500.13
##$BF8= 500.13
##$BYTORDA= 1
##$CFDGTYP= 0
##$CFRGTYP= 5
##$CHEMSTR= <none>
##$CNST= (0..31)
1 1 145 1 1 1 1 1 1 1 1 1 1 1 1 1 1 1 1 1 1 1 1 1 1 1 1 1 1 1 1 1 
##$CPDPRG= <waltz16>
##$CPDPRG1= <>
##$CPDPRG2= <waltz16>
##$CPDPRG3= <>
##$CPDPRG4= <mlev>
##$CPDPRG5= <mlev>
##$CPDPRG6= <mlev>
##$CPDPRG7= <mlev>
##$CPDPRG8= <mlev>
##$CPDPRGB= <>
##$CPDPRGT= <>
##$D= (0..31)
$$ [...]
##$SUBNAM4= <"">
##$SUBNAM5= <"">
##$SUBNAM6= <"">
##$SUBNAM7= <"">
##$SUBNAM8= <"">
##$SUBNAM9= <"">
##$SW= 239.972175391363
##$SWIBOX= (0..15)
0 1 3 0 0 0 0 0 0 0 0 0 0 0 0 0 
##$SW_h= 12077.2946859903
##$TD= 32768
##$TD0= 1
##$TE= 0
##$TE2= 300
##$TE3= 300
##$TEG= 300
##$TL= (0..7)
120 120 120 120 120 120 120 120 
##$TP= (0..7)
150 150 150 150 150 150 150 150 
##$TP07= 0
##$TPNAME0= <>
##$TPNAME1= <>
##$TPNAME2= <>
##$TPNAME3= <>
##$TPNAME4= <>
##$TPNAME5= <>
##$TPNAME6= <>
##$TPNAME7= <>
##$TPOAL= (0..7)
0.5 0.5 0.5 0.5 0.5 0.5 0.5 0.5 
##$TPOFFS= (0..7)
0 0 0 0 0 0 0 0 
##$TUNHIN= 0
##$TUNHOUT= 0
##$TUNXOUT= 0
##$USERA1= <user>
##$USERA2= <user>
##$USERA3= <user>
##$USERA4= <user>
##$USERA5= <user>
##$V9= 5
##$VALIST= <valist>
##$VCLIST= <CCCCCCCCCCCCCCC>
##$VD= 0
##$VDLIST= <DDDDDDDDDDDDDDD>
##$VPLIST= <PPPPPPPPPPPPPPP>
##$VTLIST= <TTTTTTTTTTTTTTT>
##$WBST= 1024
##$WBSW= 4
##$XGAIN= (0..3)
0 0 0 0 
##$XL= 0
##$YL= 0
##$YMAX_a= 4444296
##$YMIN_a= -12948447
##$ZGOPTNS= <>
##$ZL1= 120
##$ZL2= 120
##$ZL3= 120
##$ZL4= 120
##$ABSF1= 222.624
##$ABSF2= -17.3728
##$ABSG= 5
##$ABSL= 3
##$ALPHA= 0
##$AQORDER= 0
##$ASSFAC= 0
##$ASSFACI= 0
##$ASSFACX= 0
##$ASSWID= 0
##$AUNMP= <proc_1d>
##$AZFE= 0.1
##$AZFW= 0.5
##$BCFW= 0
##$BC_mod= 2
##$BYTORDP= 0
##$COROFFS= 0
##$CY= -3
##$DATMOD= 1
##$DC= 0
##$DFILT= <>
##$DTYPP= 0
##$F1P= 0
##$F2P= 0
##$FCOR= 0.5
##$FTSIZE= 32768
##$FT_mod= 6
##$GAMMA= 0
##$GB= 0
##$INTBC= 1
##$INTSCL= 4.134877e-10
##$ISEN= 128
##$LB= 1
##$LEV0= 0
##$LPBIN= 0
##$MAXI= 10000
##$MC2= 0
##$MEAN= 0
##$ME_mod= 0
##$MI= 0.1934396
##$NCOEF= 0
##$NC_proc= -1
##$NLEV= 6
##$NOISF1= 120.0001
##$NOISF2= 80.00006
##$NSP= 0
##$NTH_PI= 0
##$NZP= 0
##$OFFSET= 222.624
##$PC= 1.4
##$PHC0= -231.2269
##$PHC1= 40.20638
##$PH_mod= 1
##$PKNL= yes
##$PPARMOD= 0
##$PSCAL= 0
##$PSIGN= 0
##$REVERSE= no
##$SF= 50.3227315989248
##$SI= 32768
##$SIGF1= 140
##$SIGF2= 120
##$SINO= 11.81781
##$SIOLD= 32768
##$SREGLST= <13C.CDCl3>
##$SSB= 0
##$STSI= 32768
##$STSR= 0
##$SW_p= 12077.2946859903
##$SYMM= 0
##$S_DEV= 0
##$TDeff= 32768
##$TDoff= 0
##$TI= <>
##$TILT= no
##$TM1= 0
##$TM2= 0
##$TOPLEV= 0
##$USERP1= <user>
##$USERP2= <user>
##$USERP3= <user>
##$USERP4= <user>
##$USERP5= <user>
##$WDW= 1
##$XDIM= 32768
##$YMAX_p= 345501876
##$YMIN_p= -6668161
$$ End of Bruker specific parameters
$$ ---------------------------------
##NTUPLES= NMR SPECTRUM
##VAR_NAME=  FREQUENCY,     SPECTRUM/REAL,   SPECTRUM/IMAG
##SYMBOL=    X,             R,               I
##VAR_TYPE=  INDEPENDENT,   DEPENDENT,       DEPENDENT
##VAR_FORM=  AFFN,          ASDF,            ASDF
##VAR_DIM=   32768,         32768,           32768
##UNITS=     HZ,            ARBITRARY UNITS, ARBITRARY UNITS
##FACTOR=    0.368581032318806, 1,           1
##FIRST=     11203.0474431902, 0,            0
##LAST=      -874.247242800138, 0,           0
##MIN=       -874.247242800138, -6668161,    0
##MAX=       11203.0474431902, 345501876,    0
$$ Real data points
##PAGE= N=1
##DATA TABLE= (X++(R..R)), XYDATA
$$ [...]
17729 -1198703 -1796145 -2113105 -1474476 -194309 -87508 247384 1056733 1088213 625741
17720 625741 212518 167568 -109536 274684 1694664 1811921 597869 -93433 180713
17711 180713 1202495 1031118 -324699 -1213290 -1345150 -521423 813310 1106677 926656
17702 926656 1032731 1318753 1271415 1374038 1689223 1448190 1206837 890462 654274 395068
17692 395068 550108 332672 244597 1032014 787505 78694 -400761 -852949 -1197333 -996092
17682 -996092 342040 1043216 376621 -904761 -1218722 51349 81324 -527061 -1619106
17673 -1619106 -2583090 -2254079 -1624896 -877264 24655 413379 -12653 -579483 -149140
17664 -149140 690829 137312 -1259923 -1409356 -927622 -701475 -613474 -704340 -731070 -1164924
17654 -1164924 -1122511 -287070 606005 398287 542709 1087336 1302285 1725367 2080271 2064943
17644 2064943 1915881 1540282 1194080 891299 1662563 2556482 2114230 419930 -279131
17635 -279131 -76733 -313920 -73291 155803 79854 1107833 1857358 2008135 1558983 960130
17625 960130 58779 99324 942828 1122423 -297490 -1607332 -1200052 -358281 -350284 -1551446
17615 -1551446 -2892557 -3137118 -2266115 -1468113 -1127970 -786812 -171350 -527695 -1618543
17606 -1618543 -1142190 -352123 -774763 -507953 -66797 -116287 -429943 411344 311591 -721514
17596 -721514 -1350197 -963657 -846686 44220 1047140 1071052 84894 -491673 -553695 -159840
17586 -159840 212108 17468 -473378 -651213 461226 736911 105319 626212 1402543
17577 1402543 583128 217309 715604 862536 -29969 -1373550 -1467340 -955705 -912493 -862363
17567 -862363 -125249 771296 712114 150559 985516 1126061 835805 348502 -379648 105837
17557 105837 1164228 1312957 997960 590576 389321 617843 281268 -321147 -166781
17548 -166781 414223 920273 823996 113634 -4900 674 450824 1136449 1473199 1864655
17538 1864655 1906657 1391361 1438500 3011244 3692672 3021268 2433729 2324868 2694401 2037171
17528 2037171 1952040 2639344 2558288 1562072 1280330 681511 -585078 -633730 -171570 354487
17518 354487 342129 -456516 -686224 -739423 -864871 -1032499 -834223 -1136656 -1808724 -1699640
17508 -1699640 -1765852 -1191980 -685288 -280811 764503 1658379 1678554 1378652 722696 895195
17498 895195 1351675 829466 543633 349524 -215613 -827416 -489506 502960 212135 -1104514
17488 -1104514 -1787426 -1975751 -1184690 -628912 -291998 641076 1740817 1704083 47495
17479 47495 -1794267 -845627 246375 478316 116135 -744959 -939120 -918493 -1091385 -1339729
17469 -1339729 -1885559 -2372008 -2329071 -2382225 -2111106 -1377097 -549416 -315508 -802978 -740615
17459 -740615 -975309 -2119786 -2062715 -1667639 -1668882 -1880711 -1870005 -604758 227875 563956
17449 563956 352762 708110 2098184 1649806 364048 -516952 -73371 1474529 2520194
17440 2520194 2205898 778298 719673 1357691 1125765 1448202 1096088 818084 344300
17431 344300 77109 668905 1543851 1945028 2016064 1509502 539659 3769 -468554 -522007
17421 -522007 38725 1007510 1363263 922901 -115797 -1430412 -1412413 -1260921 -691126
17412 -691126 -608944 -424749 -423794 -1486575 -1675867 -1668109 -1823822 -1358905 -1538876 -1950340
17402 -1950340 -1629046 -308639 -411453 -1693467 -1208055 -198794 -899244 -1677809 -496433
17393 -496433 -14501 -956029 -1318581 -685833 -103712 -391625 -1132034 -1536612 -1261227 -1433500
17383 -1433500 -1737940 -1438058 -1794614 -2404249 -2511590 -2391993 -2781776 -2715176 -2960979 -3076915
17373 -3076915 -2337026 -1609576 -981358 -1097752 -1662141 -2112030 -1624762 -1103487 -1234694
17364 -1234694 -719550 -29371 -465145 -1181916 -1689592 -1992627 -1301798 -748637 -637448
17355 -637448 -499983 -1127118 -2033250 -1834081 -777231 427756 441034 -484720 -1782221
17346 -1782221 -2180752 -1532012 -1333969 -1486107 -1176705 -554490 -773164 -1134566 -623600
17337 -623600 -274567 -657351 -1464651 -1528978 -1121725 -495968 207466 251186 106459 495293
17327 495293 997406 1523095 1855584 1376781 1301757 1508148 2069174 1379607 520533 429606
17317 429606 224268 -177636 -300518 -305186 -443503 -483508 -644226 -1834674 -1387618 -246537
17307 -246537 -39958 -317228 -1497414 -2108847 -2312749 -1569116 -196846 1145741 1438877
17298 1438877 903779 1122226 1395759 1252346 1332167 854304 410167 92181 -449888 -554866
17288 -554866 -851578 -1416680 -1133989 151477 1176173 1026540 708219 280187 -597393
17279 -597393 -1302422 -1615128 -1680679 -1471231 -253633 854465 1295666 67870 -1868787
17270 -1868787 -2434634 -1867107 -1274985 -1685790 -2297056 -2330086 -2326373 -2380992 -1380787 -59573
17260 -59573 -657665 -1728492 -1620139 -1445039 -1066098 -146140 1394066 1544752 1560325 1532482
17250 1532482 1581223 1452152 1147588 1072658 59009 -1466656 -1744401 -1308497 -912635
17241 -912635 -707680 309276 785188 331037 414374 1040625 1447207 1050678 -93979
17232 -93979 -989519 -1161581 -1258499 -2406157 -2902732 -2027871 -1392963 -567397 81213 236879
17222 236879 71684 -309367 -687024 -1423001 -1156714 233620 1220118 1020158 -358101
17213 -358101 -1955336 -3250613 -3374411 -2393897 -1326795 -1102343 -1952065 -2271715 -1827510
17204 -1827510 -1239103 -799284 -687637 -638686 -686011 -172748 1203061 2359651 2571610
17195 2571610 1671903 763828 619356 -259403 -1185544 -851188 648441 2038590 2500379
17186 2500379 1475547 790268 196798 -78387 -570109 -1074858 -565782 -581776 -1247297
17177 -1247297 -1464946 -1228565 -1845543 -3032827 -4005953 -3681507 -2309918 -1540578 -1192843
17168 -1192843 -761133 -1132713 -1070109 -207487 -82849 -608811 -1005388 -984427 -314776 887171
17158 887171 2196505 2541925 1069151 -200455 119017 310760 275996 270062 752789 1223444
17148 1223444 1113969 865711 259265 -491993 -982579 -602686 204522 -126843 -1104018
17139 -1104018 -1447337 -1973211 -1971030 -2048066 -2052769 -2001425 -1661225 -1168489 -986619 -1175856
17129 -1175856 -467092 385866 -86225 -1172239 -1668094 -1409092 -1382453 -1158821 136383
17120 136383 1344866 1385487 581946 60338 203997 -216993 -260981 902265 797876 686511
17110 686511 875484 1091174 1355070 1267642 715542 -1069291 -1498754 -898567 -152286 1013998
17100 1013998 2028150 2383702 2675834 2171174 2332106 3337469 3857841 2544245 990193
17091 990193 454444 541311 782532 624352 -66244 -870925 -583692 237230 868657 1301098
17081 1301098 1718862 1707449 1055931 757786 225667 40498 408903 711819 282379 -978713
17071 -978713 -1637614 -764232 891256 2010331 1765569 2167664 3113297 2380584 1062272
17062 1062272 20566 -1187857 -2001372 -2157960 -2128992 -945242 1203549 2488410 2910834
17053 2910834 2239542 499245 350944 643712 305892 499986 804427 1828696 1831903
17044 1831903 1531548 2248571 2355410 1643172 1020927 -331871 -1368960 -335882 888292
17035 888292 1537724 1619914 1327156 1062272 942701 777452 387864 44757 -555418 -1576379
17025 -1576379 -1299203 -240308 -96368 -119504 -430784 -243314 9212 -141619 -583179
17016 -583179 -1208350 -1675794 -2057105 -2622526 -3089793 -2492090 -2263302 -2208664 -1844919 -873044
17006 -873044 587580 1818129 1513477 317264 -562986 -1045731 -1317586 -1640617 -988400
16997 -988400 689478 1418541 946990 316674 -354287 -1794934 -2022254 -1580060 -1091644
16988 -1091644 -109320 71586 -758443 -870468 -699761 -368489 -246355 -459204 -568908
16979 -568908 -116072 -56498 -375115 -1091294 -1716139 -1569559 -1368906 -1618104 -1657600 -1240557
16969 -1240557 -451521 1301220 2874415 3288515 2944440 2308681 1346989 90773 -880334
16960 -880334 -254309 507236 752328 1691415 1239444 -383847 -993382 -1055765 -1172798 -1982389
16950 -1982389 -1937502 -617886 210290 -5340 -1253541 -2525098 -3086846 -2173276 -556372
16941 -556372 -243809 -659506 -1160247 -1112842 -672302 -325499 -69613 745517 1700773 2035415
16931 2035415 1935412 1250660 1050721 1575197 1828689 1951511 2120597 2493118 2987093
16922 2987093 2104916 577427 146461 661072 438549 405203 116442 -160410 -877388
16913 -877388 -1108837 167883 -452497 -2006691 -2584069 -1782673 -1472689 -948025 -297934
16904 -297934 506702 452565 -49048 -1097192 -1860249 -1968860 -1981311 -955293 824605
16895 824605 3791696 4696729 3151262 1847009 1221605 383382 -64983 266667 639749
16886 639749 491365 647833 1243520 1043909 560710 377371 -354681 -1245416 -1235963 -611723
16876 -611723 -279099 -996552 -1369839 -1465910 -800165 -297025 -202498 961569 1656073 638310
16866 638310 -579762 -601313 -87292 -480454 -1480308 -1808992 -1272184 -670661 -112966 463287
16856 463287 607474 1533156 2534751 2168669 1744643 1707286 1824752 1993492 1262773 607834
16846 607834 171949 -733393 -842282 -519621 -144720 454683 769436 231781 -47683 -823097
16836 -823097 -2235769 -1680227 -1043451 -1511464 -1735872 -1163870 -876487 -1590648 -2626769
16827 -2626769 -2953984 -2538334 -1687613 -1048690 -936769 45667 1261178 1829308 2513140
16818 2513140 2912063 2176485 1224648 840736 893519 262724 -555522 -1039398 -1294204 -1461567
16808 -1461567 -946306 164187 1177691 724154 491283 1154182 1158908 371405 -265264
16799 -265264 -194022 610208 1306712 1632261 1656150 1210200 22870 -626588 620156 1263082
16789 1263082 386132 214530 1392150 1718743 1020639 -137975 -923401 -1296367 -1183138
16780 -1183138 -1034590 -768855 -768507 -649579 -180079 919360 1272895 765257 395835 953197
16770 953197 914164 539037 300949 304051 1076241 1492604 953758 389875 432199 1124971
16760 1124971 966215 342210 179365 1169071 1926176 1469139 657502 239664 1098711
16751 1098711 1450671 1660534 1985863 2381886 2395668 2642187 2379973 2622195 2599154 1209327
16741 1209327 270041 -118842 -200589 -163878 1215074 1772501 1552336 1287840 543879 272306
16731 272306 231566 -244607 -427247 -687216 -950511 -682251 -304034 -368518 -777378 -1087676
16721 -1087676 -1326165 -1524383 -1946146 -1212920 -582063 -1320690 -1799359 -1387182 -1275857
16712 -1275857 -1016029 -683549 -670397 -298271 494425 1568539 1870220 1227230 566432
16703 566432 373355 41996 287371 287126 -851001 -1437237 -2208862 -2997088 -2535968 -2012168
16693 -2012168 -1885805 -1459803 -586736 -619759 -587235 -1016803 -1610420 -1264234 -326035 -125483
16683 -125483 -1076404 -1269716 -868032 -861263 -1167751 -1140329 -1096442 -2115244 -2710587 -2268406
16673 -2268406 -1360792 -246705 1227253 2448707 3126480 4036746 3612643 2208783 1918809
16664 1918809 957874 -695316 -1349134 -1064678 -592095 -334757 -380845 -380169 -714068 -1926579
16654 -1926579 -2386082 -1914183 -962337 512027 1477344 1067146 722729 479969 493918
16645 493918 627425 650560 442881 -236492 -738742 -575672 -167287 -133673 -341357 -296379
16635 -296379 -441294 171786 102777 561714 144170 -765855 -803803 193777 632330 721201
16625 721201 1716439 1376875 603410 -629726 -1209235 -822807 -603959 -799094 -1011202
16616 -1011202 -1474695 -2227160 -1743462 -979373 -710512 -924256 -1689592 -2230879 -2159679 -2009202
16606 -2009202 -2010973 -689810 549450 1101162 2178353 2696908 1153842 -148846 -284844
16597 -284844 -578293 -1349332 -2275730 -2937601 -2776015 -1609261 -212188 827504 1107424
16588 1107424 1935317 2134973 173205 -1629175 -1818681 -777473 1052733 1669034 1114078
16579 1114078 -28813 -14589 -773386 -2638999 -3996437 -3787835 -3001126 -2103289 -1136472
16570 -1136472 -307980 862375 1389837 463799 -386257 -524279 -777216 -1272134 -1516420
16561 -1516420 -632501 727866 1441646 1510955 919538 -45965 -636667 -948467 -662519
16552 -662519 -195108 595990 1512661 2321765 3223288 3425703 3265283 2708554 1504487
16543 1504487 1111458 1106697 1306724 1394798 472617 237243 -115091 68242 436628 33072
16533 33072 -76443 -91566 385233 1057038 1765790 2549484 2610430 2025469 2171319 1868504
16523 1868504 1190842 766622 335840 835125 1850435 1194238 -520111 -835276 -309857
16514 -309857 -268706 -443630 -1021477 -1914131 -2015603 -2642980 -4109766 -4841906 -4440852 -2690329
16504 -2690329 -739986 -473375 -842612 -301900 823149 1311211 863259 -170214 -730513
16495 -730513 -26972 507527 434413 -156369 -355145 37636 -324630 -1706049 -2247544 -1674994
16485 -1674994 -1393609 -1463651 -602077 -169226 -336854 277358 2274214 2817026 3409176
16476 3409176 4000642 3017698 2092805 1531927 1733799 1945728 1539869 949843 924434 730523
16466 730523 -311765 -927155 -794558 -1038274 -1410393 -2064160 -1755710 -1569946 -1984595
16457 -1984595 -1382880 -612688 -644106 -1220511 -890451 63549 866249 -53995 -1933101
16448 -1933101 -2392998 -1981698 -1285654 -767822 136892 1403183 2106067 2951443 3000718
16439 3000718 1888104 1024438 897795 1373616 1462092 1370650 675176 -685578 -740377 406892
16429 406892 1159424 1715894 2887590 2908532 790731 -532074 -500989 263103 742393
16420 742393 543684 -792883 -2164217 -2237670 -1752757 -470393 663433 784464 220120
16411 220120 -700847 -1420243 -1834368 -1667418 -1759037 -1895740 -998176 -504212 179579 51765
16401 51765 -1260838 -1796149 -1240661 -663615 -758295 -1003887 -469666 -630702 -1010675 -1857646
16391 -1857646 -2881730 -2577173 -2345144 -1404513 -250468 728460 1759064 1261765 -135087
16382 -135087 488177 1852319 2043616 1934616 1177597 129080 120751 410942 572439 2095421
16372 2095421 3009605 2101226 1173706 698324 170138 -237096 -831972 -1604547 -1394830
16363 -1394830 -99182 536550 47975 -865025 -1112565 -1621297 -2550083 -2625630 -1523394
16354 -1523394 -760975 12602 463251 -619849 -1604885 -1226312 408187 1034501 277918
16345 277918 -384523 -607545 -734917 -827080 -1111505 -1221346 -654091 -230947 -249537 -450417
16335 -450417 -1379525 -1680183 -1320079 -519830 184119 433625 598061 810248 1072943 1140611
16325 1140611 1260220 1775512 1751065 1337077 1019715 -29579 -703481 -880212 -1842651
16316 -1842651 -2313856 -1620092 -1143752 -446556 104582 -156570 -528037 -146277 318916
16307 318916 221977 -237408 -490864 -71519 -483700 -1342347 -957561 417062 1147850 168329
16297 168329 -1292022 -1413988 -387903 776924 2042449 2958664 2687257 1422254 444318
16288 444318 -63351 -322183 -817097 -781127 -850446 -1553176 -2056241 -2822595 -2575695 -1939919
16278 -1939919 -1949320 -2325164 -2641686 -2887979 -1961611 -1189541 -2399499 -2891226 -2556292 -1478050
16268 -1478050 -476031 -60528 238121 -559779 -1159251 -43218 955950 1701076 2430833
16259 2430833 1426095 -634672 -1664898 -2221866 -2212198 -1626492 -1078338 -1716148 -1947975
16250 -1947975 -844964 -52621 -646519 -910487 -1512406 -2368021 -2094479 -1562601 -2101592
16241 -2101592 -2244112 -1363662 -525939 -64618 -180719 -252201 -97113 -663822 -2075961
16232 -2075961 -2532178 -2635898 -2512606 -2209985 -1675825 -1451857 -1284433 -1349806 -1360578 -1226375
16222 -1226375 -1220435 -837052 241170 919613 350518 -378547 -882008 -880863 313551 1888458
16212 1888458 2478248 3037767 3470597 3374025 2674820 1718046 230328 -391920 -614975
16203 -614975 -725711 76401 797674 537215 -434580 -413288 -96466 -381856 -770024 -1479986
16193 -1479986 -1470655 -1274686 -1043430 -793692 -245799 196382 -22154 -493344 -1076987 -764982
16183 -764982 -62731 617295 1125413 555159 -620275 -1831770 -2259235 -2047083 -1228869
16174 -1228869 -792035 -1176110 -998980 555463 2396284 2808475 2190024 1810853 1960647
16165 1960647 1776633 1544010 1739791 2174071 2031659 1285769 694111 1140492 1610257
16156 1610257 1376503 1156134 873977 488644 319276 -211469 -1356076 -1486349 -1006629
16147 -1006629 -818866 -419334 11572 486572 144615 -101589 -178147 90199 1126984
16138 1126984 2343311 2913782 3217499 2757915 2545180 1886020 822032 467764 492678
16129 492678 399304 764484 1411069 855317 448278 1173869 1621994 1318131 -122146 -814714
16119 -814714 -642607 -528433 -486525 -65166 770439 1532399 1982464 1641295 1193075 1839057
16109 1839057 1520261 135086 -919103 -739628 498255 1414007 766660 -185538 -769070
16100 -769070 -1149367 -1183526 -521432 945512 2194463 2153983 1686772 1168149 209756 -1140391
16090 -1140391 -1384303 -801677 -1523518 -2122820 -1301913 -817100 -1835727 -1849066 204589
16081 204589 1192320 1026213 1075966 964099 -186680 -1501672 -2646604 -3053656 -2149822
16072 -2149822 -387043 942097 1289706 464594 -640122 -1282362 -1225445 -863988 -1132933
16063 -1132933 -1564552 -1238916 -867298 -961970 -667502 434240 627786 1352576 1901362
16054 1901362 1325695 221214 -118633 189261 626172 1061850 1315853 1423193 1558806
16045 1558806 1183256 196496 888228 2207958 2761851 2009011 916348 451946 882356
16036 882356 1495302 1667597 1479984 1416544 809068 184622 -253862 -921739 -1257356 -1208692
16026 -1208692 -1283560 -1562000 -2834495 -2923153 -1592619 -233822 623624 772836 668087
16017 668087 1573910 2764138 3127695 3281144 2226141 1354730 692191 258423 598309
16008 598309 1312717 2086248 2330206 2875867 2605931 1452684 -30056 -1234902 -1020796
15999 -1020796 171277 1169699 2008298 1912240 1414586 380421 -1222465 -1935384 -1734371
15990 -1734371 -1664251 -1820329 -1607146 -285253 788985 1415510 1091282 213767 7715
15981 7715 -301241 -1224914 -1391331 -1755606 -2138777 -1029930 -567546 -578087 4264 -876328
15971 -876328 -1499966 -929537 105521 746483 670893 334399 -50070 -1137136 -2398473
15962 -2398473 -2484099 -1202043 252635 760875 730353 1347539 2045166 1726941 294346
15953 294346 -1201159 -1320990 -441152 495739 547119 -28293 -1399234 -2483028 -3053333
15944 -3053333 -2362550 -1192574 -483922 -10564 712724 1121387 1838314 2147772 1800852
15935 1800852 1299482 238750 -549444 -747808 -51899 339718 153743 -695361 -810533
15926 -810533 300359 736990 424719 142289 -151500 -7732 848173 1552192 1729091
15917 1729091 1137868 743424 912254 1153656 674646 677390 389504 -79754 327488 1702068
15907 1702068 3148251 3050631 2773130 2249634 1404397 324110 -387630 -571560 -183033
15898 -183033 -67736 -139021 378107 834434 1076538 111698 -305632 877302 1579040 1797808
15888 1797808 1626911 1064354 209548 -65802 -598678 -796269 -480148 -115988 -167125 252063
15878 252063 52853 151735 1203474 2863221 2693239 1211643 186209 -786251 -956175
15869 -956175 -1064201 -1020994 -1387433 -1504223 -590416 -770840 -1955280 -1892502 -1639284 -1257029
15859 -1257029 44883 1001282 1232867 775924 -518581 -1729566 -1132265 -978055 -2662540
15850 -2662540 -2759972 -2225451 -1219672 -466956 42465 888574 1023722 885628 889760 1456259
15840 1456259 1364393 629642 267639 -709169 -1695667 -1416633 -1103788 -151666 361597 318053
15830 318053 719226 527192 683727 1321099 2101406 1930170 1199151 832568 1600264 3273738
15820 3273738 3278588 2004800 1402351 865130 211041 -1026917 -1937176 -2415565 -3239715
15811 -3239715 -3589687 -2352823 -929284 -370628 -553095 -556737 371912 1421116 2227884
15802 2227884 1479424 158937 -603786 -901278 -850486 -779579 103305 848485 1229906 857917
15792 857917 1628065 2043569 1580818 1124846 276870 -6753 1202217 1874535 1338242
15783 1338242 959505 527517 135468 -352146 -168125 234123 566302 413416 569142
15774 569142 495081 580199 575849 490822 792281 1820435 2073973 3063726 4586262 4408299
15764 4408299 3145098 2345999 1623512 920906 1125340 973392 -76816 -831594 -607145
15755 -607145 -824747 -1390266 -2159032 -2942437 -3569328 -3084221 -2133924 -1463131 -783043 -993493
15745 -993493 -1802326 -2417418 -2374747 -1793222 -758550 392262 354408 250164 777593 1157300
15735 1157300 903811 16864 -969570 -1388286 -1545351 -1633634 -2099694 -2734958 -1756101 -993710
15725 -993710 -299018 757496 1075339 935903 237944 256152 767571 -143439 -1163101
15716 -1163101 -1338050 -274995 1207838 2035663 1305817 756212 828643 1046128 761169
15707 761169 630102 901787 1440759 1944010 2455738 2216806 1357168 994277 1652480 2937597
15697 2937597 2958903 2536575 2076326 981574 -137796 -204533 991118 1932492 1549044
15688 1549044 2046510 2034739 695467 304555 668622 1361291 2512704 2672867 2657402
15679 2657402 2238657 1198099 36821 -225505 -230022 -102320 659986 532608 65035
15670 65035 124432 672576 969049 1348708 2522042 3128660 1902896 195028 -781174
15661 -781174 584369 2902901 2914605 1755461 2191098 2634953 2839302 2630766 1461361
15652 1461361 23518 -1754822 -2231628 -787249 40358 -415596 -467686 -676234 -1304377
15643 -1304377 -2168190 -2741995 -3333215 -3190528 -3163074 -3759505 -3860085 -3465660 -2659828 -1740823
15633 -1740823 -1507241 -1451479 -1406316 -1066314 -492374 497472 1524768 696550 -270136 -863352
15623 -863352 -1755983 -1927881 -1145407 -636052 -318740 -17687 493883 930460 324946 -219531
15613 -219531 -684508 -536237 -662058 -712762 -282602 -396032 -819013 -882424 -298742 333046
15603 333046 -222351 -630805 -1092149 -1295327 -568112 594846 1189173 865484 736189
15594 736189 228057 -965313 -1148326 -1287018 -1854857 -2466150 -2208391 -2100454 -2312906
15585 -2312906 -2405510 -2989943 -2923462 -2883814 -1970741 -481501 1192370 1906897 1049785 -103719
15575 -103719 -761327 -906138 -596541 -331669 -1015779 -924524 -192465 -134265 219861 932516
15565 932516 1249816 1433476 2124471 2970560 3013551 2907823 1768127 508038 526893 1323556
15555 1323556 1621264 1636940 1161110 531033 77228 -325428 -925333 -917942 -107789 155871
15545 155871 378518 279114 -403789 -15954 991212 1528459 1521130 1684268 2012414 1935551
15535 1935551 1184900 430024 554228 1334721 1281829 -455757 -1826432 -1877577 -1864970 -1804111
15525 -1804111 -706936 -93135 -333916 352419 780009 -395323 -1225167 -1874073 -1764954
15516 -1764954 -945570 -138290 172 473098 1066428 653662 183347 -295165 -850127
15507 -850127 -1395464 -1025825 98909 262495 512878 1342319 575590 -848360 -1317994
15498 -1317994 -837426 773193 1545993 429693 -976221 -2027575 -2636445 -2089515 -1349625
15489 -1349625 -370727 96169 -614054 -1055766 -946256 -1233908 -520234 781767 452267
15480 452267 -721818 -1123555 -719479 -1415142 -2280933 -2415119 -2562541 -3143218 -3796858
15471 -3796858 -4490256 -4315219 -3425948 -2100574 -1642752 -1651308 -1332153 -1274559 -1455963 -1294193
15461 -1294193 -611670 240508 364339 318509 367635 918965 587688 -214515 -572885 -1397958
15451 -1397958 -1998999 -1389560 -273538 400565 628216 40620 -1359236 -1666708 -906679
15442 -906679 541282 1129376 1132129 1513482 1462253 286837 -1015459 -1267956 -772380 599699
15432 599699 1678411 811688 -457383 -873576 -780656 -1082013 -1946328 -2653838 -3575474
15423 -3575474 -3667310 -2959359 -2705937 -2820895 -2328145 -1858537 -845548 162461 1030017
15414 1030017 1148605 246152 -1191162 -1432372 -1519604 -1592811 -1617830 -1577878 -1150801 -799015
15404 -799015 -970384 -1177952 -1316595 -1016695 -674843 -729945 -956162 -1812770 -2984783 -3117774
15394 -3117774 -1545666 -66696 72045 53712 913914 1669922 1630544 1149535 1411971
15385 1411971 1278877 -145770 -1491527 -2613837 -2622202 -2359700 -2922369 -2217631 -789185
15376 -789185 131168 593446 -277013 -1105482 -1631267 -1978027 -1631226 -732259 -387249 55234
15366 55234 742653 351311 -1084905 -1730351 -1709962 -863394 -242343 231428 1054878 762061
15356 762061 -299706 -660860 -813053 -847470 -591445 -133682 -42109 -48920 858138 2239798
15346 2239798 2889238 2363996 1867546 1391476 -89350 -1659697 -1934276 -1091850 -230634
15337 -230634 237709 529397 680985 1080745 2099107 3033883 3246286 1679123 -389464
15328 -389464 -951835 -153899 -356885 -202273 544183 975708 1257859 713190 256973 1328185
15318 1328185 2531074 2925805 2414546 989489 44929 165826 1208038 1479541 199162
15309 199162 -722426 -1766755 -2673740 -2774560 -2459124 -2863456 -3854001 -3810576 -2107344
15300 -2107344 -476544 -345844 -807163 -703556 1433130 2963444 2556944 1368624 593392
15291 593392 943396 1188720 896810 292618 -488286 -879068 -1586562 -1830030 -631470
15282 -631470 110521 -233780 -73247 -344071 -183290 1155501 1359821 515066 563575 423767
15272 423767 -82452 -965866 -931982 -574859 -1068876 -113661 1737452 2882506 3096934
15263 3096934 2642772 3225185 3526989 2975343 2358329 634764 -1068194 -1350433 -208171
15254 -208171 269884 210071 -542152 -302360 -365307 -600124 -449329 -1044536 -1712182 -798996
15244 -798996 763342 952084 1020721 1130922 1144003 932993 616402 -656779 -1106781 -1143001
15234 -1143001 -921596 -627347 -124512 76090 -781542 -3034941 -4388732 -3446959 -2250543
15225 -2250543 -919748 -318365 893086 1198490 484359 1263460 2042989 1586161 1422144
15216 1422144 2474720 1873574 337209 -750875 -412425 -620742 -1024914 -392835 79620
15207 79620 736 -97724 -277744 -541399 70158 449170 623930 363947 -554542 -1187695
15197 -1187695 -489198 689422 423216 -543982 -560027 -37956 -73209 70500 -269723 -744501
15187 -744501 -869996 -1225076 -470261 430887 1764634 1957081 1445150 1371018 1286076 117961
15177 117961 -796280 -520520 780661 2163605 1728703 -206039 -1193680 -750029 -859586
15168 -859586 -1365728 -1275073 -1050604 -1295131 -1146501 -359904 545844 1829451 3009738
15159 3009738 3519937 3404936 1452006 -202554 -661857 -789078 -226223 950263 546604
15150 546604 -331623 -614765 -482876 -343241 -120688 -201142 -299191 525930 1355258 1360567
15140 1360567 997607 -39014 -304663 528635 784770 -138304 -1131343 -1412803 -2026705
15131 -2026705 -2853192 -3083695 -1927879 -708327 598954 993926 -295475 -1001051 -890107
15122 -890107 -777349 -1056342 -352498 380177 -350661 -1348492 -1102088 -625533 30185 263767
15112 263767 -141826 -889386 -1898231 -2454042 -2875433 -2295897 -1722324 -1204511 -206946
15103 -206946 572228 684021 382490 48636 -438090 -800464 -959043 475967 614227
15094 614227 -864346 -2085410 -2643657 -2421255 -2650776 -2723872 -2164398 -1253131 -679800
15085 -679800 -1387788 -2151148 -1821007 79183 1724777 2290058 1882820 1603493 1352833
15076 1352833 694173 811298 1222968 1167799 1789301 2071345 1194942 11036 -485569
15067 -485569 -251971 -103153 -58681 768133 2052696 2070775 878033 -668959 -1450925
15058 -1450925 -693892 -363804 107836 2238708 4011580 4088736 2798755 1731923 1166890
15049 1166890 549426 19816 -898992 -1684907 -1553730 -777195 -224386 509296 1013346
15040 1013346 385615 379414 781481 724672 -115050 -1014393 -202190 544076 216452 -162630
15030 -162630 193475 1835459 2523342 1339590 184144 -143123 -660298 -650205 -810492
15021 -810492 -875755 -1239237 -1774519 -2187246 -2437566 -2353660 -1093723 110184 -234352 -1278136
15011 -1278136 -1738957 -1252563 230607 1523805 1378155 610058 -29759 -853243 -1345068
15002 -1345068 -1243361 -241586 785733 400222 46598 -52240 780550 1091335 114102
14993 114102 -1005944 -2188705 -1978094 -1014306 -202656 394686 1314923 1299844 742491
14984 742491 -356225 -960844 -906115 -19345 246938 -777202 -1105403 -185409 474099
14975 474099 119458 -1597751 -2766312 -2076313 -1232965 -401890 541942 866252 333063
14966 333063 -1007509 -1847336 -1688842 -928604 -363122 -718626 -1408800 -1430079 -276138
14957 -276138 584510 1628033 2688316 2586623 1605514 1617538 1028121 -138077 -891185
14948 -891185 -1018947 -1103473 -1443749 -1357241 -1559275 -1284962 -286309 -901693 -1714727 -1514531
14938 -1514531 -353492 431765 -716727 -1872746 -2699012 -3624342 -3664204 -2614360 -559776
14929 -559776 886634 1121186 -609217 -1600869 -1682302 -2600277 -2982839 -2995220 -3047541 -3170189
14919 -3170189 -3085999 -2300841 -2057724 -2113136 -2364535 -2765578 -3116724 -3904928 -3997827 -3368969
14909 -3368969 -3081538 -2696225 -1939391 -1194035 -697913 -1676223 -2089987 -2260039 -2291807 -1832688
14899 -1832688 -1661410 -2005378 -2460298 -2313980 -2515685 -2273992 -1384364 -799358 -272339
14890 -272339 -358673 -657246 -1222951 -509105 1228059 1086857 58117 -1135196 -1705536
14881 -1705536 -1161852 -112241 591321 803265 1294164 1378925 900072 1219477 1797254
14872 1797254 1340402 951307 949484 1089856 1323602 1059377 587691 414310 534734 843754
14862 843754 -126161 29318 981226 1548331 1098698 14307 -611671 -919998 -780002
14853 -780002 -579814 -376410 -29725 103780 573509 508602 -340114 -539096 -448582 -452526
14843 -452526 -312945 -190663 -703659 -817398 -1028963 -1127122 -1287789 -1053227 -977787 -1577536
14833 -1577536 -1078135 -156939 178877 736601 999028 495028 695338 720148 301239 -1167638
14823 -1167638 -2322745 -2086297 -2127626 -2354671 -2102311 -1062920 -1029937 -968202 -1837762 -2715928
14813 -2715928 -2233009 -1658098 -453888 46098 -214428 -12618 -97251 265319 1327434
14804 1327434 1264716 608446 295334 209281 116842 -117780 -870098 -2102757 -3252053 -2844289
14794 -2844289 -2200468 -1689444 -25244 1976748 2937028 2314292 1618489 1107504 408181
14785 408181 252666 -196536 -591387 1846 779278 867847 399026 390867 174441 321376
14775 321376 1574204 1281969 441159 -18531 -869855 -1395957 -1270977 -264591 476368
14766 476368 74191 -623340 -1571632 -2244848 -1964169 -1021889 561434 1580025 2358883
14757 2358883 2898949 2776584 2076729 1385270 1377176 1785665 2325135 1617495 772556 918896
14747 918896 1718851 1488858 683515 662844 1068722 634621 -558234 -357978 886383
14738 886383 1132297 -275654 -1734180 -1449968 -294505 291241 426581 790605 1326791
14729 1326791 1823494 1837285 2944446 3644372 3524306 3787678 3667776 3055627 2164765
14720 2164765 869874 482531 1089214 1378685 1897161 2254744 2666862 2635581 2597673 2210677
14710 2210677 1175584 362125 418705 1404555 1376466 466317 624016 2096276 3024359
14701 3024359 2524510 1015980 -404404 -178975 119941 -98997 474242 1095813 195550
14692 195550 -499338 -90608 763228 787676 647333 337349 -90124 -853560 -1253756 -1440913
14682 -1440913 -1590029 -1393799 -1430614 -1016024 155384 1849085 1801976 365286 58105
14673 58105 -403641 -331123 203429 541490 1407379 1636353 1514982 1465659 1498982 1881824
14663 1881824 2989440 3113292 2609852 2120675 1246523 238844 -200187 187590 666523
14654 666523 846493 1324272 2122692 2139133 894577 -87764 -100882 -57579 109964 -44728
14644 -44728 -119698 -273187 -563798 -1087472 -1764990 -1723301 -1464405 -763465 -381167 -219084
14634 -219084 666825 1870795 2848770 3494044 3043481 1654133 164536 -651041 -565087
14625 -565087 -889763 -1298741 -1466061 -1500450 -1685073 -1364592 -719162 -439321 -80114 362644
14615 362644 358055 553411 179073 -78579 -210962 -519454 -610314 -587391 -139891 888290
14605 888290 1267195 340892 -74725 382522 462340 281520 849019 1367922 1251364 1369246
14595 1369246 1970849 1330666 131571 330828 1313410 1452046 1124741 976470 1121121
14586 1121121 501328 -171172 -261426 -746056 -1759339 -2436596 -2498265 -1971425 -893727
14577 -893727 -316842 -397185 550818 1682202 2154013 1849123 1556888 885016 -123505
14568 -123505 -749208 -1012687 -1237588 -2154617 -1995371 -1070244 -637220 -625658 -438647 242188
14558 242188 602523 1281751 1808612 1205533 -116059 -1422354 -1943457 -1421968 -1095676
14549 -1095676 -1087617 470448 1046542 254630 -119043 -487785 -775509 -1041809 -1987887 -1310478
14539 -1310478 476387 1681164 1608086 810191 -530847 -2642809 -4093336 -3713179 -2473501
14530 -2473501 -1607620 -1238855 -1003290 -1668957 -2491851 -3093900 -2970895 -2847670 -2437792
14521 -2437792 -500023 587208 839094 1875101 1614647 251709 -345725 -355762 -746150
14512 -746150 -1077949 -776387 316123 572940 -110824 -391892 -1125831 -1576743 -1533788 -1966267
14502 -1966267 -2203725 -2491038 -2241534 -811739 -182874 -1837 1016962 1839598 1956063
14493 1956063 2361522 2304479 1980606 1331609 938075 1356349 1427432 1652384 2215747 2193189
14483 2193189 1409474 587691 568585 838249 1998429 1391831 -356317 -849623 2851
14474 2851 887279 1017648 1371817 1591331 1935533 1882932 208625 -1681576 -2532161 -1921904
14464 -1921904 -1002245 -397404 -72063 -353200 -58677 1041098 1424683 730556 414811
14455 414811 671186 791611 -215177 -2041679 -3406627 -4068365 -4523930 -3606742 -2382262
14446 -2382262 -1575232 -1255855 -958258 -1035893 -1794158 -2502655 -2469903 -2284509 -1911085 -2120713
14436 -2120713 -2505616 -2340410 -1635302 -1797719 -2454264 -1667015 -579409 -792955 -1908623
14427 -1908623 -1835437 -1856081 -2296469 -2121819 -1552475 -1097019 -549844 42622 688064 1353642
14417 1353642 950425 826116 1014168 61529 -388884 -511476 -332593 292639 281220 -641884
14407 -641884 -916881 -409101 -339977 34403 1329212 2798601 2874551 2655287 3243222 3729247
14397 3729247 3238093 2608758 2465487 1611834 300788 -512343 -855619 -1184128 -1924248
14388 -1924248 -3447316 -4210517 -3159612 -2020804 -1071020 -132617 -225881 -1292221 -1323924
14379 -1323924 -462981 -497073 -801999 -1257224 -1788831 -1490849 -838131 -349448 -890331 -1022567
14369 -1022567 -133554 -471368 -855341 -524538 130272 271018 688864 426046 -36734
14360 -36734 -62315 126535 485585 888277 1516105 1251535 -409191 -864895 442051 66702
14350 66702 -1000341 -711774 -119774 23060 122798 416914 139766 52539 -151655 -21268
14340 -21268 605027 1401141 1476071 1313998 948296 -164832 -963353 -880290 -639549 -900267
14330 -900267 -1549870 -2120711 -2105279 -1682001 -1308864 -1266141 -1497915 -1767331 -1139451 -471102
14320 -471102 -709823 -1095582 -903697 -811864 -867071 -153964 548761 737695 573114 203021
14310 203021 -427786 -1071508 -1922123 -1861774 -1433908 -1312642 -1491859 -2335978 -1833921 -202045
14300 -202045 458472 111974 -788585 -1148442 -113545 1056372 1435915 1793024 1505556
14291 1505556 991391 1434889 1419211 731551 445882 255923 -293159 -1318721 -1333645 -448410
14281 -448410 -709884 -1307996 -1677895 -1442119 -281194 1037445 453717 -752916 -1025012
14272 -1025012 -1826328 -1748066 -579034 687958 2090205 2058694 1776977 1733557 2217513
14263 2217513 2234493 2162839 2369274 1537565 1345852 1965785 1337952 1334973 1446387 1409126
14253 1409126 1923281 1635469 664733 -300404 -1236794 -2145715 -2054475 -2292828 -2322239 -2060382
14243 -2060382 -2135551 -1306174 470375 581829 81347 48355 688297 1848454 2238834
14234 2238834 1677196 1287234 1788922 2113307 1541681 398785 -775623 -911486 -663710
14225 -663710 10993 230521 -975640 -1218607 -1234643 -1005547 -236363 116510 46404 163571
14215 163571 255686 659810 372921 -862266 -940307 -848544 -524866 129223 883643 1358885
14205 1358885 2259981 3180149 3653705 3878496 3361382 2118870 1880526 1485851 -223538
14196 -223538 -1718670 -1487429 249737 472839 -672781 -923313 -384398 -114095 -232567
14187 -232567 -518150 385928 1542459 2322632 2000329 1653903 1928459 1462726 908141
14178 908141 431033 -274234 -1107436 -1694666 -1659914 -807395 60398 -633720 -1364004 -1723191
14168 -1723191 -1359468 -1827872 -2789388 -3286488 -2801709 -1862035 -1075321 -508945 -583809 -1003935
14158 -1003935 -1670948 -1124509 261318 986946 1350319 1362670 1094640 136354 -358934
14149 -358934 380106 919499 1081544 1480980 1714084 1002190 547519 -123414 -360602 772930
14139 772930 1423024 1408424 238330 -962856 -508365 491264 558002 311847 208967 913482
14129 913482 1828399 798096 16193 -253730 -128727 -724016 -1152493 -1159351 -724188 -317588
14119 -317588 118654 473561 8626 -922370 -1381193 -769516 -163504 -125431 246667 -105674
14109 -105674 -869376 -1076185 -775033 -713399 1313 1497618 2051268 1833396 1001321 600753
14099 600753 870164 1770449 2565667 2184083 1432418 681872 -418932 -874130 -731642
14090 -731642 -532569 -643878 -69964 562794 1254938 721442 -164911 -547282 -1131068 -974569
14080 -974569 -61178 727448 1257268 1037845 1361683 887788 -270508 436774 -89928
14071 -89928 -1418667 -1802489 -2381673 -1854987 -101992 537982 305716 570282 1783376
14062 1783376 2912066 2273939 1373531 899133 -182178 -1041389 -1291493 -1013361 198903
14053 198903 1074167 1589029 1195741 245148 -670054 -1431750 -1295450 -817451 265142
14044 265142 1476323 1333866 -443222 -794113 100854 -193589 -181293 30299 88798 927812
14034 927812 1744332 2062085 1411810 561451 333472 -111727 -415184 -681218 -1187387 -1382670
14024 -1382670 -947096 -415255 1044190 2159340 2083698 1318539 859260 787249 1663485
14015 1663485 1617969 -95507 -2618237 -3583767 -3360718 -3153676 -2168862 -457228 864752
14006 864752 189405 -278857 269218 441861 -171894 61651 482725 -198877 -115519 1008802
13996 1008802 884470 -23124 -1439543 -2228025 -2315378 -1851652 -1155768 -1749374 -2702694
13987 -2702694 -1795257 -667708 -911590 -1284446 -374983 -507056 -1027252 -1625831 -1754051
13978 -1754051 -1403565 -695877 23919 -94168 -69164 246076 488709 19144 -593143 -1007760
13968 -1007760 -1660667 -2255109 -1937649 -644836 580679 1147932 864462 629577 671879
13959 671879 -20347 -992136 -1227679 -285890 1371480 1948354 1693737 1996323 2498657
13950 2498657 1715009 1199746 1593728 370234 -1958274 -1771991 -773504 153301 156451
13941 156451 745585 1532302 1304203 1438002 1265595 502031 -538910 -139249 171574
13932 171574 14538 -1199398 -2652741 -3051222 -2476134 -3218765 -3850918 -3472367 -2817718
13923 -2817718 -1815095 -401734 426215 262993 -625643 106490 980918 608588 218647
13914 218647 -408454 -319494 -364929 -350365 -214717 206326 463879 -875613 -1477677 -629655
13904 -629655 123020 1195654 2007542 1184067 -581577 -781919 -296328 -733000 -931860
13895 -931860 -747903 -551398 -624669 -980642 -2156431 -2737557 -2473490 -2470834 -2208952 -1834842
13885 -1834842 -929593 -58164 122717 197794 114363 -6912 -626450 -1209304 -927220 -582167
13875 -582167 -376790 -132450 1185066 1430346 1259791 1463110 1425546 1431701 262268 35694
13865 35694 656983 1382879 1704791 2169376 2311891 2015890 2352251 2645917 2205719 1193477
13855 1193477 1012043 1737964 1511205 521830 -337001 -344237 -53096 387904 1214132 1961503
13845 1961503 2528543 1938502 1149578 1506368 1191862 805484 953537 1416028 1907451
13836 1907451 1875446 1680303 1320197 691080 331004 -278271 -356986 162205 370333 -231594
13826 -231594 -972152 -872538 -307514 -12242 143741 90068 126466 236616 61458 -1100714
13816 -1100714 -1569092 164606 1260383 974014 446543 -161420 -473767 -774572 -618388
13807 -618388 728007 1120146 249103 -92586 606338 815275 -433761 -1691506 -1469826
13798 -1469826 -883442 -624287 -1159327 -1257750 -1044197 -882255 -1297183 -1688978 -1284343 -1519350
13788 -1519350 -1584729 -1691880 -2450522 -3091703 -3614184 -3301341 -2655309 -2471901 -2806676 -2759433
13778 -2759433 -2348193 -1160562 -535942 -787929 -8302 1205655 1831143 2327950 3334866
13769 3334866 2519144 508132 409246 790791 1175914 1826949 1333306 722156 1853094
13760 1853094 3315503 3766268 3661674 2809455 2027607 1634884 1187933 527025 -408593
13751 -408593 -1036636 -1482638 -1107935 -270341 -583796 -652747 -1157293 -2017838 -3210921 -3930726
13741 -3930726 -3074759 -2184571 -2019356 -2155453 -1825091 -1914555 -1155119 -886305 -1544629 -1533016
13731 -1533016 -1407832 -1489658 -1066158 -792247 -626347 -1006439 -716238 335464 1019110
13722 1019110 753146 855954 526161 -480708 -1071551 -1106939 -299871 228640 -265378
13713 -265378 -378249 728650 2554709 2950516 2479735 1333480 65531 -826330 -1044454
13704 -1044454 -252465 200376 -582092 -1200092 -1465973 -1009461 -132758 -740000 -1068859
13695 -1068859 -1445734 -2329902 -2922257 -3198661 -3021613 -2550010 -2061908 -1912751 -1070626
13686 -1070626 -782179 -1409489 -2021931 -1982192 -1721439 -1459664 -1314122 -1942198 -1618984 -916042
13676 -916042 -789899 -598144 85935 1411884 2772432 3258048 3231484 3608293 3519409 3209925
13666 3209925 3094041 2391016 1262097 -22128 -216436 715489 509299 -65002 -444202
13657 -444202 -1614624 -1516307 -1691748 -2146036 -1898659 -1329104 -589437 100327 569483 -89877
13647 -89877 -713766 -2274 14958 -302534 -138349 409378 674118 736319 817221 1402533
13637 1402533 1155483 -54830 -1320577 -1615131 -1275240 -459609 199379 649175 982278
13628 982278 1052834 590510 -622898 -1992099 -2277426 -1395855 -730388 499311 -252363
13619 -252363 -1194567 -1050363 -737201 -250450 -200844 -355273 41982 3646 -920563 -953173
13609 -953173 -135599 762859 1257805 1171273 1914510 2255182 1796768 1632422 1206626 898774
13599 898774 1120143 1199557 1133776 1573172 1739864 1435337 1676684 1928326 1643609 1124524
13589 1124524 1170913 1380838 1500015 1479420 534414 -638415 -1158172 -1266430 -1892093 -2019853
13579 -2019853 -2558381 -2961886 -2811628 -2061959 -1092018 -1171117 -1428916 -375359 1179534
13570 1179534 2442539 3103164 2539101 2125271 1683314 1250049 900348 565462 182594
13561 182594 -380869 -1524336 -2110704 -2657540 -1916135 378390 1868055 2294403 1763739
13552 1763739 640425 -865032 -1700874 -2082582 -2690093 -2813279 -2220747 -1910063 -1696841
13543 -1696841 -1650877 -2107702 -1740288 -1910259 -2808028 -3213813 -3129173 -2711271 -2532582 -1900474
13533 -1900474 -1956138 -2228020 -1815801 -1694737 -2194546 -2594642 -1777582 -886990 86209 1154942
13523 1154942 1414282 1994767 1973494 1007685 -901792 -1757139 -1554749 -791884 -1082681
13514 -1082681 -1500045 -1474722 -897807 -475667 -143358 1174801 2144444 2376876 2693988
13505 2693988 2889517 1740408 -39054 -1021156 -909556 -368036 338893 506454 712217
13496 712217 1632312 2722062 3039276 2370068 787177 -350722 -828883 -1486394 -1130779
13487 -1130779 -421418 289243 1015735 1330775 746107 -590954 -1012856 242577 1848232
13478 1848232 1511452 -403573 -1537894 -2068663 -1443027 -862930 39332 251989 -720435
13469 -720435 -861527 -993657 -545113 738175 1885536 2131579 1446123 -110021 -679265
13460 -679265 97125 581155 590117 735831 1265847 1238251 379602 100599 -661123 -1519848
13450 -1519848 -1343023 -884148 -640832 -330196 -276325 161777 1593164 1032431 -37078
13441 -37078 268429 256536 302232 392028 -577068 -1224153 -1388537 -1115060 -320958 -414662
13431 -414662 -1467345 -2211978 -2329395 -1897077 -1519479 -1305708 -884857 521659 1234768
13422 1234768 1064071 1346213 1032868 -38858 92758 354642 496536 393002 353583
13413 353583 630151 946619 645240 403678 33628 -915065 -1111777 408166 1905193
13404 1905193 2364922 2764051 2413937 1825327 1545441 1301753 551147 -120770 -1197359
13395 -1197359 -977584 -228001 -197377 -202461 -687960 -1376252 -1049707 -689104 -1672246 -2002298
13385 -2002298 -2442773 -3163049 -3792894 -3847272 -3240921 -2469067 -1663694 -1487994 -1361937 -1008950
13375 -1008950 -1048120 -1120485 -1327899 -949031 -467446 -821659 -1475569 -1524544 -546302 -271709
13365 -271709 -698187 -1387199 -1104271 -294751 1066566 1271968 967784 681289 975793
13356 975793 1013050 210603 -363076 -347448 486148 913541 1186218 919495 -453234 -1435411
13346 -1435411 -1644175 -889394 -384098 199953 770253 1745162 1967976 1288893 1359787 1401895
13336 1401895 1527355 1638844 910100 232952 -384895 -461432 -215290 -689989 -650410 573097
13326 573097 862538 796824 1759160 3070598 3167470 2646491 2372518 2110456 1326432 529553
13316 529553 1130837 1248063 634426 691793 -293774 -952175 -596672 -618853 -729730 -697127
13306 -697127 36371 793458 1400391 2034775 2650229 2599495 2402894 1476900 583507 1310005
13296 1310005 2173877 2747947 2461118 1978756 1894083 1488833 283662 -581366 -524992 -59604
13286 -59604 -96426 -1145824 -1716353 -1010090 -1105272 -1572235 -1900677 -1084150 272523 806851
13276 806851 218192 -1003722 -2158065 -1966661 -1341281 -878487 -600064 -1078545 -1325421
13267 -1325421 -908925 -214847 326742 787242 1034203 1587858 1911816 562543 647632
13258 647632 1725994 2329684 1761216 583745 929257 883107 -1117 -483198 -1552961
13249 -1552961 -2446096 -2449529 -2355996 -2741639 -2899118 -2069663 -1118435 -197957 -136402 -682591
13239 -682591 -136050 669200 954381 985265 815644 296468 -123326 -126719 480629 1375337
13229 1375337 843848 -335362 -1511078 -2074503 -1915776 -1089418 -109465 -345337 -1772973
13220 -1772973 -1693586 -537223 892627 1473521 801948 525576 1436465 1967031 1261277
13211 1261277 498224 621078 305626 498210 1070850 1786614 1941221 1752801 855972
13202 855972 -512706 -1248173 -1271605 -597328 475987 789700 1506399 1683031 1412972
13193 1412972 2090085 2268647 2032324 2138790 1941927 877251 576618 1499719 1877967
13184 1877967 1517510 317124 287999 1238706 1434413 1822379 1922194 1933780 1774585 1566333
13174 1566333 1147995 2010279 2868391 1428735 -621646 -563519 351498 1258376 1859412
13165 1859412 1534587 1339586 2053602 3300392 3569589 3090482 1828982 650562 509741
13156 509741 814153 1266656 2135695 2015366 1111760 448967 480690 9938 -283202 -234712
13146 -234712 231605 486019 -304926 -1169980 -1070577 -138953 3562 -38740 714055 2459600
13136 2459600 2412193 1352488 902704 442179 170644 186770 1267685 2383593 1704364
13127 1704364 232871 -361203 71670 772855 697997 169466 262833 -110564 -743826 -159267
13117 -159267 1287354 2393689 2392795 1276215 362216 513632 1234112 1622964 2070215 2588057
13107 2588057 2781239 2931769 2805210 2484380 2255654 2137322 853638 620963 1140793
13098 1140793 2253872 2792030 2932554 3370803 3599962 3671440 3219985 2833970 2323534
13089 2323534 1538988 2144975 2701126 1685122 131661 -1404829 -2275116 -2719110 -2872682
13080 -2872682 -3475151 -3666687 -3409534 -2983823 -1789337 -127655 1741003 3770081 5492080
13071 5492080 6238507 5393478 4459563 3668041 2898964 2699697 2879281 2162217 1204181
13062 1204181 838000 572203 694678 707730 1521276 3287564 4983470 4396403 2108917
13053 2108917 836374 1171872 1756515 1714200 1545706 1780281 1987252 2184634 2011508
13044 2011508 1766075 1453448 979266 873954 1137059 2215176 2915609 3275563 3611594
13035 3611594 3389317 2610006 2115534 1678842 2228648 3641264 4669680 4174061 2576335
13026 2576335 1833568 1713740 1909892 2236415 2457169 1983866 2222321 3022373 3368875
13017 3368875 3444841 3307394 2847789 2592844 2744358 3082528 2952316 2986682 3775202 4066527
13007 4066527 3770721 4686846 6505812 7474897 7352441 6478802 6442585 7006425 7483549
12998 7483549 7628135 8545970 8945716 9404066 10256437 10903203 11757693 13121284 15030783
12989 15030783 17363963 19487038 20974497 23273202 27894682 34398745 43011366 53508618
12981 53508618 66765535 84510086 108003523 138336054 179621206 233389505 291255526
12974 291255526 330060647 325570327 281695090 226859829 178508220 141101909 113017872
12967 113017872 91910068 75710164 63987395 55552600 48480687 41440925 34603687
12960 34603687 30288305 26854017 24250929 22285259 20238685 17906791 15399452 14828179
12952 14828179 15027151 14734390 13933095 13288123 13482267 13261732 12386008 10997681 9907834
12943 9907834 9797550 9140696 8023455 7505975 8480547 9191261 8709480 8626213 8308819
12934 8308819 7617997 6595475 5687296 4792564 4758629 4751141 5194765 6706876 8190151
12925 8190151 8041189 8005832 9576358 11398441 11718294 11775288 12554700 14072343 15496084
12916 15496084 17165720 18169921 17878303 16426597 14166097 12918340 13619477 14772006
12908 14772006 15683551 17337949 18077555 18244706 18900741 20562759 22133550 23813921 27237992
12899 27237992 31147807 34723326 39199973 46484645 56471784 69959564 88289004 113407076
12891 113407076 148697033 196467529 255418880 314350847 345501876 329549307 282319732
12884 282319732 233210846 196775287 171827034 145254922 116579789 92938218 74685924
12877 74685924 62116726 52749900 44755717 38690739 34545530 31557194 28527567 25001768
12869 25001768 22395695 20045898 17758280 14950980 13161649 12332016 11138621 10122858
12861 10122858 9925157 9834485 10066121 10347944 9400079 8814059 8637030 8225513 8409425
12852 8409425 8204593 7484749 7528937 7134168 6575181 6594750 6369508 6893316 7264292 7076943
12842 7076943 7260316 7696303 8498408 9804916 11112578 10755184 8858774 7635839 7564229
12833 7564229 7816318 8383550 9540572 9979045 10201651 9661995 9327039 10358305 11151587
12824 11151587 12038253 12253952 11837964 12398189 14719558 17446050 18919428 18582377 19668408
12815 19668408 21450531 22420678 24162497 28573040 34742467 41814883 50002505 60147554
12807 60147554 74478770 94727948 122037764 159658550 209825200 268439392 317473231
12800 317473231 331034543 300499149 246637265 194113923 152212040 120911888 97394240
12793 97394240 79732974 66570943 56824537 49898917 43806982 38607074 33871694 30063669
12785 30063669 26932418 24213525 21031854 18348648 17032098 15861330 14000554 12388141
12777 12388141 11955311 12290818 12472990 12290537 11391049 9405991 8120179 7004951 5534947
12768 5534947 5284339 5315749 4853859 4875546 4581485 3519778 2540822 2535300 3005077 3886802
12758 3886802 3921595 4149983 4309892 4396711 4577047 4468705 3836917 3355481 3229693 3021365
12748 3021365 2821157 2328248 2235265 3100926 3865811 4598090 4609768 3712772 2643303 2270913
12738 2270913 1909825 1997922 2367336 2634879 2756955 2442248 2510586 2502965 2527217 2490386
12728 2490386 1125478 188947 441086 869734 666402 384221 681311 859755 1220098
12719 1220098 1188072 780504 1018713 1375913 1905626 2412117 3162457 2381179 1297401
12710 1297401 1181818 1015674 659770 -59323 -194156 84060 1170980 2321199 3755290
12701 3755290 3970350 3818279 3137804 1682660 862112 404528 -527343 -1125261 -924165
12692 -924165 -212395 1027862 1974063 1936484 1088367 450553 -146363 -646263 -1242148 -959018
12682 -959018 217899 996052 1632989 1573994 795924 634571 206802 -20708 -750839 -1113917
12672 -1113917 -940185 -1401484 -765086 511308 413830 810836 1035506 254952 154096
12663 154096 275959 -121784 456723 1185286 1375030 2119155 2305348 2568266 2599708 2117356
12653 2117356 1874494 1237440 426505 379009 657657 1091650 954982 728456 1389949 1122189
12643 1122189 680558 385552 -41220 4865 56729 -925138 -1481755 -1149253 -657538 -374330
12633 -374330 55079 84117 1016864 1310128 -70714 -914722 -1336729 -2057685 -2849888 -3386703
12623 -3386703 -2105280 -410947 -10682 -232037 -805668 -973893 -358269 -247933 -145012
12614 -145012 92932 503630 1151540 1048602 981636 1124649 951443 858686 589996 -219908
12604 -219908 -980081 -744593 77220 -202273 95261 557 -4403 173791 -883308 -1351616
12594 -1351616 -1406832 -1629981 -1494375 -766376 35074 1004525 2036694 1639665 1631896 1771155
12584 1771155 736372 -321776 -763937 -1346108 -1858368 -1751115 -1482194 -1317778 846068
12575 846068 2054926 1768401 2340301 2683625 2784756 1715248 780475 1136823 1208802
12566 1208802 1018118 1989846 2538657 2496878 2094909 1107068 637052 1160129 1975210 2215153
12556 2215153 1742856 1008128 554768 438646 63156 319299 395650 184624 4657 -9218
12546 -9218 58834 831121 1625568 2345355 2322980 800577 -399311 -1134017 -1322706 -1342594
12536 -1342594 -1235193 -568703 357977 1263664 1708002 1514027 1335136 1017389 846278
12527 846278 948020 1333902 490692 297322 686606 1537283 1954652 2323125 3052955 3741132
12517 3741132 3632559 1051563 -1158258 -933068 259238 -363923 -1248370 -865890 -129589
12508 -129589 -141104 59930 720883 554119 -176401 -310740 -603599 -1536841 -2186442 -1731030
12498 -1731030 -1223461 -1311244 -764460 -477435 -158534 76698 -290243 -592928 -631418 -494327
12488 -494327 -142541 -108588 -100293 -821067 -916851 -1480375 -2001489 -1144183 269740 604048
12478 604048 752158 1152194 825147 -135696 -1022107 -1415996 -937609 -213644 -41529 660559
12468 660559 1532995 2053390 2269865 1788298 1525199 850447 -276838 -1270217 -2503898
12459 -2503898 -2597279 -1966374 -1239426 -487129 -359046 -846511 -1556150 -2600593 -3165648
12450 -3165648 -2490866 -1978270 -1660482 -471425 971227 1423676 1137453 641046 746883
12441 746883 498818 -127261 -478180 -197793 754974 48869 -1253420 -2119707 -2465833
12432 -2465833 -1753060 -1435852 -1013894 -959954 -387765 -335856 -1197846 -1750446 -1653491 -1604526
12422 -1604526 -1268471 -1084070 -1634187 -1358640 -399358 333655 687163 1275291 1709107
12413 1709107 892645 570277 100624 -1593580 -2677331 -2569774 -1572201 -511371 -1009841
12404 -1009841 -1742222 -1897317 -2071080 -1196372 -282676 -41242 -441464 -880542 -1341758
12395 -1341758 -1069433 -368094 -595129 -1129279 -1102979 -639094 238972 1124900 1116013 -91960
12385 -91960 -930880 -616033 244863 879027 1795345 2600720 3202006 3760775 3112607 2147141
12375 2147141 1368736 650834 -278488 -695297 -1385076 -1584029 -1300154 -642684 689046
12366 689046 1090599 1340193 918257 238541 -732339 -334890 380530 -56500 -792880 -417054
12356 -417054 -384621 -635574 -595599 -1110410 -1660091 -2218518 -2897459 -2125059 -506528 64397
12346 64397 -740150 -1575545 -1700470 -939952 -226587 372925 1139749 1696529 1275489 26472
12336 26472 -802000 -569348 152875 1232552 1406567 1543305 2582091 3601548 3159298
12327 3159298 2436326 2705686 1966115 331021 -600411 -594856 -1479502 -2461184 -2111153 -914536
12317 -914536 291499 1144631 669002 -104991 -695628 -753012 192170 70243 -444124 -254022
12307 -254022 504060 1381418 1436912 323264 -289400 -97808 91776 307878 -322543 -931053
12297 -931053 -1660746 -979714 -398692 -962195 -1071498 -866508 -1512259 -1927776 -437299
12288 -437299 1933783 2629018 2240264 1442417 356580 878613 2161096 2764278 2470918
12279 2470918 1838535 1351577 1421348 1368253 1927084 2145873 1866089 2138334 2208202 1205481
12269 1205481 323660 -58330 -983470 -2201610 -2692455 -2139795 -803172 1270894 2316764
12260 2316764 2044461 2695167 3708533 4933729 5277773 3953743 2076796 1196356 621398
12251 621398 654479 929197 857907 457506 432469 416609 739220 1237738 1063469 -176560
12241 -176560 -1368745 -2251850 -2685576 -3280580 -3217252 -2595506 -2318771 -1903304 -1926193 -1838721
12231 -1838721 -1808005 -1886916 -1372117 -72238 622955 1113218 1303691 1316980 1458589 1288060
12221 1288060 1803397 2094981 1392573 464524 -469930 -472854 -320981 -159313 -61400 116256
12211 116256 260083 414885 506522 673405 -592924 -1353136 -1116139 -747955 434072
12202 434072 1465817 1737287 1365310 731499 -432173 -817472 -26068 331014 176153
12193 176153 -59881 -205480 -594242 -1394345 -1544782 -1879983 -1805549 -1657653 -2704497 -3840442
12183 -3840442 -3937923 -2945544 -1594026 -1353105 -1301085 -955355 -110938 115758 -252995 -468769
12173 -468769 -110082 234524 49407 675782 636156 -173942 -453183 -101413 -811734 -575360
12163 -575360 842812 1178577 -356892 -1308608 -1526214 -2059218 -2387940 -2032049 -1680220
12154 -1680220 -1028030 -1288578 -1899312 -2923927 -3653322 -3434680 -2656473 -1345805 -103370
12145 -103370 -249216 -827633 -887349 -1587221 -2838125 -3825022 -3865654 -2123099 -99565
12136 -99565 1131129 1556469 1055823 483673 -697370 -868259 172683 -177197 -582691
12127 -582691 -129204 -116172 -1255976 -1510095 -976830 -268799 -811528 -1326484 -1483614 -2548410
12117 -2548410 -2828958 -1285857 506237 1094144 510928 514101 815831 1169687 2060586
12108 2060586 2604865 1424763 1251119 1658541 42004 -1401316 -1974857 -1511338 -1187635
12099 -1187635 -1115960 -937545 -68654 -653622 -1336198 -1142051 -840706 -666167 -490061 -980936
12089 -980936 -1031319 246955 588004 -97646 -629608 -1299693 -2016034 -2907348 -3099826 -2557625
12079 -2557625 -1761163 -1023751 -1003259 -253453 654479 996649 725771 521628 947360 541147
12069 541147 -546264 -1455457 -1454899 -1240074 -1903623 -2230598 -1679031 -1645725 -1802362 -935447
12059 -935447 -640981 -666673 -307667 -2127 -355690 -721239 -815018 -1267477 -1362334 -1475125
12049 -1475125 -1616648 -1604754 -1361505 -1336994 -786440 -760547 -301606 271552 129494 -785815
12039 -785815 -1320034 -1682957 -1783291 -1222768 -140350 549143 136566 242958 507396
12030 507396 431583 269715 -454805 -519453 -660906 -145458 236582 564264 980 -1269631
12020 -1269631 -1631868 -1319447 -671794 45603 335343 -293569 -585578 -548050 150892 1185719
12010 1185719 1152984 479488 234014 815339 54553 -1199908 -886824 -317662 94923
12001 94923 -117240 -850710 -1266760 -950045 -711968 -803008 -699564 -65488 542680 874733
11991 874733 450834 -218775 -539064 -1052812 -830320 -509545 4355 1313352 2114192
11982 2114192 2158767 1050351 -298487 -486037 -460394 -922849 -245690 288546 -413638
11973 -413638 -1037886 -1056469 -223389 788160 827123 935525 1505796 1799895 1944496 2478090
11963 2478090 2136124 1203645 993150 569994 669441 1513291 2195006 2081918 631711
11954 631711 -687542 -696191 -241209 638793 883668 1051305 1241397 1115159 1685048 2594097
11944 2594097 2652787 1317477 161943 -360033 -820766 -1001743 -1224530 -1231813 -831298 -588764
11934 -588764 -612795 -714288 -374289 231679 1196337 2450353 2714662 2698209 2093200 1181122
11924 1181122 923134 1225517 1275664 1141141 1334913 1167093 1245836 686861 -361136 -1479663
11914 -1479663 -2197821 -3068974 -3405030 -3534101 -3166369 -2318145 -1446427 -372840 -565716
11905 -565716 -1012538 -978837 159899 1013136 949566 417753 -132344 402832 1513198 1980199
11895 1980199 1692852 2656002 3144284 1947355 681203 414467 494100 716603 1314968
11886 1314968 1924020 1633988 1043695 1536489 1709669 2330546 3064621 3034077 2455654 2802191
11876 2802191 2972642 2465134 1154936 279801 818168 461265 -159242 -1308183 -1969400
11867 -1969400 -1273031 -275238 275209 549100 359995 236758 475023 622235 -190557
11858 -190557 -764050 -263176 -583867 -1152823 -1019283 -857687 -994712 -564307 388471 357436
11848 357436 304663 -201389 -1020988 -378020 -158335 -709755 -872692 -22172 475805 287378
11838 287378 213268 -26883 74139 -521703 -1313518 -1164602 -700713 -995667 -1057737 -823438
11828 -823438 -548901 445188 736946 619236 1077355 903713 207983 -711357 -1844991
11819 -1844991 -2433967 -2962171 -3369243 -2442736 -1181537 -806815 -985327 -1267876 -222695
11810 -222695 1189631 2245134 1937196 657943 -40569 108035 183139 -755162 -1620628
11801 -1620628 -1456741 -518490 -596795 -137075 398734 67194 279425 1252147 2091238 1881116
11791 1881116 1632799 2057167 2558832 2451770 1818855 1401365 942138 890397 736902 -83308
11781 -83308 -569547 -822549 -981010 -2078169 -3548646 -3436279 -2781853 -2209600 -1673483
11772 -1673483 -1222795 -714558 -101638 -90961 -535451 -2068372 -3134006 -1960909 -151092
11763 -151092 -105625 -1104368 -874107 -618203 -464028 300555 738543 1625741 1380809 809027
11753 809027 -258813 -1443192 -1643416 -717407 311337 251202 -370390 -736207 -1322640
11744 -1322640 -1319010 -946359 -481519 -227752 -945302 -1067961 -526111 -508211 -89336 -114272
11734 -114272 283097 837233 1562822 1533255 524656 101773 1048187 399721 -700850
11725 -700850 -720908 -156395 1627178 6832719 5113129 -516512 -412150 528335 1923072
11716 1923072 2149240 1354828 177407 -810310 -1971958 -1644236 -1114851 -935059 -870345
11707 -870345 -530741 -279791 241582 -130443 -478330 67362 624004 470227 437094 -84966
11697 -84966 -127765 299849 1115693 1550626 1424379 1496686 1956987 1761266 1157119 520566
11687 520566 -23493 -534928 -778730 -606448 287739 302783 3162 126695 625861 -75662
11677 -75662 -669928 -897593 -1131598 -2049922 -2163625 -499544 807572 1411863 1232958
11668 1232958 705261 1323513 2877923 3578354 3294797 2465394 1589646 1322482 1641616
11659 1641616 2162468 2094115 1430043 627678 1036580 1506286 1030763 380952 47936 441313
11649 441313 21867 -1067774 -1655593 -2124943 -2735720 -2647915 -1887218 -789705 -178740
11640 -178740 -340773 -428060 -374830 -338427 -113199 -649301 -668407 197874 966040 1121693
11630 1121693 846872 692293 860762 268615 -485755 -668648 -668608 -157551 689236 1062689
11620 1062689 1271255 1798470 1575933 1679304 2254650 2134071 1720355 1256273 68826
11611 68826 -563299 -254196 567635 1014444 226139 -585618 -372180 737432 1255455 620951
11601 620951 -86615 284299 -269814 -1433669 -977825 -831055 -1030091 -762775 -64990
11592 -64990 22087 -15089 -40780 -361890 -162926 77115 383887 -234864 -798091 -766880
11582 -766880 -863147 -297913 -83064 -423395 -300992 23296 -240446 -1659357 -2274949 -1188677
11572 -1188677 -1050178 -1633451 -1038301 -553395 145534 768236 574228 -26720 -21729 -313161
11562 -313161 -436747 -819379 -1518241 -1392302 -541024 11911 650365 1274438 1935327 2030214
11552 2030214 1835782 941665 85631 339575 857613 1658083 1690820 1332373 1001265 690452
11542 690452 429153 385975 747464 806369 688039 1425830 2400144 3429884 3538789 3579731
11532 3579731 2629933 747361 -10565 -214664 -520560 -577180 -1427393 -1957385 -1824836
11523 -1824836 -1749833 -2377270 -1978538 -1203904 -544839 161300 429049 286759 -245598 -356768
11513 -356768 -749046 -1254494 -1284484 -252503 1479452 2063357 1442702 1421060 1222326 361178
11503 361178 -906160 -492938 351091 48685 -792817 -1516529 -1021493 137862 322700
11494 322700 -63832 188023 586334 -248328 -412975 22649 -530545 -1399317 -1268080 123417
11484 123417 287563 -317926 -507161 -622822 34567 492051 382793 -647259 -1078451
11475 -1078451 -1150129 -795269 -353897 -620952 -614946 -329070 -599143 -484542 -340664 73326
11465 73326 371916 664112 737735 104180 -436573 -1091316 -936098 -626628 -795676 -428487
11455 -428487 -21925 667938 639381 -681544 -634028 -632311 -887821 -53143 1087700 462913
11445 462913 -721332 -1609490 -1827874 -2279178 -2444922 -1839795 -1034219 295659 1392002
11436 1392002 1280312 451856 -147115 -761012 -1540398 -1261105 -926942 -1069790 -1119109 -235897
11426 -235897 22710 -48620 171121 649364 1125105 1804426 1343368 608891 909931 1030680
11416 1030680 707732 1199246 1370849 1602503 1207499 163279 -676734 -1713212 -1492484
11407 -1492484 -929414 -802975 -302681 275236 -447159 -477177 60671 213167 1883 410501
11397 410501 1231934 842155 302494 355930 3791 -260830 -207220 206349 475400 1102903
11387 1102903 1552023 1264050 1065560 723088 -196569 -887710 -540315 -761345 -201889
11378 -201889 -58495 -829612 -1332814 -975202 -559019 -88041 -5481 -683611 -536308 905766
11368 905766 1978830 1411795 679213 -146722 -842149 -1244695 -1243559 -486957 -181468 -169970
11358 -169970 -125073 43244 688903 397479 -366797 -1123119 -1143780 -713894 -316508 25528
11348 25528 231784 -907168 -2582668 -3679872 -3332340 -2043071 115263 1635838 1974469
11339 1974469 1980755 2320948 2879672 3405812 3532723 3739218 2961606 2104699 1415360 456727
11329 456727 532653 1326280 2395266 2325113 1528675 1117296 722126 325064 569171 777360
11319 777360 909699 1822077 1096187 187647 761618 974935 512338 252738 -94003 -745417
11309 -745417 -575643 -9590 3346 221171 592816 753453 473199 -11423 -521401 -949218
11299 -949218 -1486079 -2124202 -2097227 -1745145 -1926994 -1222498 259709 1062878 1456396 1323618
11289 1323618 531028 421855 639232 1331264 1164571 597622 -493515 -1525088 -945129
11280 -945129 -200818 327107 1009585 1636819 1551996 585540 227979 521054 159804 -495515
11270 -495515 -579684 -377120 -1267081 -1433559 -1324197 -1037020 -41032 1110778 1897113 1876740
11260 1876740 2338054 2603879 2305096 1673459 2280499 2812780 1972479 1090854 992856 2209454
11250 2209454 1903093 508667 53225 324338 166612 -530487 -1310380 -2390784 -3345846
11241 -3345846 -2885982 -1594752 -307819 538113 953187 625709 347213 1334091 1640894
11232 1640894 1177456 236467 -847583 -787426 -474986 -639477 -100851 870249 497269
11223 497269 -370694 -128384 682368 523802 -108025 112229 427708 496455 722062 -98082
11213 -98082 -685576 -214893 333928 318018 -878973 -2346068 -2248799 -1524352 -155708 1507684
11203 1507684 1443392 1019202 1230317 812344 412436 665670 735451 -196786 -1565920 -1568929
11193 -1568929 -361175 333479 954013 1176562 799058 315835 709512 272061 -379852
11184 -379852 -78728 -194055 311697 1845690 2736678 2042181 869138 352291 396848
11175 396848 -462184 -1121739 -1387340 -1754618 -2344115 -1392898 -566532 -657588 -780364 144045
11165 144045 1237371 1080795 11785 -269860 632671 1276959 -133779 -1382768 -1158019
11156 -1158019 100270 1426847 673003 -445330 -1338072 -2127155 -2058313 -1091761 -278920
11147 -278920 -339256 -1435586 -1937366 -638768 953448 895934 271718 -1251539 -2230814
11138 -2230814 -1737058 -405869 443186 1171478 2108279 2454777 2320883 1662939 150088
11129 150088 -833063 -822915 115874 953944 1415815 1871182 1512612 704751 764973 1464254
11119 1464254 989430 311087 849260 539983 160321 507273 221337 -367637 -575932
11110 -575932 -215829 640001 1281977 1816214 2113416 1546134 934493 1181795 968070 1188100
11100 1188100 927326 408716 306702 -499990 -1159117 -1587775 -2321033 -2718318 -2234331
11091 -2234331 -1981521 -1955805 -1754252 -1479918 -1438583 -1366681 -1035522 164158 1153976 1453453
11081 1453453 1304751 1874205 2902577 2873146 2299628 1348824 681717 1231734 2052493
11072 2052493 1516364 955565 1436950 2309782 2877910 1959715 1143545 1257818 561318
11063 561318 -5336 -94705 1881 122733 -374159 437187 2304342 3307324 2719137 942855
11053 942855 -489034 -1743747 -2193980 -982883 262058 566566 371313 121980 296656
11044 296656 -195335 -748727 -1037338 -1297105 -1108387 -630457 -463497 -386894 -261050 -230495
11034 -230495 -181713 204045 902288 1632742 2195160 1685305 327649 154917 1043412 1670936
11024 1670936 1272792 842730 1126874 349721 -527077 -220004 -283730 -1048442 -795343 701624
11014 701624 1515181 681813 317927 1243635 1730591 1259416 624778 -80803 -384640 -1039512
11004 -1039512 -1259719 -837806 11458 -9298 -1350211 -2569302 -2514376 -823057 -226927
10995 -226927 -615620 -1950782 -2921142 -3166775 -2372552 -961015 237214 884124 -194998
10986 -194998 -1138967 -1050000 -1030205 -1538261 -1506325 -1292800 -38807 1228455 1525662 1989897
10976 1989897 1784057 1534675 1132773 1020381 1898176 2922443 2475774 1714402 568609
10967 568609 -903418 -1151559 -1164697 -978335 -832633 -1153134 -1010048 -800478 -1301125 -1624567
10957 -1624567 -1372740 -1659484 -2017467 -1448357 -1950302 -2459490 -1656308 -750611 -512032
10948 -512032 -578148 352979 1263177 1257459 -62027 -58037 442765 -465175 -1703548 -1315614
10938 -1315614 273215 256179 -596841 -1005402 -546722 267469 825231 882267 285209 -88919
10928 -88919 540720 1550708 1598442 793410 70361 -271748 312121 702023 1079118 1288526
10918 1288526 1152030 1015611 303840 558682 1332958 1386935 421206 -149075 694647 1681047
10908 1681047 1633215 521051 190974 805528 631014 709329 1218084 1185084 1163713 872112
10898 872112 284711 -278561 -195147 -979383 -1726079 -1095062 -64380 -120971 -515699 -1088058
10888 -1088058 -1164003 -158020 782659 610869 -731871 -1850387 -2452972 -2953377 -1899184
10879 -1899184 -865648 -886065 -880838 -1042901 -946010 -892723 -414905 191552 197513 -91325
10869 -91325 -464 42999 -305155 -253225 -322650 60129 -403716 -1081159 -836562 -368539
10859 -368539 -649953 -1079745 -1042323 -523776 -264824 -265372 -59692 -21764 -189506 358810
10849 358810 1117791 1248001 729292 222903 -847550 -1434739 -194546 1007450 1376324
10840 1376324 439837 70646 907243 1559163 1243687 789272 1204989 2522791 3467743
10831 3467743 3256669 3140220 2778860 2385560 1536643 726387 472839 455735 527741 214470
10821 214470 -268611 399417 814771 871031 698534 215361 348702 379241 -16003 -553461
10811 -553461 -1486215 -1682958 -234791 1773665 2567985 1887625 -181447 -1802651 -2719364
10802 -2719364 -2818142 -2163007 -1386250 -839191 -1511201 -1550638 -323099 -286701 -357180 65339
10792 65339 -31489 666924 668455 -146709 -381691 406168 -420886 -1818423 -1679923 -1039663
10782 -1039663 108255 840968 -109724 -294739 584940 1016646 406367 228847 80356
10773 80356 -618781 -638908 -366587 496308 914067 1249213 1874586 1456332 1308950 1260857
10763 1260857 612363 475331 1120170 2112370 2640987 2302129 754088 -521805 -187163
10754 -187163 1010544 1132948 7820 -816485 -973693 -316160 250974 175793 -287004
10745 -287004 -567008 -1314383 -1876246 -1109606 -16594 447011 87327 -420053 -304742
10736 -304742 776897 1106211 1149439 366407 -1309377 -1302492 -630846 -654208 -690662 -711712
10726 -711712 -792634 -541130 -167866 -41197 -428506 -721645 -556627 -790570 -893006 -950211
10716 -950211 -1548901 -1496894 -1346773 -566800 596686 1604699 1843541 484518 -783401
10707 -783401 593676 2573565 2960101 3200202 2964326 2766555 1822699 590142 615819
10698 615819 1813732 3082701 3275945 2769380 1882649 734293 168537 -561984 -1195504
10689 -1195504 -1337104 -510867 991627 1143575 1008498 372644 342850 795462 744475 268076
10679 268076 -319324 -568294 541859 1186760 621239 -938777 -2034996 -2492080 -2708600
10670 -2708600 -2334011 -1507059 -935460 -305309 138166 -2198 -467600 -620014 -1221431
10661 -1221431 -1516993 -689049 700825 2079068 1801220 1112536 1404468 1639696 1089314
10652 1089314 199996 -426976 -531080 -517506 -408384 -618134 -532339 415618 837772 131127
10642 131127 -19127 -195421 -629879 20767 879651 715666 -635915 -2266878 -2305357
10633 -2305357 -1108075 5842 -248149 136645 487476 -419452 -830605 -1029541 8154
10624 8154 1446768 434670 -433008 74253 426644 1088867 923000 -16267 -46653 268162
10614 268162 -117116 -37689 383230 345034 120692 -86844 -678134 -1752035 -1038412 63529
10604 63529 -166036 -1037167 -632927 -275858 -1158341 -1760485 -1819501 -1174963 -898388 -1666741
10594 -1666741 -2226256 -1645125 -1502275 -1956732 -3057965 -3852620 -3214441 -3277684 -2808109
10585 -2808109 -2446132 -2534732 -2798922 -2600262 -2830266 -3383677 -3527536 -2833814 -1998474 -1289436
10575 -1289436 -676229 -829214 -995453 -587730 23404 575836 1498468 1386634 -6440
10566 -6440 -1263438 -456904 1387517 967436 -1262795 -3552568 -4356652 -3860453 -2225553
10557 -2225553 517 1172132 2376844 2117766 1252617 1663942 1700330 119398 -1513998
10548 -1513998 -1450244 -971998 -1017403 -1203966 -1609018 -1461470 -1282485 -1635717 -2071642 -1734259
10538 -1734259 -402989 899384 1326926 1112409 317559 28433 344866 1210273 543260
10529 543260 18364 350307 595502 248957 -1303808 -2043401 -1832908 -1965815 -2909619
10520 -2909619 -2955527 -2443942 -1626897 -1265417 -1337121 -533917 -307308 -909898 -1602117 -2898816
10510 -2898816 -4224483 -3862115 -3082758 -1942863 -1447495 -1642769 -1426574 -1163107 -202251
10501 -202251 881648 743584 515938 3954 -324372 -82618 83320 592926 1382028
10492 1382028 1969215 2035910 1608125 2055218 3197188 4247656 4257967 3922408 3798030
10483 3798030 3648191 2456579 1504759 2227258 2663285 2335356 1283434 192674 139816
10474 139816 121213 -888211 -1264555 -1222714 -1414134 -1442301 -890516 -523031 -330219 140068
10464 140068 -27533 -374179 -1248022 -1316908 -1053681 -718520 83071 474050 -455483 -1611750
10454 -1611750 -2041228 -2059568 -1502815 -644612 -65676 509834 964381 790781 350145 -338268
10444 -338268 -739127 -793959 519429 1253413 712023 214029 -894131 -1333083 -1113438
10435 -1113438 -1100256 -1280467 -1114479 -878026 -1354106 -2870879 -3913626 -3707514 -2267258
10426 -2267258 -975079 -929459 -1551153 -2468430 -2590735 -1719350 -1488925 -1369039 -135206
10417 -135206 1395753 2097238 1893056 1331747 673101 -365304 -1745885 -1758907 -1472034
10408 -1472034 -1480796 -745147 -525961 -1171011 -3013756 -4531144 -4291205 -2797542 -2169885
10399 -2169885 -2491248 -2395977 -2110432 -1711151 -1194582 -680803 -688542 -641761 -801189 -1550089
10389 -1550089 -2343651 -2355933 -2008624 -1733881 -638481 573453 323704 -516964 -656339
10380 -656339 394596 663894 1562701 2500203 3279854 2963258 2136685 924568 308546
10371 308546 428640 528821 -353253 -1197332 -298674 591784 1023925 1821507 2344726 1149474
10361 1149474 -331370 30867 854027 487414 -302304 -606436 -1175613 -1388796 -1088528
10352 -1088528 -835936 -569078 72953 729190 743680 1010109 632252 -425660 -714422
10343 -714422 -397865 -847861 -573418 904601 1980250 2537118 2534070 1109407 -441837
10334 -441837 -1413927 -2900591 -4415503 -5850427 -5927250 -4763178 -3214284 -1369157 -635324
10325 -635324 -1624315 -2020243 -1146478 -295093 239563 339762 541755 155999 -677960 -1171809
10315 -1171809 -979146 214421 612500 -62285 -765612 -37196 1003197 791389 271251
10306 271251 -11574 674128 925053 -434332 -782251 844936 1858355 968453 -346717
10297 -346717 -2003482 -3674629 -4368827 -3341284 -1841349 -724861 411861 753175 642934
10288 642934 -48498 -1707854 -2695395 -2200260 -1729091 -1642778 -950977 -444518 -553106 -13673
10278 -13673 252471 224357 796466 1128774 750591 -162590 -374895 1054242 1986759 705146
10268 705146 -837778 -907305 -111055 147527 540467 1802518 2248982 931988 -287953
10259 -287953 -602714 -604963 -982510 -999574 -413199 397648 738813 816729 1238051 1583267
10249 1583267 1433154 1595269 1827772 1359364 522844 704137 937952 -39058 -462148
10240 -462148 442028 1233252 1017718 562055 249735 -160900 51206 146778 138919 601337
10230 601337 1145138 1219953 308468 353482 1832349 2025515 1606414 1037296 163184 469245
10220 469245 662362 -393763 -1174902 -1622184 -1925788 -1603273 -1496126 -1146280 -111834
10211 -111834 1177734 2081342 1781997 128267 -1456905 -2102553 -2103825 -1687176 -1707557 -2044810
10201 -2044810 -2137454 -1902744 -1040704 -912983 -1159690 -1072601 -874277 -628603 -743501 -589415
10191 -589415 -283729 -479768 -1133695 -911196 -241696 142117 -185924 -1315809 -1593771
10182 -1593771 -1156626 -1333119 -605923 -775874 -1301935 -1040109 -629406 -1340452 -2476708
10173 -2476708 -2828233 -2198210 -755947 132183 786259 -80484 -1204188 -1719660 -1315853
10164 -1315853 393837 1665542 1463591 737900 -570653 -1704550 -1704630 -1589833 -2391253
10155 -2391253 -2948999 -2397079 -1461796 -960607 -462173 -775520 -598372 171387 609843
10146 609843 986280 1212889 -354732 -2559448 -2600948 -2390396 -2771914 -2496601 -2149758
10137 -2149758 -1320645 -983771 -980238 -409377 484398 920125 107516 -1199625 -1738220 -2327176
10127 -2327176 -2308892 -2019572 -1653331 -1039930 -828981 -540935 241761 571656 553184 328756
10117 328756 -1121622 -2031105 -726035 640634 -133860 -1455997 -1331246 -144764 432951
10108 432951 -24441 -1288577 -1802630 -937136 -212676 -277262 -1118425 -2081275 -1638720 -666024
10098 -666024 -866790 -2004621 -2050979 -950170 -881049 -429294 -757195 -1088616 -1308120 -1262597
10088 -1262597 -774261 -295689 446950 1305498 1334556 1166728 1562469 1332690 1010425 -274865
10078 -274865 -1078598 -1333345 -1965021 -2199913 -2454344 -1561183 -818334 -1077868 -1719148 -2668216
10068 -2668216 -2539213 -1253951 -726739 -441746 -842190 -1078798 -488207 1722178 3135530
10059 3135530 2685012 2313133 1838168 942133 398194 101820 -710375 -903125 -707203
10050 -707203 -1020922 -1835384 -545776 804555 184865 -879698 -1608386 -955618 -977567
10041 -977567 -1968946 -3187946 -3441698 -2518759 -1543916 -1245289 -1627931 -2169264 -1454165
10032 -1454165 -406087 -17994 223774 -592820 -938701 -755683 -114172 1449750 3106023
10023 3106023 3774034 3474960 2428470 1186335 -233731 -1830039 -2210976 -2202507 -1991987
10014 -1991987 -1106469 -610613 -898298 -999333 -457638 -197470 -1118832 -2466330 -3057142
10005 -3057142 -2524294 -783922 499018 111788 -1206392 -1317141 -683760 -1015477 -775575
9996 -775575 -238896 -651660 -1732458 -2269431 -1537700 -330215 193469 -135243 -871029
9987 -871029 -2164784 -2227298 -1325401 -1212024 -1134577 -1119324 -1856247 -2190807 -2296301 -2207689
9977 -2207689 -2194429 -1445975 -635879 -1273506 -1469272 -1556049 -1546724 -2176365 -3128144 -2978117
9967 -2978117 -2240272 -1691419 -797274 622906 725018 -109365 -803286 -1247121 -1441804
9958 -1441804 -1400643 -1695958 -2211644 -2545917 -2792870 -2152441 -1350551 -1118296 -1801584 -2714981
9948 -2714981 -3327652 -2509482 -180152 616284 266184 -395224 -543021 -141249 690198
9939 690198 234563 -752437 -823643 114869 494477 836733 986420 932234 1554583 1563970
9929 1563970 888250 -87772 -788333 -1238804 -1331066 -573077 -851081 -1370559 -994441 -598198
9919 -598198 -642459 -1420253 -1508111 -2071398 -2270201 -1401140 -897822 -338716 -518520 -1476151
9909 -1476151 -2426109 -3161963 -2807897 -1993833 -2518077 -3805324 -4157530 -3070308 -3281880
9900 -3281880 -4147555 -4338248 -3813725 -3476705 -3449627 -2393425 -1103476 45326 125067
9891 125067 -1034994 -2259241 -1789183 -299859 148810 54631 -776558 -1983509 -2833644
9882 -2833644 -2378374 -2282298 -2635805 -1983315 -1591428 -1945479 -1958954 -1712637 -1525442 -1597346
9872 -1597346 -2052001 -2162194 -2542571 -3063196 -2329446 -202386 1438854 1600465 1094915
9863 1094915 931107 1101600 2157201 2723784 1761198 1080304 703558 293839 184544
9854 184544 -303876 -880270 -1509174 -2375431 -2233230 -987431 706071 1439367 1334208
9845 1334208 452517 -229810 -997299 -1218282 -426826 1078142 2459401 2864547 2116474
9836 2116474 946672 133609 -551511 -872892 -952492 -258670 -5276 -606459 -543138 504233
9826 504233 1677717 1708981 809018 201410 155492 999841 1401852 726970 -399360 -587693
9816 -587693 150019 -363424 -1293824 -804879 451454 816070 2155068 3081164 2848600
9807 2848600 1515280 -781058 -2274940 -1445997 10942 707332 272366 -971225 -1028962
9798 -1028962 -676593 -214227 452695 809826 344379 347999 127997 -258674 -429044 81192
9788 81192 457416 491034 1275788 2376168 1367326 -359442 -278242 -674518 -1078280 -938241
9778 -938241 -851033 -783040 -495415 262505 -77507 -276526 163501 366828 1074942 2312552
9768 2312552 2020166 832733 464043 925021 1297734 1427196 1856096 3310642 2937025
9759 2937025 1267823 549261 253420 416022 825002 807905 147454 -1624491 -2869757
9750 -2869757 -2691843 -2259669 -1633819 -348070 -147114 -1298255 -1806742 -723443 860686
9741 860686 1693673 1659560 1226460 1034513 494032 438336 -332584 -856055 -981520 -651399
9731 -651399 -1120216 -1775648 -2174874 -2480257 -1488319 -265814 444225 927757 1608955 1639474
9721 1639474 1329295 457320 -100661 301586 879002 703318 -463617 -1873945 -2442731
9712 -2442731 -2983029 -2907318 -1674041 -775525 -591731 -965270 -189535 736471 310970 -32674
9702 -32674 574558 1106273 1161050 1071515 1487440 2430518 2901852 2264701 1932506 1668330
9692 1668330 614635 -101531 -992131 -1275511 -1289831 -1008322 -877105 -1566128 -1497350 -1655637
9682 -1655637 -1904320 -2226010 -2166815 -1359782 -94726 430886 -73109 -934677 -1417160 -2011779
9672 -2011779 -2161943 -2175803 -2952504 -2378397 -1323145 -554214 -706502 -1426993 -1553974 -1866560
9662 -1866560 -1618199 -398105 440211 151082 -370738 -176677 174883 304595 295590 360958
9652 360958 636810 496589 961757 1527174 930180 394587 980852 294485 -71099 -11350
9642 -11350 -1250341 -1103936 76705 1229279 1842752 1392565 -141653 -1437523 -1723967
9633 -1723967 -1744741 -1387637 -136833 400868 144985 -47270 911606 1625622 1539196 646248
9623 646248 634966 718508 -74255 -861118 -367054 199606 836067 1216463 -172426 -719641
9613 -719641 -345989 -686855 -1651209 -1669769 -929382 -638138 -274054 527018 164423 -445318
9603 -445318 -757227 -1018197 -1098393 -1351247 -1198793 -1292983 -1554205 -1324123 -2045048 -3648233
9593 -3648233 -4320800 -4287518 -3829873 -4200723 -4792398 -4115798 -2952829 -1981793 -1242051 -267358
9583 -267358 310452 60941 145284 489013 324636 495791 1288728 1714109 1760231 1656333
9573 1656333 1494194 770832 -521250 -857510 -325224 285766 595348 1069521 704289
9564 704289 -530055 -303750 -76974 -685183 -577664 -530435 -530688 -269157 272375 -192048
9554 -192048 -1502670 -2404497 -2968272 -3129517 -2552520 -1482334 -877484 -544065 218125
9545 218125 587407 744633 985039 803776 -102685 -1115539 -1937397 -2128112 -781794
9536 -781794 154991 690196 104890 -876868 -1079138 -903327 -443060 174502 293353 545199
9526 545199 717089 -208644 -602852 42404 -91638 -906786 -1748674 -1563200 -712969 -594153
9516 -594153 -1144888 -1842807 -2215668 -2445439 -2631371 -2496892 -1993142 -1568398 -1403730 -713411
9506 -713411 440638 1328271 1387427 800919 815612 523974 433952 154026 -701118 -523043
9496 -523043 -456440 -1153860 -1622787 -2100059 -1248686 -61343 804484 921306 113826 -1083389
9486 -1083389 -1562374 -398788 515934 925650 248002 -370857 -13103 438349 -339414
9477 -339414 -1167498 -657501 -162051 -96728 -860581 -1911833 -2645842 -2461879 -1814605 -963000
9467 -963000 -78682 -55578 121960 761142 1022507 742249 1016555 593039 -637274 -1452279
9457 -1452279 -1387609 -1023331 -919729 -1251452 -1775063 -1402018 -747048 774380 2373446
9448 2373446 2129532 819402 512789 571192 -481002 -2224912 -3089807 -3651378 -3645795 -2553166
9438 -2553166 -1115674 41612 36792 -794359 -1432294 -1180014 -727850 -970087 -2008828
9429 -2008828 -3098072 -3217811 -2931644 -3094131 -3563106 -2486464 -1238025 142813 1488705
9420 1488705 1827429 1634469 1512928 1426841 1506671 1903654 1408503 921831 648996 729274
9410 729274 927939 794170 226821 225701 137981 743072 1010068 1388479 1944665 1338509
9400 1338509 1280696 1125248 928656 904858 566486 122217 -217387 -238661 -108248 -657535
9390 -657535 -836816 -683877 -481363 -52147 178251 385528 477736 603224 271740 14979
9380 14979 217357 248622 410574 438611 379188 53520 -281040 -466730 -1656499 -1384116
9370 -1384116 -550162 -722436 -234825 702259 1121713 106762 -1384192 -1966479 -1847967
9361 -1847967 -1720702 -935602 -86715 1137853 2266998 2350243 1814766 925304 460811
9352 460811 -460121 -1349437 -1779743 -2106523 -1516856 -199035 606698 1275949 1363758 -294781
9342 -294781 -1751678 -2425346 -2798345 -3117081 -2734094 -1455799 -180224 2902 -113500
9333 -113500 96923 -40286 -109555 5969 103361 656707 720196 123917 -232036 -915792
9323 -915792 -1357384 -582791 1071 -116029 -129295 -225409 527472 1587237 1590411 1732145
9313 1732145 2385599 1741397 520257 -789115 -1133166 -1063134 -586842 253205 257588 -22689
9303 -22689 -707293 -679711 783786 2569238 3370560 3424887 2842628 2113470 61215 -1852116
9293 -1852116 -2006352 -946100 -79005 796498 1271264 1007011 171869 -142132 177595
9284 177595 -790691 -1404907 -1779955 -1342726 200885 624907 -166932 -918263 -622221 -344662
9274 -344662 -215100 1006984 1447980 1251427 500180 -1095323 -2641250 -2694198 -2390952
9265 -2390952 -2454645 -1840315 -1880490 -1681374 -792753 -731214 -1453765 -540724 1365398 2294453
9255 2294453 2112891 1871338 2159146 1709816 818583 197032 -444646 -458461 -1294525 -2084056
9245 -2084056 -798597 -481870 -182550 292564 56348 184610 389611 141112 -9727
9236 -9727 -146827 -392721 -1098166 -538607 596086 652183 -67761 -1008824 -1844727 -2461540
9226 -2461540 -3128021 -3216736 -2190591 -1388425 -970943 -364715 -439733 -183812 75363 302658
9216 302658 -601596 -2596310 -3337777 -2157172 -375072 -1183 -208290 -21121 776117
9207 776117 1790975 2431230 2317792 1831865 2017425 680815 -1258196 -1815920 -1934021
9198 -1934021 -1389829 -803937 -718234 -540468 57771 307525 673708 -76887 -237038 -425452
9188 -425452 -1480581 -2030532 -1928291 -2127663 -1828746 -1587303 -1048127 -698014 450359
9179 450359 333373 -1292619 -1325560 -759390 -321405 -286213 -618023 165008 329155 -953514
9169 -953514 -1929125 -2315606 -2244952 -1039847 317099 1263012 1398193 2035968 1635326 257229
9159 257229 -875898 -1167903 -536083 -523029 -740495 -309443 674284 1389766 1932337 1380838
9149 1380838 679366 912802 1785753 1889463 1689225 1845973 2275536 2727722 3016916 2432110
9139 2432110 727956 -718074 -1675230 -2550934 -3016032 -1840980 270071 746766 39559
9130 39559 -384941 -443826 -182269 491354 455022 -217071 -963373 -1133294 -1214303 -1232070 -1444801
9119 -1444801 -1665392 -748039 -96794 -416090 -738590 -350336 -1133135 -1558847 -279403
9110 -279403 663944 1117175 1180160 1383397 2265658 2652144 967134 -490823 -1044799 -2029680
9100 -2029680 -1755048 -569250 -338482 125994 56566 -402521 -890979 -1225692 -1522576 -1613262
9090 -1613262 -1604027 -1399424 -1669613 -2001189 -821615 551242 801997 417344 992226 264474
9080 264474 -1420502 -3205561 -3629177 -2790779 -2586325 -2109876 -1189085 -631158 -394842
9071 -394842 -452734 -1150032 -900823 211361 1487310 1772840 1754388 2265673 1312906 -58284
9061 -58284 925068 1961513 1953151 1188266 -221109 -873250 -1255457 -1485821 -1714786 -1327220
9051 -1327220 -1319450 -1475526 -2427879 -1947664 213379 1840269 2783955 2248218 1005334
9042 1005334 257370 -831365 -1749365 -1505286 -208577 529622 -450461 -1302768 -1839239
9033 -1839239 -2802127 -3260896 -1807308 -1392834 -2064009 -1607236 -1388267 -2592266 -2635890
9024 -2635890 -1585336 -1199730 -1382247 -1160596 -164090 1214076 2349631 2745806 1712088
9015 1712088 618513 1045806 957286 -35057 -1108442 -1085339 -256832 564796 1285097 317193
9005 317193 -284060 -219649 -1124920 -2426275 -3303092 -3490955 -3130170 -2140933 -1167363 -551902
8995 -551902 438607 228606 -1303466 -2636108 -3198405 -2495016 -1619515 -1475751 -2025393
8986 -2025393 -2495328 -1566562 -891938 -186369 280133 -125543 -129823 167123 -371825 -592229
8976 -592229 -712489 -1676232 -2290234 -2058860 -2058745 -1554052 -1941370 -2044498 -412302 1357527
8966 1357527 1777383 2424054 2967278 3226727 3099856 2168073 790056 -517708 -1895535
8957 -1895535 -2023459 -1412253 -1567729 -1342793 -661697 623172 925428 973105 1199780 1448140
8947 1448140 2034961 1801705 1852559 1449814 1406008 3020392 3213060 1539859 -67219
8938 -67219 -706596 -731217 -562085 -705931 -1132962 -1606802 -1234335 204651 1260741 1583963
8928 1583963 1254639 365399 -689531 -483084 -20480 -441913 -1362878 -1784996 -1472537
8919 -1472537 -867366 -375810 -674729 -925219 -914875 -988096 -578658 219426 1011236 1365622
8909 1365622 891272 395227 865031 1241810 1386558 1905403 1562937 399756 -1431214
8900 -1431214 -2208886 -1769383 -1834355 -1580813 -1471747 -1618294 -1082311 -571721 106756 117896
8890 117896 209466 207871 -178711 -548118 -318814 -292431 84253 764633 17008 -595925
8880 -595925 600166 480665 551077 1307333 1139926 734530 426818 238662 186628 395277
8870 395277 639852 95382 -391452 514847 1728214 2346221 2527138 1901232 463831
8861 463831 239588 578348 -80860 -426649 -287318 -540682 -498936 95365 4217 -414456
8851 -414456 -953951 -1338682 -952399 -1023501 -1492718 -1958406 -2020205 -2016208 -703519 196538
8841 196538 -626006 -1666374 -2900167 -3790118 -4070971 -3630839 -2493991 -417703 945774
8832 945774 1152405 1267060 637022 544961 -214289 -591664 -260166 -1131639 -512631 944440
8822 944440 1418782 956557 538123 810731 1271252 558807 -550266 -393245 173131 -815036
8812 -815036 -1602107 -1777574 -1237166 173598 -82601 -779558 -173523 160853 -198984 -365030
8802 -365030 126208 -257003 -1062979 -1169207 -902733 -130032 -414781 -1069067 -993411 -1215913
8792 -1215913 -1367578 -1179056 -496539 -14039 -469152 -1410015 -1411338 -824605 -670809 -1089209
8782 -1089209 -740031 -850349 -984609 -346864 568007 1919756 2275237 2364468 1491435 638529
8772 638529 978590 1353093 1630815 2308556 1490404 -439226 -1311490 -1554729 -2189861 -2117936
8762 -2117936 -1535134 -1386597 -910577 -144685 543003 506633 -594492 -1059547 -183379 546896
8752 546896 948418 1263349 845037 803392 942173 541096 994427 1155920 1110861 1083366
8742 1083366 1139120 675270 -956420 -1714128 -1410001 -1264578 -1598316 -2045518 -2529264 -3316655
8732 -3316655 -3476184 -2948844 -2876993 -3426580 -3197503 -2989986 -2905829 -2740335 -1846922 -1284025
8722 -1284025 -796165 -121573 33347 -80413 -332982 -299115 1241805 2398083 2142532
8713 2142532 1187799 604435 1546715 2863107 2530621 484075 -652835 -492487 -871366
8704 -871366 -1036921 -348454 536271 1599430 2225055 1677563 1003439 1161328 1823883 2424564
8694 2424564 2524104 2156990 1832856 1393775 337159 -765160 -1285384 -1691401 -2021393
8685 -2021393 -2063264 -727852 782428 861336 390715 -361504 -1014355 -82649 1416658
8676 1416658 1616101 84563 -1566150 -1259276 184401 1209719 254603 -37884 1254142
8667 1254142 1919447 1240356 -145753 -982418 -531042 1050910 1187678 -225063 65755
8658 65755 1777551 2856059 2259203 1477225 817689 -71072 -959566 -878153 -1020943 -488981
8648 -488981 445358 943646 1216383 1301449 1399327 453170 -286651 -555545 -1036572 -949301
8638 -949301 -423318 550871 1391087 1291710 923110 -148823 -1019706 -753320 -269832 -1109935
8628 -1109935 -1468558 -1318586 -832891 577302 311639 -469108 423310 1428375 2080877
8619 2080877 2094822 1438378 712859 458947 666877 1613142 2496045 2738727 2593509 2661344
8609 2661344 2843371 2299195 1435391 1487510 1521134 1100216 1230831 1700586 2234665 2411677
8599 2411677 2739100 2865566 2223702 501895 -470567 86938 1121690 1614885 2000829
8590 2000829 1452978 585199 247093 712208 1505629 2156195 3471346 4616477 5048011
8581 5048011 5768981 6993758 9485824 14501148 23461139 34782347 39413767 33043959
8573 33043959 22876436 15124249 10128779 6743245 4537006 3017556 2280864 2667969
8565 2667969 2464583 1666093 815547 1376175 1967766 1264383 455038 -659351 -1194012
8556 -1194012 -1132770 -910232 -147191 548145 696406 1261936 2132626 2735268 2200858 2308918
8546 2308918 2099140 2033665 1211919 626709 992982 1089319 1534567 1239506 477437 44950
8536 44950 -557647 -1076142 -389456 742102 1037046 829205 173190 123815 360543 -132822
8526 -132822 -270032 293243 1031922 1028488 34830 -759718 -1155722 -1786794 -1233196 -145994
8516 -145994 -333306 -477918 151708 707360 926885 -227349 -2018426 -3487416 -2861855
8507 -2861855 -1321976 -489810 -487400 -562657 -1230606 -1208776 -544002 -115295 862317 2329196
8497 2329196 3421694 3192984 3140256 2949357 1625191 -96871 -673726 444677 1696373
8488 1696373 1988022 1835985 1426205 1420616 941498 554827 -67823 -453580 -771983 -565782
8478 -565782 -634144 -672441 -1301255 -1280776 -841964 -135799 485693 148594 -198571 262454
8468 262454 745383 922808 685263 677646 934585 605415 -286291 -107288 48087 -42712
8458 -42712 487157 799166 567921 396921 -202211 -1584180 -1685544 -712234 -25729 100707
8448 100707 81316 -132141 -520868 -15160 1653136 1759056 2129845 3060049 2772577 1371157
8438 1371157 592667 450651 -319044 -1013991 -2059902 -2342650 -1663882 -1507219 -1425975 -1338979
8428 -1338979 -2333660 -3271921 -2816829 -1894757 -371195 657696 372807 -487585 -1079494
8419 -1079494 -445162 -259927 38495 974616 1209125 1289873 1043267 582510 304382 -50840
8409 -50840 -68593 -252579 -252350 1223735 2247816 2629401 2070917 1859348 1857339 1395495 782809
8398 782809 22456 -1509824 -1895607 -1467297 -1676805 -1311478 -125181 18348 -415134
8389 -415134 -600824 -888437 -187049 395947 492596 286843 562549 810369 344235 306072
8379 306072 287103 180897 -1085150 -2854916 -3589804 -3440021 -1945197 185567 1861455
8370 1861455 2346953 1985957 1842336 867893 -89298 -427312 -528567 -739706 -609839 85624
8360 85624 -192738 38715 275177 89505 24067 -16813 -459857 -665492 -404973 -430491
8350 -430491 -472304 -1062468 -1097524 -1251786 -988697 149814 738747 -435140 -1894808 -2707717
8340 -2707717 -1820557 -446040 611879 1169022 339192 -80261 308807 130566 34883
8331 34883 45913 34977 -776003 -1527889 -1082831 -835099 -1515657 -2101048 -1993875 -1740905
8321 -1740905 -2055302 -2318690 -2380067 -2532484 -1420958 -509880 -92855 387136 1320610 1880077
8311 1880077 1930410 1862584 1659456 423811 -714673 -1970398 -2966107 -2292200 -1150435
8302 -1150435 -271593 575536 1635976 1464123 1744695 2536599 2028106 1681461 2016323
8293 2016323 1448711 982848 628959 572981 1206716 1744100 1843103 1780045 1935300 2406008
8283 2406008 2314676 1514449 1036121 857408 486821 36446 -732650 -1248957 -418563 -157258
8273 -157258 -733203 -236812 65915 -48465 24686 310524 573964 1541266 3209597 2982158
8263 2982158 954999 -767925 -1590121 -1915364 -1673689 -708230 182272 850228 2054746
8254 2054746 2762795 2512772 2121269 1235773 832125 1514985 2558546 1679153 404526
8245 404526 -68172 -1061580 -2388763 -1928153 -1046095 -718107 -277635 -337955 -145029 233979
8235 233979 427017 -300473 -470940 37469 -124965 -956889 -1849621 -2176287 -1798399 -269385
8225 -269385 1365009 2088824 1970150 1027932 1350414 1085586 407528 -659689 -1879293
8216 -1879293 -1376318 -250648 289256 915133 1593949 1464623 -15392 -614415 158833
8207 158833 853842 1649847 1829638 1488672 253977 -460392 258335 -216394 -630473 38739
8197 38739 373193 1244372 1752957 2004582 2407352 2499500 2367191 1963893 780838 -183550
8187 -183550 -171460 -401301 -322231 -120451 -244654 550199 1160369 735145 -204928 -681611
8177 -681611 -186575 -32586 -936611 -1070766 -766299 -1836621 -2431109 -2559343 -2625146 -3425141
8167 -3425141 -3015752 -1064441 659929 2167574 2412215 2062797 1525568 1193706 770662
8158 770662 34675 432310 1503641 2344800 2771931 2737120 2138136 2005882 3146934 3729014
8148 3729014 3432066 2358407 1983776 2259638 2065478 1816569 1415382 800322 -226435
8139 -226435 -1223588 -421845 510716 -119952 -864239 -1559013 -1475524 -1941247 -2365100 -2611006
8129 -2611006 -2499542 -2120068 -1682002 -258539 1773170 2905229 2526024 850926 -530655
8120 -530655 -955102 -287079 -427939 -680973 -559190 -116636 391107 -283584 -1048936 -728025
8110 -728025 795420 1695762 2373417 2392748 1878204 1281037 934055 201532 -920453 -1100939
8100 -1100939 19676 -115041 -825926 -385244 576366 438212 -577381 -1982513 -1541360
8091 -1541360 240151 1643660 2540013 1894764 1001303 794051 638537 701825 34479
8082 34479 234881 459211 970826 1103096 -3263 -405191 -20387 -56606 -1285417 -2116667
8072 -2116667 -1077002 -292602 -772746 -1306087 -1935956 -2471987 -2017200 -1338590 -387842
8063 -387842 46623 -734531 -382880 470362 1127908 1250107 283222 -150242 172783 -157081
8053 -157081 -935678 -1789594 -1879246 -1485188 -1492974 -2018733 -2228861 -2432963 -2926574 -3194873
8043 -3194873 -2002326 -1237269 -1403314 -778575 -540144 -1219717 -2154993 -2668482 -2728638 -2531976
8033 -2531976 -1638455 -824480 -154741 138162 745332 758008 654337 297817 1102191 2205671
8023 2205671 2342895 1634002 682039 550221 434373 928575 1478663 1813986 2275896 2505044
8013 2505044 2247349 1333756 670286 28294 -212451 -470511 -684367 -807077 -547746 -187524
8003 -187524 74694 725422 457108 -1121490 -2014101 -2232599 -2460403 -2950254 -3306195 -2449961
7993 -2449961 -1876402 -2532847 -2016897 -1077235 -1185062 -413463 456524 673996 -151477 -1401525
7983 -1401525 -1076837 535920 1441741 1715835 947138 176278 -603041 -1625508 -2017441
7974 -2017441 -1598654 -504796 504390 1401087 1404530 1007100 521421 469302 1041862 1541546
7964 1541546 1913223 1947034 1615201 453322 -878218 -655220 1176527 2346271 2238014
7955 2238014 1615304 1412529 1548446 1257049 1559463 742610 -501470 183025 1539718
7946 1539718 2230338 2423637 2083035 2218972 1664819 835661 -682478 -1262451 -757379
7937 -757379 -170775 646273 709192 755291 1559613 1911849 1570100 562939 -169861 141342
7927 141342 550956 575471 -36545 -381523 -1260156 -2078395 -2173013 -1524656 -811844 -1348971
7917 -1348971 -2054528 -2168396 -2750649 -3681737 -4105291 -2935351 -1573751 -890983 -6168
7908 -6168 838771 803148 314340 -437689 -915990 -627727 213820 1103116 952272 810873
7898 810873 1688760 1272246 1046207 979890 -69918 -611477 -1002216 -1233358 -1800680 -1931234
7888 -1931234 -889564 254510 1082935 1433124 882442 333965 743868 1123051 435923
7879 435923 316830 930927 1862714 2250279 2303688 1816141 1685919 1322947 726795 -49990
7869 -49990 -308985 537077 1608414 2091864 1601933 1478161 1412385 725807 62597 -1263769
7859 -1263769 -2795235 -2533687 -1473522 -778083 -269022 453248 1313844 1437694 1093501
7850 1093501 646292 -351563 -1148680 -757639 516961 864977 836342 1773723 2485668 2000574
7840 2000574 2475454 2343173 1190176 -120102 -1266404 -1252786 -408383 347712 881042
7831 881042 461779 -79944 -893270 -1200729 -554988 398749 1556712 1704325 1206706 1453410
7821 1453410 1431249 891636 730885 213198 -630114 -572688 -208032 263135 120517 -1289142
7811 -1289142 -2144564 -2211534 -2577724 -2263031 -773850 143407 -84 -570836 -39138 1299805
7801 1299805 1403181 237890 -1488439 -1084803 558977 991973 -266903 -662158 -398157
7792 -398157 -324158 -521850 -242300 74845 -11408 -350113 -256141 -83642 295014 1580118
7782 1580118 2563438 3352337 3818339 4938863 7303427 8444903 9363657 11496105 15268227
7773 15268227 21340587 29227293 33779896 30312725 22663060 16761099 12238189 9663873
$$ [...]
##END NTUPLES=NMR SPECTRUM
##END=
