##TITLE=C13_L2-SePh(IPS-f3)
 CDCl3, 2600 sc

 5.03.2019
##JCAMPDX= 6.0         $$ Bruker NMR JCAMP-DX V2.0
##DATA TYPE= NMR SPECTRUM
##DATA CLASS= NTUPLES
##ORIGIN= UXNMR, Bruker Analytische Messtechnik GmbH
##OWNER= root
$$ XWIN-NMR		Version 3.5
$$ Wed Mar  6 13:45:04 2019 Russian Standard Time (UT+4h)  she@DPX200
##.OBSERVE FREQUENCY= 50.32789651
##.OBSERVE NUCLEUS= ^13C
##.ACQUISITION MODE= SIMULTANEOUS
##.ACQUISITION SCHEME= undefined
##.AVERAGES= 21260
##.DIGITISER RES= 17
##SPECTROMETER/DATA SYSTEM= spect
##.PULSE SEQUENCE= zgpg30
##.SOLVENT NAME= CDCl3
##.SHIFT REFERENCE= (INTERNAL, CDCl3, 0, 222.653)
##AUDIT TRAIL= $$ (NUMBER, WHEN, WHO, WHERE, WHAT)
$$ ##TITLE= Audit trail, XWIN-NMR		Version 3.5
$$ ##JCAMPDX= 5.01
$$ ##ORIGIN= Bruker BioSpin GmbH
$$ ##OWNER= she
$$ F:/spectra/data/she/nmr/c13/2/pdata/1/auditp.txt
$$ ##AUDIT TRAIL=  $$ (NUMBER, WHEN, WHO, WHERE, WHAT)
(   1,<2019-03-06 09:44:54.25 +0400>,<she>,<DPX200>,
      <created by zg, POWCHK disabled, PULCHK disabled
       terminated by command 'halt'
       configuration hash MD5:
       00 E9 B6 7A A2 85 ED C7 34 08 36 98 17 FE 4E 26
       data hash MD5: 32K
       25 24 51 CF 52 6E C0 26 84 16 7B BD DD 07 79 97>)
(   2,<2019-03-06 13:42:23.07 +0400>,<she>,<DPX200>,
      <Start of raw data processing
       efp BC_mod = 2 LB = 1 FT_mod = 6 PKNL = 1 PHC0 = 1460.424 PHC1 = 17.86678 SI = 32K 
       data hash MD5: 32K
       1A D2 A4 77 3A AF 84 D1 33 63 D7 B2 8A 32 10 90>)
(   3,<2019-03-06 13:42:31.53 +0400>,<she>,<DPX200>,
      <abs ABSG = 5 
       data hash MD5: 32K
       FB F0 36 16 DD 8C 99 84 D0 73 3D D3 25 BA E3 62>)
(   4,<2019-03-06 13:43:15.84 +0400>,<she>,<DPX200>,
      <pk PHC0 = 8.260848 PHC1 = -12 
       data hash MD5: 32K
       83 9F EC 3A 2A 87 2C 5F B9 14 FC CF 05 15 B1 07>)
(   5,<2019-03-06 13:43:19.26 +0400>,<she>,<DPX200>,
      <abs ABSG = 5 
       data hash MD5: 32K
       71 C6 B8 09 27 18 EF E5 99 6B A1 48 0F 53 1A 95>)
$$ ##END=
$$ 
$$ hash MD5
$$ 60 BD 0B 8E 70 3E 65 0A 2C B8 40 2A 64 DC 25 A5
##$RELAX= 
##$RELAX= 
##$RELAX= 
##$RELAX= 
##$RELAX= 
##$RELAX= 
##$RELAX= 
##$RELAX= 
$$ Bruker specific parameters
$$ --------------------------
##$DU= <F:/spectra>
##$EXPNO= 2
##$NAME= <c13>
##$PROCNO= 1
##$TYPE= <nmr>
##$USER= <she>
##$AMP= (0..31)
100 100 100 100 100 100 100 100 100 100 100 100 100 100 100 100 100 100 
100 100 100 100 100 100 100 100 100 100 100 100 100 100 
##$AQSEQ= 0
##$AQ_mod= 1
##$AUNM= <au_zg>
##$AUTOPOS= <>
##$BF1= 50.322709
##$BF2= 200.13
##$BF3= 50.322709
##$BF4= 500.13
##$BF5= 500.13
##$BF6= 500.13
##$BF7= 500.13
##$BF8= 500.13
##$BYTORDA= 1
##$CFDGTYP= 0
##$CFRGTYP= 5
##$CHEMSTR= <none>
##$CNST= (0..31)
1 1 145 1 1 1 1 1 1 1 1 1 1 1 1 1 1 1 1 1 1 1 1 1 1 1 1 1 1 1 1 1 
##$CPDPRG= <waltz16>
##$CPDPRG1= <>
##$CPDPRG2= <waltz16>
##$CPDPRG3= <>
##$CPDPRG4= <mlev>
##$CPDPRG5= <mlev>
##$CPDPRG6= <mlev>
##$CPDPRG7= <mlev>
##$CPDPRG8= <mlev>
##$CPDPRGB= <>
##$CPDPRGT= <>
##$D= (0..31)
$$ [...]
##$SUBNAM4= <"">
##$SUBNAM5= <"">
##$SUBNAM6= <"">
##$SUBNAM7= <"">
##$SUBNAM8= <"">
##$SUBNAM9= <"">
##$SW= 239.972172959595
##$SWIBOX= (0..15)
0 1 3 0 0 0 0 0 0 0 0 0 0 0 0 0 
##$SW_h= 12077.2946859903
##$TD= 32768
##$TD0= 1
##$TE= 0
##$TE2= 300
##$TE3= 300
##$TEG= 300
##$TL= (0..7)
120 120 120 120 120 120 120 120 
##$TP= (0..7)
150 150 150 150 150 150 150 150 
##$TP07= 0
##$TPNAME0= <>
##$TPNAME1= <>
##$TPNAME2= <>
##$TPNAME3= <>
##$TPNAME4= <>
##$TPNAME5= <>
##$TPNAME6= <>
##$TPNAME7= <>
##$TPOAL= (0..7)
0.5 0.5 0.5 0.5 0.5 0.5 0.5 0.5 
##$TPOFFS= (0..7)
0 0 0 0 0 0 0 0 
##$TUNHIN= 0
##$TUNHOUT= 0
##$TUNXOUT= 0
##$USERA1= <user>
##$USERA2= <user>
##$USERA3= <user>
##$USERA4= <user>
##$USERA5= <user>
##$V9= 5
##$VALIST= <valist>
##$VCLIST= <CCCCCCCCCCCCCCC>
##$VD= 0
##$VDLIST= <DDDDDDDDDDDDDDD>
##$VPLIST= <PPPPPPPPPPPPPPP>
##$VTLIST= <TTTTTTTTTTTTTTT>
##$WBST= 1024
##$WBSW= 4
##$XGAIN= (0..3)
0 0 0 0 
##$XL= 0
##$YL= 0
##$YMAX_a= 105585918
##$YMIN_a= -26444832
##$ZGOPTNS= <>
##$ZL1= 120
##$ZL2= 120
##$ZL3= 120
##$ZL4= 120
##$ABSF1= 222.6533
##$ABSF2= -17.34351
##$ABSG= 5
##$ABSL= 3
##$ALPHA= 0
##$AQORDER= 0
##$ASSFAC= 0
##$ASSFACI= 0
##$ASSFACX= 0
##$ASSWID= 0
##$AUNMP= <proc_1d>
##$AZFE= 0.1
##$AZFW= 0.5
##$BCFW= 0
##$BC_mod= 2
##$BYTORDP= 0
##$COROFFS= 0
##$CY= -3
##$DATMOD= 1
##$DC= 0
##$DFILT= <>
##$DTYPP= 0
##$F1P= 0
##$F2P= 0
##$FCOR= 0.5
##$FTSIZE= 32768
##$FT_mod= 6
##$GAMMA= 0
##$GB= 0
##$INTBC= 1
##$INTSCL= 1.329259e-09
##$ISEN= 128
##$LB= 1
##$LEV0= 0
##$LPBIN= 0
##$MAXI= 10000
##$MC2= 0
##$MEAN= 0
##$ME_mod= 0
##$MI= 0.9312502
##$NCOEF= 0
##$NC_proc= 2
##$NLEV= 6
##$NOISF1= 120.0001
##$NOISF2= 80.00006
##$NSP= 0
##$NTH_PI= 0
##$NZP= 0
##$OFFSET= 222.6533
##$PC= 1.4
##$PHC0= 1468.685
##$PHC1= 5.866779
##$PH_mod= 1
##$PKNL= yes
##$PPARMOD= 0
##$PSCAL= 0
##$PSIGN= 0
##$REVERSE= no
##$SF= 50.3227306370915
##$SI= 32768
##$SIGF1= 140
##$SIGF2= 120
##$SINO= 35.31775
##$SIOLD= 32768
##$SREGLST= <13C.CDCl3>
##$SSB= 0
##$STSI= 32768
##$STSR= 0
##$SW_p= 12077.2946859903
##$SYMM= 0
##$S_DEV= 0
##$TDeff= 32768
##$TDoff= 0
##$TI= <>
##$TILT= no
##$TM1= 0
##$TM2= 0
##$TOPLEV= 0
##$USERP1= <user>
##$USERP2= <user>
##$USERP3= <user>
##$USERP4= <user>
##$USERP5= <user>
##$WDW= 1
##$XDIM= 32768
##$YMAX_p= 462491677
##$YMIN_p= -2653033
$$ End of Bruker specific parameters
$$ ---------------------------------
##NTUPLES= NMR SPECTRUM
##VAR_NAME=  FREQUENCY,     SPECTRUM/REAL,   SPECTRUM/IMAG
##SYMBOL=    X,             R,               I
##VAR_TYPE=  INDEPENDENT,   DEPENDENT,       DEPENDENT
##VAR_FORM=  AFFN,          ASDF,            ASDF
##VAR_DIM=   32768,         32768,           32768
##UNITS=     HZ,            ARBITRARY UNITS, ARBITRARY UNITS
##FACTOR=    0.368581032318806, 1,           1
##FIRST=     11204.5222956761, 0,            0
##LAST=      -872.772390314241, 0,           0
##MIN=       -872.772390314241, -2653033,    0
##MAX=       11204.5222956761, 462491677,    0
$$ Real data points
##PAGE= N=1
##DATA TABLE= (X++(R..R)), XYDATA
$$ [...]
$$ plain form
15838 -273089 -496467 -731446 -330167 429924 412301 449880 934634 1009377 428497 -21551
15828 -21551 -311012 -168787 -77632 -358989 -258516 -138887 343 40919 -30275 132098
15818 132098 199558 -40168 -157113 217425 315860 126932 -94671 -293636 -648226 -1100410
15808 -1100410 -1301976 -1221105 -1154341 -684089 -16778 426523 799398 956677 779549 537663
15798 537663 233955 63305 5780 -342786 -727796 -907133 -815891 -154689 404395 598907
15788 598907 364523 -65065 59139 263148 407560 589069 970702 1015493 909034 574882
15778 574882 417116 726375 1027638 985829 574120 265515 138989 41745 -169029 -344004
15768 -344004 -459144 -727301 -863786 -793597 -657035 -753958 -815107 -824284 -695691 -756109 -805505
$$ packed form
15838b73089k23378k34979M01279P60091j7623L7579M84754P4743n80880m50048
15828b1551k89461J42225R1155k81357J00473J19629J39230M0576p1194J62373
15818A32098O7460k39726j16945L74538R8435j88928k21603j98965l54590m52184
15808a100410k01566Q0871O6764M70252O67311M43301L72875J57279j77128k41886
15798E37663l03708j70650n7525l48566l85010j79337R1242O61202N59084J94512
15788E98907k34384m29588J24204K04009J44412J81509L81633M4791j06459l34152
15778E74882j57766L09259L01263m1809m11709l08605j26526r7244k10774j74975
15768c44004j15140k68157j36485P0189J36562r6923o1149r177J28593o0418m9396
$$ plain form
15757 -805505 -714644 -717435 -110875 795907 1315463 1215492 655602 161136 -317598 -497205
15747 -497205 -432801 -314399 151708 755444 917511 505418 315588 632446 617842 469904
15737 469904 62050 -297028 -35504 80042 -23088 88210 50202 -38237 -113895 -412088
15727 -412088 -556823 -384161 -142252 132442 277940 90754 -154884 -219049 64384 218455
15717 218455 345479 410683 694335 1012066 957008 650831 87435 -424577 -453066 -350155
15707 -350155 -473503 -529046 -429742 -400522 -442340 -229692 -275947 -324416 -150302 300697 700736
15696 700736 952830 1121079 1112608 578418 43159 327268 1042592 1111862 946863 1137560
15686 1137560 933431 340283 -55553 -22560 -249472 -541127 -500671 -259612 153942 482139
$$ packed form
15757h05505R0861k791O06560R06782N19556r9971n59890m94466m78734j79607
15747d97205O4404J18402M66107O03736J62067m12093j89830L16858j4604j47938
15737D69904m07854l59078K61524J15546j03130J11298l8008q8439p5658k98193
15727d12088j44735J72662K41909K74694J45498j87186k45638o4165K83433J54071
15717B18455J27024O5204K83652L17731n5058l06177n63396n12012k8489J02911
15707c50155j23348n5543R9304K9220m1818K12648m6255m8469J74114M50999M00039
15696G00736K52094J68249q471n34190n35259K84109P15324O9270j64999J90697
15686A137560k04129n93148l95836L2993k26912k91655M0456K41059M13554L28197
$$ plain form
15676 482139 742861 1178290 1263986 909452 580447 465097 355838 486526 895467 1107888
15666 1107888 856033 858487 614980 -98427 -608637 -743776 -568392 -512621 -550690 -327612
15656 -327612 396252 980860 1133043 743640 73042 -408219 -401248 -482140 -747089 -845135
15646 -845135 -495537 14763 526906 876887 908938 714180 500280 588596 454702 140488
15636 140488 -163667 -88566 -36502 -140391 -280993 -282630 -473920 -828302 -658817 -238128
15626 -238128 -96532 -273868 -21150 367580 72405 -483243 -736347 -312175 -280398 -415720
15616 -415720 -151322 -289468 -180127 -133314 -315100 -312486 -374601 -434661 -175324 8859
15606 8859 -427957 -750212 -518426 -163195 -30507 -118451 -86247 -174718 -272594 -755398 -1076333
$$ packed form
15676D82139K60722M35429Q5696l54534l29005j15350j09259J30688M08941K12421
15666A107888k51855K454k43507p13407n10210j35139J75384N5771l8069K23078
15656c27612P23864N84608J52183l89403o70598m81261O971q0892k64949r8046
15646h45135L49598N10300N12143L49981L2051j94758k13900Q8316j33894l14214
15636A40488l04155P5101N2064j03889j40602j637j91290l54382J69485M20689
15626b38128J41596j77336K52718L88730k95175n55648k53104M24172L1777j35322
15616d15720K64398j38146J09341M6813j81786K614o2115o0060K59337J84183
15606H859m36816l22255K31786L55231J32688q7944L2204q8471r7876m82804l20935
$$ plain form
15595 -1076333 -1110049 -925124 -569452 -427944 -452258 -334442 -373358 -310112 -101325 -60889
15585 -60889 -277543 -376842 -431361 -527510 -499029 -402767 44645 133091 17399 363057 589875
15574 589875 734764 1120012 997730 332472 99302 157642 43801 -215322 -212661 -62157
15564 -62157 -72489 -225312 -444363 -369886 -328377 -328053 -313781 -155655 352559 326002 -399201
15553 -399201 -709956 -420985 -91435 56024 130812 11336 -17215 -188150 -311929 174161
15543 174161 543663 215224 -367760 -415579 -357107 -313315 183246 477075 348536 35644
15533 35644 -285621 -391167 -317903 -179414 -233414 -11768 59480 -441980 -721082 -695276
15523 -695276 -885321 -1373511 -1479245 -1211654 -1025401 -591976 -109949 236075 157925 202488
$$ packed form
15595a076333l3716J84925L55672J41508k4314J17816l8916O3246K08787M0436
15585f0889k16654r9299n4519r6149K8481R6262M47412Q8446j15692L45658K26818
15574E89875J44889L85248j22282o65258k33170N8340j13841k59123K661J50504
15564f2157j0332j52823k19051P4477M1509L24J4272J58126N08214k6557p25203
15553c99201l10755K88971L29550J47459P4788j19476k8551j70935j23779M86090
15543A74161L69502l28439n82984m7819N8472M3792M96561K93829j28539l12892
15533C5644l21265j05546P3264J38489n4000K21646P1248n01460k79102K5806
15523f95276j90045m88190j05734K67591J86253M33425M82027L46024p8150M4563
$$ plain form
15513 202488 149506 201 -376028 -890111 -1045501 -1063193 -996041 -824936 -652705 -282917
15503 -282917 221221 491486 618702 198199 -134347 -300636 -159055 -47712 -261013 -350545
15493 -350545 -393986 -358817 -12608 74504 -214807 -298744 -20764 185744 408718 792747
15483 792747 728560 195163 -256427 -614568 -852010 -748917 -438933 -303729 -567093 -929382
15473 -929382 -765768 -697156 -914255 -1379157 -1320097 -1177389 -1362467 -1354712 -1386052 -1180758
15463 -1180758 -668344 -342771 -299007 -175479 -204942 -460228 -607141 -778231 -911667 -819741
15453 -819741 -424865 -306185 -514802 -721326 -608928 -381445 -35843 157902 -248546 -499635
15443 -499635 -448659 -311535 -210776 -110483 121263 260020 318422 589972 895324 786806
$$ packed form
15513B02488n2982j49305l76229n14083j55390j7692O7152J71105J72231L69788
15503b82917N04138K70265J27216m20503l32546j66289J41581J11343k13301q9532
15493c50545m3441L5169L46209Q7112k89311q3937K77980K06508K22974L84029
15483G92747o4187n33397m51590l58141k37442J03093L09984J35204k63364l62289
15473i29382J63614O8612k17099m64902N9060J42708j85078P755l1340K05294
15463a180758N12414L25573M3764J23528k9463k55286j46913j71090j33436R1926
15453h19741L94876J18680k08617k06524J12398K27483L45602J93745m06448k51089
15443d99635N0976J37124J00759J00293K31746J38757N8402K71550L05352j08518
$$ plain form
15433 786806 203745 62756 351184 758576 902102 755537 311538 -128875 -123257 -225066
15423 -225066 -407177 -609591 -865292 -949654 -448485 -171624 -50530 -172260 220421 728377
15413 728377 364619 -132199 -336233 -333511 -349828 -270770 255111 214591 -140428 -439895
15403 -439895 -257462 174179 -86642 -816124 -1252507 -1440881 -1056080 -527086 -426773 -402915
15393 -402915 -44488 67554 -76054 -198239 -491302 -654170 -698140 -541614 -383995 -484876
15383 -484876 -263610 -382812 -365379 105093 412151 288004 -204217 -408217 -274641 58776
15373 58776 354551 544872 170948 -399514 -839451 -944806 -630340 32539 269600 141642
15363 141642 -12666 -236448 -317739 -302571 -209151 140154 435013 618873 763145 632252
$$ packed form
15433G86806n83061j40989K88428M07392J43526j46565m43999m40413N618j01809
15423b25066j82111k02414k55701q4362N01169K76861J21094j21730L92681N07956
15413G28377l63758m96818k04034K722j6317P9058N25881m0520l55019k99467
15403d39895J82433M31641k60821p29482m36383j88374L84801N28994J00313K3858
15393d02915L58427J12042j43608j22185k93063j62868m3970J56526J57619j00881
15383d84876K21266j19202J7433M70472L07058j24147m92221k04000J33576L33417
15373E8776K95775J90321l73924n70462m39937j05355L14466O62879K37061j27958
15363A41642j54308k23782q1291J5168R3420L49305K94859J83860J44272j30893
$$ plain form
15353 632252 559510 411823 69818 -16508 -213901 33273 298519 503484 380343 248734
15343 248734 110932 -73643 -35442 109709 422735 924867 1084764 855593 884532 1042519
15333 1042519 1055652 730669 645963 648648 366143 -84166 -356320 -741832 -744704 -251616
15323 -251616 155889 80303 158642 291200 -74883 -567187 -897996 -992534 -1121138 -1179318
15313 -1179318 -721652 -37722 349298 408159 403363 755783 692866 138224 -435878 -310572
15303 -310572 -155127 -129031 -77056 -179099 -504652 -800825 -936665 -909799 -663411 -671480
15293 -671480 -591232 -277855 -48727 -54184 -460933 -642623 -501243 -467253 -699764 -654720
15283 -654720 -481800 -102610 663278 1185218 1348110 1359244 1133929 1060905 935881 775443
$$ packed form
15353F32252p2742j47687l42005q6326j97393K47174K65246K04965j23141j31609
15343B48734j37802j84575L8201J45151L13026N02132J59897k29171K8939J57987
15333A042519J3133l24983q4706K685k82505m50309k72154l85512k872M93088
15323b51616M07505p5586P8339J32558l66083m92304l30809r4538j28604n8180
15313a179318M57666O83930L87020N8861m796L52420o2917n54642n74102J25306
15303c10572J55445K6096N1975j02043l25553k96173j35840K6866K46388q069
15293f71480Q0248L13377K29128n457m06749j81690J41380L3990k32511M5044
15283f54720J72920L79190P65888N21940J62892J1134k25315p3024j25024j60438
$$ plain form
15273 775443 495082 -473 -246865 -363568 -418162 -433994 -292001 149413 680372 846733
15263 846733 707341 530336 5282 -90454 -256465 -867805 -982717 -860433 -1089095 -1381856
15253 -1381856 -1121216 -694768 -350991 -32410 86502 200488 53356 -408459 -311476 71524
15243 71524 289547 275532 -226038 17842 476009 495573 442905 431943 370139 316091 212554
15232 212554 237575 390503 357059 204733 155292 32499 -202788 -433894 -408344 -598101
15222 -598101 -837958 -890083 -701162 -792987 -816916 -509364 -413619 -433658 -725144 -534358
15212 -534358 -219979 -380504 -441664 -371465 -495471 -325290 111991 179798 137584 176089
15202 176089 249640 494336 463361 429365 648104 737240 1313607 1985286 1960806 1784120
$$ packed form
15273G75443k80361m95555k46392j16703n4594j5832J41993M41414N30959J66361
15263H46733j39392j77005n25054r5736j66011o11340j14912J22284k28662k92761
15253a381856K60640M26448L43777L18581J18912J13986j47132m61815R6983L83000
15243G1524K18023j4015n01570K43880M58167J9564n2668j0962o1804n4048j03537
15232B12554K5021J52928l3444j52326m9441j22793k35287k31106K5550j89757
15222e98101k39857n2125J88921r1825k3929L07552R5745k0039k91486J90786
15212e34358L14379j60525o1160P0199j24006J70181M37281O7807m2214L8505
15202A76089P3551K44696l0975l3996K18739Q9136N76367O71679k4480j76686
$$ plain form
15192 1784120 1424755 1002832 487970 133983 71751 586210 1408613 1905849 1502578 968674
15182 968674 577877 339195 548423 707272 529696 335627 268608 413212 386584 -215754
15172 -215754 -805271 -760939 -803638 -1380280 -1625576 -1575395 -1309686 -1115423 -781396 -45898
15162 -45898 -36343 -282884 -177589 -419453 -692725 -616114 -205729 312606 255517 -72772
15152 -72772 -286349 -29385 526799 573381 402882 295214 256781 79469 -327532 -569087
15142 -569087 -171795 -198699 -98410 202788 89458 31550 250990 573774 402776 -96686
15132 -96686 -538472 -559365 -501026 -266437 57459 43630 189617 729634 659556 16417
15122 16417 -252479 48244 159309 301077 281407 226335 309025 8784 -313850 -314503 4720
$$ packed form
15192A784120l59365m21923n14862l53987o2232N14459Q22403M97236m03271n33904
15182I68674l90797k38682K09228J58849j77576j94069o7019J44604k6628o02338
15172b15754n89517M4332m2699n76642k45296N0181K65709J94263L34027P35498
15162d5898R555k46541J05295k41864k73272P6611M10385N18335n7089l28289
15152g2772k13577K56964N56184M6582j70499j07668l8433j77312m07001k41555
15142e69087L97292k6904J00289L01198j13330n7908K19440L22784j70998m99462
15132i6686m41786k0893N8339K34589L23896j3829J45987N40017p0078o43139
15122A6417k68896L00723J11065J41768j9670n5072Q2690l00241l22634o53L19223
$$ plain form
15111 4720 -44508 -25730 152879 270860 402495 117281 -375117 -695702 -534693 -226399
15101 -226399 -153691 37409 154762 109965 196344 -203999 -418406 -674783 -997041 -1126597
15091 -1126597 -1122148 -704882 -229105 -58792 -110292 -241599 -413902 -542914 -187992 499455
15081 499455 444790 23726 -187598 -375691 -231296 98585 329280 395598 654021 763051
15071 763051 415830 -38822 -263879 -220242 134330 265127 373350 454153 410309 348769
15061 348769 442403 462966 -232304 -476753 -329643 -283739 177951 530877 464119 329614
15051 329614 -280163 -588778 -207310 467661 748649 456904 169296 34215 118818 90174
15041 90174 -185660 -78991 -75948 -176479 -283976 -602451 -864125 -689032 -566906 -617698
$$ packed form
15111D720m9228J8778J78609J17981J31635k85214m92398l20585J61009L08294
15101b26399P2708J91100J17353m4797Q6379m00343k14407k56377l22258j29556
15091a126597M449M17266M75777J70313n1500j31307j72303j29012L54922O87447
15081D99455n4665m21064k11324j88093J44395L29881K30695O6318K58423J09030
15071G63051l47221m54652k25057M3637L54572J30797J08223Q0803m3844o1540
15061C48769R3634K0563o95270k44449J47110M5904M61690L52926o6758j34505
15051C29614o09777l08615L81468O74971K80988k91745k87608j35081Q4603k8644
15041I0174k75834J06669L043j00531j07497l18475k61674J75093J22126n0792
$$ plain form
15031 -617698 -761380 -700629 -274608 45178 45463 -198455 -358835 -195305 -290648 -552199
15021 -552199 -668764 -708628 -779843 -927885 -1009128 -527182 -173606 -447989 -786258 -734023
15011 -734023 -564317 -542702 -574159 -636521 -504885 -636447 -768218 -586084 -622423 -368493
15001 -368493 19366 302861 343819 282798 187816 -4452 199109 97366 -449426 -579383
14991 -579383 -47791 217088 165485 -113326 -152649 -171260 -408032 -488667 -418988 -537139
14981 -537139 -623292 -663220 -591687 -640511 -616692 -369228 156559 704748 1076139 873175
14971 873175 463019 303466 180468 127047 89858 -66611 -219357 -450159 -563115 -540513
14961 -540513 -563136 -792100 -768635 -951792 -891028 -546747 -350808 16714 580681 1105457
$$ packed form
15031f17698j43682O0751M26021L19786K85k43918j60380J63530r5343k61551
15021e52199j16565l9864p1215j48042q1243M81946L53576k74383l38269N2235
15011g34023J69706K1615l1457o2362J31636j31562j31771J82134l6339K53930
15001c68493L87859K83495M0958o1021r4982j92268K03561j01743n46792j29957
14991e79383N31592K64879n1603k78811l9323j8611k36772q0635O9679j18151
14981e37139q6153l9928P1533m8824K3819K47464N25787N48189L71391k02964
14971H73175m10156j59553j22998n3421l7189j56469j52746k30802j12956K2602
14961e40513k2623k28964K3465j83157O0764L44281J95939L67522N63967N24776
$$ plain form
14951 1105457 1221463 845764 468736 118065 -216234 -158741 -272877 -254254 -139971 -32750
14941 -32750 360060 627272 189264 -156719 215579 700163 487822 -37842 41291 -23430
14931 -23430 -575834 -905427 -614993 201542 758529 712058 568207 172857 52982 326396
14921 326396 263921 -59118 -105064 16738 -247004 -393153 -302230 -74652 -4631 449027
14911 449027 929733 726556 586497 320707 100361 146886 15566 270366 304882 -238239
14901 -238239 -527662 -458335 -308339 -141159 -202167 -381170 -348491 -322475 -452498 -855953
14891 -855953 -981048 -772830 -352111 -370591 -323353 -198003 -541952 -994405 -831775 -658903
14881 -658903 -388747 -66686 -41890 -413885 -653602 -675310 -805798 -817918 -837997 -575573
$$ packed form
14951A105457J16006l75699l77028l50671l34299N7493j14136J8623J14283J07221
14941c2750L92810K67212m38008l45983L72298M84584k12341n25664P9133o4721
14931b3430n52404l29593K90434Q16535N56987m6471j43851l95350j19875K73414
14921C26396o2475l23039m5946J21802k63742j46149R0923K27578P0021M53658
14911D49027M80706k03177j40059k65790k20346M6525j31320K54800L4516n43121
14901b38239k89423O9327J49996J67180o1008j79003L2679K6016j30023m03455
14891h55953j25095K08218M20719j8480M7238J25350l43949m52453J62630J72872
14881f58903K70156L22061K4796l71995k39717k1708j30488j2120k0079K62424
$$ plain form
14871 -575573 16172 474586 494623 357534 410813 337503 155805 16611 75304 160755
14861 160755 -102540 -511963 -312965 308223 548343 379090 118465 -6191 -136339 -11440
14851 -11440 348371 480637 389338 749286 701374 346734 55152 -43353 67325 254274
14841 254274 69039 -353708 -719485 -1029217 -735368 -520460 -922822 -935421 -731076 -348433
14831 -348433 88952 433047 726910 742814 619708 870969 1224478 1560426 1855178 1709661
14821 1709661 1570304 1192355 437263 -135436 -560479 -583013 -340700 -165393 -218994 -313388
14811 -313388 -146790 476787 861579 684751 428982 415245 164817 -144114 -102986 480937
14801 480937 925742 1105637 804429 194169 -342198 -478999 -379711 -372781 -688311 -955225
$$ packed form
14871e75573N91745M58414K0037j37089N3279p3310j81698j39194N8693Q5451
14861A60755k63295m09423J98998O21188K40120j69253k60625j24656j30148J24899
14851a1440L59811J32266r1299L59948m7912l54640k91582r8505J10678J86949
14841B54274j85235m22747l65777l09732K93849K14908m02362j2599K04345L82643
14831c48433M37385L44095K93863J5904j23106K51261L53509L35948K94752j45517
14821A709661j39357l77949p55092n72699m25043k2534K42313J75307n3601r4394
14811c13388J66598O23577L84792j76828k55769j3737k50428l08931M1128N83923
14801D80937M44805J79895l01208o10260n36367j36801R9288O930l15530k66914
$$ plain form
14791 -955225 -745835 -428005 35174 216900 -55308 27435 498058 609638 159070 -319596
14781 -319596 -603505 -650996 -524424 -160381 31745 109025 143122 35378 -80832 -402
14771 -402 -101638 -18654 366389 478408 630725 559465 449669 525848 393094 137337 50415
14760 50415 32320 -98421 -77322 234049 343131 542 -347939 -690431 -1222226 -1590636
14750 -1590636 -1722048 -1429664 -927126 -687337 -702009 -342147 19388 17001 -255236 -350269
14740 -350269 -440936 -603439 -681023 -575272 -285231 -46918 466388 427994 -116538 -179452
14730 -179452 201941 331062 434447 418320 210671 390395 387016 523685 703407 248753
14720 248753 -290736 -307506 -57591 139202 -106877 -299036 -458529 -1018314 -1309647 -1097420
$$ packed form
14791i55225K09390L17830M63179J81726k72208Q2743M70623J11580m50568m78666
14781c19596k83909m7491J26572L64043J92126P7280L4097j07744j16210Q0430
14771d02j01236Q2984L85043J12019J52317p1260j09796P6179j32754k55757q6922
14760E0415j8095j30741K1099L11371J09082l42589l48481l42492n31795l68410
14750a590636j31412K92384N02538K39789j4672L59862L61535k387k72237r5033
14740c50269r0667j62503p7584J05751K90041K38313N13306l8394n44532o2914
14730a79452L81393J29121J03385j6127k07649J79724l379J36669J79722m54654
14720B48753n39489j6770K49915J96793k46079j92159j59493n59785k91333K12227
$$ plain form
14710 -1097420 -542679 -263464 -231995 -182688 -90430 65817 241323 231985 465474 877499
14700 877499 582920 -1879 -188905 -357363 -924119 -1063369 -1122028 -1068842 -530112 57993
14690 57993 518847 648294 880877 772548 54193 -818836 -945233 -799052 -590940 -126108
14680 -126108 320020 654795 479065 -10561 -254817 -367208 -242474 -18072 105006 241495
14670 241495 397425 229043 46999 -291691 -586135 -493795 -472925 -590301 -690459 -1063417
14660 -1063417 -1410223 -1102789 -568429 -304412 -269681 76044 611220 603554 131766 -119902
14650 -119902 258567 252036 138528 602243 606109 414918 91317 -147840 -340054 107912
14640 107912 282574 -99831 -418164 -566657 -334622 -59406 -209109 -662754 -535692 -283564
$$ packed form
14710a097420N54741K79215L1469M9307R2258J56247J75506r338K33489M12025
14700H77499k94579n84799j87026j68458n66756j39250n8659N3186N38730N88105
14690E7993M60854J29447K32583j08329p18355q73029j26397J46181K08112M64832
14680a26108M46128L34775j75730m89626k44256j12391J24734K24402J23078J36489
14670B41495J55930j68382j82044l38690k94444R2340K0870j17376j00158l72958
14660a063417l46806L07434N34360K64017L4731L45725N35176p666m71788k51668
14650a19902L78469o531j13508M63715L866j91191l23601k39157j92214M47966
14640A07912J74662l82405l18333j48493K32035K75216j49703m53645J27062K52128
$$ plain form
14630 -283564 -466855 -511399 -368925 -90346 -51312 -169501 -153703 -90170 -105962 116234
14620 116234 639483 788334 423821 -373445 -828793 -674818 -517758 -52886 587229 1043417
14610 1043417 1185862 1094634 976110 885229 216998 -368818 -674361 -643798 -71814 363603
14600 363603 279203 -88689 -479228 -893657 -887949 -558743 -453747 -114330 197413 317046
14590 317046 560154 566005 536277 570286 699225 405917 448450 151822 -283689 -442483
14580 -442483 -288462 439329 973438 841158 364284 167201 71761 -262817 -434373 -258592
14570 -258592 -230701 -16226 64606 -85267 -177677 -217885 -429472 -322934 -141583 257244
14560 257244 760102 727823 366231 451816 385401 176610 -131208 -310702 -318846 -418833 -300848
$$ packed form
14630b83564j83291m4544J42474K78579L9034j18189J5798O3533j5792K22196
14620A16234N23249J48851l64513p97266m55348J53975J57060M64872O40115M56188
14610A043417J42445r1228j18524r0881o68231n85816l05543L0563N71984M35417
14600C63603q4400l67892l90539m14429N708L29206J04996L39417L11743J19633
14590C17046K43108N851k9728L4009J28939k93308M2533k96628m35511j58794
14580d42483J54021P27791N34109j32280m76874j97083r5440l34578j71556J75781
14570b58592K7891K14475Q0832j49873r2410m0208k11587J06538J81351L98827
14560B57244N02858l2279l61592Q5585o6415k08791l07818j79494q144r9987J17985
$$ plain form
14549 -300848 163092 519817 601297 1028320 1220821 842227 498453 567996 618376 446213
14539 446213 135576 -36083 209511 518839 441959 -22761 -521123 -584002 -728917 -1239865
14529 -1239865 -1342849 -765852 -222571 -174419 -192061 -163542 -207693 -316179 -498891 -858300
14519 -858300 -938777 -840882 -971426 -740625 -529469 -322680 254501 648992 764369 366242
14509 366242 -258202 -691530 -685816 -648509 -604672 -684788 -555530 -233744 67295 135628 169010
14498 169010 -97772 -661311 -1132941 -1257173 -1324183 -1303539 -1057902 -296152 201438 38818
14488 38818 -77429 46133 331110 118959 109365 397911 649968 519627 144402 101803
14478 101803 588603 797258 534889 486475 180542 -281409 -190452 14121 -20357 9919
$$ packed form
14549c00848M63940L56725Q1480M27023J92501l78594l43774O9543N0380j72163
14539D46213l10637j71659K45594L09328p6880m64720m98362o2879j44915n10948
14529a239865j02984N76997N43281M8152j7642K8519m4151j08486j82712l59409
14519h58300q0477R7895j30544K30801K11156K06789N77181L94491J15377l98127
14509C66242o24444m33328N714L7307M3837q0116J29258L21786L01039O8333L3382
14498A69010k66782n63539m71630j24232o7010K0644K45637P61750M97590j62620
14488C8818j16247J23562K84977k12151r594K88546K52057j30341l75225m2599
14478A01803M86800K08655k62369m8414l05933m61951R0957K04573l4478L0276
$$ plain form
14468 9919 16592 -241496 -274737 -89260 49056 43420 -184755 -102865 261235 683682 793730
14457 793730 301369 -93834 -3364 138725 287607 420080 346564 52392 57183 -86256
14447 -86256 -253243 -334815 -448947 -597915 -625338 -547450 -571472 -832571 -1091177 -778319
14437 -778319 -559409 -533721 -692066 -764795 -550609 -207967 -541844 -1033833 -805022 -678274
14427 -678274 -1021629 -1499423 -1751769 -1622243 -1388639 -1183790 -1156340 -1181789 -999771 -1044728
14417 -1044728 -1339976 -1177295 -955181 -800700 -695157 -513716 -314541 -84811 311217
14408 311217 753481 1146640 1489835 1507556 1199030 412146 -545891 -1000106 -1022020 -906787
14398 -906787 -681705 -668128 -989853 -880750 -509217 -202400 -110181 -398898 -417206 -43942
$$ packed form
14468I919O673k58088l3241J85477J38316n636k28175Q1890L64100M22447J10048
14457G93730m92361l95203R0470J42089J48882J32473p3516k94172M791j43439
14447h6256j66987q1572j14132j48968k7423P7888k4022k61099k58606L12858
14437g78319K18910K5688j58345p2729K14186L42642l33877m91989K28811J26748
14427f78274l43355m77794k52346J29526K33604K04849K7450k5449J82018m4957
14417a044728k95248J62681K22114J54481J05543J81441J99175K29730L96028
14408C11217M42264L93159L43195J7721l08526p86884r58037m54215k1914J15233
14398i06787K25082J3577l21725J09103L71533L06817R2219k88717j8308L73264
$$ plain form
14388 -43942 275530 182825 23700 -475602 -681142 -413331 -22037 79594 -113767 -292142
14378 -292142 -231422 -140160 -276428 -243569 -195875 -237258 -156658 -328460 -646769 -400320 -42791
14367 -42791 -270844 -401708 -331074 -440273 -831481 -700221 -301211 -183328 -490092 -811947
14357 -811947 -577098 -241880 -247138 -217522 -39319 1054 -60248 -205527 -165378 -173900 -534310
14346 -534310 -737602 -194477 169534 127985 147263 -109640 -641832 -823073 -653114 -794579
14336 -794579 -1088787 -1241749 -904259 -209481 -137849 -586053 -1173753 -811006 -18414 233516
14326 233516 271719 -154793 -238387 196213 168435 -264294 -905809 -915131 -637291 -810891
14316 -810891 -1003208 -980463 -647796 -473730 -327667 58820 317247 483432 481938 287594
$$ packed form
14388d3942L19472r2705j59125m99302k05540K67811L91294J01631j93361j78375
14378b92142O0720R1262j36268L2859M7694m1383Q0600j71802l18309K46449L57529
14367d2791k28053j30864P0634j09199l91208J31260L99010J17883l06764l21855
14357h11947K34849L35218n258K9616J78203M0373o1302j45279M0149q522l60410
14346e34310k03292N43125L64011m1549J9278k56903n32192j81241J69959j41465
14336g94579k94208j52962L37490O94778P1632m48204n87700L62747P92592K51930
14326B33516L8203m26512q3594M34600k7778m32729o41515r322K77840j73600
14316h10891j92317K2745L32667J74066J46063L86487K58427J66185j494j94344
$$ plain form
14306 287594 -118247 -447489 -624114 -770281 -700295 -317320 -201012 -408005 -17909 140212
14296 140212 205401 110788 15095 372113 627471 579534 755115 617669 29867 -95971
14286 -95971 102739 145247 44950 -459142 -577234 -776348 -1125537 -1026460 -902472 -835872
14276 -835872 -458623 96730 459813 553968 487789 336192 399142 445911 303717 331575
14266 331575 23793 -480662 -598884 -601034 -740746 -709560 -992980 -1404692 -1274453 -1305049
14256 -1305049 -1528992 -1509221 -1386204 -1192955 -1029104 -626210 -472776 -681651 -856110 -643936
14246 -643936 -39886 219810 -15429 -6209 -468547 -897083 -1100090 -1197490 -606899 44276
14236 44276 415535 341252 95647 -362967 -897370 -733333 9084 601919 879659 869195
$$ packed form
14306B87594m05841l29242j76625j46167O9986L82975J16308k06993L90096J58121
14296A40212O5189r4613r5693L57018K55358m7937J75581j37446n87802j25838
14286i5971J98710M2508j00297n04092j18092j99114l49189R9077J23988O6600
14276h35872L77249N55353L63083R4155o6179j51597O2950M6769j42194K7858
14266C31575l07782n04455j18222k150j39712L1186k83420m11712J30239l0596
14256a305049k23943J9771J23017J93249J63851M02894J53434k08875j74459K12174
14246f43936O04050K59696k35239R220m62338m28536k03007r7400N90591O51175
14236D4276L71259p4283k45605m58614n34403J64037P42417N92835K77740j0464
$$ plain form
14226 869195 760329 496154 171244 -326585 -686735 -985696 -1355185 -1107022 -1014571 -962392
14216 -962392 -713589 -347255 -184770 32450 65327 131768 12853 -367057 -742011 -992388
14206 -992388 -820559 -429317 62414 184716 291260 319967 282109 610081 477089 -98047
14196 -98047 -654306 -909692 -613661 -288734 -71054 -217349 -570886 -127586 546850 691187
14186 691187 630655 231033 906 131164 433210 475956 397451 235513 -103189 30791
14176 30791 93417 -167920 14199 395210 169635 8043 28167 -257891 -605908 -527575
14166 -527575 212000 362010 202376 186197 29919 45719 65800 323846 468234 407198
14156 407198 515977 232417 -167632 -286829 -434575 -570593 -647893 -675637 -396022 314644
$$ packed form
14226H69195j08866k64175l24910m97829l60150k98961l69489K48163R2451N2179
14216i62392K48803L66334J62485K17220L2877O6441j18915l79910l74954k50377
14206i92388J71829L91242M91731J22302J06544K8707l7858L27972j32992n75136
14196i8047n56259k55386K96031L24927K17680j46295l53537M43300O74436J44337
14186F91187o0532l99622k30127J30258L02046M2746p8505j61938l38702J33980
14176C0791O2626k61337J82119L81011k25575j61592K0124k86058l48017P8333
14166e27575P39575J50010j59634j6179j56278J5800K0081K58046J44388o1036
14156D07198J08779k83560m00049j19197j47746j36018p7300k7744K79615P10666
$$ plain form
14146 314644 226947 -217561 -164947 27144 367372 738286 578437 -149615 -684978 -797393
14136 -797393 -598595 -27833 338879 -183903 -722099 -485422 -194071 130720 -48940 -629238
14126 -629238 -539296 -130408 31593 -47651 -7602 -196530 -22693 305631 175522 -187808
14116 -187808 -318873 -488855 -740912 -747316 -853120 -926845 -969974 -1033613 -902340 -793292
14106 -793292 -782282 -709887 -676440 -541665 -304680 -362643 -434496 15541 623294 969196
14096 969196 896351 296135 -87349 -223108 -576814 -293450 -125377 -499825 -748034 -727391
14086 -727391 -659940 -399242 -505178 -681662 -791738 -994936 -1170188 -960492 -1034222 -1158535
14076 -1158535 -780685 -283728 -48783 -55835 -139286 -300291 -231248 190247 441312 689778
$$ packed form
14146C14644q7697m44508N2614J92091L40228L70914j59849p28052n35363j12415
14136g97393J98798N70762L66712n22782n38196K36677K91351L24791j79660n80298
14126f29238Q9942M08888J62001p9244M0049j88928J73837L28324j30109l63330
14116a87808j31065j69982k52057o404j05804p3725m3129o3639J31273J09048
14106g93292J1010P2395L3447J34775K36985n7963p1853M50037O07753L45902
14096I69196p2845o00216l83484j35759l53706K83364J68073l74448k48209K0643
14086g27391O7451K60698j05936j76484j10076k03198j75252K09696p3730j24313
14076a158535L77850M96957K34945p052q3451j61005O9043M21495K51065K48466
$$ plain form
14066 689778 1075715 1115950 730032 476051 234604 -205414 -456218 -318799 -262139 -195505
14056 -195505 -28005 -29323 -284672 -617271 -620906 -459139 -265905 -73470 169511 49984
14046 49984 -279372 -768361 -941237 -680663 -741917 -1157600 -1103903 -841390 -666479 -681400
14036 -681400 -780764 -522424 -73897 -61365 -107328 -134742 -264366 -417532 -758032 -1306771
14026 -1306771 -1444467 -1260936 -1037518 -809596 -1002498 -1577800 -1685884 -1532601 -1247161
14017 -1247161 -924414 -548418 -181390 37386 135605 244720 90789 65928 227048 -81840
14007 -81840 -494649 -303699 138510 505108 769379 563329 247352 47838 -267775 -375121
13997 -375121 -119475 123945 252322 424101 287584 -22565 194220 672080 672854 207109
$$ packed form
14066F89778L85937M0235l85918k53981k41447m40018k50804J37419N6660O6634
14056a95505J67500j318k55349l32599l635J61767J93234J92435K42981j19527
14046D9984l29356m88989j72876K60574o1254m15683N3697K62513J74911j4921
14036f81400r9364K58340M48527J2532m5963k7414j29624j53166l40500n48739
14026a306771j37696J83531K23418K27922j92902n75302j08084J53283K85440
14017a247161L22747L75996L67028K18776R8219J09115j53931k4861J61120l08888
14007h1840m12809J90950M42209L66598K64271k06050l15977j99514l15613j07346
13997c75121K55646K43420J28377J71779j36517l10149K16785M77860P74m65745
$$ plain form
13987 207109 -193234 -168386 -169365 -506036 -468541 -312377 -218250 81188 199494 56797 -134495
13976 -134495 -24090 98784 -125016 17829 28477 73443 56221 51045 -289548 -587882
13966 -587882 -947806 -759679 -401945 -452227 -493163 -652414 -99247 763896 865642 411908
13956 411908 72083 56785 -70933 -178501 -331313 -438484 -226127 -230057 -10968 273762
13946 273762 -75848 -351851 -294066 -528803 -1028514 -1472281 -1514914 -1156651 -1095979 -1183608
13936 -1183608 -1317708 -1596558 -1582413 -1235826 -507788 -137127 -43134 -208274 -375555 77102
13926 77102 480564 98620 -146085 -9779 65806 81340 24005 -156294 -532185 -809959
13916 -809959 -914491 -685850 -306818 -293375 -6852 24081 -132044 -99900 -358324 -429457
$$ packed form
13987B07109m00343K4848r79l36671L7495J56164R4127K99438J18306j42697j91292
13976a34495J10405J22874k23800J42845J0648M4966j7222n176l40593k98334
13966e87882l59924J88127L57734n0282m0936j59251N53167Q63143J01746m53734
13956D11908l39825j5298j27718j07568j52812j07171K12357l930K19089K84730
13946B73762l49610k76003N7785k34737m99711m43767m2633L58263O0672q7629
13936a183608j34100k78850J4145L46587P28038L70661R3993j65140j67281M52657
13926G7102M03462l81944k44705J36306P5585J5534n7335j80299l75891k77774
13916h09959j04532K28641L79032J3443K86523L0933j56125L2144k58424p1133
$$ plain form
13906 -429457 33084 453203 343459 -236627 -682802 -425788 -183523 -383230 -619961 -622209
13896 -622209 -377024 -182423 -30448 435188 941810 1190851 1235749 1308815 1223336 933585
13886 933585 493186 243357 86612 8653 -124349 -311572 -281624 70566 186229 214672
13876 214672 663647 682743 529800 121628 -254864 -338268 -463403 -465185 -183585 -22176
13866 -22176 -55012 -264601 -193140 -419735 -891259 -1111898 -1365456 -1339644 -1273837 -1434233
13856 -1434233 -1240030 -580610 23508 210007 45551 -87214 -218559 -619874 -686625 -456761
13846 -456761 -118011 -139614 -49236 29782 -157077 89740 509961 266812 -82732 -374413
13836 -374413 -347124 -23017 -137481 -227737 -101148 36282 -326723 -1204391 -1964040 -2181822
$$ packed form
13906d29457M62541M20119j09744n80086m46175K57014K42265j99707k36731k248
13896f22209K45185J94601J51975M65636N06622K49041M4898P3066q5479k89751
13886I33585m40399k49829j56745p7959j33002j87223K9948L52190J15663K8443
13876B14672M48975J9096j52943m08172l76492q3404j25135j782K81600J61409
13866b2176l2836k09589P1461k26595m71524k20639k53558K5812O5807j60396
13856a434233J94203O59420O04118J86499j64456j32765j31345m01315o6751K29864
13846d56761L38750k1603R0378P9018j86859K46817M20221k43149l49544k91681
13836c74413K7289L24107j14464r0256J26589J37430l63005q77668p59649k17782
$$ plain form
13826 -2181822 -1772019 -1028649 -631532 -581820 -445571 -156760 -131355 -180304 -538469 -823274
13816 -823274 -740961 -783355 -796874 -835768 -865595 -397678 23692 425526 574389 -9985
13806 -9985 -629945 -698134 -340091 195498 454342 807854 694890 221597 -226035 -800889
13796 -800889 -1328568 -1549002 -1242056 -781358 -727749 -583248 -608673 -745382 -847842 -1066188
13786 -1066188 -935396 -563042 -323534 -211957 36395 326088 211997 -4123 143958
13777 143958 334660 505767 459795 189399 148429 2094 -476319 -668017 -827752 -1083554
13767 -1083554 -812441 -537416 -522248 -521290 -547894 -53475 497603 432859 300868 200522
13757 200522 106802 -80190 -471997 -770816 -937884 -925107 -428293 165680 312730 251413
$$ packed form
13826b181822M09803P43370L97117M9712J36249K88811K5405m8949l58165k84805
13816h23274Q2313m2394j3519l8894k9827M67917M21370M01834J48863n84374
13806i985o19960o8189L58043N35589K58844L53512j12964m73293m47632n74854
13796h00889n27679k20434L06946M60698N3609J44501k5425j36709j02460k18346
13786a066188J30792L72354K39508J11577K48352K89693j14091k16120J48081
13777A43958J90702J71107m5972k70396m0970j46335m78413j91698j59735k55802
13767a083554K71113K75025J5168R58k6604M94419N51078o4744j31991j00346
13757B00522r3720j86992l91807k98819j67068J2777M96814N93973J47050o1317
$$ plain form
13747 251413 357558 351514 84740 -282450 -51766 103751 202650 424518 253451 338017
13737 338017 469326 339789 -39987 -181523 -240333 -212023 -177849 -387026 -724142 -866756
13727 -866756 -929295 -769631 -326630 116466 261971 137650 -16092 1842 47317 169913
13717 169913 212886 122633 439739 933503 1098541 637423 213274 -64505 -589051 -647357
13707 -647357 -462524 -401866 -272243 237202 722471 631722 242314 -31566 -477838 -860691
13697 -860691 -496277 -544863 -1027153 -1332297 -1601534 -1567132 -1716969 -1786716 -1420314 -899450
13687 -899450 -534235 -256617 -240347 -323988 -333986 -580939 -551061 2883 251296 341347 331484
13676 331484 -176778 -506347 -107557 145938 41506 -202085 -372697 -428132 -41785 305539
$$ packed form
13747B51413J06145o044k66774l67190K30684J55517R8899K21868j71067Q4566
13737C38017J31309j29537l79776j41536n8810K8310L4174k09177l37116j42614
13727h66756o2539J59664M43001M43096J45505j24321j53742J7934M5475J22596
13717A69913M2973r0253L17106M93764J65038m61118m24149k77779n24546n8306
13707f47357J84833O0658J29623N09445M85269r0749l89408k73880m46272l82853
13697h60691L64414m8586m82290l05144k69237L4402j49837o9747L66402N20864
13687h99450L65215K77618J6270q3641r998k46953K9878N53944K48413R0051r863
13676C31484n08262l29569L98790K53495j04432k43591j70612n5435L86347L47324
$$ plain form
13666 305539 83314 -119974 -175214 -591797 -767787 -556846 -347211 -253751 -600588 -697653
13656 -697653 -645214 -450062 -270780 -100130 112812 -199156 -675736 -449748 -53884 -434775
13646 -434775 -577554 -350948 -53877 29378 117174 124793 -11458 -44008 154099 116275 9539
13635 9539 409214 421568 10469 -486864 -601696 -486055 -435969 -454717 -512675 -420057 -142663
13624 -142663 -11808 62196 175896 325678 -30931 -430602 -293975 -200484 -568627 -632418
13614 -632418 -412572 -452109 -383167 124590 617474 1032649 1057810 893807 1040270 1290539
13604 1290539 1284312 841154 450146 509675 574656 461698 460775 552969 269100 -175455 7913
13593 7913 436737 218855 66041 107769 66017 -213151 -507912 -373152 -329656 -331124 -489005
$$ packed form
13666C05539k22225k03288n5240m16583j75990K10941K09635R3460l46837r7065
13656f97653N2439J95152J79282J70650K12942l11968m76580K25988L95864l80891
13646d34775j42779K26606K97071Q3255Q7796P619j36251l2550J98107l7824j06736
13635I539L99675J2354m11099m97333j14832J15641N0086j8748n7958R2618K77394
13624a42663J30855P4004J13700J49782l56609l99671J36627R3491l68143o3791
13614f32418K19846l9537O8942N07757M92884M15175K5161j64003J46463K50269
13604A290539o227m43158l91008N9529O4981j12958r23R2194k83869m44555J83368
13593G913M28824k17882j52814M1728m1752k79168k94761J34760M3496j468j57881
$$ plain form
13582 -489005 -403859 -647558 -1255737 -1377911 -1329400 -1088326 -717957 -387319 -225037 -486354
13572 -486354 -820255 -750955 -436221 -286862 37533 525288 220052 -531272 -822107 -1081511
13562 -1081511 -1124462 -874145 -507807 -152135 207149 547959 601019 478665 391207 165812
13552 165812 -348909 -570592 -561093 -398257 -641236 -922714 -507031 -76755 140789 -124408
13542 -124408 -175714 -324204 -363541 -2360 278959 257483 235777 -87008 -819293 -810113 -356493
13531 -356493 -166746 -94799 -32176 143509 522870 715620 940853 1003902 1340723 1375068
13521 1375068 1156068 1315206 1152056 559789 220472 7063 -766164 -1390072 -1478746 -1298136
13511 -1298136 -861527 -573754 -659553 -1017277 -812418 -585142 -408204 279912 808994 749371
$$ packed form
13582d89005Q5146k43699o08179j22174M8511K41074L70369L30638J62282k61317
13572d86354l33901O9300L14734J49359L24395M87755l05236p51324k90835k59404
13562a081511m2951K50317L66338L55672L59284L40810N3060j22354q7458k25395
13552A65812n14721k21683R499J62836k42979k81478M15683M30276K17544k65197
13542a24408n1306j48490l9337L61181K81319k1476k1706l22785p32285R180M53620
13531c56493J89747P1947O2623J75685L79361J92750K25233O3049L36821L4345
13521A375068k19000J59138j63150n92267l39317k13409p73227o23908q8674J80610
13511a298136M36609K87773q5799l57724K04859K27276J76938O88116N29082n9623
$$ plain form
13501 749371 491472 215166 58571 21947 -188278 -553988 -979044 -1307969 -1543598 -1335980
13491 -1335980 -943357 -793531 -857430 -950786 -902511 -514821 -56279 398596 602425 453212
13481 453212 338962 49866 -387521 -599624 -493843 -233222 151370 177141 45946 -121253
13471 -121253 -203005 -120087 -126139 51352 57352 189085 264334 110526 131696 -43303 -400830
13460 -400830 -380671 -52167 88186 -153026 -565606 -973784 -1103109 -1031460 -671847 -606189
13450 -606189 -791317 -1072909 -1079553 -757881 -538993 -361516 -243382 -348978 -533538 -368672
13440 -368672 -115755 -277439 -728608 -714805 -578957 -538831 -339446 40099 23894 -140786
13430 -140786 -77082 132247 289896 632666 716816 402061 65611 -56769 -366468 -758117
$$ packed form
13501G49371k57899k76306j56595l6624k10225l65710m25056l28925k35629K07618
13491a335980L92623J49826o3899r3356M8275L87690M58542M54875K03829j49213
13481D53212j14250k89096m37387k12103J05781K60621L84592K5771j31195j67199
13471a21253q1752Q2918o052J77491O000J31733P5249j53808K1170j74999l57527
13460d00830K0159L28504J40353k41212m12580m08178j29325P1649L59613O5658
13450f06189j85128k81592o644L21672K18888J77477J18134j05596j84560J64866
13440c68672K52917j61684m51169J3803J35848M0126J99385L79545j6205j64680
13430a40786O3704K09329J57649L42770Q4150l14755l36450j22380l09699l91649
$$ plain form
13420 -758117 -644501 -309737 -84115 81025 53365 2727 -74591 -91002 36211 127055
13410 127055 121203 317830 224377 -364863 -534181 159440 762535 818170 592112 172485
13400 172485 -334024 -466423 -375947 -297091 -251542 -95880 130708 386779 448502 346677
13390 346677 412030 606530 702729 378319 311444 190208 156518 137837 -20622 59241 196292
13379 196292 408463 398588 333795 494093 585061 626883 463008 252288 468587 641384
13369 641384 552278 479333 478622 463936 498848 813552 845426 531100 559503 301181 -23857
13358 -23857 -59732 -35225 -120642 -230002 -9828 336093 792329 1149488 1193624 1428088
13348 1428088 1452358 989504 835227 665996 348590 267573 465725 327783 -2018 60055
$$ packed form
13420g58117J13616L34764K25622J65140k7660n0638p7318j6411J27213R0844
13410A27055n852J96627r3453n89240j69318O93621O03095N5635k26058m19627
13400A72485n06509j32399R0476P8856M5549J55662K26588K56071O1723j01825
13390C46677O5353J94500R6199l24410o6875j21236l3690j8681j58459P9863J37051
13379A96292K12171r875o4793J60298R0968M1822j63875k10720K16299J72797
13369F41384q9106p2945p11j4686L4912L14704L1874l14326K8403k58322l25038
13358b3857l5875K4507q5417j09360K20174L45921M56236L57159M4136K34464
13348A428088K4270m62854j54277j69231l17406q1017J98152j37942l29801O2073
$$ plain form
13338 60055 -132072 -668539 -744584 -654179 -601748 -419065 -227597 -379320 -731930 -1157775
13328 -1157775 -1301581 -854568 -415638 -409964 -380572 -208683 -106289 -56142 -305441 -413367
13318 -413367 -295598 54578 178118 370126 723517 937346 1152706 1280747 1204270 930164
13308 930164 739443 685334 863393 823720 672845 554129 475172 413420 293155 270674
13298 270674 87711 -336745 -341816 -106519 531630 922231 769285 403424 248582 538605
13288 538605 904775 1186170 984320 836129 1074867 1244864 1138146 914867 784106 679653
13278 679653 650952 202106 -586791 -796043 -375227 4349 266957 292964 317455 255808
13268 255808 384289 628445 631477 634138 644083 524888 323249 199275 32925 -81127 137178
$$ packed form
13338F0055j92127n36467p6045R0405N2431J82683J91468j51723l52610m25845
13328a157775j43806M47013M38930N674K9392J71889J02394N0147k49299j07926
13318d13367J17769L50176J23540J92008L53391K13829K15360J28041p6477k74106
13308I30164j90721n4109J78059l9673j50875j18716p8957o1752j20265k2481
13298B70674j82963m24456n071K35297O38149L90601j52946l65861j54842K90023
13288E38605L66170K81395k01850j48191K38738J69997j06718k23279j30761j04453
13278F79653k8701m48846p88897k09252M20816L79576K62608K6007K4491o1647
13268B55808J28481K44156L032K661R945j19195k01639j23974j66350j14052K18305
$$ plain form
13257 137178 38632 92898 371268 267081 -139105 -542858 -642797 -358902 20768 -154988
13247 -154988 -627814 -791076 -696108 -576477 -518264 -378188 -5893 89347 -8761 -37686
13237 -37686 86285 166285 245783 326930 366542 393828 722206 968691 1098945 1198134 898239
13226 898239 561373 444963 523879 325357 225429 111083 54698 376949 918071 1347820
13216 1347820 1755620 1782049 1271935 780882 296785 -95540 -113502 167883 629822 613949
13206 613949 275203 26601 -169669 -309487 -91369 259582 548085 1035839 1303191 1003561
13196 1003561 898402 1045502 1156113 1307279 1329723 986032 518705 380039 377714 806332
13186 806332 1152242 585110 -90927 -130720 304111 1026121 1399509 1478685 1614773 1789929
$$ packed form
13257A37178r8546N4266K78370j04187m06186m03753r9939K83895L79670j75756
13247a54988m72826j63262R4968J19631N8213J40076L72295R5240r8108k8925
13237c7686J23971Q0000P9498Q1147L9612K7286L28378K46485J30254R9189k99895
13226H98239l36866j16410P8916j98522r9928j14346n6385L22251N41122M29749
13216A347820M07800K6429n10114m91053m84097l92325j7962K81385M61939j5873
13206F13949l38746k48602j96270j39818K18118L50951K88503M87754K67352k99630
13196A003561j05159J47100J10611J51166K2444l43691m67327j38666k325M28618
13186H06332L45910n67132o76037l9793M34831P22010L73388P9176J36088J75156
$$ plain form
13176 1789929 1661866 1238432 741678 231333 81784 587648 1085251 1023018 749532 442284
13166 442284 153412 59080 378572 794370 1004331 1074409 978120 1041291 1531266 1972811
13156 1972811 2231942 2168113 1793459 1275887 575785 144005 202882 531166 735973 587719
13146 587719 261413 261883 368100 487012 673781 1005488 894115 400322 38225 49107
13136 49107 469147 866558 1119529 1239933 1354185 1216310 1184383 1150718 879768 699698
13126 699698 398490 -318572 -846640 -411305 243043 583607 482453 375366 554801 676405
13116 676405 776227 773183 499204 390929 595684 685767 398043 311736 689873 1055984
13106 1055984 978114 935916 790097 620207 585112 1179927 1987606 2254899 2251189 1684174
$$ packed form
13176A789929j28063m23434m96754n10345j49549N05864M97603o2233k73486l07248
13166D42284k88872r4332L19492M15798K09961P0078r6289O3171M89975M41545
13156A972811K59131o3829l74654n17572p00102m31780N8877L28284K04807j48254
13146E87719l26306M70J06217J18912J86769L31707j11373m93793l62097J0882
13136D9107M20040L97411K52971J20404J14252j37875l1927l3665k70950j80070
13126F99698l01208p17062n28068M35335O54348L40564j01154j07087J79435J21604
13116F76405R9822l044k73979j08275K04755R0083k87724q6307L78137L66111
13106A055984p7870m2198j45819j69890l5095N94815Q07679K67293l710n67015
$$ plain form
13096 1684174 1204024 1417385 1618983 1961444 2037123 1791403 1613291 1248019 1058091 1211230
13086 1211230 1601804 1909766 1987668 2181032 2227554 1822459 1512037 896619 531870 866713
13076 866713 860129 437118 443006 748173 991600 925589 1002232 1321339 1735745 1691040 1608054
13065 1608054 1883825 2420439 2691196 2498231 1954405 1614395 1579465 1686705 1516254 1232315
13055 1232315 1216174 1166991 1100219 1424793 1966414 2441827 2662296 2269208 2312159 2498838
13045 2498838 2572758 2220728 1701450 1594833 1573788 1847672 2175873 2463318 2525568 2338908
13035 2338908 2250940 2597300 3020236 3404968 3653994 3433016 3289896 3281769 3445191 3583147
13025 3583147 3674656 4029972 4785568 4742089 3987711 3153726 2919325 3342517 3965073 4176370
$$ packed form
13096A684174m80150K13361K01598L42461P5679k45720j78112l65272j89928J53139
13086A211230L90574L07962P7902J93364M6522m05095l10422o15418l64749L34843
13076H66713o584m23011N888L05167K43427o6011P6643L19107M14406m4705q2986
13065A608054K75771N36614K70757j92965n43826l40010l4930J07240j70451k83939
13055A232315j6141m9183o6772L24574N41621M75413K20469l93088M2951J86679
13045B498838P3920l52030n19278j06617k1045K73884L28201K87445O2250j86660
13035B338908q7968L46360M22936L84732K49026k20978j43120q127J63422J37956
13025C583147R1509L55316P55596m3479p54378q33985k34401M23192O22556K11297
$$ plain form
13015 4176370 4239428 4378931 4200901 3679107 3802170 3981397 3994856 3872241 3787063 4145260
13005 4145260 4238823 4032553 4310134 4596641 5090896 5561482 5888248 6372826 6985839 7637860
12995 7637860 8438894 9263301 9416673 9461220 9874642 10352046 11065453 12423382 14048938
12986 14048938 15531179 17160034 19159946 21451228 24237346 27728456 32309359 38055684
12978 38055684 45336109 54751849 67608749 84845425 107690245 138482886 180594319
12971 180594319 237651600 310362025 387286985 436263250 425730172 364681750 288640434
12964 288640434 221595783 170106287 132232213 104780696 84636193 69642315 58125345
12957 58125345 49381984 42768274 37299330 33133136 30086304 27467373 24749340 22472698
$$ packed form
13015D176370O3058J39503j78030n21794J23063J79227J3459j22615q5178L58197
13005D145260R3563k06270K77581K86507M94255M70586L26766M84578O13013O52021
12995G637860Q01034Q24407J53372M4547M13422M77404P13407J357929J625556
12986A4048938J482241J628855J999912K291282K786118L491110M580903N746325
12978C8055684P280425R415740J2856900J7236676K2844820L0792641M2111433
12971A80594319N7057281P2710425P6924960M8976265j0533078o1048422p6041316
12964B88640434o7044651n1489496l7874074k7451517k0144503j4993878j1516970
12957E8125345q743361o613710n468944m166194l046832k618931k718033k276642
$$ plain form
12949 22472698 20592600 18737254 17136849 16348365 15502884 14462887 13556674 12652531 12169769
12940 12169769 11682853 10860129 10235136 9843616 9203775 8849706 8181543 7374965 7203052
12931 7203052 7358604 7446905 7659157 7787161 7642324 7429327 7455106 7965413 8466233 8615661
12921 8615661 8803098 9082145 9147823 9210772 9415214 9750505 10323598 11199813 12438435 13845869
12911 13845869 15329635 17472936 19070957 19514669 19391850 18935369 18011385 17015410 16375602
12902 16375602 16151663 16586753 17415844 18582476 19734792 21382789 23929341 27311199
12894 27311199 31101830 35863490 42186399 50438745 61429780 76002478 95155877 120885690
12886 120885690 155972474 203256662 266835097 346570726 424766703 462491677 437856994
$$ packed form
12949B2472698j880098j855346j600405p88484q45481j039997r06213r04143m82762
12940A2169769m86916q22724o24993l91520o39841l54069o68163q06578j71913
12931G203052J55552Q8301K12252J28004j44837k12997K5779N10307N00820J49428
12921H615661J87437K79047O5678O2949K04442L35291N73093Q76215J238622J407434
12911A3845869J483766K143301J598021M43712j22819m56481r23984r95975o39808
12902A6375602k23939M35090Q29091J166632J152316J647997K546552L381858
12894B7311199L790631M761660O322909Q252346J0991035J4572698J9153399K5729813
12886A20885690L5086784M7284188O3578435P9735629P8195977L7724974k4634683
$$ plain form
12879 437856994 370540273 289648928 218590845 166279314 128891151 102110296 82574548
12872 82574548 68468255 57694648 49253538 42343059 36601880 31650109 27987541 25406023
12864 25406023 23108848 21381206 19759840 18105286 16941120 15869936 15227708 15028992
12856 15028992 14502045 13625322 12801113 12085509 11524404 11104443 10740827 10308956 9658241
12847 9658241 9096994 8945653 8875506 8831368 8754648 8694808 8329227 8051522 7716892 7521525
12837 7521525 7620184 7919356 8031027 8153733 8346224 8614340 9158377 9545193 9973530 10249598
12827 10249598 10128108 9938873 9904143 9902900 9723929 9421764 9449936 10086293 10726144 11259041
12817 11259041 11774437 12260856 13005632 14110201 15372821 17170175 19506278 21879358
$$ packed form
12879D37856994o7316721q0891345p1058083n2311531l7388163k6780855j9535748
12872H2574548j4106293j0773607q441110o910479n741179m951771l662568k581518
12864B5406023k297175j727642j621366j654554j164166j071184o42228j98716
12856A5028992n26947q76723q24209p15604n61105m19961l63616m31871o50715
12847I658241n61247j51341p0147m4138p6720n9840l65581k77705l34630j95367
12837G521525R8659K99172J11671J22706J92491K68116N44037L86816M28337K76068
12827A0249598j21490j89235l4730j243j78971l02165K8172O36357O39851N32897
12817A1259041N15396M86419P44776J104569J262620J797354K336103K373080
$$ plain form
12809 21879358 24654991 28193892 32685836 38099813 44741767 53444721 65105943 80586210
12801 80586210 101346823 129153712 166532394 217555746 284652483 362545132 426136740
12794 426136740 437826766 390348418 315458625 243879035 186962442 144599297 113459673
12787 113459673 90760779 73961197 61233926 51738521 44068303 38212444 33771604
12780 33771604 30050879 27080180 23988917 21059852 18706562 16991569 15968254 14832955
12772 14832955 13603249 12322773 11307182 10552819 9856672 9345560 8579208 7912890 7413307
12763 7413307 6816260 6868918 7451949 7501344 6986636 6271584 5731979 5380484 5060607 4406942
12753 4406942 3896332 4035579 4037836 3914022 3717179 3555893 3731557 3874031 4118937 4603839
$$ packed form
12809B1879358K775633L538901M491944N413977O641954Q702954J1661222J5480267
12801H0586210K0760613K7806889L7378682N1023352O7096737P7892649O3591608
12794D26136740J1690026m7478348p4889793p1579590n6916593m2363145l1139624
12787A13459673k2698894j6799582j2727271r495405p670218n855859m440840
12780C3771604l720725k970699l091263k929065k353290j714993j023315j135299
12772A4832955j229706j280476j015591p54363o96147n11112p66352o66318m99583
12763G413307n97047N2658N83031M9395n14708p15052n39605l51495l19877o53665
12753D406942n10610J39247K257j23814j96843j61286J75664J42474K44906M84902
$$ plain form
12743 4603839 4651555 4166479 3874128 3756952 3507136 3250548 3161970 2978420 3097733 3049305
12733 3049305 2670153 2701392 2816102 3017960 3328068 3424396 3058483 2593299 2264694 2277002
12723 2277002 2368348 2526347 2525829 2124652 1796096 1865426 1784019 1983412 2111340 2206271 2985935
12712 2985935 3428974 3571331 3398546 3252212 3403488 3887786 3875609 3135577 2561151 2664960
12702 2664960 2691619 2399248 2227376 1839072 1465501 1135451 1157164 1075164 1287378 1874255
12692 1874255 2032218 2233775 2571287 2594306 2289682 1758355 1461563 1557551 1933930 2041971
12682 2041971 2102735 1996386 1487909 951554 502544 422863 705138 851806 718920 631011
12672 631011 380802 603267 676246 401562 366333 512621 524464 252246 283843 547172
$$ packed form
12743D603839M7716m85076k92351j17176k49816k56588q8578j83550J19313m8428
12733C049305l79152L1239J14710K01858L10108R6328l65913m65184l28605J2308
12723B277002R1346J57999n18m01177l28556O9330q1407J99393J27928R4931P79664
12712B985935M43039J42357j72785j46334J51276M84298j2177p40032n74426J03809
12702B664960K6659k92371j71872l88304l73571l30050K1713q2000K12214N86877
12692A874255J57963K01557L37512K3019l04624n31327k96792R5988L76379J08041
12682B041971O0764j06349n08477n36355m49010p9681K82275J46668j32886q7909
12672F31011k50209K22465P2979k74684l5229J46288J1843k72218L1597K63329
$$ plain form
12662 547172 599096 441073 322697 18823 -253000 -264429 -231158 108535 390776 511421
12652 511421 612769 944259 1156432 1127590 819086 568854 572895 1172321 1438016 1232857
12642 1232857 936246 597458 608210 703902 1042111 1120431 788367 631293 827915 984889
12632 984889 958476 1030736 952994 508755 -487 -131115 16950 269714 534230 812949
12622 812949 743087 862755 1108524 1536827 1785834 2039544 2071571 1859467 1844456 1784989
12612 1784989 1410453 793253 544145 204417 -191447 131261 479712 688656 884293
12603 884293 1096077 1154026 981561 897767 877815 1229621 1106558 682209 359659 19327
12593 19327 -103337 288644 685795 646122 583100 648190 524939 24541 -69293 95498
$$ packed form
12662E47172N1924j58023j18376l03874k71823j1429L3271L39693K82241J20645
12652E11421J01348L31490K12173k8842l08504k50232M041N99426K65695k05159
12642A232857k96611l38788J0752R5692L38209P8320l32064j57074J96622J56974
12632I84889k6413P2260p7742m44239n09242j30628J48065K52764K64516K78719
12622H12949o9862J19668K45769M28303K49007K53710L2027k12104j5011n9467
12612A784989l74536o17200k49108l39728l95864L22708L48451K08944J95637
12603H84293K11784N7949j72465q3794j9952L51806j23063m24349l22550l40332
12593A9327j22664L91981L97151l9673o3022O5090j23251n00398r3834J64791
$$ plain form
12583 95498 32880 -101266 326871 770226 924331 1067585 1000370 783091 792079 831902 431478
12572 431478 239297 131440 -2090 -94352 -345559 -734983 -950663 -535553 157694 624561
12562 624561 588483 368371 208142 1553 -602374 -936268 -344998 145215 -95576 -63382
12552 -63382 525166 1138147 1023412 526084 462686 297347 604 -363356 -96496 314071
12542 314071 548584 530772 418644 120415 -278173 -722314 -938060 -658506 -142124 429844
12532 429844 724651 558582 391125 293923 173307 31110 -49525 -102218 227724 391210
12522 391210 530586 715713 353707 -30681 190425 380861 521385 704492 513908 -31993
12512 -31993 -329878 -12242 315683 853551 1157114 790004 403107 -46966 -106856 217124
$$ packed form
12583I5498o2618j34146M28137M43355J54105J43254o7215k17279Q988L9823m00424
12572D31478j92181j07857j33530r2262k51207l89424k15680M15110O93247M66867
12562F24561l6078k20112j60229k06589o03927l33894N91270M90213k40791L2194
12552f3382N88548O12981j14735m97328o3398j65339k96743l63960K66860M10567
12542C14071K34513j7812j12128k98229l98588m44141k15746K79554N16382N71968
12532D29844K94807j66069j67457r7202j20616j42197q0635n2693L29942J63486
12522C91210J39376J85127l62006l84388K21106J90436J40524J83107j90584n45901
12512c1993k97885L17636L27925N37868L03563l67110l86897m50073n9890L23980
$$ plain form
12502 217124 593640 805241 596400 809142 1314329 1842046 1865219 1235256 742387 625866
12492 625866 527303 333883 634509 769480 813599 790061 634257 268452 -198817 -275354
12482 -275354 -119810 -49426 -31050 -38433 118632 608418 876752 782987 819045 1054616 1142011
12471 1142011 815871 276073 -639579 -1175592 -981757 -370814 -3659 -162051 -399608
12462 -399608 -554086 -272783 28487 123876 212977 498512 483002 150396 -101446 -181160
12452 -181160 34001 347459 654276 548867 170509 204940 475778 466013 194432 -197042
12442 -197042 -16463 182972 300274 601563 782579 996202 675170 529204 644204 768624
12432 768624 617837 601836 776649 1106029 1208539 1152548 869086 511307 233691 22835
$$ packed form
12502B17124L76516K11601k08841K12742N05187N27717K3173o29963m92869j16521
12492F25866r8563j93420L00626J34971M4119k3538j55804l65805m67269p6537
12482b75354J55544P0384J8376p383J57065M89786K68334r3765L6058K35571Q7395
12471A142011l26140n39798r15652n36013J93835O10943L67155j58392k37557
12462c99608j54478K81303L01270R5389Q9101K85535j5510l32606k51842p9714
12452a81160K15161L13458L06817j05409l78358L4431K70838r765k71581l91474
12442a97042J80579J99435J17302L01289J81016K13623l21032j45966J15000J24420
12432G68624j50787j6001J74813L29380J02510n5991k83462l57779k77616k10856
$$ plain form
12422 22835 -287037 -459166 -84353 153766 375203 494947 340337 -134607 -533451 -332688
12412 -332688 -152927 22809 136548 347191 118492 10236 322267 667446 977721 1035213
12402 1035213 848292 720238 827531 801338 794164 527696 164540 95793 335552 463249
12392 463249 458230 149247 -106607 36700 564031 1107331 1106523 856559 568704 527329 465035
12381 465035 228402 321571 266442 693582 1168117 1205250 1162752 1064049 716287 37905
12371 37905 -613755 -880680 -725994 -437925 -254000 -245898 -177715 543995 1152741 945937
12361 945937 516119 211408 507164 1000224 973993 423419 73293 201486 582578 560820
12351 560820 115693 -631882 -964569 -1096678 -997427 -432155 51751 395250 829125 665258
$$ packed form
12422B2835l09872j72129L74813K38119K21437J19744j54610m74944l98844K00763
12412c32688J79761J75736J13739K10643k28699j08256L12031L45179L10275N7492
12402A035213j86921j28054J07293k6193p174k66468l63156o8747K39759J27697
12392D63249n019l08983k55854J43307N27331N43300q08k49964k87855m1375o2294
12381D65035k36633R3169n5129M27140M74535L7133m2498r8703l47762o78382
12371C7905o51660k66925J54686K88069J83925Q102O8183P21710O08746k06804
12361I45937m29818l04711K95756M93060k6231n50574l50126J28193L81092k1758
12351E60820m45127p47575l32687j32109R9251N65272M83906L43499M33875j63867
$$ plain form
12341 665258 39070 -182974 -66987 98029 109614 135740 221633 321338 656726 913942
12331 913942 844756 623655 84007 -380538 -657630 -532189 -299232 -288933 -521429 -495135
12321 -495135 -383506 -218139 -365807 -1017636 -1367949 -1463851 -1456882 -1241728 -770167 -405286
12311 -405286 -604937 -215897 46301 -293263 -630625 -1130590 -1116631 -427878 -204818 -460621
12301 -460621 -358471 -391027 -441444 -788516 -975291 -777007 -735992 -679120 -754960 -729510 -516518
12290 -516518 -228823 -70234 -197911 -259068 -169923 171480 272468 -1504 -43922 346623
12280 346623 413130 758016 1008679 915972 794372 904640 872898 649851 261265 289051
12270 289051 996350 1336348 1110160 1049922 1033855 935699 808939 585132 460978 429518
$$ packed form
12341F65258o26188k22044J15987J65016J1585K6126Q5893R9705L35388K57216
12331I13942o9186k21101n39648m64545k77092J25441K32957J0299k32496K6294
12321d95135J11629J65367j47668o51829l50313r5902O969K15154M71561L64881
12311d05286j99651L89040K62198l39564l37362m99965J3959O88753K23060k55803
12301d60621J02150l2556n0417l47072j86775J98284M1015N6872p5840K5450K12992
12290e16518K87695J58589j27677o1157Q9145L41403J00988k73972m2418L90545
12280C46623O6507L44886K50663r2707j21600J10268l1742k23047l88586K7786
12270B89051P07299L39998k26188o0238j6067r8156j26760k23807j24154l1460
$$ plain form
12260 429518 612256 983337 1318280 1475231 1452299 1205949 864592 856160 747865 328562
12250 328562 187894 219790 310978 167643 281043 682647 930848 921672 1093265 926155
12240 926155 478586 -32894 -33241 97310 337712 407297 -108798 -642126 -455565 209989
12230 209989 563206 586834 411384 440513 570357 810262 1152253 1559918 1311606 857934
12220 857934 883370 1191866 1557415 1288630 527482 343825 282755 189031 412028 354892
12210 354892 -59675 -360082 -334642 -52606 305568 433426 465623 881505 1034868 811549
12200 811549 615662 489535 423967 393543 373364 128424 -265883 -654657 -739515 -590601
12190 -590601 -519186 -604190 -593385 -398007 -163154 -102497 33376 312679 360538 286909 286389
$$ packed form
12260D29518J82738L71081L34943J56951k2932k46350l41357q432j08295m19303
12250C28562j40668L1896R1188j43335J13400M01604K48201r176J71593j67110
12240I26155m47569n11480l47J30551K40402O9585n16095n33328J86561O65554
12230B09989L53217K3628j75450K9129J29844K39905L41991M07665k48312m53672
12220H57934K5436L08496L65549k68785p61148j83657o1070r3724K22997n7136
12210C54892m14567l00407K5440K82036L58174J27858L2197M15882J53363k23319
12200H11549j95887j26127o5568l0424k0179k44940l94307l88774q4858J48914
12190e90601P1415q5004J0805J95378K34853O0657J35873K79303M7859p3629n20
$$ plain form
12179 286389 507663 714084 878436 1199570 979038 568117 617831 397021 63901 211666
12169 211666 568495 280588 -162476 -210705 -10201 -79378 -81628 -257390 -760479 -1074655
12159 -1074655 -845627 -180355 -64387 230637 608057 319241 104250 396417 536017
12150 536017 318672 206063 516949 675791 136832 -494004 -691130 -1032310 -783546 -119688
12140 -119688 -10872 -429520 -781282 -966687 -783414 -288379 -20044 -51466 -178510 107197
12130 107197 487899 353706 45599 -371227 -611848 -710887 -928944 -466519 -12424 -159388
12120 -159388 -176685 96178 218734 70748 85151 143945 84492 -12879 230544 641743
12110 641743 638389 441317 373099 389684 158844 -258490 -229344 -113076 -482776 -734828
$$ packed form
12179B86389K21274K06421J64352L21134k20532m10921M9714k20810l33120J47765
12169B11666L56829k87907m43064m8229K00504o9177k250j75762n03089l14176
12159a074655K29028O65272J15968K95024L77420k88816k14991K92167J39600
12150E36017k17345j12609L10886J58842n38959o30836j97126l41180K48764O63858
12140a19688J08816m18648l51762j85405J83273M95035K68335l1422j27044K85707
12130A07197L80702j34193l08107m16826k40621r9039k18057M62425M54095j46964
12120a59388j7297K72863J22556j47986J4403N8794n9453r7371K43423M11199
12110F41743l354j97072o8218J6585k30840m17334K9146J16268l69700k52052
$$ plain form
12100 -734828 -561402 -307818 -178140 226467 717098 786310 468430 19868 123419 305120
12090 305120 198802 137279 182435 288779 -62689 -493186 -613142 -767901 -710449 -111498
12080 -111498 291332 139538 -56849 -133357 164739 317229 337538 477225 403363 208427
12070 208427 -94389 -308329 -319554 -218744 -31066 130933 91426 -56336 -310258 -501598
12060 -501598 -567725 -141166 305140 85702 27662 281753 550893 674754 -9924 -266293
12050 -266293 374343 603821 144928 -377313 -204579 -128887 -224797 -774546 -1237043 -1158743
12040 -1158743 -856813 -322550 -116838 290608 980328 1057592 613433 415868 226401 198012
12030 198012 241253 193186 251298 487705 634476 1073910 1520836 1622872 1446013 925904
$$ packed form
12100g34828J73426K53584J29678M04607M90631O9212l17880m48562J03551J81701
12090C05120j06318o1523M5156J06344l51468m30497j19956j54759N7452N98951
12080a11498M02830j51794j96387p6508K98096J52490K0309J39687p3862j94936
12070B08427l02816k13940j1225J00810J87678J61999l9507j47762k53922j91340
12060e01598o6127M26559M46306k19438n8040K54091K69140J23861o84678k56369
12050b66293O40636K29478m58893n22241J72734P5692r5910n49749m62497P8300
12040a158743L01930N34263K05712M07446O89720P7264m44159j97565j89467k8389
12030A98012M3241m8067N8112K36407J46771M39434M46926J02036j76859n20109
$$ plain form
12020 925904 461591 342364 185376 212601 472563 343171 230581 185701 613880 1204828
12010 1204828 1334826 832886 27848 -549747 -601977 -45716 100363 200695 650368 702453
12000 702453 525259 59523 -362752 -490604 -559603 -369059 50479 -231000 -530293 -61892
11990 -61892 -7193 -242147 -38884 138062 141901 104790 221503 201231 293346 674238 890317
11979 890317 854647 871834 835993 645696 561224 314653 -145899 -465633 -535360 -382409
11969 -382409 -191788 -151444 -160292 -429404 -848690 -1035454 -984828 -995957 -1069249 -804362 -235912
11958 -235912 236857 678529 770717 241439 -145414 -383444 -295170 -179727 -184448 -239289
11948 -239289 -226687 -512041 -823789 -983486 -972837 -648795 -461962 -480740 -335030 -287733
$$ packed form
12020I25904m64313j19227j56988K7225K59962j29392j12590m4880M28179N90948
12010A204828J29998n01940q05038n77595n2230N56261J46079J00332M49673N2085
12000G02453j77194m65736m22275j27852o8999J90544M19538k81479k99293M68401
11990f1892N4699k34954K03263J76946L839l7111J16713k0272R2115L80892K16079
11979H90317l5670J7187l5841j90297q4472k46571m60552l19734o9727J52951
11969c82409J90621M0344q848k69112m19286j86764N0626j1129p3292K64887N68450
11958b35912M72769M41672R2188n29278l86853k38030Q8274J15443m721n4841
11948b39289J2602k85354l11748j59697J0649L24042J86833j8778J45710M7297
$$ plain form
11938 -287733 -61114 205612 366459 693214 722062 587666 446261 212139 126484 -21988
11928 -21988 15070 229177 495585 332922 -136618 149560 567329 971419 1116067 794201
11918 794201 394364 481775 560499 660461 569377 528184 758604 914471 1186402 1297764
11908 1297764 1072075 1168191 1469701 1884288 1977346 1506725 1045612 1001447 1008032 791638
11898 791638 553440 126640 -363613 -509732 -810214 -897816 -382140 -130188 -72573 379194
11888 379194 898085 1041585 965075 668052 493549 171807 -27559 342719 517572 152720
11878 152720 -206020 -238346 168342 524347 559614 215455 134485 95933 -116577 -56884
11868 -56884 570391 973118 592795 216070 63893 60659 119339 178485 -11069 -374123
$$ packed form
11938b87733K26619K66726J60847L26755K8848j34396j41405k34122q5655j48472
11928b1988L7058K14107K66408j62663m69540K86178M17769M04090J44648l21866
11918G94201l99837Q7411P8724R9962r1084m1193K30420J55867K71931J11362
11908A297764k25689R6116L01510M14587R3058m70621m61113m4165O585k16394
11898G91638k38198m26800m90253j46119l00482q7602N15676K51952N7615M51767
11888C79194N18891J43500p6510k97023j74503l21742j99366L70278J74853l64852
11878A52720l58740l2326M06688L56005L5267l44159q0970l8552k12510N9693
11868e6884O27275M02727l80323l76725j52177l234N8680N9146j89554l63054
$$ plain form
11858 -374123 -528030 -369089 -75676 -79612 -370799 -313572 -79486 -240079 -375171 -177771
11848 -177771 -151562 -80585 -439232 -844064 -1274874 -1471491 -1378300 -1009747 -379996 -111327
11838 -111327 -477858 -614415 -468891 -680684 -880397 -500998 -46658 274777 195332 -119547
11828 -119547 -230148 -203590 -274497 19476 188325 -23386 32829 -276566 -704371 -313905
11818 -313905 -17235 -37074 -195093 -424127 -523052 -546320 -463414 -602003 -862532 -1124997
11808 -1124997 -1225278 -1184459 -882684 -537321 -356207 -73363 304310 731566 1285607 1540678
11798 1540678 1347366 1011709 1058436 1029039 938769 947930 1036982 897318 650689 629905 929111
11787 929111 1281946 1574838 1691889 1185190 536219 211289 453800 466638 284928 297482
$$ packed form
11858c74123j53907J58941K93413l936k91187N7227K34086j60593j35092J97400
11848a77771K6209P0977l58647m04832m30810j96617R3191L68553O29751K68669
11838a11327l66531j36557J45524k11793j99713L79399M54340L21435p9445l14879
11828a19547j10601K6558p0907K93973J68849k11711N6215l09395m27805L90466
11818c13905K96670j9839j58019k29034r8925k3268Q2906j38589k60529k62465
11808a124997j00281M0819L01775L45363J81114K82844L77673M27256N54041K55071
11798A540678j93312l35657M6727k9397r0270R161Q9052j39664k46629k0784K99206
11787I29111L52835K92892J17051n06699o48971l24930K42511J2838j81710J2554
$$ plain form
11777 297482 611101 714177 511222 478144 715232 542303 456576 679513 1054651 1377918
11767 1377918 1072712 414828 3969 28544 357411 555798 495290 357979 -148096 -1258074
11757 -1258074 -1696565 -1011245 -181215 70623 458504 554934 574570 732427 247363 -556136
11747 -556136 -883916 -469853 -18482 -134932 -212152 250565 560637 339005 26659 13539
11737 13539 -10933 -166088 -36158 380502 582941 339790 -81357 -216841 -277232 171961
11727 171961 410972 340873 310757 215283 -150377 -53873 445470 749995 537173 -58877
11717 -58877 -415495 -25948 473574 705687 493958 89675 -460289 -764553 -229472 445203
11707 445203 578333 428749 86718 -302961 -529566 -330947 -113085 3492 179778 17493
$$ packed form
11777B97482L13619J03076k02955l3078K37088j72929q5727K22937L75138L23267
11767A377918l05206o57884m10859K4575L28867J98387o0508j37311n06075j109978
11757a258074m38491O85320Q30030K51838L87881R6430J9636J57857m85064q03499
11747e56136l27780M14063M51371j16450p7220M62717L10072k21632l12346j3120
11737A3539k4472j55155J29930M16660K02439k43151m21147j35484o0391M49193
11727A71961K39011p0099l0116r5474l65660R6504M99343L04525k12822n96050
11717e8877l56618L89547M99522K32113k11729m04283n49964l04264N35081O74675
11707D45203J33130j49584l42031l89679k26605J98619K17862J16577J76286j62285
$$ plain form
11697 17493 -420330 -921119 -1245721 -845595 63925 732437 545122 191594 8105 -340646
11687 -340646 -270854 72129 349169 684076 616793 173376 -172845 -365506 -304884 -148396
11677 -148396 85040 446185 1144534 1543188 1284896 1023378 1014561 1280722 1216985 863609
11667 863609 77357 -91402 311232 424410 588651 754582 702144 650851 760363 849106
11657 849106 856076 754646 540735 106212 -37011 -6010 10269 112304 142209 -264573
11647 -264573 -668861 -326954 46392 -365223 -868603 -1035595 -1182094 -552411 243502 79038
11637 79038 -357308 -528849 -492419 9445 -43716 -325008 -292545 -206803 17523 59526 -149070
11626 -149070 -386993 -707608 -932043 -847646 -423374 -73974 244463 664413 853849 1103585
$$ packed form
11697A7493m37823n00789l24602M00126R09520O68512j87315l53528j83489l48751
11687c40646O9792L42983K77040L34907o7283m43417l46221j92661O0622J56488
11677a48396K33436L61145O98349L98654k58292k61518q817K66161o3737l53376
11667H63609p86252j68759M02634J13178J64241J65931n2438n1293J09512Q8743
11657H49106O970j01430k13911m34523j43223L1001J6279J02035K9905m06782
11647b64573m04288L41907L73346m11615n03380j66992j46499O29683P95913j64464
11637G9038m36346j71541L6430N01864n3161k81292L2463Q5742K24326M2003k08596
11626a49070k37923l20615k24435Q4397M24272L49400L18437M19950J89436K49736
$$ plain form
11616 1103585 1366360 1742578 1778993 1527854 1478368 1564942 1141481 851402 1024506 869082
11606 869082 336204 345196 663739 601658 440815 579712 523746 54199 -707610 -1047823
11596 -1047823 -715051 -213843 -155860 -226887 1749 155295 -129306 -430172 -556925 -596998
11586 -596998 -404892 -70897 206612 97914 -541236 -1137239 -1148751 -1224014 -1309728 -746095
11576 -746095 -277498 -282115 -415213 -627868 -574739 -558550 -718826 -540623 -31778 6632
11566 6632 -308538 -589612 -555000 -99052 194612 376319 261125 131855 -66953 -199638
11556 -199638 13900 -82726 -156666 -120489 -81069 -51204 -354073 -582171 -117706 51710
11546 51710 204085 454930 297850 -177289 -357456 -285638 234486 861486 805663 398585
$$ packed form
11616A103585K62775L76218L6415k51139m9486Q6574m23461k90079J73104j55424
11606H69082n32878Q992L18543o2081j60843J38897n5966m69547p61809l40213
11596a047823L32772N01208N7983p1027K28636J53546k84601l00866j26753m0073
11586e96998J92106L33995K77509j08698o39150n96003j1512p5263q5714N63633
11576g46095M68597m617j33098k12655N3129J6189j60276J78203N08845L8410
11566F632l15170k81074L4612M55948K93664J81707j15194j29270j98808j32685
11556a99638K13538r6626p3940L6177L9420K9865l02869k28098M64465J69416
11546E1710J52375K50845j57080m75139j80167P1818N20124O27000n5823m07078
$$ plain form
11536 398585 164739 229903 246876 370257 372404 39415 43389 175329 554876 961798 1217968
11525 1217968 1296815 1374049 1383225 1225821 953038 848470 350540 -380519 -363170 40949
11515 40949 82243 -78590 -290360 -375353 -218349 121785 262037 -143102 -57554 265988
11505 265988 140021 -277787 -440272 -442795 -478651 -745082 -983412 -1056530 -906154 -766716
11495 -766716 -505578 -108712 -103393 -308472 -556329 -608218 -721018 -782474 -482797 17244
11485 17244 357232 122234 -179799 -257021 -264964 -138016 -103316 -462775 -437807 -167708 -209487
11474 -209487 -56758 354862 767325 1070323 616953 -506406 -1113994 -736703 -276272
11465 -276272 -575737 -561728 -544048 -713887 -899201 -945657 -822542 -727031 -705191 -1195572
$$ packed form
11536C98585k33846O5164J6973J23381K147l32989L974J31940L79547M06922K56170
11525A217968P8847P7234R176j57404k72783j04568m97930p31059J7349M04119
11515D0949M1294j60833k11770q4993J57004L40134J40252m05139Q5548L23542
11505B65988j25967m17808j62485k523l5856k66431k38330p3118J50376J39438
11495g66716K61138L96866N319k05079k47857n1889j12800o1456K99677N00041
11485A7244L39988k34998l02033p7222p943J26948L4700l59459K4968K70099m1779
11474b09487J52729M11620M12463L02998m53370j123359o07588L77291M60431
11465b76272k99465J4009J7680j69839j85314m6456J23115R5511K1840m90381
$$ plain form
11455 -1195572 -1477882 -1183999 -738405 -388628 -299825 -132282 461875 682257 832801 758384
11445 758384 599347 497871 437775 -102320 -675984 -1150323 -1252317 -1052054 -1014167 -861416
11435 -861416 -532663 -359759 51472 240387 -167131 -614629 -1109549 -1093670 -800990 -585378
11425 -585378 -564687 -672294 -717451 -593465 -53979 -97262 -538738 -487888 -250008 90938
11415 90938 257425 232606 446349 582933 617551 522007 387282 147928 -418398 -939767
11405 -939767 -1258404 -1077356 -618357 -501858 -713384 -674633 -410490 182824 272780 41248
11395 41248 187201 584036 655516 266416 -152364 -16832 -194403 -502769 -480941 104687
11385 104687 805380 702350 418900 173820 137739 52746 -220244 -270600 -69056 196385
$$ packed form
11455a195572k82310K93883M45594L49777Q8803J67543N94157K20382J50544p4417
11445G58384j59037j01476o0096n40095n73664m74339j01994K00263L7887J52751
11435h61416L28753J72904M11231J88915m07518m47498m94920J5879K92680K15612
11425e85378K0691j07607m5157J23986N39486m3283m41476N0850K37880L40946
11415I0938J66487k4819K13743J36584L4618r5544j34725k39354n66326n21369
11405i39767l18637J81048M58999J16499k11526L8751K64143N93314Q9956k31532
11395D1248J45953L96835P1480l89100m18780J35532j77571l08366K1828N85628
11385A04687P00693j03030k83450k45080l6081q4993k72990n0356K01544K65441
$$ plain form
11375 196385 435144 515657 496019 562260 321276 388957 897169 1123444 1220509 925683
11365 925683 698598 671498 362732 151746 308721 472542 395931 241177 335564 491855
11355 491855 738439 810752 844850 816006 439892 213666 87969 60417 -175251 -381385
11345 -381385 -327201 87669 1055 -695530 -946506 -1252922 -876108 -203554 -219899 -671145
11335 -671145 -634008 -347748 -572907 -721677 -337464 -48755 355440 340414 116201 135793
11325 135793 334824 224374 -82961 33017 341778 352898 179810 238329 693969 788286
11315 788286 485580 326553 -2317 -282924 -382264 -615270 -401883 252036 476980 128162
11305 128162 -255362 145799 468429 98999 -164325 -227206 -291786 -443388 -525641 -463737
$$ packed form
11375A96385K38759Q0513j9638O6241k40984O7681N08212K26275R7065k94826
11365I25683k27085k7100l08766k10986J56975J63821p6611j54754R4387J56291
11355D91855K46584P2313L4098k8844l76114k26226j25697k7552k35668k06134
11345c81385N4184M14870q6614o96585k50976l06416L76814O72554j6345m51246
11335f71145L7137K86260k25159j48770L84213K88709M04195j5026k24213J9592
11325A35793J99031j10450l07335J15978L08761J1120j73088N8519M55640R4317
11315G88286l02706j59027l28870k80607r9340k33006K13387O53919K24944l48818
11305A28162l83524M01161L22630l69430k63324o2881o4580j51602q2253O1904
$$ plain form
11295 -463737 -475903 -294305 242678 429627 475261 492656 377299 360762 188426 -148682
11285 -148682 -288146 -306655 -705572 -1009959 -1001348 -759067 -533193 -415478 -349532 -404840
11275 -404840 -520395 -396644 -222091 -479828 -782001 -1015657 -704363 -699564 -896569 -951938
11265 -951938 -1114956 -1238244 -1169630 -843777 -657523 -557863 -489154 -301149 -166712 42777
11255 42777 -110659 -128114 130511 -38999 -300373 -414306 -694214 -815441 -830819 -652659
11245 -652659 -621115 -359724 142039 192315 -40197 -74297 81910 69123 41038 -51989 -213721
11234 -213721 -235452 -126406 275545 611382 523236 366363 376080 673108 711531 449207
11224 449207 -36329 -198412 -168081 -28811 229215 242399 434758 729598 776323 634033
$$ packed form
11295d63737j2166J81598N36983J86949M5634J7395j15357j6537j72336l37108
11285a48682j39464j8509l98917l04387Q611K42281K25874J17715O5946n5308
11275d04840j15555J23751J74553k57737l02173k33656L11294M799j97005n5369
11265i51938j63018j23288O8614L25853J86254R9660O8709J88005J34437K09489
11255D2777j53436j7455K58625j69510k61374j13933k79908j21227j5378J78160
11245f52659L1544K61391N01763N0276k32512l4100J56207j2787k8085r3027j61732
11234b13721k1731J09046M01951L35837q8146j56873R717K97028L8423k62324
11224D49207m85536j62083L0331J39270K58026J3184J92359K94840M6725j42290
$$ plain form
11214 634033 316104 119703 12941 -220470 -205778 78703 -192349 -644211 -384213 -103649
11204 -103649 -199148 -188130 -421910 -613913 -412252 -344843 -265915 -205161 -203145 -164874 908
11193 908 291616 614078 375750 219516 210479 105686 327949 680403 781632 738060 677553
11182 677553 799671 841550 1075411 1007149 809537 587774 512766 644050 736079 280057
11172 280057 -647025 -991587 -548561 -123736 -60630 -217407 -146780 -139428 -381551 -522909
11162 -522909 -690032 -437118 -13729 330479 245603 -142383 -499100 -405254 -49653 276710
11152 276710 706682 765531 506026 410919 279009 120270 -80714 -210657 147242 414720
11142 414720 446247 577756 859318 912490 927909 876035 865318 853808 1009434 957828 568458
$$ packed form
11214F34033l17929j96401j06762k33411J4692K84481k71052m51862K59998K80564
11204a03649r5499J1018k33780j92003K01661O7409P8928O0754K016L8271J65782
11193I08K90708L22462k38328j56234r037j04793K22263L52454J01229m3572o0507
11182F77553J22118M1879K33861o8262j97612k21763p5008J31284R2029m56022
11172B80057r27082l44562M43026M24825O3106j56777P0627P352k42123j41358
11162e22909j67123K52914M23389L44208q4876l87986l56717R3846L55601L26363
11152B76710M29972N8849k59505r5107j31910j58739k00984j29943L57899K67478
11142D14720L1527J31509K81562N3172J5419n1874j0717j1510J55626n1606l89370
$$ plain form
11131 568458 573650 365081 -355658 -855143 -791954 -554576 -608605 -701240 -160634 388502
11121 388502 643348 335452 158037 218289 -96071 -250884 -234381 -473610 -546824 -142702
11111 -142702 -129287 -520376 -504819 -405481 -13441 261195 -65694 -236275 -131 180539
11101 180539 225733 327318 337765 264681 80850 163758 256533 153904 479756 712395
11091 712395 289217 -312583 -83888 396141 693775 1257227 1476937 1127276 597350 278466
11081 278466 348032 604114 544625 -109902 -288043 361046 872009 1273682 1465045 1588302
11071 1588302 1680734 1399925 801251 77668 -527081 -793612 -748063 -519330 -179989 -139893
11061 -139893 -389576 -378135 -137031 327316 578109 700827 816021 1045635 1143486 997582
$$ packed form
11131E68458N192k08569p20739m99485O3189K37378n4029r2635N40606N49136
11121C88502K54846l07896j77415O0252l14360j54813J6503k39229p3214M04122
11111a42702J3415l91089J5557R9338L92040K74636l26889j70581K36144J80670
11101A80539M5194J01585J0447p3084j83831Q2908R2775j02629L25852K32639
11091G12395m23178o01800K28695M80029K97634N63452K19710l49661n29926l18884
11081B78466O9566K56082n9489o54527j78141O49089N10963M01673J91363J23257
11071A588302R2432k80809n98674p23583o04749k66531M5549K28733L39341M0096
11061a39893k49683J1441K41104M64347K50793J22718J15194K29614R7851j45904
$$ plain form
11051 997582 764539 637510 258175 -67125 162109 504975 541600 -88760 -323203 -247654
11041 -247654 -255548 -111184 -371759 -550056 -558312 -429787 -209311 -183097 -186849 -160095 91557
11030 91557 455051 642337 467552 90484 13795 371481 544327 202318 -379638 -909602
11020 -909602 -1097463 -1293939 -1508021 -1239853 -825653 -458140 -564853 -1046590 -1001392 -347119
11010 -347119 -111066 -388013 -255992 -106719 64028 475588 633739 548464 99295 -387223
11000 -387223 -665698 -954044 -1136914 -1349755 -1386341 -1292466 -1077118 -836781 -910836 -699644
10990 -699644 -434549 -236645 -129183 -8945 51305 -77389 -152761 -70575 305654 912975
10980 912975 1334830 1261088 1025576 574266 -41301 -491806 -444408 -255908 -270971 -392142
$$ packed form
11051I97582k33043j27029l79335l25300K29234L42866L6625o30360k34443P5549
11041b47654p894J44364k60575j78297q256J28525K20476K6214l752K6754K51652
11030I1557L63494J87286j74785l77068p6689L57686J72846l42009n81956n29964
11020i09602j87861j96476k14082K68168M14200L67513j06713m81737M5198O54273
11010c47119K36053k76947J32021J49273J70747M11560J58151q5275m49169m86518
11000c87223k78475k88346j82870k12841l6586R3875K15348K40337p4055K11192
10990f99644K65095J97904J07462J20238O0250j28694p5372Q2186L76229O07321
10980I12975M21855p3742k35512m51310o15567m50505M7398J88500j5063j21171
$$ plain form
10970 -392142 -309997 -449749 -672152 -658477 -681161 -552813 -591806 -632108 -335785 -426462 -420195
10959 -420195 -84175 -37872 142168 160898 -14253 -325743 -432883 -348298 60078 417792
10949 417792 26848 -464400 -350967 301 180156 296988 21316 -573961 -987317 -996251
10939 -996251 -909618 -650554 -489293 -851160 -837726 -727267 -771684 -865323 -846506 -719041
10929 -719041 -304129 33347 86012 -105187 -473704 -559736 -362106 -71968 -1920 -102858
10919 -102858 -317446 -433294 -675552 -916264 -1103446 -1116189 -1056856 -1082728 -998054 -828359
10909 -828359 -724050 -307045 42687 354158 863841 1277458 1272620 859141 394848 -101011
10899 -101011 -185289 109850 354851 -108194 -490920 -365752 -182386 206361 469680 202071
$$ packed form
10970c92142Q2145j39752k22403J3675k2684J28348l8993m0302K96323r0677O267
10959d20195L36020M6303J80040J8730j75151l11490j07140Q4585M08376L57714
10949D17792l90944m91248J13433L51268J79855J16832k75672n95277m13356q934
10939i96251Q6633K59064J61261l61867J3434J10459m4417r3639J8817J27465
10929g19041M14912L37476N2665j91199l68517q6032J97630K90138P0048j00938
10919a02858k14588j15848k42258k40712j87182j2743N9333k5872Q4674J69695
10909h28359J04309M17005L49732L11471N09683M13617m838m13479m64293m95859
10899a01011q4278K95139K45001m63045l82726J25168J83366L88747K63319k67609
$$ plain form
10889 202071 -6656 143828 186706 491485 866772 752836 631083 628870 653153 364321
10879 364321 -233884 -818276 -1188824 -1298319 -1290083 -1108992 -948637 -955653 -403384 -89936
10869 -89936 -221558 163209 389605 351712 750844 1086811 919573 889117 1052017 1054364
10859 1054364 1057516 755116 351487 391139 498027 364827 276340 266241 338635 281989 130943
10848 130943 69846 105472 102760 385493 466149 119669 -37473 -337739 -275199 -390197 -812782
10837 -812782 -966949 -614979 93644 725874 1037741 1049401 726625 603778 619867 703657
10827 703657 661714 316553 378269 485809 437309 193358 415337 931248 832705 385682
10817 385682 45893 116698 479170 680307 759969 194208 -100483 227051 742982 937170
$$ packed form
10889B02071k08727J50484M2878L04779L75287j13936j21753k213K4283k88832
10879C64321n98205n84392l70548j09495Q236J81091J60355p016N52269L13448
10869h9936j31622L84767K26396l7893L99132L35967j67238l0456J62900K347
10859A054364L152l02400m03629L9652J06888j33200q8487j0099P2394n6646j51046
10848A30943o1097L5626k712K82733Q0656l46480j57142l00266O2540j14998m22585
10837h12782j54167L51970P08623O32230L11867J1660l22776j22847J6089Q3790
10827G03657m1943l45161O1716J07540m8500k43951K21979N15911r8543m47023
10817C85682l39789P0805L62472K01137P9662n65761k94691L27534N15931J94188
$$ plain form
10807 937170 643054 34084 -478331 -684118 -772702 -888025 -534736 -501813 -525425 -161310
10797 -161310 -227980 -553927 -659058 -215987 85935 -178982 -325217 -29365 29770 -177010
10787 -177010 99359 195023 10282 -187575 -367321 -98718 460267 716729 246272 -49267
10777 -49267 -82335 112124 130394 -177051 -665398 -697693 -577083 -685361 -677123 -493140 -409534
10766 -409534 -267639 -221320 -1151 80853 -25285 -468907 -727148 -422032 -87355 -444165
10756 -444165 -433772 -43178 160338 497961 1166126 1270657 544646 208830 291201 -64851
10746 -64851 -243730 -146427 -362607 -421492 -834769 -1265133 -1051304 -675736 -661288 -672404
10736 -672404 -396687 -273042 -640404 -855653 -889838 -597166 -283206 -200779 -456540 -530859
$$ packed form
10807I37170k94116o08970n12415k05787q8584j15323L53289L2923k3612L64115
10797a61310o6670l25947j05131M43071L01922k64917j46235K95852N9135k06780
10787a77010K76369R5664j84741j97857j79746K68603N58985K56462m70457k95539
10777d9267l3068J94459J8270l07445m88347l2295J20610j08278Q238J83983Q3606
10766d09534J41895M6319K20169Q2004j06138m43622k58241L05116L34677l56810
10756d44165J0393L90594K03516L37623O68165J04531p26011l35816Q2371l56052
10746f4851j78879R7303k16180n8885m13277m30364K13829L75568J4448j1116
10736f72404K75717J23645l67362k15249l4185K92672L13960Q2427k55761p4319
$$ plain form
10726 -530859 -405229 97954 801911 607347 253965 325421 262490 -169379 -223450 18355
10716 18355 56678 255365 118387 -150716 -306122 -426871 -445464 -640258 -598575 -462919
10706 -462919 -644774 -357164 -207010 -511512 -906346 -1183875 -1172971 -723435 -241902 -219392
10696 -219392 -151813 -365400 -345537 -99075 -224393 -470189 -417048 -165695 77730 480465
10686 480465 518119 140756 168091 382201 260440 -45541 117898 551921 754417 670061
10676 670061 455221 371442 395602 172129 -69190 -162821 14110 57634 -14991 -170372
10666 -170372 -296327 -70236 -236425 -484868 -797218 -1250351 -1461208 -1238204 -993016 -910039
10656 -910039 -833599 -543951 26685 433307 469106 775403 619997 106498 -182140 -441149
$$ packed form
10726e30859J25630N03183P03957j94564l53382P1456o2931m31869n4071K41805
10716A8355L8323J98687j36978k69103j55406j20749j8593j94794M1683J35656
10706d62919j81855K87610J50154l04502l94834k77529J0904M49536M81533K2510
10696b19392O7579k13587J9863K46462j25318k45796N3141K51353K43425M02735
10686D80465L7654l77363K7335K14110j21761l05981J63439M34023K02496q4356
10676F70061k14840q3779K4160k23473k41319r3631J76931M3524p2625j55381
10666a70372j25955K26091j66189k48443l12350m53133k10857K23004K45188Q2977
10656i10039P6440K89648N70636M06622L5799L06297j55406n13499k88638k59009
$$ plain form
10646 -441149 -822817 -590511 -249774 -34301 22623 131110 499482 834600 882203 524449
10636 524449 285037 278026 98855 -524848 -843512 -847227 -627745 -501276 -403084 -175794
10626 -175794 66283 239321 130312 -252682 -353572 -193602 412547 578639 248532 397382
10616 397382 645125 409139 148603 210361 136085 -34306 143468 338118 600441 584919
10606 584919 407419 494900 657023 919552 899910 843253 769550 901966 781378 314733
10596 314733 68498 93009 533144 905284 468838 -854 -281692 -208721 378915 506050
10586 506050 246317 -251877 -482081 -501520 -788302 -947999 -977477 -774729 -771654 -929884
10576 -929884 -941295 -874765 -854897 -985287 -1030141 -897882 -471226 222383 769767 904656
$$ packed form
10646d41149l81668K32306L40737K15473N6924J08487L68372L35118M7603l57754
10636E24449k39412p011j79171o23703l18664l715K19482J26469R8192K27290
10626a75794K42077J73038j09009l82994j00890J59970O06149J66092l30107J48850
10616C97382K47743k35986k60536O1758p4276j70391J77774J94650K62323j5522
10606E84919j77500Q7481J62123K62529j9642n6657p3703J32416j20588m66645
10596C14733k46235K4511M40135L72140m36446m69692k80838P2971N87636J27135
10586E06050k59733m98194k30204j9439k86782j59697k9478K02748L075j58230
10576i29884j1411O6530J9868j30390m4854J32259M26656O93609N47384J34889
$$ plain form
10566 904656 1121227 1233637 1767209 2544993 2753068 2386044 2011147 2054851 2095413 1731222
10556 1731222 1287070 852996 646476 332166 406696 901138 1252205 1096585 776036 504322
10546 504322 115451 369971 551962 740957 372371 -98481 -275741 -5586 343073 608737
10536 608737 709242 473347 366850 434398 519404 567240 923568 902633 176432 -210860
10526 -210860 126633 698037 885026 352781 -267171 -242565 219895 281619 35845 -4338
10516 -4338 69634 -272933 -332824 77927 22182 -372265 -223815 40473 189536 204686 16339
10505 16339 -198037 -519710 -826212 -718604 -474432 -528154 -461638 -91975 211104 559068
10495 559068 503561 196904 475436 843972 943074 672185 302673 118531 -11217 400283
$$ packed form
10566I04656K16571J12410N33572P77784K08075l67024l74897M3704M0562l64191
10556A731222m44152m34074k06520l14310P4530M94442L51067j55620l20549k71714
10546E04322l88871K54520J81991J88995l68586m70852j77260K70155L48659K65664
10536F08737J00505k35895j06497O7548Q5006M7836L56328k0935p26201l87292
10526b10860L37493N71404J86989n32245o19952K4606M62460O1724k45774m0183
10516d338P3972l42567n9891M10751n5745l94447J48450K64288J49063J5150j88347
10505A6339k14376l21673l06502J07608K44172n3722O6516L69663L03079L47964
10495E59068n5507l06657K78532L68536R9102k70889l69512j84142j29748M11500
$$ plain form
10485 400283 819892 749704 614528 239196 -208261 -122592 -145028 66799 373088 431128
10475 431128 454995 489124 451847 -178451 -527774 -785537 -1267715 -1356219 -1177816 -868628
10465 -868628 -557500 -291919 -385710 -531513 -298218 -284986 -508941 -601070 -465844 65742
10455 65742 528263 836832 1177654 656408 319485 175549 -93160 -309783 -152665 518656
10445 518656 944617 998092 872168 986877 767536 458731 310866 -237830 -649236 -619609
10435 -619609 -340807 239191 962145 1208409 915789 623155 354198 251276 148467 -226104
10425 -226104 -661559 -300328 444 113655 122578 -151839 -253737 -318572 -169095 223108
10415 223108 633928 1012978 1297253 814669 46565 -112107 327665 441655 340061 -83735
$$ packed form
10485D00283M19609p0188j35176l75332m47457Q5669k2436K11827L06289N8040
10475D31128K3867L4129l7277o30298l49323k57763m82178q8504J78403L09188
10465h68628L11128K65581r3791j45803K33295J3232k23955r2129J35226N31586
10455F5742M62521L08569L40822n21246l36923j43936k68709k16623J57118O71321
10445E18656M25961N3475j25924J14709k19341l08805j47865n48696m11406K9627
10435f19609K78802N79998P22954K46264k92620k92634k68957j02922j02809l74571
10425b26104m35455L61231L00772J13211Q923k74417j01898o4835J49477L92203
10415B23108M10820L79050K84275m82584p68104j58672M39772J13990j01594m23796
$$ plain form
10405 -83735 -553005 -538542 -686307 -924002 -791038 -334600 -201617 -93432 269549 151933
10395 151933 -137773 -34085 -74514 -221253 262577 629124 296054 -95247 204817 422910
10385 422910 137999 87731 -41922 -398711 -952174 -1104748 -466492 -143150 247140 1056444
10375 1056444 1573547 1541890 1083233 645083 394895 324169 121358 184604 133213 227634
10365 227634 534291 623683 323641 23015 108650 186755 -20084 -170263 -202872 -485287
10355 -485287 -801699 -930670 -923419 -711247 -418663 -27303 236293 187738 156280 238350
10345 238350 248089 177112 188779 372808 517420 492337 394190 41256 -41945 -223231 -646457
10334 -646457 -718449 -771976 -1033995 -1029904 -891743 -875378 -680056 -740425 -701901 -549792 -423039
$$ packed form
10405h3735m69270J4463j47765k37695J32964M56438J32983J08185L62981j17616
10395A51933k89706J03688m0429j46739M83830L66547l33070l91301L00064K18093
10385D22910k84911n0268j29653l56789n53463j52574O38256L23342L90290Q09304
10375A056444N17103l1657m58657m38150k50188p0726k02811O3246n1391R4421
10365B27634L06657Q9392l00042l00626Q5635P8105k06839j50179l2609k82415
10355d85287l16412j28971P251K12172K92584L91360K63596m8555l1458Q2070
10345B38350R739p0977J1667J84029J44612k5083r8147l52934q3201j81286m23226
10334f46457p1992n3527k62019M091J38161J6365J95322o0369L8524J52109J26753
$$ plain form
10323 -423039 -276558 -49569 -51185 -224597 -340523 -488978 -436608 -480989 -547080 -160031
10313 -160031 327215 731398 553185 58163 -165611 -142683 -196012 -132851 48781 78565
10303 78565 93260 -20546 -238735 -528023 -452124 -235278 88774 653888 636539 72913
10293 72913 -154508 -184775 -398874 -42051 338797 508525 637926 258626 351765 559912
10283 559912 652100 434834 304083 -31548 32373 246393 401042 782827 673169 53144
10273 53144 -128840 39972 277986 325336 194910 224335 122753 -140442 223160 350906
10263 350906 248950 62800 379890 988383 931458 599336 464254 309282 -280024 -368325
10253 -368325 -296873 -375846 -182077 49865 375843 729470 1059130 1239423 1018196 648692
$$ packed form
10323d23039J46481K26989j616j73412j15926j48455N2370m4381o6091L87049
10313a60031M87246M04183j78213m95022k23774K2928n3329O3161J81632K9784
10303G8565J4695j13806k18189k89288P5899K16846L24052N65114j7349n63626
10293G2913k27421l0267k14099L56823L80848J69728J29401l79300R3139K08147
10283E59912R2188k17266j30751l35631O3921K14020J54649L81785j09658o20025
10273E3144j81984J68812K38014M7350j30426K9425j01582k63195L63602J27746
10263C50906j01956j86150L17090O08493n6925l32122j35082j54972n89306q8301
10253c68325P1452p8973J93769K31942L25978L53627L29660J80293k21227l69504
$$ plain form
10243 648692 361234 335930 49794 67966 -64876 -406603 -430944 -669534 -862410 -686824
10233 -686824 -162511 541834 804436 453640 87887 -118917 43720 407537 430614 364228
10223 364228 463090 450092 879821 1052835 518069 -54174 -192522 -247180 -495701 -716123
10213 -716123 -807985 -878091 -860446 -677096 -640607 -645140 -907593 -1119295 -915958 -925130 -1049871
10202 -1049871 -647069 -211726 2551 377138 393116 25318 -260390 -304702 -351017 -424728
10192 -424728 -191620 213039 369516 708014 879393 1052715 1106963 635893 -11270 -636759
10182 -636759 -928400 -1065079 -1076005 -820037 -589415 -248548 44798 73227 -376360 -1010724
10172 -1010724 -1127057 -1103328 -799645 -612599 -742877 -1242775 -1436223 -1273738 -1078063 -801499
$$ packed form
10243F48692k87458k5304k86136J8172j32842l41727k4341k38590j92876J75586
10233f86824N24313P04345K62602l50796l65753k06804J62637L63817K3077o6386
10223C64228R8862j2998M29729J73014n34766n72243j38348n4658k48521k20422
10213g16123r1862p0106J7645J83350L6489m533k62453k11702K03337r172j24741
10202a049871M02802M35343K14277L74587J5978l67798k85708m4312m6315p3711
10192d24728K33108M04659J56477L38498J71379J73322N4248m71070o47163o25489
10182f36759k91641j36679j0926K55968K30622L40867K93346K8429m49587o34364
10172a010724j16333K3729L03683J87046j30278m99898j93448J62485J95675K76564
$$ plain form
10162 -801499 -397252 -245159 132579 689631 1337168 1690476 1719386 1346474 847980 479930
10152 479930 115337 148680 265106 106999 -438796 -607538 107613 772641 673697 128787
10142 128787 -198019 -175402 11653 212991 26800 -482476 -1001366 -960608 -636519 -474934
10132 -474934 -586317 -736220 -655389 -792337 -1168139 -904040 -239414 323617 541198 435573
10122 435573 508180 434444 248860 436274 740159 1033916 1130736 909018 850908 1248521
10112 1248521 1244741 463518 150146 216455 -147601 -326530 -280249 132760 364948 299437
10102 299437 477625 610861 640330 631493 422434 284505 516450 716672 854124 665090
10092 665090 373621 534057 475111 185444 -151162 -416845 -353946 -203278 -75681 32116
$$ packed form
10162h01499M04247J52093L77738N57052O47537L53308K8910l72912m98494l68050
10152D79930l64593L3343J16426j58107n45795j68742P15151O65028r8944n44910
10142A28787l26806K2617J87055K01338j86191n09276n18890M0758L24089J61585
10132d74934j11383j49903Q0831j36948l75802K64099O64626N63031K17581j05625
10122D35573P2607p3736j85584J87414L03885K93757R6820k21718n8110L97613
10112A248521l780p81223l13372O6309l64056j78929M6281M13009K32188o5511
10102B99437J78188J33236K9469q837k09059j37929K31945K00222J37452j89034
10092F65090k91469J60436n8946k89667l36606k65683O2899J50668J27597J07797
$$ plain form
10082 32116 -254957 -527980 -349038 -8734 395196 376584 407686 524217 445803 224818
10072 224818 -186103 -622425 -1077082 -880356 -531461 -278101 -243118 -112349 188263 -62796
10062 -62796 -452879 -520002 -287383 -425149 -429680 -425959 -695331 -1115530 -990450 -544709 70398
10051 70398 260821 -183580 -472324 -220901 -406514 -702388 -815416 -751917 -847500 -959926
10041 -959926 -971651 -454880 58835 175007 535863 1013216 1146413 861647 385492 292232
10031 292232 326956 557458 614608 296615 10690 31565 112577 218467 514899 301499
10021 301499 -160039 -504070 -684814 -909624 -1032533 -993069 -718809 -399494 129383 364491
10011 364491 416123 513045 411820 355528 715366 836488 726255 899279 775062 322002
$$ packed form
10082C2116k87073k73023J78942L40304M03930j8612L1102J16531p8414k20985
10072B24818m10921m36322m54657J96726L48895K53360L4983J30769L00612k51059
10062f2796l90083o7123K32619j37766m531L721k69372m20199J25080M45741O15107
10051G0398J90423m44401k88744K51423j85613k95874j13028O3499r5583j12426
10041i59926j1725N16771N13715J16172L60856M77353J33197k84766m76155r3260
10031B92232L4724K30502N7150l17993k85925K0875Q1012J05890K96432k13400
10021C01499m61538l44031j80744k24810j22909L9464K74260L19315N28877K35108
10011C64491N1632R6922j01225n6292L59838J21122j10233J73024j24217m53060
$$ plain form
10001 322002 204611 252494 21211 -660762 -615864 71628 383928 676050 744548 556396
9991 556396 164778 -405670 -571541 -568898 -517670 -361969 -257096 -156879 -294090 -773036
9981 -773036 -1063121 -1076126 -940643 -613900 -556030 -579244 -327477 -383326 -694231 -860339
9971 -860339 -640819 -373306 -273379 -60476 142689 -72646 -521333 -538988 -216539 -136921
9961 -136921 -329587 -437875 -602490 -609930 -795719 -682178 -166231 -42015 -202860 -349937
9951 -349937 -425590 -704202 -352626 200334 651432 926059 415262 -174112 -195090 -239108
9941 -239108 -404255 -551013 -677088 -478818 -433581 -662583 -366043 54154 -272319 -566159
9931 -566159 -798623 -659082 116768 651482 873070 861636 213799 -540006 -917868 -656728
$$ packed form
10001C22002j17391M7883k31283o81973M4898O87492L12300K92122O8498j88152
9991E56396l91618n70448j65871K643N1228J55701J04873J00217j37211m78946
9981g73036k90085j3005J35483L26743N7870k3214K51767n5849l10905j66108
9971h60339K19520K67513R9927K12903K03165k15335m48687j7655L22449P9618
9961a36921j92666j08288j64615p440j85789J13541N15947J24216j60845j47077
9951c49937p5653k78612L51576N52960M51098K74627n10797n89374k0978m4018
9941b39108j65147j46758j26075J98270M5237k29002K96540M20197l26473k93840
9931e66159k32464J39541P75850N34714K21588j1434o47837p53805l77862K61140
$$ plain form
9921 -656728 -459499 -103021 253661 373022 699871 678566 411936 85417 -27024 -67016
9911 -67016 -473395 -603067 -463523 -214665 -194420 -313231 -391265 -305275 49359 325268
$$ packed form
9921f56728J97229L56478L56682J19361L26849k1305k66630l26519j12441l9992
9911f7016m06379j29672J39544K48858K0245j18811p8034Q5990L54634K75909
$$ [...]
##END NTUPLES=NMR SPECTRUM
##END=
