##TITLE=C13_L1_SePh(A)(2)(+1)
 CDCl3, 26600 sc

 14.02.2019
##JCAMPDX= 6.0         $$ Bruker NMR JCAMP-DX V2.0
##DATA TYPE= NMR SPECTRUM
##DATA CLASS= NTUPLES
##ORIGIN= UXNMR, Bruker Analytische Messtechnik GmbH
##OWNER= root
$$ XWIN-NMR		Version 3.5
$$ Fri Feb 15 13:44:55 2019 Russian Standard Time (UT+4h)  she@DPX200
##.OBSERVE FREQUENCY= 50.32789651
##.OBSERVE NUCLEUS= ^13C
##.ACQUISITION MODE= SIMULTANEOUS
##.ACQUISITION SCHEME= undefined
##.AVERAGES= 26600
##.DIGITISER RES= 17
##SPECTROMETER/DATA SYSTEM= spect
##.PULSE SEQUENCE= zgpg30
##.SOLVENT NAME= CDCl3
##.SHIFT REFERENCE= (INTERNAL, CDCl3, 0, 222.661)
##AUDIT TRAIL= $$ (NUMBER, WHEN, WHO, WHERE, WHAT)
$$ ##TITLE= Audit trail, XWIN-NMR		Version 3.5
$$ ##JCAMPDX= 5.01
$$ ##ORIGIN= Bruker BioSpin GmbH
$$ ##OWNER= she
$$ F:/spectra/data/she/nmr/c13/2/pdata/1/auditp.txt
$$ ##AUDIT TRAIL=  $$ (NUMBER, WHEN, WHO, WHERE, WHAT)
(   1,<2019-02-15 13:43:44.57 +0400>,<she>,<DPX200>,
      <created by zg, POWCHK disabled, PULCHK disabled
       terminated by command 'halt'
       configuration hash MD5:
       00 E9 B6 7A A2 85 ED C7 34 08 36 98 17 FE 4E 26
       data hash MD5: 32K
       D8 A5 16 9C C5 84 41 B8 65 9F B9 52 0E 64 3B 8C>)
(   2,<2019-02-15 13:43:51.34 +0400>,<she>,<DPX200>,
      <Start of raw data processing
       efp BC_mod = 2 LB = 1 FT_mod = 6 PKNL = 1 PHC0 = 1453.766 PHC1 = 39.22154 SI = 32K 
       data hash MD5: 32K
       A8 1A 03 03 5F 19 4C 4D 09 0B A1 39 A5 48 5C 32>)
(   3,<2019-02-15 13:43:55.31 +0400>,<she>,<DPX200>,
      <abs ABSG = 5 
       data hash MD5: 32K
       08 AB 5F A7 D1 32 65 E5 24 68 9F 63 75 04 43 C6>)
$$ ##END=
$$ 
$$ hash MD5
$$ 80 CB 15 89 40 F2 56 E3 67 AC 8E A7 7D EB B4 BB
##$RELAX= 
##$RELAX= 
##$RELAX= 
##$RELAX= 
##$RELAX= 
##$RELAX= 
##$RELAX= 
##$RELAX= 
$$ Bruker specific parameters
$$ --------------------------
##$DU= <F:/spectra>
##$EXPNO= 2
##$NAME= <c13>
##$PROCNO= 1
##$TYPE= <nmr>
##$USER= <she>
##$AMP= (0..31)
100 100 100 100 100 100 100 100 100 100 100 100 100 100 100 100 100 100 
100 100 100 100 100 100 100 100 100 100 100 100 100 100 
##$AQSEQ= 0
##$AQ_mod= 1
##$AUNM= <au_zg>
##$AUTOPOS= <>
##$BF1= 50.322709
##$BF2= 200.13
##$BF3= 50.322709
##$BF4= 500.13
##$BF5= 500.13
##$BF6= 500.13
##$BF7= 500.13
##$BF8= 500.13
##$BYTORDA= 1
##$CFDGTYP= 0
##$CFRGTYP= 5
##$CHEMSTR= <none>
##$CNST= (0..31)
1 1 145 1 1 1 1 1 1 1 1 1 1 1 1 1 1 1 1 1 1 1 1 1 1 1 1 1 1 1 1 1 
##$CPDPRG= <waltz16>
##$CPDPRG1= <>
##$CPDPRG2= <waltz16>
##$CPDPRG3= <>
##$CPDPRG4= <mlev>
##$CPDPRG5= <mlev>
##$CPDPRG6= <mlev>
##$CPDPRG7= <mlev>
##$CPDPRG8= <mlev>
##$CPDPRGB= <>
##$CPDPRGT= <>
##$D= (0..31)
0 1.5 0.00345 0 0 0 0 0 0 0 0 0.03 2e-05 3e-06 0 0 0 0 0 0 0 0 0 0 0 0 
0 0 0 0 0 0 
##$DATE= 1550146275
##$DBL= (0..7)
120 120 120 120 120 120 120 120 
##$DBP= (0..7)
150 150 150 150 150 150 150 150 
##$DBP07= 0
##$DBPNAM0= <>
##$DBPNAM1= <>
##$DBPNAM2= <>
##$DBPNAM3= <>
##$DBPNAM4= <>
##$DBPNAM5= <>
##$DBPNAM6= <>
##$DBPNAM7= <>
##$DBPOAL= (0..7)
$$ [...]
##$SUBNAM4= <"">
##$SUBNAM5= <"">
##$SUBNAM6= <"">
##$SUBNAM7= <"">
##$SUBNAM8= <"">
##$SUBNAM9= <"">
##$SW= 239.972172959595
##$SWIBOX= (0..15)
0 1 3 0 0 0 0 0 0 0 0 0 0 0 0 0 
##$SW_h= 12077.2946859903
##$TD= 32768
##$TD0= 1
##$TE= 0
##$TE2= 300
##$TE3= 300
##$TEG= 300
##$TL= (0..7)
120 120 120 120 120 120 120 120 
##$TP= (0..7)
150 150 150 150 150 150 150 150 
##$TP07= 0
##$TPNAME0= <>
##$TPNAME1= <>
##$TPNAME2= <>
##$TPNAME3= <>
##$TPNAME4= <>
##$TPNAME5= <>
##$TPNAME6= <>
##$TPNAME7= <>
##$TPOAL= (0..7)
0.5 0.5 0.5 0.5 0.5 0.5 0.5 0.5 
##$TPOFFS= (0..7)
0 0 0 0 0 0 0 0 
##$TUNHIN= 0
##$TUNHOUT= 0
##$TUNXOUT= 0
##$USERA1= <user>
##$USERA2= <user>
##$USERA3= <user>
##$USERA4= <user>
##$USERA5= <user>
##$V9= 5
##$VALIST= <valist>
##$VCLIST= <CCCCCCCCCCCCCCC>
##$VD= 0
##$VDLIST= <DDDDDDDDDDDDDDD>
##$VPLIST= <PPPPPPPPPPPPPPP>
##$VTLIST= <TTTTTTTTTTTTTTT>
##$WBST= 1024
##$WBSW= 4
##$XGAIN= (0..3)
0 0 0 0 
##$XL= 0
##$YL= 0
##$YMAX_a= 156443370
##$YMIN_a= -38965678
##$ZGOPTNS= <>
##$ZL1= 120
##$ZL2= 120
##$ZL3= 120
##$ZL4= 120
##$ABSF1= 222.6608
##$ABSF2= -17.33601
##$ABSG= 5
##$ABSL= 3
##$ALPHA= 0
##$AQORDER= 0
##$ASSFAC= 0
##$ASSFACI= 0
##$ASSFACX= 0
##$ASSWID= 0
##$AUNMP= <proc_1d>
##$AZFE= 0.1
##$AZFW= 0.5
##$BCFW= 0
##$BC_mod= 2
##$BYTORDP= 0
##$COROFFS= 0
##$CY= -3
##$DATMOD= 1
##$DC= 0
##$DFILT= <>
##$DTYPP= 0
##$F1P= 0
##$F2P= 0
##$FCOR= 0.5
##$FTSIZE= 32768
##$FT_mod= 6
##$GAMMA= 0
##$GB= 0
##$INTBC= 1
##$INTSCL= 1.329259e-09
##$ISEN= 128
##$LB= 1
##$LEV0= 0
##$LPBIN= 0
##$MAXI= 10000
##$MC2= 0
##$MEAN= 0
##$ME_mod= 0
##$MI= 0.9312502
##$NCOEF= 0
##$NC_proc= 3
##$NLEV= 6
##$NOISF1= 120.0001
##$NOISF2= 80.00006
##$NSP= 0
##$NTH_PI= 0
##$NZP= 0
##$OFFSET= 222.6608
##$PC= 1.4
##$PHC0= 1453.766
##$PHC1= 39.22154
##$PH_mod= 1
##$PKNL= yes
##$PPARMOD= 0
##$PSCAL= 0
##$PSIGN= 0
##$REVERSE= no
##$SF= 50.3227302600002
##$SI= 32768
##$SIGF1= 140
##$SIGF2= 120
##$SINO= 35.31775
##$SIOLD= 32768
##$SREGLST= <13C.CDCl3>
##$SSB= 0
##$STSI= 32768
##$STSR= 0
##$SW_p= 12077.2946859903
##$SYMM= 0
##$S_DEV= 0
##$TDeff= 32768
##$TDoff= 0
##$TI= <>
##$TILT= no
##$TM1= 0
##$TM2= 0
##$TOPLEV= 0
##$USERP1= <user>
##$USERP2= <user>
##$USERP3= <user>
##$USERP4= <user>
##$USERP5= <user>
##$WDW= 1
##$XDIM= 32768
##$YMAX_p= 284262769
##$YMIN_p= -1195007
$$ End of Bruker specific parameters
$$ ---------------------------------
##NTUPLES= NMR SPECTRUM
##VAR_NAME=  FREQUENCY,     SPECTRUM/REAL,   SPECTRUM/IMAG
##SYMBOL=    X,             R,               I
##VAR_TYPE=  INDEPENDENT,   DEPENDENT,       DEPENDENT
##VAR_FORM=  AFFN,          ASDF,            ASDF
##VAR_DIM=   32768,         32768,           32768
##UNITS=     HZ,            ARBITRARY UNITS, ARBITRARY UNITS
##FACTOR=    0.368581032318806, 1,           1
##FIRST=     11204.8992329031, 0,            0
##LAST=      -872.395453087158, 0,           0
##MIN=       -872.395453087158, -1195007,    0
##MAX=       11204.8992329031, 284262769,    0
$$ Real data points
##PAGE= N=1
##DATA TABLE= (X++(R..R)), XYDATA
$$ [...]
15943h21777J04754J78581J88951j3880r092J12220N336q7156J032J6095k58343
15932e83279O8686M22744K87330j17724k79191j11157q2685R295R8879r1157r3114
15921d71373J08430J60241r369J645M766R9531j71436N4207K69112r4832k04216
15910b53294N956J15426L6213M4041j02394o5982L4237M4060K61473K51918l0717
15899C40937o1499l5511j6883l8938P5445K6523j15586R3928Q5402P8201K8505
15888D60524l8550Q0408N7224p596K8166p8861j28287j41545k15862m6955J15268
15877H3934J63669M5932R808k7143j29083j67310r8342k3147K35577L61679K492
15866D58066j94022q2611Q0559J02438j8476n4496k3040j4849L3453J11709P7705
$$ y = [-821777, -717023, -538442, -349491, -363371, -372463, -260243, -254907, -342063, -341031, -324936, -583279, -514593, -91849, 195481, 77757, -201434, -312591, -395276, -385981, -287102, -378259, -471373, -362943, -202702, -212071, -210426, -205660, -106129, -277565, -223358, 45754, -49078, -253294, -247338, -131912, -95699, -51658, -154052, -220034, -185797, -141737, 119736, 371654, 340937, 279438, 243927, 227044, 188106, 263551, 290074, 174488, 268416, 353818, 432019, 460524, 421974, 502382, 559606, 552010, 580176, 501315, 373028, 231483, 15621, -31334, 83934, 247603, 293535, 303343, 276200, 147117, -20193, -118535, -141682, 93895, 455574, 458066, 264044, 181433, 261992, 364430, 345954, 291458, 268418, 253569, 287022, 398731, 476436]
15855D76436J04050j54404l14660o7031K87944n003j17154K5976R3294j21561
15845B07887J4824J58397j40170k39209k52830j41132P8878J95064L02722J12259
15835B96690m0320k06553l20980j4441J82542L3882j11928j03894o2634J454P6435
15824b69747j13055k96310j8973L23297K00126q6978J05001K22554K4567j64198
15814g3716k25605j00878J90793k6939q7967P532J64995K5881J17480M7828l0664
15803H740R3304J60907K31790j16542r7251p9265o4426j59367k12519p4051p0153
15792c78833j78010k04255j18951Q0559K80984J70338J79481K22634O2283J11324
15782B27554J79655J39150J665m2653o1521r5768k8873j50829q3863l754J05745
$$ y = [476436, 580486, 426082, 111422, 44391, 332335, 327332, 210178, 236154, 329448, 207887, 222711, 381108, 240938, 1729, -251101, -392233, -313355, -118291, 184431, 296690, 256370, 49817, -271163, -285604, -103062, -69180, -181108, -285002, -347636, -346182, -269747, -382802, -679112, -698085, -374788, -174662, -261640, -156639, 65915, 90482, -73716, -299321, -400199, -209406, -236345, -324312, -316780, -151785, -125904, -8424, 39404, 8740, 102044, 262951, 494741, 378199, 280948, 201683, 137257, -22110, -234629, -308680, -378833, -556843, -761098, -880049, -799490, -518506, -348168, -168687, 53947, 116230, 227554, 407209, 546359, 548024, 505371, 443850, 348082, 319209, 168380, 84517, 80763, 186508]
15771A86508R2606k48769m05195k03793m4964J9452J05185J91079J98901J4578
15761i4412q6452r9424m8442m9768L4634O5774o2782l12578K890J97487K70169
15750a82904K13027m3073j55873j13189P4738J52364J00035m5230J0262J17680
15740A27837j03786k18741k35827J2575m9296r1515J82077J12539k0804J35194
15730a49747J68127L1518j56336j35471q5578k1791K21755K31237r8041j70468
15720a64795j0803k15152k34592k04870j08261O0719K69801K64909J32182J6248
15710a94614m7080k3760P0271K01830J08500k36111P483L33672J96866Q3881M1053
15699E41991n8290k4478J43218p8279k29866j7094m2854r5320j7839q3070r0369
$$ y = [186508, 279114, 30345, -374850, -578643, -623607, -604155, -498970, -307891, -108990, -94412, -180864, -280288, -328730, -378498, -343864, -278090, -340872, -653450, -650560, -453073, -182904, 30123, -12950, -168823, -282012, -207274, -54910, 45125, -105, 10157, 127837, 24051, -194690, -430517, -417942, -467238, -558753, -376676, -264137, -284941, -149747, 18380, 49898, -106438, -241909, -327487, -349278, -127523, 103714, 5673, -164795, -175598, -390750, -625342, -830212, -938473, -877754, -607953, -343044, -210862, -194614, -241694, -265454, -195183, 6647, 115147, -120964, -113481, 220191, 417057, 500938, 541991, 483701, 459223, 602441, 524162, 294296, 277202, 234348, 139028, 121189, 38119, -52250]
15688e2250J6011J5068J45990n340j86941K8943N3129M1797M1864K8629Q6042
15677B12942J5066k47117j69853N5337K17591K85617J57403n8614O6231K02656
15667G37259j52730l53101k83499j08693n4128m1463J6137K46301J84375Q0751
15657B71209p782l13008j76445p1599J54645J25099L1196n4080k45544j58855
15647d45164N0383K67576K86759K6835j9795J87294R1870j22875j81417j1046
15637A30420Q3973J70520J30712j73787l0067L2238j56401K8091K01041p7313
15627C39427m82439l41729R8127L56993J9984j90770l3453O2735J71384J47313
15617A47572Q5283J75847J67043O7757n6489K6441M7206K878j09186J3764M2663
$$ y = [-52250, -36239, -21171, 124819, 119479, -67462, -38519, 14610, 56407, 98271, 126900, 212942, 228008, -19109, -188962, -133625, 83966, 369583, 526986, 468372, 534603, 737259, 584529, 231428, -52071, -160764, -214892, -256355, -240218, 6083, 190458, 271209, 263427, -49581, -226026, -297625, -142980, -17881, 13315, -40765, -286309, -445164, -394781, -127205, 159554, 186389, 166594, 353888, 445758, 322883, 141466, 130420, 214393, 384913, 515625, 341838, 311771, 344009, 187608, 215699, 416740, 339427, -143012, -484741, -386614, -29621, -9637, -200407, -233860, -171125, 259, 147572, 232855, 408702, 575745, 643502, 587013, 613454, 660660, 663538, 554352, 568116, 610779]
15606F10779j80920j98368J31695Q2836j15589o6212p1836o5916q6354j94402
15596a54287j11799K1562j13764P2511L81155M3603k54619l1983K83631P5316
15586B11326j17475m6271j02430l45336l49643j35956J88663J88750Q2849J4913
15576d10610J86600K82207p0596n0173N5440J88405J04082j00703k82614l14157
15566d12119q9406J12909J09122M1796j1820R5703J80739p4918l45515j67398
15556e60907N6285J18413J86091J08830p3244r4742j34857j89614l70360k20748
15546a174853K73997L62682J63814J26845J72292j3637m9496j04635M3065K31732
15536C1806m8720j72107r2752J8706L1116J10774L58295P3974k26621j14164J39836
$$ y = [610779, 429859, 231491, 363186, 446022, 330433, 264221, 192385, 126469, 40115, -154287, -266086, -244524, -358288, -285777, 95378, 138981, -115638, -147621, 136010, 211326, 93851, 47580, -54850, -400186, -749829, -885785, -697122, -508372, -425523, -410610, -224010, 58197, -12399, -62572, -7132, 181273, 285355, 184652, -97962, -412119, -501525, -388616, -279494, -237698, -249518, -153815, 26924, -47994, -393509, -560907, -504622, -386209, -200118, -91288, -164532, -259274, -394131, -583745, -954105, -1174853, -900856, -538174, -374360, -247515, -75223, -88860, -138356, -242991, -199926, 31806, -16914, -189021, -281773, -263067, -231951, -121177, 237118, 311092, 84471, -29693, 110143]
15525A10143m5485l65680j12242J97021J9237l76336n039K39298J00945M3117
15515a95021J47329P9837J393P5326J72795J73872j09026j83545m4807p499n9250
15504E1404m5895P1920R5319k6461j0998j15501j98665o3995n4721r6265J72773
15493b21085L51792j608j18491M6380k29294j60911K89985L08191P6912j34922
15483B06949n0242J91141J59940j88625j28374J8832j41907l27634k87130R4575
15473d52475J97380J09884L76898R8140k03798p9298j98268m8736J56770K08001
15463A64498O3670j33430r7837k18l2877m0608l4794J58522J01532q4847K2826
15452H6437J64403o5836r7665J41985K13314O3043j60378j98717l3756M0148l6901
$$ y = [110143, 64658, -301022, -413264, -216243, -197006, -573342, -578381, -339083, -238138, -195021, -47692, 32145, 33538, 108864, 281659, 455531, 346505, 162960, 118153, 110654, 51404, 5509, 77429, 172748, 146287, 135289, 19788, -178877, -242872, -297593, -393858, -221085, 130707, 129099, 10608, 56988, -172306, -333217, -43232, 264959, 341871, 206949, 156707, 347848, 507788, 319163, 190789, 209621, 67714, -259920, -547050, -452475, -255095, -145211, 231687, 329827, 126029, 46731, -151537, -200273, -43503, 164498, 228168, 94738, -3099, -3317, -36194, -76802, -111596, 46926, 148458, 63611, 86437, 250840, 185004, 87339, 229324, 442638, 505681, 345303, 146586, 112830, 152978, 116077]
15441A16077N8284j0098j92015j33158Q4445J03047Q3086J64906J64373q2909
15431C56038j64670p4165k6585O0038J32102j10679m9817o5120k30622r4230K03311
15420f4399J16995n0854J79407m2447j94180k90773j75426P3941Q2293j30666
15410d96109K48K76125L23784J29867J11695K84746J43439n491j57815j68398
15400D42091j50629k76968q6172P3104n9864o7060k3343p2833J2855L1835q4035
15389b61019N734q973p7146K92408K14741l8925j64402l00248k0365M7205N8296
15378b52694J71181L7858K02195K21708m3127j51649K3859l0365j40038J10453
15368A49381j20351k55830q8109J12052K65484J84603o9680j25667j45671j72152
$$ y = [116077, 174361, 164263, -27752, -160910, -76465, 26582, 109668, 274574, 438947, 356038, 191368, 117203, 90618, 150656, 282758, 172079, 122262, 57142, -173480, -267710, -64399, 52596, 1742, 181149, 138702, -55478, -346251, -521677, -447736, -365443, -496109, -495861, -219736, 104048, 233915, 345610, 630356, 773795, 768304, 610489, 442091, 291462, 14494, -71678, 1426, -58438, -125498, -148841, -221674, -208819, -176984, -261019, -255285, -264258, -341404, -48996, 165745, 126820, -37582, -337830, -358195, -310990, -252694, -81513, -43655, 158540, 380248, 337121, 185472, 209331, 178966, 38928, 149381, 29030, -226800, -314909, -202857, 62627, 247230, 177550, 51883, -93788, -265940]
15358b65940n8516J77444J30318k2760j39446j07632J24125J69339J59105L19706
15348D85743Q3991k20405l68682l88755J46294M59009J92571o0519j19247Q8818
15338B98818j9635m7521o8274r6238P7909m6651l30042l65280o2141J65269J76749
15327c17037K10490J52963j31190l93595j79603K82736L76315K55614p6075j59549
15317B1069j36472L8007J38155Q8702K96844R9160j7818Q0666N5930r8236m25174
15306A40833k27195j33203j86845r5487K25429K89482M9434k23855k00149Q5637
15296b75919K09558L54643J49938k25155k24278K3989Q7311N9469k9667Q2772
15286B12661K3585o8472j72283k02064j45349p7011M8121N6927J03756J81634
$$ y = [-265940, -324456, -147012, -16694, -39454, -178900, -286532, -162407, 6932, 166037, 485743, 569734, 349329, -19353, -408108, -261814, 197195, 389766, 329247, 210000, 298818, 279183, 231662, 163388, 67150, 145059, 98408, -231634, -596914, -659055, -493786, -317037, -106547, 46416, -84774, -478369, -657972, -375236, 1079, 256693, 180618, 21069, -115403, -77396, 60759, 149461, 446305, 545465, 527647, 608313, 664243, 566007, 140833, -86362, -219565, -406410, -501897, -276468, 13014, 62448, -161407, -361556, -275919, -66361, 288282, 438220, 213065, -11213, 12776, 100087, 159556, 129889, 212661, 236246, 167774, -4509, -206573, -351922, -428933, -380812, -323885, -220129, -38495]
15276c8495J05305j5199k4979N6553J96539l4948l36865K6423K17929J83976N2328
15265C88567j17141o7640k60326k63141J67924K10432J08393m3499J04978j2359
15255B16188j82054M4791Q3036P1820m608l36586l8302J34288j13328j80398n7571
15244c62724M106p2393J20429J59907P1347Q6698L102p3797j2997J9846k03639
15233b60115j01145J28137r862j88702j84917O9113K28018K4974j25984N0353
15223c70130R582J97763K63569P0628k22054j53684J66149J01635j32278j67440
15213b36260N2540K83023R2942j16165R7098p4520k23501Q0902K74644J24281
15203C54984J11257l9645k56501j50385j23817k34547M8683K18362J76025L1604
$$ y = [-38495, 66810, 51611, 26632, 83185, 279724, 244776, -92089, -65666, 152263, 336239, 388567, 271426, 203786, -56540, -319681, -151757, 58675, 167068, 123569, 228547, 216188, 34134, 78925, 161961, 233781, 229173, -107413, -145715, -11427, -124755, -305153, -362724, -358618, -431011, -310582, -150675, -79328, 7370, 10472, -63325, -76322, -56476, -260115, -361260, -233123, -242985, -431687, -616604, -547491, -319473, -294499, -420483, -370130, -360548, -162785, 100784, 171412, -50642, -204326, -38177, 63458, -68820, -236260, -183720, 99303, 192245, 76080, 173178, 98658, -124843, -43941, 230703, 354984, 466241, 426596, 170095, 19710, -104107, -338654, -289971, -71609, 104416, 136020]
15193A36020j33509j67856j80281o1022J32753J20111k1314m880J15213M4770
15183a9995L7198l4463l4326L5638J03248J30796N7377R1036J55439K02854k8998
15172F95804k67225j12358J31400k16101j51471k02507j35118L0296R3982O899
15162a26399l5483L0213l3135j43544r6593J93019K25039r7662p3624j00177j56575
15151d14921j43011J21078K79767J36929j30011n7933K7154l5487J69992J23028
15141G6585j61948j32951k01693k01702j28313r2231N686J36922P9195J31972
15131d88478R2740J17149L6593K59453K74435J20008j22549j74603j9486j69312
15121g4050O4812K16532o8910o1464J45829K58120J89882O8627l09268l85454
$$ y = [136020, 2511, -165345, -345626, -406648, -273895, -153784, -175098, -179978, -64765, -19995, 17203, -17260, -51586, -15948, 87300, 218096, 275473, 366509, 521948, 724802, 695804, 428579, 316221, 447621, 231520, 80049, -122458, -257576, -227280, -133298, -126399, -161882, -131669, -164804, -308348, -404941, -211922, 13117, -84545, -158169, -258346, -414921, -557932, -436854, -157087, -20158, -150169, -208102, -180948, -216435, -46443, 76585, -85363, -218314, -420007, -621709, -750022, -842253, -836567, -699645, -620450, -488478, -395738, -278589, -241996, 17457, 291892, 411900, 289351, 114748, 95262, -74050, -9238, 207294, 138384, 76920, 222749, 480869, 670751, 739378, 430110, 44656]
15111D4656j65757N5638J82569k5575r2738J30959J14485k10700k02980P0573
15101i8870P7641m349J56152Q5696R225j15319r0297q9095r8545m9635O4951J5707
15089a36738J85021J47349J18297J34969Q7146J84005J46563l5783j97840k25852
15079D07137j11052P4815l2467j11658k8805K006K00869k1183l38146k13410n1230
15068b23124j38260n8375j11885N3741J87461m8087k84694K8746J87934J02970
15058c03573J20780J55992j03507j82254j89331l3295K34384L41924J74619p4036
15048A41703j27486k17113l7798K16480L79555K61490j71844m46530k65708j41919
15038d09170k8874P8689L36568L33739K41531l3181j89989J31312K5259k71708
$$ y = [44656, -121101, -65463, 117106, 91531, -1207, 129752, 244237, 33537, -169443, -98870, -21229, -25578, 130574, 216270, 225495, 110176, 19879, -69216, -167761, -217396, -152445, -136738, 48283, 195632, 313929, 448898, 536044, 720049, 866612, 830829, 632989, 407137, 296085, 370900, 338433, 226775, 197970, 199976, 400845, 379662, 41516, -171894, -223124, -361384, -419759, -531644, -477903, -290442, -338529, -623223, -594477, -406543, -303573, -182793, -26801, -130308, -312562, -501893, -535188, -300804, 41120, 215739, 141703, 14217, -202896, -240694, -24214, 355341, 616831, 444987, -1543, -267251, -409170, -438044, -359355, -22787, 310952, 552483, 519302, 329313, 460625, 485884, 214176]
15028B14176k50685J34019K43222O1133k79885k80874q1037o5508P6590L5933
15018a92916p2679M9760j4715Q3821O0808j47047J45090Q4509k4665J45034N5268
15007A72268j15222n2950j47748k21703j05179M1184k6849K47904J63902O1147
14997A6754P263k53043q2362q4695j10866j06132L22317L44098P5893m363K8260
14986A53124q2475k73250q8455R1524Q2206K26875K60173j640l53826j90003K15937
14975D0190K42481R9119l12098l55962j49985j372K09067L22177K57505L03206
14965F54328Q8122k31697l22158k96719j16184o8688j1836q3224k12432o0831
14955f61319Q8389K90567K98232J10549p5795M759J56706q6082l67098j31864
$$ y = [214176, -36509, 97510, 340732, 401865, 121980, -158894, -239931, -305439, -228849, -192916, -265595, -215835, -230550, -146729, -85921, -232968, -87878, -3369, -28034, 117000, 172268, 57046, 4096, -143652, -365355, -470534, -429350, -456199, -208295, -44393, 16754, 24017, -229026, -311388, -396083, -506949, -613081, -290764, 53334, 129227, 124864, 153124, 70649, -202601, -291056, -199532, -117326, 109549, 369722, 368082, 14256, -175747, 40190, 282671, 381790, 69692, -286270, -436255, -437627, -228560, 93617, 351122, 654328, 742450, 510753, 188595, -108124, -224308, -292996, -304832, -388056, -600488, -661319, -572930, -282363, 15869, 126418, 50623, 55382, 212088, 126006, -241092, -372956]
14945c72956K07667K11725l2575q5129N1331M1440k748M2418o2556k52281k50442
14934e04106j28808K45121J10497j36571p6974L43o6672M984K33826J88372m3587
14923a73575j42412j51225k7612J66520J27657O9640k7101j49344J21633L20231
14913A34412Q6968k26302k38942j2722J09039j19962j77908P3091K45284K13213
14903H6171J88771Q8641J84745K0894j00092o7970j79708j68691j62414j77923
14893b87576j43010l1980J75869J83030J02489m340q6574R7205J2849j47545k35732
14882c65315j39942J15922K17096J09393m2037L42q2196j654J53213k0206J07125
14871E1741O7195N7057j44577k48441J02092L22684K3647j53643p02j63001j3993
$$ y = [-372956, -165289, 46436, 13861, -71268, -19937, 21503, 18755, 61173, -1383, -253664, -504106, -632914, -387793, -277296, -413867, -490841, -490498, -557170, -552186, -318360, -129988, -173575, -315987, -467212, -494824, -328304, -200647, -131007, -158108, -307452, -185819, 134412, 221380, -4922, -243864, -256586, -147547, -267509, -445417, -372326, -127042, 86171, 274942, 363583, 548328, 569222, 469130, 401160, 221452, 52761, -109653, -287576, -430586, -462566, -286697, -103667, -1178, -5518, -92092, 5113, 17962, -129583, -365315, -505257, -389335, -172239, -62846, -104883, -104541, -186737, -188391, -35178, -55384, 51741, 118936, 175993, 31416, -217025, -114933, 207751, 231398, 77755, 77053, -85948, -99941]
14860i9941J82949O7056J23797p4260k46417k43522k38449M1315P5424L1404Q8070
14849b92574Q9374K11826l2922k77408j94439K5333M1326Q5696K56780J07155
14839B0147l598l1091r769L749j41627K5563J97722O8881k38571k20460J00016
14828b29038J77637m038j85256K4979J96435J26065P9048j60739l00726k98894
14818e74527k36721j10389L00696K96802J88526j47864k93907K9627K47652O7768
14808b32337J30595K14556o3475k33567j66384J55220J56870O6422M6673j4453
14798F0120j54440m37863l42692L3219J96979J86710R9993m8965r2799J25071
14788c74667R3009K39290L03774K9977j37829r7331j22318n2822J0364K3094k99723
$$ y = [-99941, 83008, 150064, 273861, 199601, -46816, -290338, -528787, -487472, -412048, -380644, -292574, -203200, 8626, -24296, -301704, -496143, -470810, -429484, -343788, -87008, 20147, 16549, -14542, -24311, -20562, -162189, -136626, 61096, 129977, -108594, -329054, -229038, -51401, -55439, -240695, -215716, -19281, 106784, 185832, 25093, -275633, -574527, -811248, -921637, -620941, -324139, -135613, -283477, -577384, -547757, -300105, -232337, -101742, 112814, 49339, -184228, -350612, -195392, -38522, 27900, 74573, 60120, -94320, -532183, -874875, -841656, -644677, -457967, -357974, -406939, -499738, -374667, -281658, -42368, 261406, 291383, 153554, 56223, -66095, -118917, -108553, -85459, -385182]
14777c85182k33470R5688Q0043k6075J56200P4840k79629j14964J16946R6140
14767d19463Q6711K35041K19480J26290N2435j3453j13936k17987k03715k15213
14757d63810m988Q0889J0647J16994Q082j01501r9938j13833Q6353K09490P2574
14746a99041j39823j91137J32801J29771o7083L8521L49634L66675r3767k03583
14736A22968m2751q669k29156j67957j56166p3959Q6356j18759k8139J98684K39973
14725a77575J8700j14562J00691J71084P5166r1573N4964J41239n9064j67274
14715d8204k29727j76195J51651K44459K8152m4445J21369r870k32022j75952
14705c70784J51191J50947j61111p9398J61786J15321j4548K2190l0562J4637
$$ y = [-385182, -618652, -522964, -442921, -468996, -312796, -237956, -517585, -632549, -515603, -419463, -332752, -97711, 121769, 248059, 300494, 287041, 173105, -44882, -248597, -463810, -468798, -387909, -377262, -260268, -252186, -353687, -453625, -567458, -481105, -271615, -199041, -338864, -530001, -397200, -267429, -334512, -295991, 53643, 420318, 326551, 122968, 80217, 71548, -157608, -325565, -481731, -555690, -469334, -588093, -616232, -417548, -177575, -158875, -273437, -172746, -1662, 73504, -18069, 36895, 178134, 119070, -48204, -277931, -454126, -302475, -58016, -29864, -74309, 47060, 37190, -194832, -370784, -219593, -68646, -229757, -309155, -147369, -32048, -46596, -24406, -54968, -40331]
14695d0331k42979k89850J13586K35354k515N0080N0201k9846L4427q5748k776
14684b10397K45606K02623o5859j39630k31830j96906J96068K0796m0598J56843
14674f3284J65248p1226k52186l15342Q6087M41821J42594k48289k18767n2926
14664c86270R5602K69519K09813J63508P3112O7727K0872k7406l33096l37595
14654a84214j99804j05K79066K44575M4527l7704J44138K03343k849j63042j62847
14643A65084r9791j39364k09536j76959J65J07838J17155K1541J16371P4746P8907
14632E6157J52827m9136n9162N7674l160M7805J41569o5947j96867l09012k88239
14621e15491R0302L59420K66853l6486j71244L5005P9327J82266Q1614j11595
$$ y = [-40331, -283310, -573160, -459574, -224220, -226735, -176655, -126454, -156300, -121873, -207621, -210397, 35209, 237832, 171973, 32343, -199487, -396393, -200325, -179529, -220127, -63284, 101964, 30738, -221448, -536790, -450703, -8882, 133712, -114577, -333344, -386270, -290668, -21149, 188664, 352172, 425284, 493011, 513883, 486477, 153381, -184214, -384018, -384123, -105057, 139518, 184045, 146341, 290479, 493822, 490973, 327931, 165084, 65293, -74071, -283607, -460566, -460401, -352563, -235408, -213867, -97496, -22750, 56157, 208984, 159848, 100686, 158360, 155200, 203005, 344574, 278627, 81760, -227252, -515491, -425189, -65769, 201084, 164598, -6646, 28359, 107686, 289952, 371566, 259971]
14611B59971K28287J52957j14302k80298j88374l9706N7386N6433k5757Q4403
14601A91000k3190r2914M289q7891p3652q5517m8218j42345n6494J59492N006
14590b50434j07111K2729K27723J19591N1515j4087k06976r1428m8027j0183O8396
14579b38292k5922k8858K45526K70224O482k08231k94945j39543m9924p8744J38205
14568d04022L31140J26896k44092k07614J15330K1521o552J7550q9381r6887J72520
14557b63591J46084j35556r5008j210J13716J23895j94810q6584J76023K73603
14547E6562Q8968n5658j82862L4238R6904j14221j05643o9445q9945J74739P8108
14536h8255j64391k09079J26017K27321K80189J71118J8066J26361p3778l22464
$$ y = [259971, 488258, 641215, 526913, 246615, 58241, 18535, 75921, 132354, 106597, 191000, 167810, 74896, 79185, -8706, -82358, -167875, -216093, -358438, -414932, -255440, -250434, -357545, -334816, -107093, 12498, 64013, 49926, -157050, -248478, -296505, -306688, -238292, -264214, -293072, -47546, 222678, 229160, 20929, -274016, -413559, -463483, -542227, -404022, -72882, 54014, -190078, -397692, -282362, -260841, -267393, -249843, -339224, -436111, -263591, -117507, -253063, -348071, -349281, -235565, -111670, -306480, -393064, -217041, 56562, 145530, 89872, -92990, -58752, 38152, -76069, -181712, -251157, -341102, -166363, -88255, -252646, -461725, -335708, -108387, 171802, 342920, 360986, 487347, 413569, 91105]
14526I1105k53658k04635n1154q6874M1229J86767k8785L1071J44226L9043O3626
14515b8039N538l2907R1983L1670j46986l2669J68319Q5290j09958l6705j5289
14504a9753q3540n5275K9669k58512l50361J26854Q2164N5290M9183k41629l38773
14493a004683R9226M20424M90009J90750r5114p7506M6596J80051J36707m6929
14483C39531j71782j67716q8111j57368J23102N7189j35499j48232j24549m8156
14473e21591J75872J68965M6442L1459K17104K4027j0870L1294k61315l31198
14463d29811j06219L6208J94887N0374j27488j71671o1520J04034J0867J4758
14453d85581L8885K22139L25286J98476L0399J6862J23809q6952k74491l04633
$$ y = [91105, -162553, -367188, -418342, -505216, -463987, -277220, -306005, -274934, -130708, -91665, -28039, -22501, -55408, 36575, 68245, -78741, -111410, 56909, 142199, 32241, -4464, -19753, -103293, -158568, -128899, -387411, -737772, -610918, -528754, -473464, -424281, -665910, -1004683, -905457, -485033, 4976, 195726, 100612, 23106, 69702, 249753, 386460, 339531, 167749, 33, -88078, -245446, -122344, -65155, -200654, -348886, -473435, -521591, -345719, -176754, -130312, -98853, 118251, 142278, 131408, 162702, -98613, -429811, -536030, -499822, -304935, -254561, -382049, -553720, -615240, -511206, -500339, -485581, -446696, -224557, 100729, 299205, 329604, 346466, 470275, 383323, 108832, -195801]
14443a95801p2899P7783k2321k1924R8162J08054O9978m71j81330J04584J53565
14432A17380q070P8193J19109k39109j46743N822j19159o5554J72338K80663J73786
14421C68656J0339K973N092K9233l54373m08642k45071j31997J60961J07578J90251
14410b65000K48194J4140P2956K07517j3135m7836o2591m7671o8898k76299j29920
14399c68543Q9895J35726K7904R1641L54957K30705k35632m12790J5265L1778
14389c9094r6827m3925O4768K34994K38158N4903l6181r8694J25948N0103j44894
14378C09259n9180P8121P1795O5788j34196j75507M9843J41034J30907n7342k61851
14367A58671l2186J9474r6370q5740L2985k0230k66628K4888J72527J61689k6197
$$ y = [-195801, -268700, -190917, -213238, -235162, -137000, -28946, 41032, 40561, -140769, -36185, 117380, 109310, 187503, 306612, 67503, -79240, -73418, -192577, -258131, -85793, 194870, 368656, 378995, 381968, 387060, 416293, 61920, -346722, -591793, -723790, -562829, -455251, -265000, -16806, -2666, 70290, 277807, 264672, 216836, 154245, 106574, 37676, -238623, -368543, -278648, -142922, -115018, -23377, 331580, 562285, 326653, -86137, -70872, -39094, -135921, -179846, -115078, 119916, 358074, 412977, 376796, 278102, 404050, 454153, 309259, 250079, 328200, 399995, 465783, 331587, 156080, 205923, 346957, 477864, 420522, 158671, 126485, 145959, 49589, -36151, -3166, -23396, -290024, -265136, -92609, 69080, 42883]
14356D2883o3177k9074Q0949p1321n6552J66870J87065m7849j70708m5530l510
14345i954j9266N4387J48553q5013k29961m8069j23257j50570q4754N1095Q8864
14334d07945o1808P660K40728R0811n9725P491L9064k60144j79858j968k2408
14323f08102J99394Q3782M1701J21707J12245J27816J43847J19910J37873m1203
14313D38970q3124j33154j30912q0756r6662m4982J18752k09805l22019m9402
14303e93094k6919j36498q4109K33729L66600K14751r0164j17047J22517r6394
14293b06628j95106J2349R0030j05324k25195k03149j66305O9007J83079J73601
14283e73641n960q0105j36398K02990M17002j3547m7957Q7828m3723j32911p1665
$$ y = [42883, -20294, -49368, 31581, -39740, -96292, 70578, 257643, 209794, 39086, -6444, -9954, -29220, 25167, 173720, 88707, -141254, -189323, -312580, -463150, -547904, -496809, -407945, -469753, -462093, -221365, -130554, -190279, -182788, -143724, -403868, -583726, -585694, -608102, -408708, -324926, -283225, -161518, -49273, 78543, 222390, 342300, 480173, 438970, 355846, 222692, 91780, 11024, -85638, -130620, -11868, -221673, -543692, -593094, -620013, -756511, -840620, -606891, -240291, -25540, -115704, -232751, -110234, -206628, -401734, -389385, -299355, -404679, -629874, -833023, -999328, -930321, -747242, -573641, -579601, -659706, -796104, -593114, -176112, -189659, -237616, -149788, -193511, -326422, -398087]
14272c98087L4582j50980j09453p4279l5008J40072L09165J49449q7540J5847
14262b06232j12091K04985K67636j11817j91380M9193j08647m2252n0189J42949
14252a57845K53911j7881j78674K6083J77653J12652L07220L9077l07676k74273
14242a9753n5768j61005K2858J56527N0098j20744n7724J55520J82418K09442
14232C61869J90043j1575j07015j72598J3469K8205N771m6501j47901k34745j27338
14221b48316Q404K59713J98349Q7851j07173l67691j71896J07613J64780J82413
14211A14047J37896J13467r0697n4032O7686j12393r9897p3435j93793j14958
14201c06109p0453Q6179K46173J14373K40088J49085j50099q1051J90137L6998
$$ y = [-398087, -363505, -514485, -623938, -698217, -733225, -593153, -283988, -134539, -222079, -206232, -318323, -113338, 154298, 42481, -148899, -99706, -208353, -250605, -300794, -157845, 96066, 78185, -100489, -74406, 103247, 215899, 523119, 562196, 254520, -19753, -75521, -236526, -213668, -57141, -7043, -127787, -185511, -29991, 152427, 361869, 551912, 540337, 433322, 260724, 274193, 302398, 308169, 261668, 113767, -120978, -248316, -239912, 19801, 218150, 306001, 198828, -168863, -340759, -233146, -68366, 114047, 251943, 365410, 274713, 220681, 288367, 175974, 76077, 2642, -191151, -306109, -376562, -290383, -44210, 70163, 310251, 459336, 309237, 228186, 418323, 455321]
14191D55321j77792n04735m41644J7080l2031k98270j21595J04577L83739J71034
14181d44316L0032J97824K61119L4778Q0892K33238j53365l40939r4463O4341
14171a30859n9480p0254P9479L4081J76322J41489j25620n6142r5706P9703L95450
14160C68463l0075j24125j39033n6023J49777J79041K07240R3352p9612j89963
14150C79042r6354O1421J29748j04131l48656j32230K98407J46855j26581j99728
14140G793k49373j48167K8798m0326o8903J78197O3032N5523Q3164k4933K05113
14129H9918K25628P5777O0622J63089J32623P4426k01584j76923J02633J250j58523
14118C88936j29852p0531M0644O2476n0019J10829K94941J42936l44451l70851
$$ y = [455321, 277529, -227206, -668850, -651770, -683801, -982071, -1103666, -999089, -615350, -444316, -414284, -216460, 44659, 79437, 160329, 393567, 240202, -100737, -195200, -130859, -190339, -260593, -181114, -147033, 29289, 170778, 45158, -10984, -106690, -26987, 368463, 338388, 214263, 75230, 19207, 168984, 348025, 555265, 648617, 569005, 379042, 282688, 344109, 473857, 369726, 21070, -111160, 187247, 334102, 207521, 7793, -241580, -389747, -360949, -401275, -470178, -291981, -228949, -173426, -90262, -115195, 89918, 315546, 391323, 451945, 615034, 747657, 822083, 620499, 443576, 546209, 547459, 388936, 259084, 188553, 229197, 291673, 241654, 352483, 647424, 790360, 445909, 75058]
14108G5058k04824j47896r7513l196J94459K62331J73698J06384O5799J15147
14098E39447M1638j67623k19198j52213Q336l4104q7753p3026l1498q1952j4553
14087b72499J34090J34028j85855j61806R7228R0414O8638Q3884r1248J04996
14077A870K85588l7026k60949k486J21938q775q0041r8666j27541j48149Q5353
14066b68884J5833l185J71929J04645J18638k32k74064j90526j35696J22595J81027
14055a57920j0490R575Q2481n164R0372J77632O8089L6260K598n3698k26990k51148
14043b38403m3460J4394j571R6392J59205l5758j14468m165R1213K5566k9540
14032h0595P9020R9473l530O126K4388K3155J4962o3482k00940k3255J20356J25809
$$ y = [75058, -129766, -277662, -375175, -378371, -183912, 78419, 252117, 358501, 424300, 539447, 581085, 413462, 194264, 42051, 50387, 16283, -71470, -144496, -175994, -257946, -272499, -138409, -4381, -190236, -352042, -254814, -164400, -95762, -11878, -103126, 1870, 287458, 250432, -10517, -13003, 108935, 100160, 20119, -78547, -206088, -354237, -268884, -253051, -256236, -84307, 20338, 138976, 138744, -135320, -325846, -461542, -338947, -157920, -168410, -158835, -76354, -81518, 8854, 186486, 254575, 290835, 293433, 239735, 12745, -238403, -281863, -267469, -269040, -172648, -13443, -49201, -163669, -167834, -76621, -51055, -80595, -1575, 97898, 94368, 100494, 124882, 148037, 162999, 99517, -101423, -124678, -4322, 121487]
14020A21487J59117k3348j76695k4177n398j42505K6498R2930o3257P9174n7584
14009a3758q744J5796n3493J4127Q975J1904k77180j90852O9441K82219J61086
13998A9521j3625J2395J96494K58286j30075k37594j01262j1334n8213j40737
13988b06144n511J62744K91565J88771J42500p7527k51828j58044j16650j32355
13978a62479O2147n6256k09355q2007P6410J05061K06401N5704r4851K3979P5343
13967I7j94p3620l9503j6459K570K38204J56769j01850r4449j97776k18538J20493
13955b24256L61955P6174N5080L2176l19262k29956j0173k5479N0292K05325M4495
13944A6371j65271j68500p9917J3814j5109j06709J39025o6377j68859j06435
$$ y = [121487, 280604, 257256, 80561, 56384, 50986, -91519, -65021, 27909, -35348, 43826, -13758, -22502, -6706, -60199, -46072, -37097, -25193, -302373, -493225, -423784, -141565, 19521, 5896, 18291, 214785, 473071, 342996, 105402, 4140, -7194, -65407, -206144, -211655, -48911, 242654, 431425, 573925, 496398, 244570, 86526, -30124, -162479, -100332, -156588, -365943, -447950, -371540, -266479, -60078, -4374, -99225, -75246, 97, -97, -73717, -113220, -129679, -127109, 111095, 267864, 166014, 71565, -126211, -344749, -224256, 137699, 213873, 268953, 301129, -18133, -248089, -258262, -283741, -233449, -28124, 16371, -148900, -317400, -397317, -383503, -398612, -505321, -366296, -432673, -601532, -707967]
13934g07967q5069J00905K50572J42753M3741J06980j4932m1485J47813L8329
13924a8360k2291l6593o9775L08631K94916j79887l32540j7128p7799J625J21420
13913b7781o4984j64513o4537K259K18929J96528N8661k15174j5913K66009J35471
13902C24955J3667l8830O8117J18886q5689j09916o8935j094l34k75005j31078
13891a85256J76931L96683L11526O7526l05021k27268k4432L9039J4714J7388
13881B81830p4074j69457p5398R591q1418j29594J09133l563l0573n7742k24013
13870d45278k8315P7561N3994K61803q308j52593J65467Q8770K30180q459l80870
13859a46048l61723k6524K9040J44113K23853M6415j3875q8781j04031j54884
$$ y = [-707967, -793036, -692131, -441559, -298806, -255065, -148085, -163017, -204502, -56689, -18360, -40651, -77244, -147019, 161612, 456528, 276641, -55899, -73027, -150826, -149201, -27781, -92765, -257278, -321815, -319556, -100627, 95901, 154562, -60612, -76525, 189484, 324955, 338622, 299792, 367909, 486795, 401106, 291190, 222255, 221161, 220827, -54178, -185256, -8325, 388358, 699884, 767410, 462389, 235121, 210689, 249728, 264442, 281830, 207756, 38299, -37099, -27508, -108926, -238520, -129387, -132950, -163523, -221265, -445278, -473593, -396032, -342038, -80235, -88543, -241136, -75669, 13101, 243281, 234822, -146048, -507771, -534295, -505255, -361142, -137289, -90874, -104749, -193530, -297561, -452445]
13849d52445j24012J19189L20431J72405r663m6309J1077J00463j8779l4248l6480
13838A629j00756o9135m8448Q8284J29923r7880j01796j66106R958J78352n9130
13827b35105M4839L769q9455K1797P3450j88284J5064L04638K62583R0701p9890
13816B24107k86307j06079K29550K93775Q3393O4185K1467r1143N2603J62224
13806F47775k2870k86598p4095K411k08856l7657K11694J02154m0293k35857k72640
13795b14832N1793M77989L04495o5181j26372l08839k6112L208k04559k40406
13785c48816m375R0512J32535K39255J22244k07557j79868J31582L9712j69853
13775a54629j21247K00942Q6636j92529j00588o1027J36692L60517L32485j07194
$$ y = [-452445, -576457, -457268, -136837, 35568, 25905, -20404, -9327, 91136, 72357, 38109, 1629, -99127, -168262, -216710, -128426, 1497, -96383, -198179, -364285, -354327, -175975, -235105, -190266, -186497, -275952, -254155, -180705, -368989, -353925, -49287, 213296, 303997, 224107, -62200, -168279, 61271, 355046, 438439, 502624, 524091, 432948, 485551, 647775, 624905, 338307, 264212, 266623, 57767, 20110, 231804, 333958, 293665, 57808, -214832, -163039, 314950, 619445, 554264, 427892, 119053, 92941, 96149, -108410, -348816, -353191, -262679, -130144, 109111, 231355, 23798, -156070, -24488, 15224, -154629, -275876, -74934, 11702, -180827, -281415, -342442, -205750, 154767, 487252, 380058]
13765C80058l39707l17171k11516q9019J63387J51747J68033L18116J18884J95086
13755E37898M7676m1336j03774l2984j26847j86388j31817o2350M7659r8900M6116
13744a05047L93618L05466j09408k50814n3735J13983Q6399o2406j21010n6742
13734A40304p0545M3176K18023K9786o2185o2796k08877j6464n115k55548l09951
13723e60192j36244q3890K2452K32892K82952P9425K49739K73351j29927j39631
13713I0927n0386j34278j36645j08542n5581J04617J94061J13027J20744L69361
13703E07305L00516J32354q3694j99620n8583j28848j30606j62797k3197M4859
13693A97689k36580n06090l14480J63437K74324K26167Q6485p038m5198Q068R2682
$$ y = [380058, 40351, -276820, -488336, -577355, -413968, -262221, -94188, 223928, 342812, 537898, 585574, 544238, 440464, 407480, 280633, 94245, -37572, -99922, -52263, -151163, -105047, 288571, 594037, 484629, 233815, 180080, 294063, 380462, 318056, 197046, 140304, 69759, 112935, 330958, 360744, 298559, 235763, 26886, 10422, 5307, -250241, -560192, -696436, -780326, -757874, -524982, -242030, -162605, 87134, 360485, 230558, 90927, 40541, -93737, -230382, -338924, -394505, -289888, -95827, 17200, 137944, 507305, 807821, 940175, 856481, 656861, 598278, 469430, 338824, 176027, 152830, 197689, -38891, -544981, -859461, -696024, -421700, -195533, -109048, -116086, -161284, -153216, -60534]
13682f0534R3798n9229o1243m1454Q9163K32732J13823j24707j44055k98118j08395
13671c68219K37648K27226K909P8035l0967j85188j35765n251M4710K8109N3484
13660e3269n284p1929O6714J21307R3593L1362j46923k64321j49902K08985K06060
13649C6393N1309j56768j65418N9793J25410n7732k1179J81800J92994j05383
13639A41219j21902L0387N8754K9275m8590r3561r6701N2360j3458k03450k88268
13628e53935j14131O2827R1498J75627L16223K44495L6234l08954k38374Q3352
13618b05138R0704M789r3331R85J07682J21595K15232K67400R7242l963p0316
13607E32881j20635q5966p6246j43919j627O4679K32373q9608k88628k62695j08503
$$ y = [-60534, 33264, -25965, -87208, -128662, -39499, 193233, 307056, 182349, 38294, -259824, -368219, -130571, 96655, 99564, 177599, 146632, -38556, -174321, -179572, -134862, -106753, -53269, -58553, -130482, -63768, 57539, 151132, 182494, 35571, -228750, -378652, -169667, 36393, 87702, -69066, -234484, -174691, -49281, -107013, -128192, 53608, 246602, 141219, 19317, 49704, 108458, 137733, 89143, -4418, -101119, -48759, -62217, -265667, -553935, -668066, -605239, -513741, -338114, -21891, 222604, 258838, -50116, -288490, -205138, -114434, -109645, -202976, -201991, -94309, 27286, 242518, 509918, 607160, 603197, 532881, 412246, 326280, 250034, 106115, 104488, 169167, 401540, 311932, 23304, -239391, -347894]
13596c47894p107r0822p5712J66830J62164p3016k18213k536K24304J30090N8507
13585g3405K0432Q6158k9584p4172k16024j75682J14962K2545O9089J89558L31486
13574B65363K83950M6733j98424m78977k73028m8532N4868Q547n3480J20476K62922
13563i582J07740k16375l68596k71679J77886J29096P2010K51529K83692j03312
13553E2409j84813J23844p5965j43037Q4350n8882j66337l1650K44345K72863
13543A17127j3503j03978l5419K69792K37886P6400p9340k52322j22431m2058
13533E2154O2991J24451k06541k07778M8416J23461j8295J26066O6685k120k10047
13522d0557k83871j87587o1457J73420o946r3685J16427P8073J80334Q2299n2735
$$ y = [-347894, -355001, -445823, -521535, -354705, -192541, -265557, -483770, -486306, -262002, -131912, -73405, -52973, 33185, 3601, -70571, -286595, -462277, -347315, -324770, -255681, -66123, 265363, 549313, 596046, 397622, -81355, -354383, -402915, -348047, -339500, -392980, -272504, -9582, 98158, -118217, -486813, -758492, -580606, -451510, -379500, -127971, 155721, 52409, -132404, -8560, -84525, -227562, -143212, -202094, -368431, -400081, -155736, 117127, 103624, -354, -35773, 234019, 471905, 548305, 468965, 216643, 94212, 52154, 115145, 239596, 33055, -174723, -126307, -2846, -21141, 104925, 171610, 169490, -40557, -324428, -512015, -573472, -400052, -406998, -500683, -384256, -306183, -125849, -43550, -96285]
13511i6285p5048J5300o7381J25421K89870J18641J31897J14749r931l42537l29010
13500a24314K4449J51227P2454L3274O7536J18390k4120j55918k45204j00151
13490a82377J56913J98484J53755N3432q8612p0278J38969m8379j98487N8938
13480A72358K29532J3707J3472N5692J41144J8198l40130l80694j12107j3266
13470b02094N0442K38910J60996j1833j03434j89675r5585J36130L75383K53513
13460F12753k19405k96612Q2609J43021l6114q7534k46049O1765J12226K1068
13450A47728q9184R046J18874n6730r0636J42048M6570Q9480l728j13020l2377
13439A68071k588q1524k17341j31144l1937J88799J93763K32643O6483q0826k02892
$$ y = [-96285, -171333, -156033, -223414, -97993, 191877, 310518, 442415, 557164, 547233, 204696, -124314, -99865, 51362, 123816, 157090, 224626, 343016, 318896, 162978, -82226, -182377, -25464, 173020, 326775, 380207, 291595, 221317, 360286, 311907, 113420, 172358, 401890, 415597, 429069, 484761, 625905, 644103, 303973, -76721, -188828, -202094, -151652, 87258, 248254, 236421, 132987, -56688, -152273, -16143, 359240, 612753, 393348, 96736, 179345, 322366, 286252, 198718, -47331, 14434, 126660, 147728, 58544, 67590, 186464, 129734, 39098, 181146, 227716, 317196, 313468, 200448, 168071, 165483, 83959, -133382, -264526, -296463, -107664, 86099, 318742, 385225, 304399, 101507]
13428A01507k14062J13364K50835M0448m711J5345l17639j57190J95685J12431
13418A36013m8322o0209N4555Q7889O9155J78620J44485l3794O4910m1373j66767
13407C85162j92606j15440K079L6977J09562J19888J70387J11622O9258J02940
13397G99829k37744k49778j70334l8003K43043Q4757l2393N1425j04270k29153
13387A17379k1258k0680k47359j6204j28258Q5814K91494j8090k01246l23909
13377d82317K2558L56246K60171K83753P6795k02573P1645J55418q531j2119j8943
13366E02103k81890k96095j0257K47423K44088k3634m2485j03094o0774Q0789
13356B56174r597p084Q9363J00854m6376j97717k12021L4746K39343k8478k97564
$$ y = [101507, -112555, 809, 251644, 292092, 287381, 302726, -14913, -172103, 23582, 136013, 87691, 27482, 82037, 169926, 239081, 417701, 562186, 528392, 593302, 551929, 385162, 192556, 77116, 79195, 116172, 225734, 345622, 516009, 627631, 696889, 799829, 562085, 312307, 141973, 103970, 347013, 431770, 399377, 450802, 346532, 117379, 96121, 75441, -171918, -188122, -316380, -230566, 60928, 42838, -158408, -482317, -459759, -103513, 156658, 440411, 517206, 314633, 386278, 541696, 533165, 521046, 502103, 220213, -75882, -86139, 161284, 405372, 381738, 339253, 236159, 175385, 256174, 246577, 239493, 328856, 429710, 383334, 185617, -26404, 8342, 247685, 219207, -78357]
13345g8357j49128L7691Q5869J02087J71392j247o3938P1992K71301L71897K6406
13334H45965k42111j43569q117K67079L35100l1092k54522k77149q5839K3396
13324D29141K7580L3677p2482J0090j2890k5710l8807J9232j99885P221N6189
13313B33356J0720K69139L8246j21380O0312K06206K33424q5210k75157q7632
13303D82024O4800J70691J67773k39730l54964j55325j49654q3308l09208k95023
13293g01924J5070J43737J92127J2607j07387J89551J25849j05889q0264j23479
13283d40002J27837L97357J50657J84349J92876j70136k29643Q8853Q1711j95561
13273A88298k77746j57410J32266K16854p6489j566J93492R8488j04364j13491
$$ y = [-78357, -227485, -189794, -103925, -1838, 169554, 168307, 104369, 176361, 447662, 819559, 845965, 603854, 460285, 452168, 719247, 1054347, 1023255, 768733, 491584, 405745, 429141, 456721, 490398, 417916, 428006, 415116, 389406, 350599, 369831, 169946, 177167, 233356, 244076, 513215, 551461, 430081, 490393, 696599, 930023, 844813, 569656, 482024, 546824, 717515, 885288, 645558, 290594, 135269, -14385, -97693, -406901, -701924, -686854, -543117, -350990, -338383, -445770, -256219, -130370, -236259, -316523, -440002, -312165, 85192, 235849, 420198, 613074, 442938, 213295, 302148, 383859, 188298, -89448, -246858, -114592, 102262, 25773, 24207, 217699, 316187, 211823, 98332]
13263I8332J29665R4730j25637k12184o1462L08527L70095K11421l4814m46631
13253C32042l77309k61772Q0157J26054K39513K27111m5841q1343r9947K4971
13243A63636Q1148L7768M3376J7984k39226j36480Q1437Q7953J41646M5658M4304
13232C69204k7342j93477l370J62025P0142K05353J73810O4379R8939N944n8069
13221H67538j82821j86184J28540Q9406j76090j3476L9309Q9963J46030j57385
13211F44830r1687M0761l04665j76923J15420K69079K64732J86555P1392j51109
13201H68385l15228l35566k11381p7729r9718o3619p0923j9515J5839K04485N36943
13190D31973M50464j24435l33583j40844m6002R0392O0635J96886l8105m3985
$$ y = [98332, 227997, 322727, 197090, -15094, -76556, 231971, 602066, 813487, 778673, 332042, -45267, -307039, -226882, -100828, 138685, 365796, 319955, 238612, 138665, 163636, 244784, 282552, 325928, 343912, 104686, -31794, 49643, 137596, 279242, 324900, 369204, 341862, 148385, 145015, 307040, 377182, 582535, 756345, 820724, 919663, 925607, 867538, 684717, 498533, 627073, 716479, 540389, 526913, 566222, 656185, 802215, 644830, 553143, 593904, 289239, 112316, 227736, 496815, 761547, 948102, 1019494, 868385, 553157, 217591, 6210, -71519, -171237, -234856, -305779, -325294, -309455, -104970, 431973, 882437, 758002, 424419, 283575, 237573, 327965, 388600, 585486, 547381, 503396]
13180E03396j12565j91571M1214L38860K00570R6391M3972n8365j53935p0562
13170F37405r0492o149q5109k04132j6664j25893j69477J95351J35981Q3738R8458
13159D53017P7396m4370k65872j25900N4463J13137K99447J71605J06756K8945
13149H68624Q3908K8361k44578k79105k05832K22935J54941J7686N1264M4003
13139G42207n6699o6344R642j80248k14199L0346L05321K81790j11537k10629
13129E29650k15500q9117n1739l4618K83788K77311L11561K45065p1486l1584
13119A153331N1448k57267l78612j1677K9382J56254K03616J07960J18567r60
13109A172042j69738p7019r9859j54493L6877K10150P2123K02557O3379j40926
$$ y = [503396, 390831, 199260, 240474, 579334, 779904, 876295, 920267, 861902, 707967, 637405, 546913, 540764, 455655, 251523, 234859, 108966, -60511, 134840, 270821, 354559, 453017, 530413, 486043, 220171, 94271, 148734, 261871, 561318, 732923, 839679, 868624, 952532, 980893, 736315, 457210, 251378, 474313, 629254, 646940, 698204, 742207, 685508, 619164, 628806, 448558, 234359, 264705, 570026, 851816, 740279, 529650, 314150, 225033, 173294, 138676, 422464, 699775, 1011336, 1256401, 1184915, 1153331, 1204779, 947512, 568900, 557223, 586605, 742859, 946475, 1054435, 1173002, 1172042, 1002304, 925285, 825426, 670933, 707810, 917960, 990083, 1192640, 1256019, 1115093]
13099A115093j31990J083m9582M4536Q8280p0140L4262p3489j55455N0897J79988
13088A033483L29364J72254m2647k43107j80700R1519O6996Q812M2656Q2276J37579
13077A498485N8302J9451k12487q3466J05016J72368Q608q1155r4542j96520J18604
13066A312664M37890K48255o1230n743J62616k7374j73265j69881l4341P8144
13056A767735J08135J92138K01193J56847J17348L4259j39153k53718j95592j44247
13046A844945K48652K11697o9427j52739j57300j56283K10852K91666K28481n8012
13036B442532m6117J39840Q3257p848N5368q315K08311Q4267m0908K7177m0548
13025B897016O4016K38442K79801L68615L11668M79742N70723N76572N59497J079312
$$ y = [1115093, 983103, 984186, 934604, 979140, 1067420, 997280, 1031542, 958053, 802598, 853495, 1033483, 1362847, 1535101, 1492454, 1249347, 1068647, 1160166, 1227162, 1235974, 1278630, 1360906, 1498485, 1556787, 1576238, 1363751, 1280285, 1385301, 1557669, 1566277, 1485122, 1390580, 1194060, 1312664, 1750554, 1998809, 1937579, 1931836, 2094452, 2067078, 1893813, 1723932, 1689591, 1767735, 1875870, 2068008, 2269201, 2426048, 2543396, 2577655, 2438502, 2184784, 1989192, 1844945, 2093597, 2305294, 2235867, 2083128, 1925828, 1769545, 1980397, 2272063, 2500544, 2442532, 2396415, 2536255, 2619512, 2611664, 2667032, 2658717, 2867028, 2951295, 2910387, 2937564, 2897016, 2961032, 3199474, 3479275, 3847890, 4159558, 4639300, 5210023, 5786595, 6346092, 7425404]
13015G425404J348538K244576L045034N066722Q268453J1828976L983219r625387
13007C3585535r853357n993161l583568k500936j533493j135671o42152m60272
12999G882925k00900q720Q7490L08803L77774j5841J29740L68926L17089N42973
12989I790259Q46033Q03289J230344J515721J454431J862312K751713L366212
12981B3620314M244072N229299O758297Q715035J1844277J5924325K1615725K9338199
12973A27289543L9588728M8988751M6545371J9016972k1990717m6340066m7794000
12966A65304582l9031052k9290776k1231696j5469287j1397326q547569o781016
12959C3555860n166222l833876k814436k427196k213542j806510j354674j160587
$$ y = [7425404, 8773942, 11018518, 14063552, 19130274, 27398727, 39227703, 43210922, 33585535, 23732178, 17739017, 14155449, 11654513, 10121020, 8985349, 8343197, 7882925, 7682025, 7673305, 7760795, 8069598, 8447372, 8431531, 8561271, 8930197, 9247286, 9790259, 10636292, 11439581, 12669925, 14185646, 15640077, 17502389, 20254102, 23620314, 27864386, 33093685, 39851982, 48567017, 60411294, 76335619, 97951344, 127289543, 166878271, 215867022, 262412393, 281429365, 259438648, 213098582, 165304582, 126273530, 96982754, 75751058, 60281771, 48884445, 40336876, 33555860, 28389638, 24555762, 21741326, 19314130, 17100588, 15294078, 13939404, 12778817]
12951A2778817j131983r88916q53588p04350o47885m91044l62615L3657l92594
12942G239499p14676l94376k72492j76843j21229n0052K23159K07610k5091j81882
12932E733627k21160k00380P802j57168k28446K4459p2978l47626p6121K07817
12922D669826K13491L50870K94901L49635M69960N68839N74098O43393J109891
12913I244904J711285J585842P30342l28187j003603o33560l34546k63869j06948
12904A0601660J25079K32694N52750R68612J337373J533224J625476J875739K530489
12895B1383096L095593M026902N487747P188880R447590J2940058J7897047K4276267
12887A05743180L3044275M3967824N2184206M2892548O430736l3927859n0602072
$$ y = [12778817, 11646834, 10657918, 9804330, 9099980, 8452095, 7961051, 7598436, 7632093, 7239499, 6524823, 6130447, 5857955, 5681112, 5559883, 5509831, 5732990, 5940600, 5915509, 5733627, 5512467, 5312087, 5319889, 5162721, 4934275, 4958734, 4885756, 4538130, 4462009, 4669826, 4883317, 5234187, 5529088, 5878723, 6348683, 6917522, 7491620, 8135013, 9244904, 10956189, 12542031, 13272373, 12944186, 11940583, 11307023, 10972477, 10708608, 10601660, 10726739, 10959433, 11512183, 12480795, 13818168, 15351392, 16976868, 18852607, 21383096, 24478689, 28505591, 33993338, 41182218, 50629808, 63569866, 81466913, 105743180, 138787455, 182755279, 234939485, 277832033, 284262769, 250334910, 199732838]
12880A99732838m7037339l6518312k6597868j9473829j4128796j0479931p830158
12873C7666605n895647m602623l636381k960029k320250j877250j638287j594518
12865A3141620j447592j124433q38612p35442m23682m16657m46864k04564p3530
12856G430244j29618l24900l26569k68523j55813k51401k94181k16204j21282
12847E341753j2563j33455k66225n2747J9109M3538k362k5861L7634K24517q2084
12836E091254l34983n0980J71255J68102L07220J14306k33934j59251k3497m379
12826E045113K73624M02968K13871L48337L71158L94125N23077N41038M27228
12817H540539M74163N93569Q60354J333073J280330J433941J780810J978361K597995
$$ y = [199732838, 152695499, 116177187, 89579319, 70105490, 55976694, 45496763, 37666605, 31770958, 27168335, 23531954, 20571925, 18251675, 16374425, 14736138, 13141620, 11694028, 10569595, 9730983, 8995541, 8571859, 8155202, 7708338, 7503774, 7430244, 7300626, 6975726, 6649157, 6380634, 6224821, 5973420, 5679239, 5463035, 5341753, 5329190, 5195735, 4929510, 4876763, 4895872, 4939410, 4937048, 4911187, 4948821, 5173338, 5091254, 4756271, 4705291, 4876546, 5044648, 5351868, 5466174, 5232240, 5072989, 5049492, 5045113, 5318737, 5721705, 5935576, 6283913, 6655071, 7049196, 7572273, 8113311, 8540539, 9014702, 9608271, 10468625, 11801698, 13082028, 14515969, 16296779, 18275140, 20873135]
12808B0873135L744598M716528O028218Q214326J0679308J3806270J8928647K6211603
12800A13202633L5803805M6374747N0108128L2495971o808364m0031499m9208868
12793A81936553m2974298l2977822k4225893j7354879j2537541r340146p180775
12786C5345199n658972m575123l495281k773491k347415j863002j362614j124462
12778A2144839j350705j238545r20653p34953p63811n80252k58025q3647k67041
12769E947207m56121n70292n51856n75318m49863k87336k17676k77708r7882m6969
12759B416186r0338m0475r2124n5243r0973p5249J1052j66008m54916k23826J16429
12748A254515K05926K37760O5176Q1573m8605j22270k43869j24158K99673L24247
$$ y = [20873135, 24617733, 29334261, 35362479, 43576805, 54256113, 68062383, 86991030, 113202633, 149006438, 195381185, 245489313, 277985284, 271176920, 231145421, 181936553, 138962255, 105984433, 81758540, 64403661, 51866120, 42525974, 35345199, 29686227, 25111104, 21615823, 18842332, 16494917, 14631915, 13269301, 12144839, 10794134, 9555589, 8634936, 7899983, 7136172, 6555920, 6297895, 6214248, 5947207, 5491086, 4920794, 4368938, 3793620, 3343757, 3056421, 2838745, 2561037, 2463155, 2416186, 2325848, 2285373, 2193249, 2138006, 2047033, 1971784, 1982836, 1816828, 1361912, 1138086, 1254515, 1460441, 1698201, 1763377, 1844950, 1796345, 1674075, 1430206, 1306048, 1605721, 1929968]
12738A929968Q5598j97409l79677n43342k57618M4119K31985R7423j0228N4731
12728A055550P9326j36270j64933L1154O3490J35677J30278j74925j71337K4210
12718H72220R154j989q9848j06701j97706q145L9979J43630K16927J145j32586
12707G46080L643J84485J08619k4339r7595O8127J03042j77K9562p2743j47108
12696I01596k2372k33026k20801P8566J67634N946O8231J16004M382j24797r8895
12685F42468N1186o893j50810p692L37389K04663k17434k6539J49712q7813k16116
12674F72121k76201j72764j27924j02536J49349k633j39826P9489L18026j3513
12664C83588l29611J3129K26466Q5894J14474M1620J03523J94612J13924M5471
$$ y = [1929968, 2015566, 1818157, 1438480, 895138, 637520, 681639, 913624, 1011047, 1000819, 1055550, 1134876, 998606, 833673, 864827, 928317, 1063994, 1194272, 1019347, 848010, 872220, 881374, 879385, 789537, 682836, 485130, 476985, 516964, 660594, 877521, 878666, 746080, 749723, 934208, 1042827, 1018488, 920893, 989020, 1092062, 1091885, 1121447, 1048704, 901596, 879224, 646198, 425397, 503963, 671597, 677543, 745774, 861778, 866160, 741363, 642468, 693654, 686761, 535951, 528259, 865648, 1070311, 852877, 826338, 976050, 888237, 672121, 395920, 223156, 95232, -7304, 142045, 139412, -414, 79075, 397101, 383588, 53977, 67106, 293572, 379466, 493940, 535560, 639083, 833695, 947619, 993090]
12654I93090k28809l15366n6498K12564J89350M4275k76532j87663k00271l43012
12644a68872K3958K67489K03957Q8916J57106M4912k37034j29717r2961j73667
12634a5913k1260J13563Q7805K1000P7169o2077k47933j00048J28840J55360j02734
12623C3772k06115J2670m3840j37894K12078K57186K15194K02823P3449J84842
12613H04165J8122k34203l941J02939k0603j9276O7938j93963j86729r6932n5515
12602A82002K2536j72386k5639J21301J36078J15960j28687r6758j05278j01684
12592e2555j04791J90545L91679J67114j69674l77076j22920J68426J25114N7294
12582B73156M4607k12970k27926Q8119J96607J29746N6155k5728q8558r3526O7809
$$ y = [993090, 764281, 448915, 392417, 604981, 794331, 838606, 562074, 374411, 174140, -168872, -144914, 122575, 326532, 415448, 572554, 617466, 380432, 250715, 157754, -15913, -37173, 76390, 164195, 185195, 262364, 200287, -47646, -147694, -18854, 136506, 33772, -172343, -159673, -203513, -341407, -129329, 127857, 343051, 545874, 619323, 804165, 822287, 588084, 584143, 687082, 666479, 647203, 715141, 521178, 334449, 237517, 182002, 204538, 32152, 6513, 127814, 263892, 379852, 251165, 154407, 49129, -52555, -157346, 33199, 424878, 591992, 422318, 45242, -77678, 90748, 215862, 273156, 317763, 104793, -123133, -35014, 161593, 291339, 347494, 321766, 233208, 139682, 207491]
12571B07491K45554J08019j77881l8420K12787J86395N3109k08384k63811j32245
12561A92614q1741j16951K5978O6290N4425J08182j04321p1998r9739j78594k1224
12550b27079J28783L09787K68423K39604M7487j31852k08672j61294J25781J73451
12540E64419J54715O9645l6973j43916p2715m6771j97926o8571q6576m8577k697
12529H4057R9N3766O3036K14525J36204j70413l07119j01277p6238r0323k1045
12518b14728J9211K77493J65045l9531J76167J01774j24089k15159j31718l4415
12508a9950K1381J01081n6961k73705K2849R3974j606R7540p5107k08037j20612
12497d19153J82495J98926M8566m4933r3681m0419l16329l46289n325K73536K38717
$$ y = [207491, 453045, 561064, 383183, 344763, 557550, 743945, 797054, 588670, 324859, 192614, 110873, -6078, 19900, 86190, 140615, 248797, 144476, 72478, -27261, -205855, -227079, -98296, 211491, 479914, 719518, 767005, 635153, 426481, 265187, 390968, 564419, 719134, 788779, 751806, 607890, 535175, 488404, 290478, 221907, 135331, 86754, 84057, 84156, 137922, 200958, 415483, 551687, 381274, 74155, -27122, -103360, -193683, -214728, -195517, 81976, 247021, 207490, 383657, 485431, 361342, 146183, 14465, -19950, 1431, 102512, 45551, -228154, -205305, -111331, -112937, -15397, -90504, -298541, -419153, -236658, -37732, 10834, -34099, -127780, -168199, -484528, -830817, -836142, -562606, -323889]
12486c23889Q6710o5983j63467M0620J97631J77998N6712N7465J46651J82521
12476C92969O1124p6831r4348o3714n798n7223k00785k20619K61082K42218j89350
12465D8725j54948n3724L3206R2308R0876Q9303j2146l0160k98274l1361n2224
12454b78419j54184P4246K84712K10102j22439L3460K19070q717k70548r3009
12444a05726R5820J74304l7675L13164K21776k47811k85650r5440q6905j88Q6514
12433C2183r3272k19048m1696J58283k4644o4955K58893J89264j49411k69426
12423b23829J22402K75482J75519N8434J6894r1969M1887J52347p8622l06573
12413A41972k26523k21078n8848n3851K12231L51383J21103l8869m8954L176o6280
$$ y = [-323889, -237179, -303162, -466629, -426009, -228378, -50380, 6332, 63797, 210448, 392969, 454093, 377262, 282914, 219200, 213402, 156179, -44606, -265225, -4143, 238075, 48725, -106223, -159947, -126741, -34433, 56443, 145746, 133600, 103440, -194834, -226195, -278419, -432603, -358357, -73645, 136457, 14018, 47478, 266548, 257831, -12717, -105726, -9906, 164398, 126723, 439887, 661663, 413852, 128202, 32762, -54143, -54331, 32183, -61089, -280137, -321833, -163550, -188194, -253149, 5744, 195008, 45597, -223829, -101427, 174055, 349574, 408008, 424902, 332933, 374820, 527167, 448545, 141972, -84551, -305629, -364477, -418328, -206097, 145286, 266389, 227520, 178566, 181742, 115462]
12402A15462j62390r1152r7366q6109L310r5452Q9868j6544p6142K77880K81109
12391A42474m8176l4881P6602K11508J2936q7529Q4008J03586j9702J1647l3577
12380D18896J13356l2099j56097J08754K35746q7935j52250N7460j06231j59415
12370B40185J22973K67376J84773J0338k9273j37307k40903l60537j53066J1930
12360h3511J41041M5671j51974m8494m9726m573J96610L3632L8573N1898l03333
12349a34186k70940l8736M8398K51046K63139Q6571p7660j25082J49621K48593
12339D00764j28292k86642L2288J96301J25313L7635J38791L3003n7439j12427
12329C79295j75316M9011N6448p8428k09881k48K08918J0967r6575j89116q5696
$$ y = [115462, -46928, -138080, -235446, -321555, -318245, -413697, -323829, -340373, -416515, -138635, 142474, 94298, 59417, 136019, 347527, 360463, 272934, 356942, 460528, 440826, 452473, 418896, 532252, 500153, 344056, 452810, 688556, 600621, 448371, 505831, 399600, 240185, 363158, 630534, 815307, 825645, 796372, 659065, 418162, 57625, -95441, -83511, 57530, 103201, -48773, -97267, -146993, -151566, 45044, 78676, 117249, 169147, -134186, -405126, -443862, -395464, -144418, 118721, 205292, 127632, 2550, 152171, 400764, 272472, -14170, 18118, 214419, 339732, 377367, 516158, 549161, 491722, 379295, 203979, 252990, 309438, 231010, 21129, 20881, 229799, 240766, 144191, -44925, -130621]
12318a30621R0799J93632O7287N5804m4780j32990r5424k13852j53982Q1099N4950
12307b28078o2320N3689j1377J19643J38336J00809K18091o8981j47048N2798
12297A65562J16668p7802J96257O550k78280j46469n8693K8490J90343L52280
12287D94906J65184J7257p7984k29280k79223j75309k46597q052M7789R6135J03388
12276i1786j04026j74502k8876J96094J63820j35792j34761r0217k32632O3385
12266e69293K96884K1325J80819L14020K13891k46323J2217K35173k44493l26495
12256a12275K019J0770j56612Q474J13720M7698J12616P1419q7467k0736q2876
12245i3250j25966p1334k62951j06601K23688L31007K17913M8352l38120k48162
$$ y = [-130621, -39822, 153810, 221097, 276901, 232121, 99131, 3707, -210145, -364127, -283028, -228078, -290398, -236709, -248086, -128443, 9893, 110702, 328793, 259812, 112764, 165562, 282230, 204428, 400685, 407235, 128955, -17514, -76207, -47717, 142626, 494906, 660090, 677347, 599363, 370083, 90860, -84449, -331046, -339098, -291309, -195174, -91786, -195812, -370314, -399190, -203096, -39276, -175068, -309829, -400046, -632678, -569293, -272409, -251084, -70265, 243755, 457646, 211323, 223540, 458713, 214220, -112275, -110256, -99486, -256098, -247624, -133904, -86206, 26410, 97829, 10362, -10374, -93250, -219216, -290550, -553501, -660102, -436414, -105407, 112506, 160858, -177262, -425424]
12235d25424k7624q6112L3947R876R2045J21249P5346J91358R585k43152k30655
12224d79561J6009J56235J77670L4907J32536J67788N1797K9417r3276k29258
12214c5736j80514k4645Q8850J87996m6215k73389k0218L60953K91783K31655
12204E80520R1244l04541k67606J23206L453m0886j45491j78482j76103k8359
12194c43045K3355Q0586J97829J98132O7699o7603j85589j09941o2187L4144K36192
12183F9572J89341J06933J5117j83958q9761j86543k25244j63608J16014L49981
12173b156J99871j92401j42940Q554l246J94922q2696k01485K46034L20108p6401
12162B68164j06707J80720K96625R0489k71226k21961R9421j04777l47999k70381
$$ y = [-425424, -453048, -539160, -505213, -495337, -403292, -282043, -206697, -15339, -5754, -248906, -479561, -463552, -307317, -129647, -94740, 37796, 205584, 257381, 286798, 193522, -35736, -216250, -240895, -152045, 35951, -10264, -283653, -303871, 57082, 348865, 580520, 671764, 367223, 99617, 222823, 226276, 185390, 39899, -138583, -314686, -343045, -319690, -239104, -41275, 156857, 224556, 156953, -28636, -138577, -200764, -166620, 69572, 258913, 365846, 380963, 197005, 107244, -79299, -304543, -468151, -352137, -2156, 197715, 5314, -137626, -129072, -132318, 62604, -20092, -221577, 24457, 344565, 268164, 161457, 342177, 638802, 729291, 458065, 236104, 335525, 230748, -117251, -387632]
12152c87632j2933L95060L92199J60318p7567j53993l10501l09466j79173p6475
12142e60163Q4146j5529K8147j37438k50482o887J72846L80788M03057J36224
12132B34709p7639O7519O7646J7144j74157l64726J44163K91679j6074K0679p8210
12121A32733j64164Q3464J69293J66394J99605l00480n39077k77690J97491L09594
12111b2837L3010m6808j2267r649j97935J50945J63374m0550J53923K06943L8062
12100D16211j58429j58472J19627Q6833L3837Q7858n2490p1742k09440k48419
12090a54626j6278J61106J81316L82489L21346J70380j69986k58121k58492k83248
12080G5886k9321n260j59410j02700J46798J78080j32887n6239N1756j8132N0295
$$ y = [-387632, -400565, -5505, 386694, 547012, 469445, 315452, 4951, -304515, -483688, -560163, -476017, -491546, -463399, -600837, -851319, -858206, -685360, -304572, 98485, 234709, 157070, 224589, 292235, 309379, 135222, -229504, -85341, 206338, 190264, 210943, 132733, -31431, 52033, 221326, 387720, 587325, 286845, -252232, -529922, -332431, -22837, 10173, -36635, -48902, -58551, -256486, -105541, 57833, 17283, 171206, 378149, 416211, 257782, 99310, 218937, 305770, 339607, 427465, 374975, 303233, 93793, -154626, -170904, -9798, 171518, 554007, 875353, 1045733, 875747, 617626, 359134, 75886, 46565, 41305, -118105, -220805, -74007, 104073, -28814, -85053, -33297, -51429, -1134]
12069a134K25187J32628k03886m13622l1002O7979K3445Q2333j17133Q2026P4746
12058g8433p9291L1099L15161L09537M455j28264j68587j83489j77883q9292R0618
12047a54369J50939J90071P8083j20748j87957L1336N4252j30992J02928L12981
12037C26524Q628r8310k02978j38579L3588k55P0508L25512L05001n446k847j45218
12025D76128k76205k35669k09228r604J90512J30412J9272k6698k79752k54516
12015d75348j49324r0127j1794L33284L23722K08273J26274j64041j57407n0347
12005a06835R4698n3380k0289j9419j59250r1069k70064q6229M9317k7245j21193
11994h10958L993M0293K5663J79211K85165K41105J34685P9186N792k18437k53087
$$ y = [-1134, 224053, 356681, 152795, -260827, -291829, -223850, -200405, -118072, -235205, -153179, -78433, -157724, -126625, 188536, 498073, 502528, 374264, 205677, 22188, -155695, -244987, -154369, -3430, 186641, 264724, 143976, -43981, -12645, 41607, -89385, 13543, 326524, 335152, 236842, 33864, -104715, -71127, -71382, -874, 324638, 629639, 624193, 621346, 476128, 199923, -35746, -244974, -254578, -64066, 66346, 85618, 58920, -220832, -475348, -624672, -714799, -726593, -393309, -69587, 138686, 264960, 100919, -56488, -106835, -12137, -65517, -85806, -105225, -264475, -355544, -625608, -711837, -662520, -689765, -810958, -806965, -766672, -741009, -561798, -276633, -35528, 99157, 178343, 184135, -34302, -287389]
11983b87389j92196m2363J68865J49508J14474J46096r4402k37993m4003R5995
11973b23408j24636j75259j5321L3934j101O0363K31762K42313p791l50545q4721
11962d14410N4936M5754K1232J23589R9883j00199j51215R2848K53593L22605
11952C48616R5872k58465k23340O2837J48727J39552o0331j50196k33926l19920
11942d50574R3303K60895O3436j08997J55085K13878m8935k01580k48236k7217
11932b98942q5972Q471M03130L47042j06160n42238r8495M73925K20502l4562
11922B86701o9694j78261l22788k16715k9838J19669J92561L9943q9561K35580
11912c2403M01354P7076j51154o3962p7440k00862k56634l6945J93666J48935
$$ y = [-287389, -479585, -521948, -353083, -203575, -89101, 56995, -37407, -275400, -319403, -223408, -348044, -523303, -538624, -504690, -505791, -445428, -213666, 28647, 20856, -329689, -414410, -359474, -313720, -292488, -168899, -69016, -169215, -320430, -227582, 26011, 348616, 444488, 186023, -37317, 25520, 174247, 313799, 253468, 103272, -130654, -450574, -357271, -96376, -32940, -141937, 13148, 227026, 178091, -23489, -271725, -298942, -384914, -376443, 26687, 373729, 267569, -274669, -373164, 100761, 321263, 286701, 217007, 38746, -284042, -500757, -530595, -410926, -218365, -178422, -267983, -32403, 368951, 446027, 294873, 230911, 153471, -47391, -304025, -340970, -147304, 1631]
11902A631R0811J05007J02015p1706r0521j77079k89988j78336K14690J37170
11892a56306N1222J05545j39852j59911r3694q9704k7407r762j27781j07030K7650
11881g27030K20219L91934J52946J10595l0295j09986J44481L3365k35503m597
11871e3871M616k13286j33290j07242J50622L14177K53748l4456j9462J26717
11861B88273R2689j55560l69033k73754j07472j12988Q1517N6767J74825P6387
11851b48349k54276j76852l6018j25553N8045m1895q3176J94007L51113K83658
11841g9296l5846k75505m451J38884Q1547J44268P8569R6112n5177P3514J16480
11830B79099j21414r4967J27238K5440k99557l44716l71493j11521K00574M29265
$$ y = [1631, 92442, 197449, 299464, 227758, 137237, -39842, -329830, -508166, -293476, -156306, -105084, 461, -139391, -299302, -392996, -482700, -510107, -519869, -647650, -754680, -727030, -506811, -114877, 38069, 148664, 118369, 8383, 152864, 186229, -49274, -53871, -49255, -262541, -395831, -503073, -352451, -38274, 215474, 181018, 161556, 288273, 380962, 225402, -143631, -417385, -524857, -637845, -556328, -499561, -324736, -248349, -502625, -679477, -715495, -841048, -783003, -824898, -908074, -714067, -362954, -79296, -115142, -390647, -395098, -256214, -174667, -30399, 48170, 144282, 89105, 162619, 279099, 157685, 62718, 189956, 215396, -84161, -428877, -800370, -911891, -711317, -282052]
11820b82052M01750N2330K25384P9297j01893o3544O9022R2381j53688k48533
11810G0454j76676O9086K09712Q1459j61324m10038q7862J72986N6076m8259J31941
11799i2445l7051k39036p5134J29195J71179J30013j07159J20169K46791N9262
11789C05784p8438L7722M8607j64231j83265n9733k54246k838P9104N6877K24966
11778A0309K40358J28321J09285r4790k56261j53178J05190J62571N6445R0504
11768C98754M1130K3202j86810k49723l00918j50791P9925R2288J44831Q0827
11758b7285J16581J19179K17372K68941J09815n3567k66212k89326K0958J06608
11748C23064k49495l51706k07717P3806K19493M94276K95453j3190k77953o5608
$$ y = [-282052, 119698, 172028, 397412, 476709, 374816, 311272, 380294, 472675, 318987, 70454, -106222, -37136, 172576, 254035, 92711, -317327, -405189, -232203, -176127, -224386, -92445, -129496, -368532, -443666, -314471, -143292, -13279, -120438, -269, 246522, 305784, 227346, 265068, 313675, 149444, -33821, -93554, -347800, -350638, -271534, -214657, 10309, 250667, 378988, 488273, 393483, 137222, -15956, 89234, 251805, 308250, 398754, 439884, 463086, 276276, 26553, -274365, -425156, -345231, -252943, -108112, -27285, 89296, 208475, 425847, 694788, 804603, 751036, 484824, 195498, 216456, 323064, 73569, -278137, -485854, -412048, -192555, 301721, 597174, 583984, 306031, 240423]
11738B40423J20837m9303k6370M3958K09380J96088k19629l17101k19154J27458
11728A06587L8932k78295j29116L5762L01712K56621k6406j31425Q9401J24592
11718C88365o6713k85470j70506J18560L05012J53066j09297q9792K3187o9154
11708A97258j35448M0092K12604J311r1264Q2670O0320Q6860K8561j2188j38495
11697C32281l06706n0315p8044n4295M2092k8964q2498m7618K09884K5699j87817
11686b26301j40164l107J20088K31213q90n7255L8717J24682J19556m279r4513
11675A07747j38001q3357j27989j08690m1308J00822K26450K75612K0994O3142
11665B95422P6899K1827J02792M1258j003k88059j40330K38245M6268R761n6115
$$ y = [240423, 361260, 311957, 285587, 329545, 538925, 735013, 515384, 198283, -20871, 106587, 145519, -132776, -261892, -226130, 75582, 332203, 305797, 174372, 263773, 388365, 321652, 36182, -134324, -15764, 289248, 442314, 333017, 243225, 266412, 197258, 61810, 101902, 314506, 315817, 224553, 307223, 367543, 454403, 482964, 470776, 332281, 25575, -24740, -102784, -157079, -114987, -143951, -226449, -274067, -64183, -38484, -226301, -366465, -369572, -249484, -18271, -19161, -76416, -37699, 86983, 206539, 202260, 107747, -30254, -113611, -241600, -350290, -391598, -290776, -64326, 211286, 232280, 295422, 372321, 394148, 496940, 538198, 537195, 249136, 108806, 347051, 393319, 403080, 346965]
11654C46965k59666l53101l49283j93745J56558K82495J90647J4279j12318l04025
11644e81194r3303J28737R1685J69376K65434J84162j80550l31885p8916L50856
11634g5598M24925J03292k61109j31035m987j57030j44522k2949m1735j37165
11624d47913J4741K07993J25840R4559j27414j68066J27784J49142J05430J01405
11614A83501J22412P3569o5601p2387k81660j47117J43295L20551l9764k61271
11604b4472L7989l7642j27688l5872l8440k7291J32461M195j51824O350O3347
11593a98887n8528j61972J1899R9275J53697P1759J9743M0534l2492J15982m7971
11582A3039j6696K07930J7183p4018j09781p6224p4707J8404r6043p4377q2180
$$ y = [346965, 87299, -265802, -615085, -808830, -652272, -369777, -179130, -164851, -277169, -581194, -674497, -545760, -454075, -284699, -19265, 164897, -15653, -347538, -426454, -75598, 349327, 452619, 191510, 60475, 55488, -101542, -246064, -269013, -310748, -447913, -433172, -225179, -99339, -4780, -132194, -300260, -172476, -23334, 82096, 183501, 305913, 379482, 313881, 241494, -40166, -187283, -43988, 276563, 236799, -24472, 13517, -24125, -151813, -187685, -226125, -253416, -120955, -116760, -268584, -262234, -198887, -257415, -419387, -407488, -308213, -154516, -82757, -63014, -22480, -54972, 61010, 13039, -3657, 204273, 221456, 147438, 37657, -38567, -113274, -94870, -190913, -265290, -347470]
11571c47470P7564K57594K88153J4772j41601k18617j82310J84413K49109Q804
11561A90411m0513k40426j74619J3699M3016J87671J59675q4290r0267J1569L1492
11550G418o3133J3399q1563j7191J32240K5347M4912L0184q0861j41888L2856
11539i8280J09866j3959j63739j24871P9882J42872l403r5373K11736K00166J9432
11528B64329P9902J90283p9468l59122k37825M2084J51119L1389j33772l17707
11518c68788J14321L88071K49044J29749l9940j59374J0981Q2722o4678j12433
11508B29675j83579l71514j91035K5596J29616R3773p0236k33500j42508j3845
11498g27557p1798k09482N5393K66111J14031L01456M21646O2227j77194l24389
$$ y = [-347470, -269906, -12312, 275841, 290613, 149012, -69605, -251915, -67502, 181607, 190411, 149898, -90528, -265147, -251448, -208432, -20761, 138914, 54624, -35643, -24074, 7418, -55715, -42316, -123879, -141070, -8830, 16517, 61429, 91613, 10752, -131136, -98280, 11586, -2373, -166112, -290983, -211101, -68229, -71632, -167005, 44731, 244897, 264329, 344231, 534514, 455046, 95924, -141901, -99817, 51302, 82691, -51081, -368788, -254467, 133604, 382648, 512397, 472457, 313083, 324064, 406786, 342108, 229675, 46096, -325418, -516453, -490857, -361241, -267468, -337704, -571204, -713712, -727557, -799355, -1008837, -953444, -687333, -573302, -271846, 149800, 212027, 34833, -289556]
11488b89556m13748k22737J4342K61616J39292j32828j3160Q0033J54098O0691
11478c61957R1040J40308J98257O7273K13763J23559j84438j67924n8949J20550
11468A81482J07459L9293J28363n6500p1029J15270j20198k43590k54462k20023
11458c93935K17431M45228J26621R1006J6204j38335k4294o5361l42366k60759
11448c28560j52083k32028k61474J18747L07015L81687J34289l863J43190p459
11438I9461j99254K1139R7733j05348j72666j470k4198k220l5491q4346p4414
11427d81074M8039R5687r5767j38110p9769K25819J78698J64369q7915j26348
11417b96371m5920P9454m4699j25627K99248L14445J91908J67951N3185k06963
$$ y = [-289556, -703304, -926041, -911699, -650083, -510791, -643619, -656779, -576746, -422648, -361957, -270917, -130609, 67648, 134921, 348684, 472243, 287805, 119881, 60932, 181482, 288941, 328234, 456597, 400097, 329068, 444338, 324140, 80550, -173912, -393935, -176504, 268724, 395345, 486351, 502555, 364220, 339926, 274565, -67801, -328560, -480643, -712671, -974145, -855398, -548383, -166696, -32407, -36270, 106920, 99461, -99793, -78654, 19079, -86269, -258935, -260405, -284603, -286823, -322314, -406660, -481074, -433035, -337348, -433115, -571225, -650994, -425175, -246477, -82108, -170023, -296371, -342291, -262837, -307536, -433163, -133915, 180530, 372438, 540389, 593574, 386611]
11407C86611m93979l08184j2328J12199N0884k3427l2153o743J90574J43994j61039
11396a53591M0379K77385J86134J34442N3752k0921j26520r2765J21720n5268
11386C64747k56488n437K9385n1399J07542K50282J50627j3307J03491K5111q3223
11375F21331j24179m00m2516k0150r6970j84865j70285j35236M4903K21877M8405
11364A61915O5557R273j44916k9901M4213j72384l6223k8874o2282R618j3874
11353a97878j19709j06234J43450K20791M8195j76825j54906n9969J40815J27191
11343a35079M639k58175k95728j03994J3742J45951K05662K00656J5131j03864
11333c11059j63804l58165q3325K33161M51865L42134J21718J02061l004k8539
$$ y = [386611, -107368, -415552, -427880, -315681, -264797, -288224, -320377, -327120, -136546, 7448, -153591, -113212, 164173, 350307, 484749, 538501, 517580, 391060, 298295, 420015, 364747, 108259, 102822, 132207, 80808, 188350, 438632, 589259, 575952, 679443, 704554, 621331, 497152, 496752, 454236, 434086, 337116, 152251, -18034, -153270, -108367, 113510, 161915, 227472, 236745, 91829, 61928, 106141, -66243, -102466, -131340, -193622, -184004, -197878, -317587, -423821, -280371, -59580, -11385, -188210, -343116, -403085, -262270, -135079, -130440, -388615, -684343, -788337, -774595, -628644, -422982, -222326, -207195, -311059, -474863, -833028, -916353, -683192, -231327, 110807, 232525, 334586, 331582, 303043]
11323C03043l24635m10023j38203q2811K9097J8533K6982p2029M6800K2842r5126
11312f75530q5009j43650J25275L59759J80079p3333j88875o788J11027K16168
11302a80877k7975l8025O1208K02843J69859P3752L0681j43850k91772j94948
11292c39104o3518J10889L01514K57697M4596j98315l04521l02446j05480J22526
11282d76162L95808L00003L6342O3319o7244l72889r6688J75776J18640j56500
11272g9595k6153L0189J39523k8567p6420n8595p3836J57492K54765J28525Q6865
11261D54193M9634K0775n0651k48969k61391k7917R2383Q4182O7209l0556k45574
11250i6682j23415m8921J56064K55096J28378O7292J66243j17772j80210p3891
$$ y = [303043, -21592, -431615, -569818, -652629, -623532, -604999, -578017, -650046, -603246, -580404, -675530, -760539, -904189, -778914, -419155, -239076, -312409, -501284, -508072, -397045, -180877, -208852, -246877, -185669, 17174, 187033, 260785, 291466, 147616, -144156, -339104, -402622, -291733, 9781, 267478, 312074, 113759, -190762, -493208, -598688, -476162, -80354, 219649, 255991, 319310, 252066, -120823, -217511, -41735, 76905, -79595, -105748, -75559, 63964, 35397, -41023, -99618, -173454, -15962, 238803, 367328, 454193, 503827, 524602, 473951, 224982, -36409, -64326, 28057, 112239, 179448, 148892, -96682, -220097, -269018, -112954, 142142, 270520, 337812, 504055, 386283, 206073, 132182]
11240A32182K267m8265j40881j15914o8920K349M8504J65208M7819J7995Q7387
11229A29731J31643l8174r4417n1059j00494j06611o1994J69690K4199k15672
11219b13158L3232J14983k9229r7667n3384K45604O7374R7829R1370N5708j6838
11208B95824k50271k94841P0034K59540J6035J33292N5786m4108o7197k49177
11198g5083k02327J18952K41156K05055j07740j95030k06113K41632M00654K50620
11188F71776j68195l34252J6824K4232k80491l36688l18327j27431Q9867R9241
11178f63444j1412j16277q9536J44202L0945L3008J46478O0966K5316m683K0647
11167d23790J50683P80J95021J45992j13119N0724M3097j26167k67872k17371
$$ y = [132182, 134449, 86184, -54697, -170611, -239531, -237182, -188678, -23470, 24349, 42344, 129731, 261374, 223200, 128783, 77724, -22770, -129381, -191375, -21685, 2514, -213158, -179926, -64943, -94172, -191839, -245223, 381, 67755, 165584, 256954, 312662, 295824, 45553, -249288, -179254, 80286, 96321, 229613, 285399, 241291, 174094, -75083, -277410, -158458, 82698, 287753, 180013, -15017, -221130, 20502, 421156, 671776, 503581, 169329, 186153, 210385, -70106, -406794, -725121, -852552, -762685, -663444, -674856, -791133, -880669, -736467, -705522, -672514, -526036, -465070, -439754, -444437, -423790, -273107, -272327, -77306, 68686, -44433, 6291, 49388, -76779, -344651, -562022]
11157e62022j187J9761N5928k0762p3738l6600J34941K62433K33994J39995q8409
11146F4334q0068O3679J16592J45655j5786k2900o6846j21964l3302L7330j36786
11135e0062l1904R1403J17980K86655Q7837O885O9205m963k31651k02624j01162
11124C7599r4637J26901R9943J9267N026r8228j75297J90753J44733j07594l5752
11113A12714Q2445p1532j57074k44043l29826q2086O1858J57268J72858L6035
11103b61383K08843L56880n1792j88091k07225m2241j78639p4088J88233M3969
11093b05534J31973J63096O5268r480L103k55078k13713J69559K56489P6835q4051
11082I8467k38605j24216L92914J20770k87719k69689k02371L8884J55441m4261
$$ y = [-562022, -563209, -543448, -487520, -508282, -582020, -618620, -483679, -221246, 12748, 152743, 64334, -15734, 47945, 164537, 310192, 294406, 271506, 204660, 82696, 49394, 86724, -50062, -81966, 9437, 127417, 414072, 501909, 508794, 577999, 573036, 341385, 138761, 37599, -57038, 69863, 169806, 189073, 194099, 95871, -79426, 111327, 256060, 148466, 112714, 195159, 123627, -33447, -277490, -607316, -689402, -627544, -470276, -297418, -261383, -52540, 304340, 252548, 64457, -142768, -185009, -363648, -437736, -249503, -205534, -73561, 89535, 154803, 145323, 148426, -106652, -320365, -150806, 105683, 182518, 98467, -140138, -264354, 128560, 249330, -38389, -308078, -510449, -471565, -316124, -360385]
11072c60385j10288J28022R8641J29574J33847J47765L9801n975O9959j7966j15307
11061A37688j16023k22502j27169J32815R3481M0045p851n2986k23881N7277J69789
11050a19317L13490K54063J23321L5513N997j70773j43974j01971j44588j19930
11040f8169Q5778K00330K0321r9356j87733k16530K09431K50528O9745K79143
11030E43488N2335k30722m14879l18406k5461K99967K16665j40698J00538K27099
11020C09926J38272k3788l89297l02369J6223J8762j73998j3469L07407K31975
11010A19644j9675m1563L6599P8029j22459o4585p9650K4646j7741j82629K8521
10999b40863k1574K4049J63257J3694K11695J13943j12751O7119j6760j82893
$$ y = [-360385, -470673, -342651, -244010, -114436, 19411, 167176, 206977, 201002, 270961, 252995, 137688, 21665, -200837, -328006, -195191, -101710, -61665, -69516, -122502, -346383, -289106, -119317, 194173, 448236, 571557, 607070, 613067, 442294, 298320, 196349, 51761, -68169, 17609, 217939, 238260, 138904, -48829, -265359, -55928, 194600, 264345, 543488, 595823, 365101, -49778, -368184, -393645, -93678, 122987, -17711, 82827, 309926, 448198, 424410, 35113, -267256, -251033, -232271, -406269, -419738, -112331, 119644, 99969, 58406, 95005, 173034, 50575, -14010, -93660, -69014, -86755, -269384, -240863, -262437, -238388, -75131, -61437, 150258, 264201, 151450, 218569, 201809, 18916]
10989A8916j52922j1399m0847j99573o1585o2065r7228k77980j4445K86315J96104
10978d16709j17042p4349J53972L40743Q6181j99071j55115j28269j04053r8200
10968g11912k429P776j79744n6478K56881L12864K00421J36866L0372j19054r7043
10957b21480P1240K72092K4022j01027m4159J78987O1572j29763K4279Q9107j03099
10946A21771r8192O8299l3198J00815n719K3314K32830K56260O9797K9023j4259
10935G50741p8921L9581J17155J20322j22303j63192p6678l3502P2455L67641
10925I93299L28024l2776l27199j35281p3055j6475j78208k49213k0598J52314
10915D40832Q5343k51732j52757J9980l41840j89866J25866P0783N194j43251
$$ y = [18916, -134006, -145405, -186252, -385825, -447410, -509475, -606703, -884683, -899128, -612813, -416709, -533751, -608100, -454128, -113385, -27204, -226275, -381390, -509659, -613712, -711912, -714341, -706565, -886309, -942787, -685906, -373042, -172621, -35755, -5383, -124437, -221480, -150240, 121852, 145874, 44847, 688, 179675, 241247, 111484, 135763, 224870, 121771, 23579, 91878, 58680, 159495, 153776, 177090, 409920, 666180, 735977, 765000, 750741, 671820, 711401, 828556, 948878, 826575, 663383, 586705, 553203, 625658, 993299, 1321323, 1288547, 961348, 826067, 753012, 736537, 558329, 309116, 288518, 440832, 526175, 274443, 121686, 141666, -200174, -390040, -264174, -193391, -188197, -331448]
10905c31448j11355l9885M390K43479J34855N3566L4238K9657j80472k46677l6873
10894d46525R8012J00648J09728P2150m9951j12967M7256P8091R6324J63434j51972
10883D228k85715k16858J5641L8873j05024J53595J13693o8145K9827r0104j13224
10872e23213j6196K7553R6899P9232j74801m9883J83742O5692O8444L3978O6535
10861a42018K781j32679O0439R7507o0010j01225j49833K9003R1905o197j3281
10850c23608L83324L05988k6069m5895K9622m1737j37486p7923K1062J92919R5669
10839C75866k17937j68945m1116R3061j83619l30593K4975J75835O8397j07377
10829c11453j61971l4219L27485M93296K14330q0371J0583j12377k77157k61861
$$ y = [-331448, -442803, -482688, -478298, -234819, -99964, -46398, -12160, 17497, -162975, -409652, -446525, -348513, -247865, -138137, -65987, -115938, -228905, -181649, -103558, -7234, 156200, 4228, -281487, -498345, -482704, -443831, -548855, -395260, -281567, -349712, -319885, -409989, -523213, -539409, -511856, -414957, -335725, -510526, -560409, -376667, -310975, -242531, -208553, -142018, -139237, -271916, -211477, -113970, -173980, -275205, -425038, -396035, -304130, -310327, -323608, 59716, 365704, 339635, 293740, 323362, 281625, 144139, 66216, 87278, 280197, 375866, 157929, -11016, -52132, 40929, -142690, -473283, -448308, -272473, -204076, -311453, -473424, -507643, -180158, 313138, 527468, 447097, 457680, 345303, 68146, -193715]
10819a93715l9327K71288o901k60150k12199j5143k0522l6651O3627J68700K14012
10808f6981J35913r0444o7387M77619N14448m6270k87722r2478O1449J14758J55048
10797H07953j95457m87778m36779k12434l0800K48240K30376Q8319j4506r8960
10787a01826j7489m6042j662N0439J13527Q7893j38966j10442l0058K9887J33476
10776c1263j78623j45642J10450J47462K32539J29837j9498J96622L4382j09591
10766C66675O8009k6891k86213q9983L673N5239P0742j8054j70741k17479j44954
10755c89977j20178J31396K85492K06895N7068k8323j46504r5485N6428N7286
10745A4098l9291k45898l65560l9609L69535K24660Q2420m6863J05558J97206
$$ y = [-193715, -233042, 38246, 31345, -228805, -441004, -456147, -476669, -513320, -449693, -280993, -66981, 68932, -21512, -88899, 388720, 903168, 856898, 569176, 476698, 538147, 652905, 807953, 612496, 124718, -312061, -524495, -555295, -307055, -76679, 11640, -2866, -101826, -119315, -165357, -167019, -116580, -3053, 84840, -54126, -164568, -194626, -164739, -31263, -209886, -355528, -245078, -97616, 134923, 264760, 245262, 441884, 476266, 366675, 434684, 407793, 121580, 31597, 35270, 90509, 161251, 143197, -27544, -245023, -389977, -510155, -378759, -93267, 113628, 170696, 142373, -4131, -99616, -43188, 14098, -25193, -271091, -636651, -676260, -306725, -82065, 355, -46508, 59050, 256256]
10735B56256j01154l1523M037j53437k58463o0229m4795j94622J73103L55558
10725e5269K28170J20134R4101J19683O4520R004K4578J18785j9136k53289j03162
10714C48119J48370k478l17269j03494J21995r285L8650K36757J29191M9141Q8200
10703G27897J72395M9348j39753j62243r0420j34874k97954j31070L2892m408
10693B1810j28532k29366j24065K88107M66162L01921n9204n3577p9752p4983
10683C28521k22785m23522r8211Q8837Q0021n355j31043k20170R4094K22141p5472
10672c62944j12855m6021O9695J97054K75681K36965J16297k9026R186J27106
10662D81138j0932l9950k4161k07652o8339J31106L699j10062k41960j78031j22359
$$ y = [256256, 155102, 123579, 127616, -25821, -284284, -344513, -389308, -583930, -410827, -55269, 172901, 293035, 387136, 506819, 571339, 580343, 604921, 723706, 704570, 451281, 348119, 496489, 494011, 176742, 73248, 195243, 185958, 224608, 461365, 590556, 639697, 727897, 900292, 949640, 809887, 647644, 557224, 422350, 124396, -6674, 26218, 21810, -106722, -336088, -460153, -172046, 294116, 596037, 536833, 483256, 403504, 328521, 105736, -317786, -415997, -327160, -247139, -252494, -383537, -603707, -509613, -287472, -362944, -475799, -521820, -452125, -255071, 20610, 257575, 373872, 344846, 354032, 481138, 470206, 430256, 406095, 198443, 130104, 261210, 264909, 154847, -87113, -265144, -387503]
10651c87503k1866Q4056K78067J96496n7830j55549k57191p4004K38972Q4754
10641g1598n0744n319N4404L1762K34171N2953q3064j9207Q9691J01270J11958
10630D46277M0762k47954l73047j48228Q6609K1743k79341j71255J86011J04456
10620c33967j1416O389P2202n8711P0536k1945j06977j25990l4267L298N2192
10609d88656J11361n1486M0809J68909L13884K19856J9951p7691o4753l6193L2002
10598A87993J37425L03520l6861m16936m27053j37445J61510m6755j32478k7977
10588d35057J92207K72658l0426l2323j4492J7637o4192O1078j20260k13031J903
10577c64298O9157J36366J45646K19023J3125k29649M4894l220k26963j13368
$$ y = [-387503, -409369, -325313, -47246, 149250, 91420, -64129, -321320, -395324, -156352, -71598, -122342, -127661, -73257, -41495, 192676, 245629, 162565, 143358, 233049, 334319, 446277, 487039, 239085, -133962, -282190, -195581, -173838, -453179, -624434, -438423, -333967, -345383, -338994, -266792, -325503, -254967, -276912, -383889, -509879, -544146, -540848, -488656, -377295, -428781, -387972, -219063, 94821, 314677, 334628, 256937, 192184, 155991, 187993, 325418, 628938, 592077, 175141, -251912, -389357, -227847, -274602, -407080, -435057, -242850, 29808, -618, -32941, -47433, -29796, -93988, -32910, -153170, -366201, -364298, -295141, -158775, -13129, 205894, 219019, -10630, 34264, 31044, -195919, -309287]
10567c09287K9921k82008r8127J54403j5236j72548j69481M4219Q5390Q3259K57612
10556c91883J31231k8838j21850P3007J49768J31617J38686j25219J9932J91523
10546A67974o2816j33855j38288j41403o1043k857K1144q5013j03945J13704K84280
10535a42118J37817j36023j90309n5541k2449k7305J90524K06985Q7328n4495
10525e586J3926K26072J28069o9126j1814j52617l35195K0865K38280J26971j1071
10514A68774m4913M1162j45l21325j68928L110J120L9868L23148n5717k38874
10503b52720N6593J91670m5420o4465q2613K8086L8200j96323j27290Q0713P6576
10492b96993P2703j9432O6331J83064K05373k9223o4161K5186n1687k35471k47113
$$ y = [-309287, -279366, -561374, -659501, -505098, -520334, -692882, -862363, -818144, -732754, -649495, -391883, -260652, -289490, -411340, -338333, -188565, -56948, 81738, -43481, -23549, 167974, 105158, -28697, -166985, -308388, -369431, -372288, -351144, -436157, -540102, -426398, -142118, -4301, -140324, -330633, -386174, -408623, -435928, -245404, -38419, 48909, -5586, 8340, 234412, 362481, 293355, 281541, 128924, -206271, -185406, 52874, 179845, 168774, 123861, 165023, 164878, -156447, -325375, -322265, -321145, -281277, 41871, -13846, -252720, -196127, -4457, -49877, -114342, -196955, -168869, -130669, -326992, -454282, -373569, -296993, -224290, -243722, -177391, 5673, 211046, 181823, 117662, 142848, 91161, -144310, -391423]
10481c91423K3430J27514K6551j37319j43090J23962M5721j19779j83807J29626
10471d98614J03410M9001J16631J54612N2365K0550n1049j37696j64603q7590
10461d42983L1539K51592J00951j16235l1514J03859J48880N4743o6635n7451
10451b3254O4614J05554p7853n423J00215J12716J9089j96262J01134L38859p0552
10440D68837k72843k79520k61983k29225j18623Q7217J28445O1132O7738P6256
10430b72569J47375J14086r272j47445k55159k05304J13502J21253P5911N0270
10420b67352k5432n0670o7812j12814p0783J71445K02732L36924L32298J13545
10410E62081j42770j5032k51212l68793q0844Q1722K03728J98880r9088k67972
$$ y = [-391423, -367993, -240479, -213928, -351247, -494337, -370375, -324654, -444433, -628240, -498614, -395204, -346203, -229572, -74960, -22595, -2045, -53094, -190790, -355393, -442983, -411444, -159852, -58901, -175136, -206650, -102791, 46089, 100832, 34197, -23254, 41360, 146914, 69061, 63638, 163853, 276569, 295658, 99396, 200530, 539389, 468837, 195994, -83526, -345509, -574734, -693357, -606140, -477695, -416563, -348825, -272569, -125194, -11108, -20380, -167825, -422984, -628288, -514786, -393533, -317622, -267352, -292784, -343454, -411266, -524080, -594863, -423418, -220686, 116238, 448536, 562081, 419311, 404279, 153067, -215726, -296570, -214848, -11120, 187760, 88672, -179300]
10400a79300q7071M4739m2479q3746l7341K69453L66886L32577J6483P212K0454
10389F27867J1782k0972j83289j36800j30846n3098q8068J14J22607K1898j68946
10378B249p2746P8958K1262j0657o5915k3817o7527L7327K2371l0314j52548j62897
10366d24254m7892l9762j39001j04683R9084K89330K57012j5068k34830R1692
10356b68372M17858K30606o7431j74383k08069o5595j15207j84244J22271J58782
10346a53784j30313q5531J13771L33430K70837M8822m1797J7860M6528Q9027j73764
10335C35086j27788K7794k71440k31583J05263R1971Q1514q0073k96057l88401
10325g53714K27566N22997K79640m649j00952J03286L455p6076J1008J37642J73040
$$ y = [-179300, -266371, -221632, -264111, -347857, -385198, -115745, 251141, 583718, 600201, 607413, 627867, 639649, 618677, 435388, 298588, 167742, 114644, 26576, 26690, 149297, 171195, 2249, -70497, 8461, 29723, 19066, -46849, -70666, -138193, -100866, -78495, -108809, -261357, -424254, -472146, -511908, -650909, -755592, -656508, -367178, -110166, -125234, -360064, -268372, 149486, 380092, 312661, 138278, -69791, -135386, -250593, -434837, -312566, -153784, -284097, -369628, -255857, 77573, 348410, 397232, 355435, 373295, 419823, 508850, 335086, 207298, 235092, -36348, -267931, -162668, -70697, 10817, -69256, -365313, -753714, -526148, -3151, 276489, 271840, 170888, 274174, 277629, 201553, 212561, 350203, 523243]
10314E23243J39934j24144j88359m08495n34979l53635p879K79134N11062K39385
10304G5267j90251k00514p728K09621K11967Q3542j66469R709J443q5953O5856
10293F490Q9562M4056o8750m8943O3509m2549j82740j32100m4629L9476J18414
10282a58204K0021j07703O8488K6207L9777L61907K63681r6435o7042K08860O8707
10271F28264j96788J54983L50861P8312m17378m67229j91817j18655J76845L51073
10261C48471N4152q9103j39494j56123j22775J34423k1126k15379L5370M4831
10251a26753j96118k45195j14257J59766J47144Q9445J90917K79717J94942M8799
10241D28407Q9735p25k39125k61262l2987j48319j35274P0286L14109J50901j26850
$$ y = [523243, 663177, 539033, 350674, -57821, -592800, -946435, -954314, -675180, -164118, 75267, -114984, -315498, -323226, -113605, 98362, 181904, 15435, 25144, 26587, -59366, 6490, 96052, 140108, 71358, 22415, 85924, 43375, -139365, -271465, -316094, -276618, -158204, -138183, -245886, -177398, -151191, -111414, 250493, 514174, 417739, 350697, 559557, 628264, 431476, 586459, 937320, 1015632, 598254, 131025, -60792, -179447, -2602, 348471, 402623, 313520, 174026, 17903, -104872, 29551, 8425, -206954, -171584, -126753, -322871, -568066, -682323, -522557, -375413, -285968, -95051, 184666, 379608, 428407, 518142, 517417, 278292, 17030, -15957, -164276, -299550, -229264, 84845, 235746, 108896]
10230A08896k60846k00397j14620j16369o1017O1694J49384R1654n2224l7223
10220d31068J95734N7484k00136k32292j71782k10634K83429M48839L45648J82948
10210B68170j6131p9462O1202K7669n950j59856l21213J4928L97347L06955J875
10199D95534N2920J3540M3187k2681l51840k97676j29514k13992p2263J9588k7636
10188d90833p274P7978K3485j64190k1124J58819R6020j29465j24146J07372K65663
10177b07695J96020K75317L73218N0394j69121r3090j56601j88982k5515J4984
10167F8929k4387j5226P4253j01480l41736k36823J06247L39326K94676J76769
10157C40548R7856J6816k02747l50315j38572j55786l08614j70331n5290J01774
$$ y = [108896, -151950, -352347, -466967, -583336, -644353, -582659, -433275, -341621, -393845, -431068, -235334, -177850, -377986, -610278, -782060, -992694, -709265, -260426, 85222, 268170, 252039, 172577, 233779, 261448, 255498, 95642, -225571, -210643, 186704, 493659, 495534, 548454, 561994, 605181, 582500, 230660, -67016, -196530, -410522, -482785, -463197, -490833, -498107, -420129, -396644, -560834, -581958, -423139, -327119, -456584, -580730, -473358, -207695, -11675, 263642, 636860, 687254, 518133, 425043, 268442, 79460, 53945, 68929, 44542, 29316, 103569, 2089, -339647, -576470, -470223, -130897, 163779, 340548, 438404, 455220, 252473, -97842, -236414, -392200, -700814, -871145, -926435, -824661]
10147h24661M64344L73982K57903P7751k14406j56709j63995R9832J53754k64792
10137a96997j35260K61073P6847o6434l1113r4223j87906j13308J503O1722Q1267
10126c42829j06823r0646K0496J61272m2346j79308l2131L52585M87165J29170
10116C56605k78828k64444j23695j32351m8949K2096K12904M16054L46272j14985
10106C90679l61650k17137m5072N7036J77591J19760j14521o8746N5336K30248
10096B23524N3575j56091j26255j55800j18036K8139N1053q7032j50913j71480
10086f09316K29386L91495L2058k61338j87988J19934R7190k03292k92235m8470
10076g32576m4033m9521J44276O8768J1557K3358n4980j46966o6033j08455J4671
$$ y = [-824661, -360317, 13665, 271568, 349319, 134913, -21796, -185791, -85959, 67795, -196997, -332257, -71184, 5663, -60771, -91884, -186107, -374013, -487321, -485818, -424096, -342829, -449652, -540298, -519802, -358530, -400876, -580184, -612315, -259730, 227435, 356605, 77777, -186667, -310362, -442713, -491662, -469566, -256662, 159392, 505664, 390679, 29029, -188108, -233180, -176144, 1447, 121207, 6686, -62060, -6724, 223524, 277099, 121008, -5247, -161047, -279083, -250944, -199891, -286923, -437836, -609316, -379930, 11565, 43623, -217715, -405703, -285769, -188579, -391871, -684106, -732576, -776609, -826130, -681854, -613086, -601529, -578171, -633151, -780117, -846150, -954605, -939934]
10065i39934K33511J7369n726N9479j00229n7492K31549J91365R1280q3726K30129
10054a32425L04619o5864n0170r4811j47306j79986N8879J35197l7400j41065
10044c50332m0620l7499K2732J69032L00869L51944J09800P5441K00177K21205
10034A022749K694j96655k20874k32469L9805K28876r944m09776j05418J90944
10024C09932n5242j76118j80378n279P4513o8859k69779J28670K04852N745l2639
10013f4582K6922k4739j53861l9743Q5674K92829L97178K2670k16954j5180o9344
10002B40870p7169r7508l63341k47743J3342K1203j6652p3303J07319J03838N4401
9991c34743J00334J85720q0040j81503m7091K31209K67438R725k34450m6337Q7788
$$ y = [-939934, -706423, -689054, -694780, -635301, -735530, -793022, -561473, -370108, -278828, -362554, -132425, 172194, 106330, 56160, -38651, -185957, -365943, -307064, -171867, -209267, -350332, -390952, -428451, -405719, -236687, 64182, 416126, 525926, 601367, 801544, 1022749, 1025443, 828788, 607914, 375445, 415250, 644126, 634182, 224406, 118988, 309932, 254690, 78572, -101806, -107085, -32572, -101431, -371210, -242540, -37688, -31943, -64582, -37660, -62399, -216260, -256003, -170329, 122500, 519678, 542348, 325394, 310214, 240870, 163701, 66193, -297148, -544891, -531549, -510346, -526998, -600301, -492982, -389144, -334743, -234409, -48689, -128729, -310232, -357323, -126114, 141324, 151049, -83401, -129738, -41950]
9980d1950N6190J2175J63657O2684J1439j61274q5399J47000q6809Q9702J46827
9969C14242P7028l0173o3643k05143j92337j5077P6294M6374K15953J27538j4653
9958C36403J05453O7563l09598l85989K2620K59643M7159j3458L9504k5095j57513
9947a3308j09961n6109J70327J75472O9556J58340N7677l8454N5350j13938j73210
9936A81742j37694q6886K7822K18648J47082k23407j61215J02310p6456l1396
9926c9450P1531p6755k9176R3721K8797j10993j17335k66175n6946K84741J26464
9915i1576o1035M6415j4505Q3599J90370N2316j1973j2532n0690J43477M244q4599
9903A93511J25746M0294k50995k89703J40393J08560J61860J1315l99639j97637
$$ y = [-41950, 14240, 26415, 190072, 252756, 264195, 102921, 17522, 164522, 77713, 167415, 314242, 391270, 361097, 297454, 92311, -100026, -115103, -38809, 7565, 223518, 351056, 336403, 441856, 509419, 199821, -186168, -163548, 96095, 143254, 129796, 169300, 144205, -13308, -123269, -179378, -9051, 166421, 235977, 394317, 451994, 413540, 468890, 354952, 181742, 44048, -42838, -15016, 203632, 350714, 127307, -33908, 68402, -8054, -39450, 32081, -44674, -73850, 19871, 48668, -62325, -179660, -445835, -502781, -218040, -91576, -152611, -106196, -120701, -37102, 153268, 205584, 193611, 181079, 130389, 273866, 278110, 193511, 319257, 359551, 108556, -181147, -40754, 67806, 229666, 240981, -158658, -356295]
9893c56295K6767J75016M38045J26266o119P9860O7320J46131l5886l51394m04435
9882i4724j30206J7121J70195N5660n2752r8484k1116K19258L04562P3978j48058
9871B95434k28070j61175J02129K3778N3803O8432P781q7693q2639J63778J19872
9860B75430n5445n7157l2464R9829K05076R876j82728j80236k49758k57408J1996
9849d12989J83114j25408j44153k9506n0405K29208L38532J45161K03938K30658
9839E68150j47020j62066j03494j5590l2571N6638O9605P3026J14379J75633N9175
9828F55865J72668O977l31401l86663k69308m7881N6082Q1167P1963O3462j47333
9817g4402r8060k9134M0362K50680R1659j48218k97911o2798N9628j19548L2155
$$ y = [-356295, -329528, -154512, 283533, 409799, 403680, 483540, 550860, 696991, 661105, 309711, -94724, -224930, -207809, -37614, 18046, -34706, -133190, -154306, 64952, 369514, 443492, 295434, 67364, -93811, 8318, 32096, 85899, 154331, 162112, 74419, -8220, 155558, 275430, 219985, 162828, 130364, 230193, 435269, 445145, 262417, 82181, -167577, -424985, -412989, -229875, -355283, -499436, -528942, -579347, -350139, -11607, 133554, 337492, 568150, 421130, 259064, 155570, 139980, 107409, 164047, 233652, 306678, 421057, 596690, 655865, 828533, 835510, 504109, 117446, -151862, -199743, -143661, -62494, 9469, 72931, -74402, -172462, -201596, -161234, 89446, 181105, 32887, -265024, -327822, -268194, -387742, -355587]
9806c55587P2561j36238k28584k1509K05397R0010J64368J60740L487K8627J01425
$$ y = [-355587, -283026, -419264, -647848, -669357, -463960, -373950, -209582, -48842, -45355, -16728, 84697]
$$ [...]
##END NTUPLES=NMR SPECTRUM
##END=
