##TITLE=C13_DDQ-easychem
 aceton, 700 sc

 26.9.2019
##JCAMPDX= 6.0         $$ Bruker NMR JCAMP-DX V2.0
##DATA TYPE= NMR SPECTRUM
##DATA CLASS= NTUPLES
##ORIGIN= UXNMR, Bruker Analytische Messtechnik GmbH
##OWNER= root
$$ XWIN-NMR		Version 3.5
$$ Thu Sep 26 16:31:39 2019 Russian Standard Time (UT+4h)  she@DPX200
##.OBSERVE FREQUENCY= 50.327896
##.OBSERVE NUCLEUS= ^13C
##.ACQUISITION MODE= SIMULTANEOUS
##.ACQUISITION SCHEME= undefined
##.AVERAGES= 700
##.DIGITISER RES= 17
##SPECTROMETER/DATA SYSTEM= spect
##.PULSE SEQUENCE= zgpg30
##.SOLVENT NAME= CDCl3
##.SHIFT REFERENCE= (INTERNAL, CDCl3, 0, 222.624)
##AUDIT TRAIL= $$ (NUMBER, WHEN, WHO, WHERE, WHAT)
$$ ##TITLE= Audit trail, XWIN-NMR		Version 3.5
$$ ##JCAMPDX= 5.01
$$ ##ORIGIN= Bruker BioSpin GmbH
$$ ##OWNER= she
$$ F:/spectra/data/she/nmr/c13/1/pdata/1/auditp.txt
$$ ##AUDIT TRAIL=  $$ (NUMBER, WHEN, WHO, WHERE, WHAT)
(   1,<2019-09-26 16:30:43.51 +0400>,<she>,<DPX200>,
      <created by zg, POWCHK disabled, PULCHK disabled
       terminated by command 'halt'
       configuration hash MD5:
       00 E9 B6 7A A2 85 ED C7 34 08 36 98 17 FE 4E 26
       data hash MD5: 32K
       61 17 5D 28 C5 21 19 05 B3 3D 93 CB B1 0C 8F BE>)
(   2,<2019-09-26 16:30:45.35 +0400>,<she>,<DPX200>,
      <Start of raw data processing
       efp BC_mod = 2 LB = 1 FT_mod = 6 PKNL = 1 PHC0 = -383.6302 PHC1 = 29.20636 SI = 32K 
       data hash MD5: 32K
       3F 3F 06 B1 00 68 8A E8 7B F5 78 0A 63 26 DB 7C>)
(   3,<2019-09-26 16:31:04.23 +0400>,<she>,<DPX200>,
      <pk PHC0 = 0.6943935 PHC1 = -3.2 
       data hash MD5: 32K
       48 B1 64 62 F4 81 A1 32 F8 6C 89 7F FF F9 87 91>)
(   4,<2019-09-26 16:31:08.28 +0400>,<she>,<DPX200>,
      <abs ABSG = 5 
       data hash MD5: 32K
       C5 01 77 EA 65 F3 02 51 11 02 35 50 D6 38 07 D6>)
$$ ##END=
$$ 
$$ hash MD5
$$ 4E E0 0E F0 B6 79 EB E9 60 FB 4D DA A6 53 3A D1
##$RELAX= 
##$RELAX= 
##$RELAX= 
##$RELAX= 
##$RELAX= 
##$RELAX= 
##$RELAX= 
##$RELAX= 
$$ Bruker specific parameters
$$ --------------------------
##$DU= <F:/spectra>
##$EXPNO= 1
##$NAME= <c13>
##$PROCNO= 1
##$TYPE= <nmr>
##$USER= <she>
##$AMP= (0..31)
100 100 100 100 100 100 100 100 100 100 100 100 100 100 100 100 100 100 
100 100 100 100 100 100 100 100 100 100 100 100 100 100 
##$AQSEQ= 0
##$AQ_mod= 1
##$AUNM= <au_zg>
##$AUTOPOS= <>
##$BF1= 50.322709
##$BF2= 200.13
##$BF3= 50.322709
##$BF4= 500.13
##$BF5= 500.13
##$BF6= 500.13
##$BF7= 500.13
##$BF8= 500.13
##$BYTORDA= 1
##$CFDGTYP= 0
##$CFRGTYP= 5
##$CHEMSTR= <none>
##$CNST= (0..31)
1 1 145 1 1 1 1 1 1 1 1 1 1 1 1 1 1 1 1 1 1 1 1 1 1 1 1 1 1 1 1 1 
##$CPDPRG= <waltz16>
##$CPDPRG1= <>
##$CPDPRG2= <waltz16>
##$CPDPRG3= <>
##$CPDPRG4= <mlev>
##$CPDPRG5= <mlev>
##$CPDPRG6= <mlev>
##$CPDPRG7= <mlev>
##$CPDPRG8= <mlev>
##$CPDPRGB= <>
##$CPDPRGT= <>
##$D= (0..31)
0 2 0.00345 0 0 0 0 0 0 0 0 0.03 2e-05 3e-06 0 0 0 0 0 0 0 0 0 0 0 0 0 
0 0 0 0 0 
##$DATE= 1569498718
##$DBL= (0..7)
120 120 120 120 120 120 120 120 
##$DBP= (0..7)
150 150 150 150 150 150 150 150 
$$ [...]
##$SUBNAM4= <"">
##$SUBNAM5= <"">
##$SUBNAM6= <"">
##$SUBNAM7= <"">
##$SUBNAM8= <"">
##$SUBNAM9= <"">
##$SW= 239.972175391363
##$SWIBOX= (0..15)
0 1 3 0 0 0 0 0 0 0 0 0 0 0 0 0 
##$SW_h= 12077.2946859903
##$TD= 32768
##$TD0= 1
##$TE= 0
##$TE2= 300
##$TE3= 300
##$TEG= 300
##$TL= (0..7)
120 120 120 120 120 120 120 120 
##$TP= (0..7)
150 150 150 150 150 150 150 150 
##$TP07= 0
##$TPNAME0= <>
##$TPNAME1= <>
##$TPNAME2= <>
##$TPNAME3= <>
##$TPNAME4= <>
##$TPNAME5= <>
##$TPNAME6= <>
##$TPNAME7= <>
##$TPOAL= (0..7)
0.5 0.5 0.5 0.5 0.5 0.5 0.5 0.5 
##$TPOFFS= (0..7)
0 0 0 0 0 0 0 0 
##$TUNHIN= 0
##$TUNHOUT= 0
##$TUNXOUT= 0
##$USERA1= <user>
##$USERA2= <user>
##$USERA3= <user>
##$USERA4= <user>
##$USERA5= <user>
##$V9= 5
##$VALIST= <valist>
##$VCLIST= <CCCCCCCCCCCCCCC>
##$VD= 0
##$VDLIST= <DDDDDDDDDDDDDDD>
##$VPLIST= <PPPPPPPPPPPPPPP>
##$VTLIST= <TTTTTTTTTTTTTTT>
##$WBST= 1024
##$WBSW= 4
##$XGAIN= (0..3)
0 0 0 0 
##$XL= 0
##$YL= 0
##$YMAX_a= 3895666
##$YMIN_a= -4049222
##$ZGOPTNS= <>
##$ZL1= 120
##$ZL2= 120
##$ZL3= 120
##$ZL4= 120
##$ABSF1= 222.624
##$ABSF2= -17.3728
##$ABSG= 5
##$ABSL= 3
##$ALPHA= 0
##$AQORDER= 0
##$ASSFAC= 0
##$ASSFACI= 0
##$ASSFACX= 0
##$ASSWID= 0
##$AUNMP= <proc_1d>
##$AZFE= 0.1
##$AZFW= 0.5
##$BCFW= 0
##$BC_mod= 2
##$BYTORDP= 0
##$COROFFS= 0
##$CY= -3
##$DATMOD= 1
##$DC= 0
##$DFILT= <>
##$DTYPP= 0
##$F1P= 0
##$F2P= 0
##$FCOR= 0.5
##$FTSIZE= 32768
##$FT_mod= 6
##$GAMMA= 0
##$GB= 0
##$INTBC= 1
##$INTSCL= 4.134877e-10
##$ISEN= 128
##$LB= 1
##$LEV0= 0
##$LPBIN= 0
##$MAXI= 10000
##$MC2= 0
##$MEAN= 0
##$ME_mod= 0
##$MI= 0.1934396
##$NCOEF= 0
##$NC_proc= -1
##$NLEV= 6
##$NOISF1= 120.0001
##$NOISF2= 80.00006
##$NSP= 0
##$NTH_PI= 0
##$NZP= 0
##$OFFSET= 222.624
##$PC= 1.4
##$PHC0= -382.9358
##$PHC1= 26.00636
##$PH_mod= 1
##$PKNL= yes
##$PPARMOD= 0
##$PSCAL= 0
##$PSIGN= 0
##$REVERSE= no
##$SF= 50.3227315989248
##$SI= 32768
##$SIGF1= 140
##$SIGF2= 120
##$SINO= 11.81781
##$SIOLD= 32768
##$SREGLST= <13C.CDCl3>
##$SSB= 0
##$STSI= 32768
##$STSR= 0
##$SW_p= 12077.2946859903
##$SYMM= 0
##$S_DEV= 0
##$TDeff= 32768
##$TDoff= 0
##$TI= <>
##$TILT= no
##$TM1= 0
##$TM2= 0
##$TOPLEV= 0
##$USERP1= <user>
##$USERP2= <user>
##$USERP3= <user>
##$USERP4= <user>
##$USERP5= <user>
##$WDW= 1
##$XDIM= 32768
##$YMAX_p= 410350085
##$YMIN_p= -3476185
$$ End of Bruker specific parameters
$$ ---------------------------------
##NTUPLES= NMR SPECTRUM
##VAR_NAME=  FREQUENCY,     SPECTRUM/REAL,   SPECTRUM/IMAG
##SYMBOL=    X,             R,               I
##VAR_TYPE=  INDEPENDENT,   DEPENDENT,       DEPENDENT
##VAR_FORM=  AFFN,          ASDF,            ASDF
##VAR_DIM=   32768,         32768,           32768
##UNITS=     HZ,            ARBITRARY UNITS, ARBITRARY UNITS
##FACTOR=    0.368581032318806, 1,           1
##FIRST=     11203.0474431902, 0,            0
##LAST=      -874.247242800138, 0,           0
##MIN=       -874.247242800138, -3476185,    0
##MAX=       11203.0474431902, 410350085,    0
$$ Real data points
##PAGE= N=1
##DATA TABLE= (X++(R..R)), XYDATA
32767b44135k76624j9595o0674l48494O6400J56343J67914J63613J85443O04559
32757C94750L48435J5308k82231j55023j88107k68674j60080j6607l10393J39181
32747d83441K44428j86620j11807o1759L2366K53296L2531M0313J2408l63518
32737e91803l62303k61260k67191N0523L26145J20184J58022R1873l63214j41970
32727a240994M23740N78972O18209M69455k28766l02442k32154p18395q01728
32718a434103J06348Q57137K59228k10222J88804j66935m50801k28892M3255q2673
32708a118854J68878J83678k64924K5179N14441j8190j90921K94143K24968J7753
32698a63849j06654n8600l76126k0044N71378K81252k15358l41754J13293K35071
$$ plain form
32767 -244135 -520759 -540354 -601028 -949522 -883122 -726779 -558865 -395252 -209809 394750
32757 394750 743185 758493 476262 321239 133132 -135542 -295622 -312229 -622622 -483441
32747 -483441 -239013 -425633 -537440 -599199 -566833 -313537 -281006 -240693 -228285 -591803
32737 -591803 -954106 -1215366 -1482557 -1432034 -1105889 -985705 -827683 -735810 -1099024 -1240994
32727 -1240994 -817254 -238282 379927 849382 620616 318174 86020 -632375 -1434103
32718 -1434103 -1327755 -470618 -211390 -421612 -232808 -399743 -850544 -1079436 -1036181 -1118854
32708 -1118854 -949976 -766298 -1031222 -1006043 -491602 -509792 -700713 -406570 -181602 -163849
32698 -163849 -270503 -329103 -705229 -725273 -153895 127357 -88001 -429755 -316462 -81391
32688h1391J66635j48075k41593j04038k22549k80967j27079L63403j05689n11370
32678a292713j06991K31462M63929N21361j48983p6977m1403l48532J28099K42113
32668d28635J18722j1709n68414l60044M80666L06821j039L354q4617n786J88662
32657c62019L12307R3156k72354m60585k07915L420o3600k4502K55615N69483
32647a56994N33145J05570n74351l89502l6591m32661k05172M6606L31490N37266
32637b41194K29491n8450P3888j84599p54408j46664L80136K59195J96936K99129
32627E3460L03589l0115j21058J70193J90010m11866k41523L53510J87141l41964
32617A11377l53533l5046r4634j9756J11205r6133k51505K96071N5216k16671
$$ plain form
32688 -81391 85244 -62831 -304424 -408462 -631011 -911978 -1039057 -675654 -781343 -1292713
32678 -1292713 -1399704 -1168242 -704313 -182952 -331935 -408912 -450315 -798847 -670748 -428635
32668 -428635 -309913 -321622 -890036 -1250080 -769414 -462593 -463632 -460278 -544895 -550681 -362019
32657 -362019 -49712 43444 -228910 -689495 -897410 -893990 -957590 -982092 -726477 -156994
32647 -156994 376151 481721 -92630 -482132 -518723 -951384 -1156556 -1109950 -778460 -241194
32637 -241194 -11703 -70153 3735 -180864 -935272 -1081936 -701800 -442605 -245669 53460
32627 53460 357049 326934 205876 376069 566079 154213 -87310 266200 453341 111377
32617 111377 -242156 -277202 -371836 -391592 -280387 -376520 -628025 -331954 -276738 -493409
32607d93409j17399P09805N93632J5335m80740k21043j37794j33022M2311j60946
32597c83270l47170J65669K20614l67708o20155j13384M59703J41717J84049M9926
32587f10009o10331n16079k98272M18290O57049L78739L97215j15025n7983j31290
32577d87696L7853J26057j91651J40385M25616M0590j42459n38882j39016M44284
32567b84919O7871j17554J30147J88672J41288j15828K06956Q9520J00498r8923
32557C07728l96377n99871j98336M35978J83008J4859q1939r3162m97404o22705
32547a548221l37677L68195M82044N2981m57363k10589J40164J87219M33628K67136
32537f22483J73217P8865P7872K982m61822n56116j09244J74862R4885L26765
$$ plain form
32607 -493409 -610808 98997 692629 707964 227224 6181 -131613 -264635 -222324 -383270
32597 -383270 -730440 -564771 -344157 -711865 -1332020 -1445404 -985701 -843984 -659935 -610009
32587 -610009 -1220340 -1736419 -2034691 -1616401 -959352 -580613 -183398 -298423 -356406 -487696
32577 -487696 -449843 -323786 -515437 -375052 50564 91154 -51305 -590187 -729203 -284919
32567 -284919 -217048 -334602 -204455 -15783 125505 9677 216633 306153 406651 307728
32557 307728 -88649 -688520 -886856 -450878 -267870 -253011 -334950 -428112 -925516 -1548221
32547 -1548221 -1885898 -1517703 -1035659 -982678 -1440041 -1650630 -1510466 -1323247 -889619 -622483
32537 -622483 -449266 -370401 -292529 -289547 -751369 -1307485 -1416729 -1241867 -1146982 -820217
32527h20217N32263n5117j89313K84842J52957L02132L39071m47420j19972N1097
32517C0323J06641K81441j71286k75264k71634m57920l47965J8243K94642j67367
32507i60146j018146m96988K32150j1305k10142J35511M91108N29065R01024L67021
32497d0848J35809K95034l9082l61086l83633K05644M20295o4253K3827J54272
32487C45979K1359J1956p3109J64507J5831L6302o56322n73426K5529k21298L15954
32476e86738N49486L77836Q9417J3129j12906j94686j80793k49648l05449L89008
32466b11344J90152j93398k02889l5036K87188K00054R1425K29030J11907m49044
32456A8045n70745K85375O47144J27895k41696j81590j37472k93037k06604J15959
$$ plain form
32527 -820217 -287954 -343071 -532384 -247542 -94585 207547 546618 99198 -20774 30323
32517 30323 136964 418405 247119 -28145 -299779 -757699 -1105664 -1087421 -792779 -960146
32507 -960146 -1978292 -2475280 -2243130 -2254435 -2464577 -2329066 -1837958 -1308893 -407869 -40848
32497 -40848 94961 389995 350913 -10173 -393806 -188162 232133 167880 191707 345979
32487 345979 367338 379294 306185 470692 486523 522825 -133497 -706923 -681394 -902692 -586738
32476 -586738 -37252 340584 430001 443130 330224 135538 -45255 -294903 -600352 -211344
32466 -211344 -21192 -214590 -417479 -452515 -165327 34727 126152 355182 467089 18045
32456 18045 -552700 -267325 379819 507714 266018 84428 -53044 -346081 -552685 -436726
32446d36726k78810o76981n62198j41554L98131O11104L98160q02017m25762K91530
32436a625123J79065j21604k38977J67130L1932n98717l90338L56049J61391k35895
32426b315087L61816N70655L05894j02894l62647m6816j60681k9130k59675j22577
32416b161142N87957P97316P15602N61169j30095j20069J42728p06259r28235
32407a241028m99117l642M06023R40647P82952l73381m00803j3151M16988O46923
32397F62411L953k54837l3713k24546m17962k67294M6871M56686K3689R8276M96951
32386E90485L47588n52065l98243J70820N7527q0914L53033R1389j80857j18583
32376B80180j21082N7798k37094l32500j38012J20469J84704l40150o12601o9231
$$ plain form
32446 -436726 -715536 -1392517 -1954715 -2096269 -1698138 -1087034 -688874 -1490891 -1916653 -1625123
32436 -1625123 -1446058 -1567662 -1806639 -1639509 -1607577 -2206294 -2596632 -2240583 -2079192 -2315087
32426 -2315087 -1953271 -1382616 -1076722 -1179616 -1542263 -1589079 -1749760 -1778890 -2038565 -2161142
32416 -2161142 -1573185 -775869 -60267 500902 370807 250738 393466 -312793 -1241028
32407 -1241028 -1740145 -1743787 -1337764 -397117 385835 12454 -388349 -401500 15488 662411
32397 662411 666364 411527 377814 153268 -264694 -531988 -485117 -28431 -4742 93534 590485
32386 590485 938073 386008 -12235 158585 216112 135198 488231 579620 398763 280180
32376 280180 159098 216896 -20198 -352698 -490710 -370241 -185537 -525687 -1138288 -1207519
32366a207519L04761L77229j36962l05791L56873J52868k77360J20032M83032
32357a32837L3663k82007k68063m6887K51413k3941J85406K06410k50878m47781
32347g75502O20041K85547l96108J90897L84762K33534K34094k2461n3852q8789
32337F12163j33441l47903L32792J28558n73189j032071k36689L75733O7304k06172
32327a012915r8775K38213k84934k32524L10939N69380M7122j09784j30703O7192
32317f36789M03620L85458k98285k87397l23019l80400k71906K27683M09824K95883
32307d75328N58661J56458K76286M1217n26935l99214O1766K81784J4032M4221
32297C2948k83037r12397m72502j40940k88075j89985l35940r7792J59956M41570
$$ plain form
32366 -1207519 -902758 -525529 -662491 -968282 -611409 -458541 -735901 -615869 -132837
32357 -132837 -99174 -381181 -649244 -696131 -444718 -468659 -283253 -76843 -327721 -775502
32347 -775502 -155461 130086 -266022 -75125 309637 543171 777265 754804 700952 612163
32337 612163 478722 130819 463611 592169 18980 -1013091 -1249780 -874047 -806743 -1012915
32327 -1012915 -1111690 -873477 -1158411 -1390935 -1079996 -510616 -463494 -573278 -703981 -636789
32317 -636789 -233169 152289 -145996 -433393 -756412 -1136812 -1408718 -1181035 -771211 -475328
32307 -475328 83333 239791 516077 557294 30359 -368855 -307089 -25305 -11273 32948
32297 32948 -250089 -1162486 -1634988 -1775928 -2064003 -2253988 -2589928 -2687720 -2527764 -2086194
32287b086194O37082O21715K7001k85776J84886K70473L26248l07808l85574R6516
32277i01431O17457K96336j20590M1023j81788o90961j55556K87359N81889M86203
32267B59941N98086J17541m75206k80227l85759o02235k41677Q0446k1056K25149
32257g24997N72120M53131J08701K42934J50226q4065k83123l5340m507m17273
32247b2193l12595p2377l83325l14417q21823r29387j97119L24184P96507J016242
32237i16303N15350L58121O6040k79300k77083L20618L84497M0473P5511K80597
32227E68521r1187l66997p61198p97266J87186P93334M12236l73391l19828K17938
32217e30652M20013J36903l39285k73497K36194M55981r3645j71509j17874M39314
$$ plain form
32287 -2086194 -1449112 -827397 -800396 -1086172 -901286 -630813 -304565 -612373 -997947 -901431
32277 -901431 -283974 12362 -108228 -67205 -248993 -939954 -1095510 -808151 -226262 259941
32267 259941 858027 975568 500362 220135 -165624 -767859 -1009536 -929090 -950146 -724997
32257 -724997 -152877 300254 408955 651889 802115 718050 434927 399587 395080 -22193
32247 -22193 -334788 -407165 -790490 -1104907 -1926730 -2856117 -3053236 -2729052 -1932545 -916303
32237 -916303 -400953 -42832 23208 -256092 -533175 -212557 171940 212413 287924 568521
32227 568521 477334 110337 -650861 -1448127 -1260941 -467607 -55371 -428762 -748590 -530652
32217 -530652 -110639 26264 -313021 -586518 -350324 105657 12012 -159497 -277371 161943
32207A61943M8725r6708L38305K2809j37137P6531m64209q33733j93909K71461
32197h05922K26210l15105p97899j94275M91324M86530J49332l94377q2P41490
32187d12774K05072j80547k17779k79042k15727J5499m30104N9466N95022M04151
32177d56763p7064n5522j04382K54790N23591K15891j80949n43873n34645k93410
32167a252336M9342L35829N62055k0202p71074q97975k47908K69710L93713o9616
32157a648462p98147r4531M46376J27795R9969K28508J80984M614L43619K54188
32147h55087k74311o90417k9128P26408P96298j26086k14725j88331M1390L2234
32137g81755N11752q9346m66811R4223K5891n2537J35111O20273J92177j94260
$$ plain form
32207 161943 210668 113960 452265 475074 337937 414468 -49741 -883474 -1077383 -805922
32197 -805922 -579712 -894817 -1692716 -1886991 -1395667 -909137 -759805 -1154182 -1154264 -412774
32187 -412774 -207702 -388249 -606028 -885070 -1100797 -1085298 -1515402 -1455936 -860914 -456763
32177 -456763 -533827 -589349 -693731 -438941 84650 300541 119592 -424281 -958926 -1252336
32167 -1252336 -1202994 -867165 -305110 -325312 -1096386 -1994361 -2242269 -1972559 -1578846 -1648462
32157 -1648462 -2446609 -2541140 -2094764 -1966969 -1867000 -1638492 -1457508 -1452894 -1109275 -855087
32147 -855087 -1129398 -1819815 -1848943 -1122535 -326237 -452323 -667048 -855379 -813989 -781755
32137 -781755 -270003 -359349 -826160 -731937 -706046 -758583 -623472 -3199 188978 -5282
32127e282l71671m33845m45435j05156Q6237j69156J3833M03445L21877j05280
32117h10433m09035p0083J91756L16949Q19500J043154O27542j39174m11988q06565
32107C51623j047755l84671p5654p718k3757l65954n41208J29195O04010K15933
32097a145956N67523M31631J76854M72828K38974l49737j46085j62853l66318
32088b83139k92818o55088o47613J0828Q72501J194438Q93281J31040m89637p30273
32078C520K7536l52674o78198M16972J99503M23594O78176M47569L51574K42422
32068A759994n15023j305724j116778k34959K45553K48441M45020M18604L57883
32059C03011K25538J63187m9987k46910J8719L703k9868m93523r24896l37064
$$ plain form
32127 -5282 -376953 -810798 -1256233 -1361389 -1275152 -1444308 -1430475 -1027030 -705153 -810433
32117 -810433 -1219468 -1289551 -1097795 -780846 38654 1081808 1709350 1570176 1158188 351623
32107 351623 -696132 -1080803 -1156457 -1164175 -1187932 -1553886 -2095094 -1965899 -1361889 -1145956
32097 -1145956 -578433 -146802 30052 502880 741854 392117 246032 83179 -283139
32088 -283139 -575957 -1231045 -1878658 -1867830 -995329 199109 1092390 1223430 733793 3520
32078 3520 31056 -321618 -999816 -582844 -383341 40253 718429 1165998 1517572 1759994
32068 1759994 1244971 -60753 -1177531 -1412490 -1166937 -918496 -473476 -54872 303011
32059 303011 528549 691736 641749 394839 413558 417261 387393 -106130 -1031026 -1368090
32049a368090N74185O30948N30174Q18244L7677r73783o44664l93169m30912q5800
32039a305190K35813m542K87190N42927j09341o87585l91947l50733m95177Q4425
32029b194160J80273q796O00641J10712p1776P31812N79268K78237K63864L00083
32019G70158r1538l93529j054165m98567L39873L92678J93116j10924L265J99394
32009b50239l00552Q8027Q25083O87711J96005m31126q4819j85147r788L16832
31999H51987j38253n26025q3244m93268r41197K29998K07054l01085j53155m2522
31989a389710R8092L58918L67555L53808Q8502k37902n61917p94596j29698M89800
31979a357148N63556Q5139m30681k05589j01935m26990m41344n7809N0924N6132
$$ plain form
32049 -1368090 -793905 -162957 367217 1185461 1223138 249355 -395309 -788478 -1219390 -1305190
32039 -1305190 -1069377 -1073919 -786729 -243802 -353143 -1040728 -1432675 -1783408 -2278585 -2194160
32029 -2194160 -2013887 -2022683 -1422042 -1311330 -1383106 -651294 -72026 206211 470075 770158
32019 770158 678620 285091 -769074 -1267641 -927768 -535090 -341974 -452898 -449633 -250239
32009 -250239 -550791 -462764 362319 1050030 1246035 814909 730090 544943 535155 851987
31999 851987 713734 187709 104465 -388803 -1330000 -1100002 -892948 -1194033 -1347188 -1389710
31989 -1389710 -1291618 -932700 -565145 -211337 -122835 -360737 -922654 -1717250 -1846948 -1357148
31979 -1357148 -793592 -708453 -1139134 -1344723 -1446658 -1873648 -2314992 -2372801 -2321877 -2265745
31969b265745P41916P58722o9724k74930j83235K69883L19354K10312M55737K31643
31959A93933P4602K919j2433l98343n51202j28895k9348N03281O14247j25456
31949A43305R1583l33607p56757k76361J72863M32954K90762L00146L37826L51767
31939G54481J67099m92963l74203n17047L6229O11196L23571m76166q86358m85014
31929a339175K23920O46208J70915l24309K06595J09649r5553K31485M41552P69135
31919A040422M5308k77642k49508j47434J69799N36067k16737n02972K01503L49706
31909I48512o5504l48589m0644K00972m54116m06646p22567o16356j27904M8730
31899a584112L69828P63236O02788J50079K1117j21331j88236L70824M73310m64732
$$ plain form
31969 -2265745 -1523829 -765107 -834831 -1109761 -1292996 -1023113 -703759 -493447 -37710 193933
31959 193933 268535 271454 259021 -139322 -690524 -819419 -848767 -345486 268761 143305
31949 143305 234888 -98719 -855476 -1131837 -958974 -526020 -235258 64888 402714 754481
31939 754481 921580 428617 54414 -462633 -426404 184792 508363 32197 -854161 -1339175
31929 -1339175 -1115255 -469047 -298132 -622441 -415846 -306197 -401750 -170265 271287 1040422
31919 1040422 1085730 808088 558580 411146 580945 1117012 900275 397303 598806 948512
31909 948512 883008 534419 493775 694747 240631 -166015 -888582 -1504938 -1632842 -1584112
31899 -1584112 -1214284 -451048 151740 301819 322936 201605 13369 384193 857503 392771
31889C92771n46303j98410K34281J71729p4103P49360L43375r9855r6490l52252
31879E24103l62857K39962J45839k55533l46109j93450J5525j5002l34898k549
31869e84969k44127k86242M05857M19422P52552P40096l7379q93413q50901n98599
31859a177703m72185K11847M25385K26195P89911M62847L55655J11461l16304
31850F17109k6004J9328l85560j45499R9211K79320K77041L53548M88529N2363
31840A629386n06658n69186o39903j42257J48111j80942o15540k3442N50286K00535
31830a49610j2556l61144j72156L17852O89405L65462K1640l68377o50207k9212
31820c48903L62187k98851p88393L05370P72740j27762l26279j61380L3863P03479
$$ plain form
31889 392771 -153532 -351942 -117661 54068 -20035 729325 1072700 972845 876355 524103
31879 524103 161246 401208 547047 291514 -54595 -248045 -232520 -247522 -582420 -584969
31869 -584969 -829096 -1115338 -709481 -290059 462493 1202589 1165210 271797 -579104 -1177703
31859 -1177703 -1649888 -1438041 -1012656 -786461 3450 466297 821952 933413 617109
31850 617109 591105 610433 224873 79374 178585 457905 734946 1088494 1577023 1629386
31840 1629386 1122728 553542 -86361 -228618 -80507 -261449 -876989 -900431 -350145 -149610
31830 -149610 -162166 -523310 -695466 -377614 311791 677253 698893 330516 -319691 -348903
31820 -348903 13284 -285567 -1073960 -768590 4150 -123612 -449891 -611271 -577408 126071
31810A26071J97906p46478m19663K72213Q66808K75047o37832l92569j87313J75009
31800d70801Q43845N51185k54781k29959k59287j18325r4479m15489K01744O67599
31790D21252K94775m51083n99519p3897L76383L40129O5000r9709j37447l12954
31780a77070k93437M7146K63022O26522K0153q46283l81600J71557L30065Q25463
31770E85538K8127r55622j59482N26104j5550o06753k14486L35945N37024L58370
31760D19215K12789P21110M80078l51575l37488O0918P8095k53834p349o6377
31750I55582k06742o23430j45076P07106L96300j97751n96165p9268n9488l98392
31740b47324o21659K94272P74600L71516j1142J25357j20815J8168J7977k96441
$$ plain form
31810 126071 323977 -422501 -842164 -569951 296857 571904 -65928 -458497 -645810 -470801
31800 -470801 373044 924229 669448 439489 180202 61877 -32602 -448091 -246347 421252
31790 421252 716027 264944 -334575 -408472 -32089 308040 373040 273331 135884 -177070
31780 -177070 -470507 -423361 -160339 466183 486336 -359947 -741547 -569990 -239925 585538
31770 585538 613665 -341957 -501439 24665 9115 -597638 -812124 -476179 60845 419215
31760 419215 632004 1353114 1833192 1481617 1144129 1205047 1283142 1029308 1021959 955582
31750 955582 748840 125410 -19666 687440 1083740 885989 289824 210556 151068 -247324
31740 -247324 -868983 -574711 199889 571405 560263 685620 564805 582973 600950 304509
31730C04509J50986N68762l74533r13162r27335k96028m3899p1263J31881J18454
31720a351628K06741K52057J23833R16776J277693M62753J36708m73269p95119
31711G56545p54729n20918J00384Q43180O79989L53444m96987p72859o50171l66950
31701h29072M47642J009486j03905j124820m34749L83818m10676J63816N80645
31692c17815L6390K26271M41306J99967k13716k44029m69700o90396p3824K15033
31682h90513L59531L27137L27727N07316P68061M2866j22234l2814j73899j48146
31672I65032m87266l02727M8260m49614q33590m2005K12101L07186K44306k4198
31662c62515J43735J05492o71560j11917R8907l60857k86870n58670k32842K90740
$$ plain form
31730 304509 455495 1024257 649724 -263438 -1190773 -1486801 -1530700 -1601963 -1470082 -1351628
31720 -1351628 -1144887 -892830 -768997 147779 1425472 1888225 2024933 1551664 756545
31711 756545 1816 -519102 -418718 424462 1104451 1457895 960908 188049 -462122 -829072
31701 -829072 -381430 628056 524151 -600669 -1035418 -651600 -1062276 -898460 -317815
31692 -317815 -281425 -55154 386152 586119 372403 128374 -341326 -1031722 -1105546 -890513
31682 -890513 -530982 -203845 123882 631198 1399259 1442125 1319891 1287077 1113178 965032
31672 965032 477766 175039 223299 -226315 -1059905 -1101910 -889809 -582623 -338317 -362515
31662 -362515 -218780 -113288 -784848 -896765 -797858 -1158715 -1445585 -2004255 -2237097 -1946357
31652a946357K70911L64657L45857N75292N93340k6582m59086r170j38562M30657
31642I57P19347M67659k31553n60298o18357m78437p29466j91799P03494m5233
31632i63686k73121N2566N74851j692q0603M71105Q31334J75921l21080j45030
31622C20565L99317j20043j114389q53811J3982K0795M11006K04341R9785j82474
31612h00926J68419O44772q6055n10820L1632P88351N93061k32255r39629m52204
31602g95654J3295P85318M92039p7513J01955P9105j48120K59963O49377K52398
31592A612163q33999o79874O52879N57921j38026m13372k8501K36394j23607j22148
31582G19830L42178K33489K87430k26715j066181r8650K40451o59558q67383m53641
$$ plain form
31652 -1946357 -1675446 -1310789 -964932 -389640 203700 177118 -281968 -291138 -429700 957
31642 957 720304 1187963 956410 396112 -222245 -700682 -1430148 -1621947 -918453 -963686
31632 -963686 -1236807 -1184241 -609390 -611082 -691685 -220580 610754 786675 465595 320565
31622 320565 719882 599839 -514550 -1368361 -1354379 -1333584 -922578 -718237 -618452 -800926
31612 -800926 -632507 12265 -73790 -584610 -552978 235373 828434 596179 -343450 -795654
31602 -795654 -782359 2959 494998 417485 519440 598545 450425 710388 1359765 1612163
31592 1612163 778164 98290 751169 1309090 1171064 757692 729191 965585 841978 719830
31582 719830 1062008 1295497 1582927 1356212 290031 191381 431832 -227726 -1095109 -1548750
31572a548750M44528L27437n75469o92549j63278M56921N53982L69344k2894Q8905
31562g61823K53462o6492k41735K98197K29541l69208k92181j11485k09948L86526
31552h85146O14196K37270N92322k71931l24471K9771o6226N5185Q875k86705
31542b96860J42486K81736J93260J3165K95751L65034m17136p96503l7967K46308
31532a0726K13523k48325k11229N39433j55986l15528J53185n7723k19338l36991
31522f49705J94494J91737L04708M30130l98389J50687R15754M45244m77970o25673
31512D81017k48501m69893m68538p0727M40378K31129M10437L39536k25660r36533
31502e17355n31045O78509M40624K49227L98632K11833j41728j53361l69791n92650
$$ plain form
31572 -1548750 -1104222 -776785 -1352254 -2044803 -2208081 -1751160 -1197178 -827834 -850728 -761823
31562 -761823 -508361 -574853 -816588 -518391 -288850 -658058 -950239 -1061724 -1271672 -885146
31552 -885146 -270950 -33680 558642 286711 -37760 -7989 -74215 -19030 -10155 -296860
31542 -296860 -154374 127362 320622 333787 629538 994572 577436 -219067 -257034 -10726
31532 -10726 202797 -45528 -256757 282676 126690 -188838 -35653 -93376 -312714 -649705
31522 -649705 -455211 -263474 41234 471364 72975 223662 1139416 1584660 1106690 481017
31512 481017 232516 -237377 -705915 -776642 -336264 -105135 305302 644838 419178 -517355
31502 -517355 -1048400 -369891 70733 319960 718592 930425 788697 635336 265545 -327105
31492c27105k31379L25326p1237l11420K27284M01110k59238l49572j56900N57849
31482a95282M49039O46521M54016N75311J46512n55811o06994p83688R680Q10420
31472I49724M28552M5757N0566l03472p76519n81324l95092j19660J08245J74805
31462d18418J0671m24720o84369K04801Q89848j01809l28169j67551M48918J000763
31452D29965K90321J7834k86857l43210k42755p35424n89085k32927K34721M45905
31442a011512N47921R31512O92965L28926j53016k35539k72422J85070l67218
31433F46687m73352L05763K4248N685l0201M20143N33442m15116n37587k84151
31423A95561j10767k3298K24900q0627n36647n41185K20768p7704j98293K98235
$$ plain form
31492 -327105 -558484 -233158 -304395 -615815 -388531 12579 -246659 -596231 -753131 -195282
31482 -195282 253757 900278 1354294 1929605 2076117 1520306 913312 129624 139304 949724
31472 949724 1378276 1424033 1474599 1171127 394608 -186716 -581808 -701468 -593223 -418418
31462 -418418 -407747 -832467 -1516836 -1312035 -422187 -523996 -852165 -1019716 -570798 429965
31452 429965 720286 738120 451263 108053 -134702 -870126 -1459211 -1692138 -1457417 -1011512
31442 -1011512 -463591 467921 1160886 1489812 1336796 1101257 828835 1013905 646687
31433 646687 173335 479098 503346 509031 478830 898973 1432415 1017299 479712 195561
31423 195561 84794 61496 286396 205769 -330878 -872063 -651295 -728999 -927292 -629057
31413f29057M20913K40357k71109l53134j69207k86892K76252P90169M61475l239
31403D76528l65195q5892O49868M90171k00393o09139m12844m84045p61044j59126
31393a461111J03801M93375M33935l665K50904O28981L82315m0060l535r2686
31383F92254o11913n82653k84100j32233J06709M20142q2741k45233j5298J94998
31373e40068K78979j97312o19663j133914o28925N12998P08978P30810O61854
31364b26263M85602N54742L00211m25236R4627K33798o29916m34571N88269K75088
31354H16351j63733n11049P0980M27024K31556k38280m04357l63820q2277j45199
31344c62804p2149N2139J53829j28896n35322Q36741P73416J19644L3194n90991
$$ plain form
31413 -629057 -208144 32213 -238896 -592030 -761237 -1048129 -771877 18292 479767 476528
31403 476528 111333 25441 675309 1165480 965087 355948 -56896 -540941 -1301985 -1461111
31393 -1461111 -1357310 -863935 -430000 -433665 -182761 446220 828535 788475 784940 692254
31383 692254 80341 -502312 -786412 -918645 -811936 -391794 -474535 -719768 -735066 -540068
31373 -540068 -261089 -458401 -1078064 -2211978 -2840903 -2327905 -1618927 -888117 -226263
31364 -226263 259339 814081 1114292 689056 783683 1017481 387565 -47006 541263 816351
31354 816351 652618 141569 212549 639573 871129 632849 228492 -135328 -217605 -362804
31344 -362804 -434953 -382814 -228985 -357881 -893203 -56462 716954 836598 869792 278801
31334B78801o63317K43018M02005k45998m21431k70935l91830k05340k44331J73557
31324a345801M01141Q6416k74641k65005m18798M2088L47237K99645L08088l93190
31314a212820j62389J92066k71404k6917M48444M65243L45378J35819K84846N0029
31304B48295m78375l23945P5551p8168n34843k19538Q48347J146138M83860J09122
31294A276444j11703k29274n36887k91642K79614N44249K01318j40093P4510p5058
31284I91478j28384J68267j23141l80860j94592k73979j1835k72578l29478M19
31274e54683j4863O6128R5468K39197L92113M34714J70851N7344R5169k91210
31264F90228j63969r787k35448k53423l60626k26340K52339l93243k10849P54067
$$ plain form
31334 278801 -384516 -141498 260507 14509 -406922 -677857 -1069687 -1275027 -1519358 -1345801
31324 -1345801 -944660 -858244 -1132885 -1397890 -1816688 -1774600 -1427363 -1127718 -819630 -1212820
31314 -1212820 -1375209 -1183143 -1454547 -1481464 -1033020 -567777 -222399 -86580 198266 248295
31304 248295 -230080 -554025 -478474 -556642 -1091485 -1311023 -462676 683462 1167322 1276444
31294 1276444 1164741 935467 398580 106938 386552 930801 1132119 992026 1066536 991478
31284 991478 863094 1031361 908220 527360 332768 58789 46954 -225624 -555102 -554683
31274 -554683 -569546 -503418 -407950 -168753 223360 658074 828925 886269 981438 690228
31264 690228 526259 516472 281024 27601 -333025 -559365 -307026 -700269 -911118 -157051
31254a57051L94959M90086P03107k36023j37361j53990j58223l63250K57280R5235
31244G34769p1532K84387l45812j87852K85329O40389l0963m76987o42374r15745
31234g26391n47419l2694M83870L9836l44160J26136L45072J08236K54677N59669
31224B66832n8374n52848o4946M3075l52946j6636K08589J89424K89215O5063
31214A6448K09178K12364L5205j46663K61604N11508n90189j094559l24257k38671
31204a148032J81362Q53833j49339n43107l39567J66858N61961N15730M58736
31195E58435o90128o68936j05071K68388L18387J61441J56708n5089J71144K0704
31185A35983L06122K36168j5669l69766p64427n83756n0612L69023N42795K81951
$$ plain form
31254 -157051 237908 727994 1431101 1195078 1057717 903727 745504 382254 639534 734769
31244 734769 663237 947624 601812 413960 699289 1339678 1308715 831728 189354 -726391
31234 -726391 -1273810 -1306504 -822634 -782798 -1126958 -1000822 -655750 -547514 -292837 266832
31224 266832 208458 -344390 -409336 -366261 -719207 -735843 -527254 -337830 -48615 16448
31214 16448 225626 437990 473195 326532 588136 1099644 509455 -585104 -909361 -1148032
31204 -1148032 -966670 -112837 -262176 -805283 -1144850 -977992 -416031 99699 558435
31195 558435 -131693 -800629 -905700 -637312 -318925 -157484 -776 -55865 115279 135983
31185 135983 442105 678273 662604 292838 -471589 -1055345 -1105957 -736934 -194139 87812
31175H7812k78719Q238N77899j3314m04571j09113L9224L01219J63875p39531
31165c66981o78722K59279J97851l31928n1469p5477n14903j01066O48851L56576
31155f57989Q9300l48326L38115P33418N22934N5059o07044l27460j6306J18264
31145a00035l59652k70574j54541O1036N57535O22054N47515n37728k41255K69089
31135C93444K22387P6094K3246p02198n14983K14946l8001Q187J24906k34772
31125d26744m35145n93N84541P62978j20509k95882j24278J9901j18935n19589
31115f74255l70335P59978L61389m01629J0383M49816P7626Q7907K93497l67270
31105B27107o32155j07010n17918o20865L2950L86501J81528N30871O39990L83239
$$ plain form
31175 87812 -190907 -182669 395230 381916 -22655 -131768 -92544 208675 372550 -366981
31165 -366981 -1045703 -786424 -588573 -920501 -971970 -1047447 -1562350 -1663416 -1014565 -657989
31155 -657989 -568689 -917015 -578900 154518 677452 732511 125467 -201993 -218299 -100035
31145 -100035 -459687 -730261 -884802 -823766 -266231 355823 903338 365610 124355 393444
31135 393444 615831 691925 715171 12973 -502010 -287064 -325065 -316878 -191972 -426744
31125 -426744 -861889 -862482 -277941 485037 364528 68646 -55632 -35731 -154666 -674255
31115 -674255 -1044590 -284612 76777 -324852 -314469 135347 212973 300880 594377 227107
31105 227107 -405048 -512058 -1029976 -1650841 -1617891 -1231390 -1049862 -518991 120999 504238
31095E04238N16203J42842m48090K31519L74330k38617k8611K71052k65223j0551
31085A049092j12161n61238m99038N27147M32024p72068j013308J60030M23338
31076c66182J72028K64787k59631k09932L42978j61789j50748L08044J51320K31811
31066C22686l80203q01901l08075K14392P20406N59364M49780K85190K09810r2282
31056A179167m79691N0192q10748n18117K46985K83805J57002n7508n6984m40630
31046d46527k414N83990N28777N34782N14463l44018r27852q34442k52588L42685
31036c03144O25086l65107r28207l30591j94167j29889k24181N22227N20188J28106
31026f79679K59063O47281N17862P80649O72173k3373n5758n52751j020801m09546
$$ plain form
31095 504238 1020441 1163283 715193 946712 1321042 1082425 1053814 1324866 1059643 1049092
31085 1049092 936931 375693 -123345 403802 835826 63758 -949550 -789520 -366182
31076 -366182 -194154 70633 -188998 -398930 -55952 -217741 -368489 -60445 90875 322686
31066 322686 -57517 -859418 -1167493 -953101 -232695 326669 776449 1061639 1271449 1179167
31056 1179167 699476 749668 -61080 -579197 -332212 -48407 108595 51087 -5897 -446527
31046 -446527 -448941 135049 663826 1198608 1713071 1369053 441201 -393241 -645829 -303144
31036 -303144 321942 -43165 -971372 -1301963 -1496130 -1626019 -1850200 -1327973 -807785 -679679
31026 -679679 -420616 226665 744527 1525176 2197349 2173976 2118218 1565467 544666 135120
31016A35120l26166p73303m2063R29152Q98526N2914l09333o68701o17898o5010
31006g86762N10901O77048k18726l69756k62782J91811K38283k013p19724p67919
30996a509639j29315L75438J27957L51805M91005K2244j07895l25247m8275K08868
30986e43054J09388K62633M32420K64040j63851J49448J05216q6598O1497J84660
30976G75799j46499o52026J99664N44766l00357j6766N17339N22472M9681L0140
30966A524213l27439j186704n46188O74113N97153j49125l59353J85933j60465
30957B52138k58627k85469p02861j91137L32286N31653M76568O21422L56985m10548
30947G22410o47216k79259k68865n04163L51821P08142L65940M37002M14950j20056
$$ plain form
31016 135120 -191046 -964349 -1006412 -77260 821266 874180 564847 -103854 -721752 -786762
31006 -786762 -275861 401187 182461 -187295 -450077 -258266 -19983 -21996 -741720 -1509639
30996 -1509639 -1638954 -1263516 -1135559 -783754 -292749 -270505 -378400 -703647 -751922 -543054
30986 -543054 -433666 -171033 261387 525427 361576 511024 616240 529642 591139 775799
30976 775799 629300 -22726 176938 721704 421347 404581 921920 1444392 1494073 1524213
30966 1524213 1196774 10070 -536118 137995 735148 586023 226670 412603 252138
30957 252138 -6489 -291958 -994819 -1185956 -853670 -322017 154551 775973 1132958 722410
30947 722410 75194 -204065 -472930 -977093 -625272 82870 448810 885812 1300762 1180706
30937A180706P031k30485L47828M47762o36666q02577k26690J51908m706L01175
30927E35286M6422L51693L76993l47462p26116p91681O0862M74030K68099l16574
30917f8448o76593o51446j15638K95263K00320l21745k96312J56325o28588k19724
30907b326586P51645N77612K55934n3679L19597O44168L5721k79968l1909Q88972
30897G81507N71498m02556j37730R287j38371l22948K88476K81310k54692j79023
30887D96758K97108j07241q5575L55531O76821J24554l39978q11916j298820o24825
30877a317583j48980M51609K21994K27048M44145M22039j64276l92810j04237
30868c61051k30839o51171m08618L3347L10364K77392L63921M44776N50639P76533
$$ plain form
30937 1180706 1187737 957252 1305080 1752842 1116176 313599 86909 238817 234111 535286
30927 535286 581708 933401 1310394 962932 236816 -554865 -494003 -19973 248126 -68448
30917 -68448 -745041 -1396487 -1512125 -1216862 -1016542 -1338287 -1634599 -1478274 -2106862 -2326586
30907 -2326586 -1574941 -997329 -741395 -795074 -475477 168691 204412 -75556 -107465 781507
30897 781507 1353005 950449 812719 822006 683635 360687 649163 930473 675781 496758
30887 496758 793866 686625 601050 956581 1633402 1757956 1417978 606062 -692758 -1317583
30877 -1317583 -1466563 -1014954 -792960 -565912 -121767 300272 135996 -256814 -361051
30868 -361051 -591890 -1243061 -1651679 -1618332 -1307968 -1030576 -666655 -221879 328760 1105293
30858A105293O15455n10717j244184p10193j2493O28895Q35604R714p12847q46438
30848h41911r4116P7130l44845J11147P74105L87084N1324J24275J05685k15306
30838A34572L44193J026996K83362L9817L88588k05569j065664o76856j2931K3897
30828B80405P9135j29820R098P377l08843k79732l789k47706l5403k79635K15361
30817f93552q41262j341748j00347N77487N28942K6232J03035j32009J71718K00429
30807a501075J19439R43783Q87952j45205K19022K37446m29062k66085J39283
30798B05498L87529o9607k18208K54396J99232j80072l72064l54363n58221m6039
30788g51919j68010n1960N57659M19534M14606Q579K10997L97178l74596m79190
$$ plain form
30858 1105293 1720748 1210031 -34153 -744346 -756839 -127944 707660 717374 4527 -841911
30848 -841911 -936027 -858897 -1203742 -1092595 -318490 68594 119918 244193 349878 134572
30838 134572 478765 1505761 1789123 1828940 2217528 2011959 946295 269439 256508 280405
30828 280405 359540 229720 238818 246195 -62648 -342380 -346169 -593875 -629278 -908913 -693552
30817 -693552 -1534814 -2876562 -2976909 -2399422 -1870480 -1844248 -1741213 -1873222 -1701504 -1501075
30807 -1501075 -1381636 -437853 450099 304894 523916 761362 332300 66215 205498
30798 205498 593027 523420 305212 559608 758840 578768 206704 -147659 -705880 -751919
30788 -751919 -919929 -971889 -414230 5304 419910 428489 639486 1036664 662068 182878
30778A82878L22706J36997L35096o0025p66717o63063k82906m95897j68446M98700
30768i60677M21234L34153J50398L57413O4602j46476K14697J5744k89487j6525
30758A45076L70057j36728m38367M31254N98955M45172K29938N0330o51130j193924
30748a49367n74085j52210J51940N72807M01971j55272k23093N76484L62193r3288
30738G18080n47193l74742j44549p197N87568L95166n07526k57729j58089R3326
30728b02885N12367j69870n2891J71887k00464r46858n92441M24419Q06352J123842
30718H73458L27654j90642j12183j33607K77782k23987n66973m35963n09188j82578
30708h76227K34582K97589K87929L66483K40749j80649k86524j46017l48487l59768
$$ plain form
30778 182878 505584 642581 977677 917652 150935 -512128 -795034 -1290931 -1459377 -960677
30768 -960677 -539443 -205290 -54892 302521 367123 220647 435344 451088 161601 145076
30758 145076 515133 378405 -59962 371292 970247 1415419 1645357 1695687 1044557 -149367
30748 -149367 -723452 -875662 -723722 -150915 251056 95784 -127309 449175 811368 718080
30738 718080 170887 -203855 -348404 -355601 231967 627133 119607 -138122 -296211 -202885
30728 -202885 309482 139612 86721 258608 58144 -888714 -1481155 -1056736 -250384 873458
30718 873458 1201112 1010470 898287 764680 1042462 818475 251502 -184461 -693649 -876227
30708 -876227 -641645 -344056 -56127 310356 551105 370456 83932 -62085 -410572 -770340
30698g70340l83175j35449J27283M11881Q72709J61816j77271Q6630L66515j7982
30688E42617l46732P1493k40142k717M52679l49651j11150P5225K67300K74543
30678F33465n22748n01360k10205n262j87076P3326n46126o17047j50724l36227
30668b369984K40494M66055P18650J149965L04774r6218K57365K54855K1807J50952
30658A098715j39956J14585N51230J7070j089374p72398L50949M09203p3879k6979
30648D39166M5466K1113J51402K45716K17621J363j72387R5656j23320n75917
30638C45879p07959n18140M6649M55168J10881L27759K74848n47718q33515j71948
30628a218096M74005K88149L76222j97897l59132K35563R169K64529J11433L0457
$$ plain form
30698 -770340 -1153515 -1288964 -1161681 -749800 122909 284725 107454 194084 560599 542617
30688 542617 195885 267378 27236 24519 477198 127547 16397 91622 358922 633465
30678 633465 110717 -390643 -600848 -606110 -793186 -719860 -1265986 -1883033 -2033757 -2369984
30668 -2369984 -2129490 -1663435 -944785 205180 509954 413736 671101 925956 947763 1098715
30658 1098715 958759 1073344 1624574 1641644 552270 -220128 130821 540024 466145 439166
30648 439166 484632 505745 657147 902863 1120484 1121847 949460 1045116 921796 345879
30638 345879 -362080 -880220 -833571 -378403 -267522 60237 335085 -212633 -1046148 -1218096
30628 -1218096 -744091 -455942 -79720 -277617 -636749 -401186 -392017 -127488 -16055 14402
30618A4402K80218P3406j28014k2427j46896n47595n38875l42893K18329N19934
30608f20411P56077Q862j41469J99265M35952q7428R6731k34396m57159m97213
30598e41189r86602j44853P36368O02950J30768K4954R59166Q44332o1998l7750
30588A526146j01004n83824n09240j74154l66108P3467Q90097J89868p65200m96785
30578c16737Q0958J40926q8448N12844M05021m46757n56483K084O8506L72921
30568A74835K01860j53975K39848L48441J1013j96903L33563M31249K65731k24230
30558A431432m02617K89661N97226M34537j25101K59224M45958r8029m79302r36937
30548A416052k54609K91092L63697l85366q68177k21705p086J31845L74765M09721
$$ plain form
30618 14402 294620 368026 240012 217585 70689 -476906 -1015781 -1358674 -1140345 -620411
30608 -620411 135666 144528 3059 202324 638276 550848 647579 413183 -43976 -541189
30598 -541189 -1527791 -1672644 -936276 -333326 -202558 -177604 781562 1625894 1563896 1526146
30588 1526146 1425142 841318 332078 157924 -208184 -134717 755380 945248 180048 -316737
30578 -316737 -235779 -94853 -183301 329543 734564 287807 -268676 -266592 -198086 174835
30568 174835 376695 222720 462568 811009 822022 625119 958682 1389931 1655662 1431432
30558 1431432 1028815 1318476 1915702 2350239 2225138 2484362 2930320 2832291 2352989 1416052
30548 1416052 1161443 1452535 1816232 1430866 562689 340984 333898 465743 840508 1250229
30538A250229M85516K92843K41592J21371l66791n22781l98632o58008m47217
30529a878K43956K37836M47681J73250N26187O24022j80280q74396n01505J59534
30519H54407k9229j87273m87230l93494o6322K07907M31479R63232P88310N77252
30509B659039K97175L59681L07250L65724L59352L62412O38494M50290M04029
30500F203446K19246J08890j27149l86860m12394m8052M19982r0423j150403p99947
30490C936336l7782J24490o21427k28190J04149J32053K86768L06931K29576l03186
30480C929718n03081j94564M04322J51460N5089L22874P6356k45161j9420K00322
30470D177915R01908Q40303K20724J774M24350R66149J413421K497974K859590
$$ plain form
30538 1250229 1735745 2028588 2270180 2391551 2024760 1501979 1103347 445339 -1878
30529 -1878 242078 479914 927595 1100845 1627032 2251054 2070774 1196378 694873 854407
30519 854407 825178 637905 150675 -242819 -309141 -101234 330245 1293477 2081787 2659039
30509 2659039 2956214 3315895 3623145 3988869 4348221 4710633 5349127 5799417 6203446
30500 6203446 6422692 6531582 6404433 6017573 5605179 5557127 5977109 5886686 4736283 3936336
30490 3936336 3898554 4023044 3401617 3173427 3277576 3409629 3696397 4003328 4232904 3929718
30480 3929718 3426637 3232073 3636395 3787855 3842944 4165818 4242174 3997013 3977593 4177915
30470 4177915 5079823 5920126 6140850 6142624 6566974 7533123 8946544 11444518 14304108
30461A4304108L236975M174800N674799P814488J0626056J4476402J8567003K4209904
30453A03084535K8176258L3371334L8364080L7651749M1591112L6605488L4572270
30446C53416826L0325618J3861658J1589431o023878j2716047j9133657l2762494
30439C38557457l1479365l9134509l6799407l4698446l4145788k8364842k5909026
30432A08026074k0223434j5624944j3002772j0370906q404198o506638n370417
30425B8522765m002850k875058j999389j925935j931817j581953o83961m42589
30417A3079213l69950p55271j313065j509492j173348m43121q427n68713n49537
30408F388289m84987n78524J53860j30639n90746k84287m19772o19804R186L30499
$$ plain form
30461 14304108 17541083 21715883 27390682 35205170 45831226 60307628 78874631 103084535
30453 103084535 131260793 164632127 202996207 240647956 282239068 318844556 353416826
30446 353416826 383742444 397604102 409193533 403169655 390453608 371319951 338557457
30439 338557457 307078092 267943583 231144176 196445730 162299942 133935100 108026074
30432 108026074 87802640 72177696 59174924 48804018 40399820 33893182 28522765
30425 28522765 24519915 21644857 19645468 17719533 15787716 14205763 13521802 13079213
30417 13079213 12709263 11953992 10640927 9131435 7958087 7514966 7506539 6937826 6388289
30408 6388289 5903302 5324778 5478638 5347999 4757253 4472966 4053194 3433390 3442576 3773075
30398C773075M64433L44763P67447Q98766L77353k9531j019496l06958M25023
30389E694875L09693j03738P4276m12212r22767o94100l65017K69274L27519k52068
30379C925735n61108r06980n53262j58130j08265p8424j9784O8071j44328l74409
30369A089116K48798M06680n9473n64282q6484L7161l31497r31149p06304M62835
30359d34599j3430o28936k31841M99289M99957L05137O27287J37545j38703m61820
30349A59886q23773r39830k3708K74414Q42993M99747J8893M57774M81795Q24272
30339A772463L50488n64290j23607K72714j81403q51215o70763j92872o10626
30330g99111l53061N27158K32409L09404J067931O70888K04248R3911n15127n95440
$$ plain form
30398 3773075 4237508 4582271 5349718 6248484 6625837 6596306 5576810 5269852 5694875
30389 5694875 6004568 5900830 5975106 5562894 4640127 3946027 3581010 3850284 4177803 3925735
30379 3925735 3364627 2457647 1904385 1746255 1637990 1559566 1539782 1607853 1463525 1089116
30369 1089116 1337914 1744594 1685121 1120839 1034355 1071516 740019 -191130 -897434 -434599
30359 -434599 -448029 -1076965 -1308806 -809517 -309560 -4423 622864 760409 621706 159886
30349 159886 -663887 -1603717 -1627425 -1353011 -510018 -10271 8622 466396 948191 1772463
30339 1772463 2122951 1558661 1435054 1707768 1526365 675150 4387 -188485 -799111
30330 -799111 -1152172 -625014 -392605 -83201 984730 1655618 1859866 1953777 1438650 843210
30320H43210q3986l09718m10462J72033M88549J1008k11195l0203j91301K9483
30310C07418p95226m32071M35016J86612K86006J66216l5444k87933m03557j04787
30300f77750J090120P78870R9412J24822j23979J47246N19373j26856L69662L63045
30290B563965o78543j263870o00851M80484O82344K67911l72321n36446K52637
30281G95310n6310k91592n21073n30894K93754P8969k85856N34042N30363K83659
30271H30372J6537K8273R1592j26850p135K28888j2342l60306k99355J49527L57791
30260H96992j23194m28399J08567L57860J31584o23099n53404j83108J58422M64859
30250B07080N40784J64739l00417l66661M12822L66397k58340m33824l75561k92507
$$ plain form
30320 843210 759224 449506 39044 211077 699626 710634 499439 469236 277935 307418
30310 307418 -487808 -919879 -484863 -298251 -12245 153971 118527 -169406 -572963 -677750
30300 -677750 412370 1191240 1290652 1415474 1291495 1438741 1958114 1831258 2200920 2563965
30290 2563965 1885422 621552 20701 501185 1183529 1451440 1079119 542673 795310
30281 795310 739000 447408 -73665 -604559 -310805 -231836 -517692 16350 546713 830372
30271 830372 846909 875182 966774 839924 832789 1061677 1049335 689029 389674 539201 896992
30260 896992 773798 345399 453966 811826 943410 320311 -233093 -416201 -257779 207080
30250 207080 747864 912603 612186 245525 658347 1024744 766404 332580 -42981 -335488
30240c35488j64027L24428L28902K99942L04500m20789m71317R7772M58149J007850
30230A429922Q14699k41883k97126m60708n83952k13565L20421j4839p04266r10396
30220h61693o92262J17334J65368j2865k70220K33077M74032L19152j44612n57195
30210a229884j3995K28902K19778k23403l10021l18584J18068L02487J54209M7392
30200a025051k49865m42745k8219N79683O64455j62378j43541M13960J88208o7497
30190b72990k53612J46953K62055M49106N04209K47078j30755j97739l72944p8144
30180C03217K45379k7763m58173N8446R89930K41536p0835K68043L6282l54384
30170A231678m93207j22318o47141r16480q8976J200340M37153j28085J10013
$$ plain form
30240 -335488 -499515 -175087 153815 453757 758257 337468 -133849 -36077 422072 1429922
30230 1429922 2244621 2002738 1705612 1244904 660952 447387 767808 752969 48703 -861693
30220 -861693 -1553955 -1436621 -1271253 -1284118 -1554338 -1321261 -847229 -528077 -672689 -1229884
30210 -1229884 -1243879 -1014977 -795199 -1018602 -1328623 -1647207 -1529139 -1226652 -1072443 -1025051
30200 -1025051 -1274916 -1717661 -1745880 -1166197 -501742 -664120 -807661 -393701 -205493 -272990
30190 -272990 -526602 -379649 -117594 331512 835721 1082799 952044 754305 381361 303217
30180 303217 548596 520833 62660 121106 1111036 1352572 1281737 1549780 1586062 1231678
30170 1231678 738471 616153 -30988 -947468 -1036444 163896 601049 472964 582977
30161E82977L84790J34936m26899q8041J0321O200J1100k31490l00347m31056
30151c47509o16864n36294J6505P37993M12992L86388M4127p39915m98594M12195
30141g28976L21239K18291K1438l42299l72797K45745L54091L77065M64204O2146
30131F20147j21418j01771k50807j52206o08248l31053l03289l82582L97280Q86983
30121c46964J105285P80699J09686r11323j105640l05003L62296K79719N76561
30112E45316N02283M19437O9503k36255J84671n7677m47084k01387j24623n02916
30102A51268m83338J96759O43268J56474n2318M94712K17043l71579m64282k11877
30092B76130j20122r2414m32857n24316k24617L36894Q85086K53282n23137O7330
$$ plain form
30161 582977 967767 1102703 675804 587763 598084 604284 615384 383894 83547 -347509
30151 -347509 -964373 -1500667 -1484162 -746169 -333177 53211 97338 -642577 -1141171 -728976
30141 -728976 -407737 -189446 -168008 -510307 -883104 -637359 -283268 93797 558001 620147
30131 620147 498729 396958 146151 -6055 -614303 -945356 -1248645 -1631227 -1233947 -346964
30121 -346964 758321 1539020 1648706 737383 -368257 -673260 -310964 -31245 545316
30112 545316 1047599 1467036 1536539 1300284 1484955 1427278 980194 778807 654184 151268
30102 151268 -332070 -135311 507957 664431 612113 1106825 1323868 952289 488007 276130
30092 276130 156008 63594 -369263 -893579 -1118196 -781302 103784 357066 -166071 -98741
30082i8741N90744J83395k27345j52109J50583N38602k6776j37733r4849k31840
30072D93931j03187J10508J7389L9567j8697p0739L12451P64406K03093K39482
30062A988204j43625j015460o23117k65639m58391m57377k65341j02555K36759
30053a106542N78005M05733J35610o5402j43194J97341m6374l53734j11262R12463
30043D02644P91952l44963n37322k08606K36937K48259j96797l27288m46715n20526
30033i02425n8174L49741M66099N67017j75728l96588L48686K02202J85115J64173
30023G50118R8335j57362J23998J30480k70393J87937p0213o93205o82568l52447
30013i35320L40578P52285J94879O245K92051M91927N3694m33510n29568l73736
$$ plain form
30082 -98741 492003 675398 448053 295944 446527 985129 958353 820620 725771 493931
30072 493931 390744 501252 518641 558208 539511 468772 781223 1545629 1748722 1988204
30062 1988204 1844579 829119 206002 -59637 -518028 -975405 -1240746 -1343301 -1106542
30053 -1106542 -528537 -122804 12806 -52596 -195790 1551 -44823 -398557 -509819 402644
30043 402644 1194596 849633 312311 103705 340642 588901 392104 64816 -381899 -902425
30033 -902425 -960599 -610858 -144759 422258 246530 -150058 198628 400830 585945 750118
30023 750118 848453 691091 815089 945569 675176 863113 792900 99695 -582873 -935320
30013 -935320 -594742 157543 352422 358667 650718 1142645 1196339 762829 233261 -140475
30003a40475K66253O64463j27230l80148K63117L09995k38615q786J28325n99005
29993A37894j059029n92400k42369n023q2327j48962J12520j97943k32357M10633
29983a899363N57532L01812l7756l00427J06856P03329J94716k49983J75931K40624
29973b06729j97006n05225p4360m6454K35906J23774p11019m59771L29182R27076
29963e84626J088587M30369L12375M85515k82915p32894n77350Q7962M78166K6482
29953G31671m99799n56429J18682N73104k04116o44439J43612L93209M47448j55105
29943C47838k68654L79493O47655j79578p97148l17836j23663k62114l30012N38634
29933c65385M91472l15677k2319P05339P73057M30048J16752l70408q2737m2199
$$ plain form
30003 -140475 125778 790241 663011 282863 545980 855975 617360 608574 736899 137894
29993 137894 -921135 -1513535 -1755904 -1760927 -1843254 -1992216 -1879696 -2077639 -2309996 -1899363
29983 -1899363 -1341831 -1040019 -1077775 -1378202 -1271346 -568017 -373301 -623284 -447353 -206729
29973 -206729 -403735 -908960 -983320 -1029774 -793868 -670094 -1381113 -1840884 -1511702 -584626
29963 -584626 503961 934330 1246705 1732220 1449305 716411 139061 227023 705189 731671
29953 731671 231872 -324557 -205875 367229 163113 -481326 -337714 55495 502943 347838
29943 347838 79184 458677 1106332 926754 129606 -188230 -311893 -574007 -904019 -365385
29933 -365385 126087 -189590 -211909 493430 1266487 1696535 1813287 1442879 1360142 1317943
29923A317943l24775J15275O2413m80537m96229p7055r0062K43823n1832p50191
29913e31227l47579M07005Q50685N9689p8460L31283p8625r1495L3338L60833
29903I15447K49041K39570m2364n40613J9727N38799N50797l27986j157410p56074
29893c11066K1745J22901J52871n76462l90683p6631K27914l5703j54812O1691
29883i58235R03539J090145K9125k38689l50503o69221n35206r0893m40804J10889
29873a149853N64019K87925J60077L14904K35795L31520J35843r22025r65904
29864a007699m60352O623k67319J35160Q09604N16736r1866l54833J46409J73211
29854c94326j12715M31962N98200J30566n78770n77296K2278K08665K53312p8964
$$ plain form
29923 1317943 993168 1108443 1170856 690319 194090 117035 26973 270796 218964 -531227
29913 -531227 -878806 -471801 378884 438573 360113 691396 612771 521276 554614 915447
29903 915447 1164488 1404058 1361694 821081 840808 1379607 1930404 1602418 445008 -311066
29893 -311066 -289321 -166420 -13549 -590011 -980694 -1057325 -829411 -865114 -1019926 -958235
29883 -958235 -54696 1035449 1064574 825885 475382 -193839 -729045 -819938 -1260742 -1149853
29873 -1149853 -585834 -297909 -137832 177072 412867 744387 880230 -41795 -1007699
29864 -1007699 -1468051 -1461428 -1728747 -1593587 -783983 -267247 -359113 -713946 -567537 -394326
29854 -394326 -507041 -75079 523121 653687 74917 -502379 -480101 -271436 -18124 -97088
29844i7088m60565l27692M98099P49743M03545l57910l17427j20079j24120J94812
29834D1318K35985j32634j03704J65623j0109j49604L4407K80598k70144l23784
29824b32048O8237o842k13064k45846J59834M2390M73505L40923k77083k68716
29814a58710p6182p2511m6937k12110j73900N8710q2444J18690L54373K18187
29804g2834L38086L95029K32873k61749j86306L5005l3213k09212l02322m94457
29794e59100l04836J58683j63118m43766L7597l0784q1823l95876J94239N27157
29784a061627K24129R9157j00570o9684R9060J18009m10097j39802K60867N44052
29774d36506M06291Q8695k48857p36651k8595N82360L68629j8924O06892O11478
$$ plain form
29844 -97088 -557653 -885345 -387246 362497 766042 408132 90705 -29374 -153494 41318
29834 41318 277303 144669 40965 206588 196479 46875 81282 361880 91736 -232048
29824 -232048 -163811 -170653 -383717 -629563 -469729 -427339 46166 387089 110006 -158710
29814 -158710 -234892 -307403 -354340 -566450 -740350 -681640 -764084 -645394 -291021 -72834
29804 -72834 265252 660281 893154 631405 445099 480104 446891 237679 -64643 -559100
29794 -559100 -863936 -705253 -868371 -1312137 -1274540 -1305324 -1387147 -1783023 -1588784 -1061627
29784 -1061627 -837498 -738341 -838911 -908595 -809535 -691526 -1101623 -1241425 -980558 -436506
29774 -436506 -30215 58480 -190377 -927028 -955623 -373263 -4634 -23558 583334 1194812
29764A194812k91176j95980J0708l56163k28782m87386K18528P28426K37172M36392
29754A266551m5844k90597k94861k14123K74762J81872P7478j24920j42326n35251
29744A52741r40629l74038P68871O77347M78284P70950j93578n44175n19544m60401
29734a84172k60726O9368M29224P89742P41931J66987l55317L54778K91802j06343
29724A937274k67339J08777l92025j172928m52053N32540P37618P64477r9687
29715A696654o96854n51955P1533O03895j07695n99819J47863l7282q49796K36480
29705h6976J148719M60070j61188n16238r64789o99550l94341L26235N48055J21450
29695b18553l18487m31348l42947N96516Q25307K23283k15229l05672l15628j39040
$$ plain form
29764 1194812 903636 707656 718364 362201 133419 -353967 -135439 592987 830159 1266551
29754 1266551 1220707 930110 635249 421126 695888 877760 955238 830318 687992 152741
29744 152741 -787888 -1161926 -393055 284292 762576 1533526 1339948 795773 276229 -184172
29734 -184172 -444898 -375530 53694 843436 1585367 1752354 1397037 1751815 2043617 1937274
29724 1937274 1669935 1778712 1386687 213759 -238294 294246 1031864 1796341 1696654
29715 1696654 999800 447845 519378 1123273 1015578 415759 563622 526340 -323456 -86976
29705 -86976 1061743 1521813 1360625 844387 -120402 -819952 -1214293 -888058 -340003 -218553
29695 -218553 -537040 -968388 -1311335 -714819 110488 333771 118542 -187130 -502758 -641798
29685f41798J63326L11390J17415J89799K70260j72593m79361r5589J6458L74282
29675E3589M02177k28473o07124n33384K07237O29253O9494k91580k80025K73996
29665c04840K84657k75765L82122P75778K0761n46920p88759k59815N65304N89361
29655D41884N3282r79396o70990n00454K11313L68620K81257O68360J21537J38192
29645A33605O31164L41923k73951l81677L11013M88198J01119K37367l459n28285
29635A057017k22734J98974l16388p40339p81869K24156N88835O8522m75816q9922
29625d89564k61l16374j6875r9196j52427m4402r6226m01607k41101P25322Q47485
29614b85226O05804J106183J06218n84038l49917L45522J90999j99381l16848
$$ plain form
29685 -641798 -478472 -167082 -49667 140132 410392 237799 -241562 -337151 -320693 53589
29675 53589 455766 227293 -379831 -913215 -705978 -76725 -7231 -298811 -578836 -304840
29665 -304840 -20183 -295948 86174 861952 882713 335793 -452966 -712781 -147477 441884
29655 441884 495166 -484230 -1155220 -1655674 -1444361 -1075741 -794484 -126124 -4587 133605
29645 133605 764769 1106692 832741 451064 762077 1250275 1351394 1588761 1585302 1057017
29635 1057017 834283 1033257 716869 -23470 -805339 -581183 7652 76174 -399642 -489564
29625 -489564 -489825 -806199 -823074 -922270 -1074697 -1119099 -1215325 -1616932 -1858033 -1132711 -285226
29614 -285226 320578 1426761 1532979 948941 599024 944546 1135545 936164 619316
29605F19316j73392J95433p08078r05154j44365k50934Q46405O42899m71608p5729
29595d25207j11106l13554l13163O7848J84330N32642J165600J018896j3962n69704
29585A222620p97593j148490m64918R0893L22305L11985j78505l53895J40008
29576h55590j1857O7161k8965L9061L96161j33468o3840j3040P6941k2170K02831
29565c46775K76689k61429j14697k11615m76308K53644J008272O75805L54057
29556A157643J78118j53998n95554m07902j74289R7155k0855Q4242L7243J08265
29546C10068l35399j85735k88136m19999M16692O37603K03706j39229m46491m77136
29536g24056J41932L39187l92976m02672j68433r615P76774P36975j41325l87657
$$ plain form
29605 619316 445924 641357 -66721 -971875 -1116240 -1367174 -520769 122130 -349478 -425207
29595 -425207 -536313 -849867 -1163030 -1095182 -910852 -378210 787390 1806286 1792324 1222620
29585 1222620 425027 -723463 -1188381 -1097488 -775183 -463198 -641703 -995598 -855590
29576 -855590 -867447 -800286 -829251 -790190 -394029 -527497 -591337 -604377 -527436 -549606 -346775
29565 -346775 -70086 -331515 -446212 -657827 -1134135 -880491 127781 803586 1157643
29556 1157643 1335761 1181763 586209 178307 4018 101173 80318 164560 201803 310068
29546 310068 -25331 -211066 -499202 -919201 -502509 135094 338800 199571 -246920 -724056
29536 -724056 -582124 -242937 -635913 -1038585 -1207018 -1216633 -439859 297116 155791 -231866
29526b31866j41059l43941k58651m9292k27751l63959l8217N54536Q63419M30689
29516A93908J70649n83333p2531L29987m62916q1871L06214N5014l76249L4422
29506d86706K59871l77541l70848k75661K69541N25965M85302J18455m93467m99756
29496h44845n42731m60016J92226N11678L71745N24975P59431N37510o6779l46222
29486F36972j55940k66941j96970p08155j219224k37331P53490N56118r0665j72937
29476a101583K09236N29060R21008P85102L53630m43876o86178k06655N23621
29467H83365Q31516J10314j28281o74176j85399M64278m44344n45727K93238J07596
29457G12380k49374m5129m93228n77788M60454J077379p711n92096n8608N51098
$$ plain form
29526 -231866 -372925 -716866 -975517 -1024809 -1252560 -1616519 -1654736 -1100200 -236781 193908
29516 193908 364557 -218776 -291307 38680 -424236 -506107 -199893 -144879 -521128 -486706
29506 -486706 -226835 -604376 -975224 -1250885 -981344 -455379 29923 148378 -345089 -844845
29496 -844845 -1387576 -1847592 -1655366 -1143688 -771943 -246968 512463 1049973 983194 636972
29486 636972 481032 214091 17121 -691034 -1910258 -2147589 -1394099 -837981 -928646 -1101583
29476 -1101583 -892347 -363287 557721 1342823 1696453 1252577 566399 359744 883365
29467 883365 1714881 1825195 1696914 1022738 837339 1301617 857273 311546 604784 712380
29457 712380 463006 417877 -75351 -653139 -192685 884694 876983 284887 226279 777377
29447G77377K07896k82679n17812m40002J36691O31392M31770q5044L9041j47261
29437G51369l62011m37455l39302k45732q8137j3245j94180l3127N53734Q18421
29427D10335N54690o3838m25057m3381m65219r00475p87930j77650K69050N04619
29417a124856R18709O83887m5910k71636j26100l22266O00034O43443k63288n92542
29407I9475q32557m15401K80418L12556l08449N97933R23300M79584k2184r05211
29397B09464p45961K2336P21910K70862o68407p62707j80782J2962L93302J0577
29387g16444q07787m54395k16563K53870P14150Q39156L89236L383P3563k7752
29377E0417r4961K27091N09811j31490o83493p15724q8929p4444K87867P10304
$$ plain form
29447 777377 985273 702594 184782 -255220 -118529 512863 944633 859589 898630 751369
29437 751369 389358 -48097 -387399 -633131 -721268 -734513 -928693 -961820 -408086 410335
29427 410335 965025 901187 476130 432749 -32470 -932945 -1720875 -1898525 -1629475 -1124856
29417 -1124856 -206147 477740 431830 160194 34094 -288172 311862 955305 692017 99475
29407 99475 -733082 -1148483 -868065 -555509 -863958 -266025 657275 1136859 1114675 209464
29397 209464 -536497 -514161 207749 478611 -189796 -952503 -1133285 -1120323 -727021 -716444
29387 -716444 -1524231 -1978626 -2195189 -1941319 -1227169 -388013 1223 4606 78169 50417
29377 50417 -44544 182547 692358 560868 -122625 -838349 -927278 -1001722 -713855 -3551
29367c551N18044K24154L1070k21822p0790L85327o0066k05871j00471J29485
29357F25509j63073o40621n14046K51493L47557j4855j3714j61815R8310j84992
29347c70247Q7863O06002K88347n67280l97595o8790l3923K48384j11973m19290
29337g38502k91190n2987N3202J03617n6348L9387M06459M90735j30857m14049
29327e90533m27939l46152p73805j39494M10175M79853O58073J27943l90506J19701
29317h72684k79824l53377q6628K95559l3770k79469K79507N53052p3504m08752
29307a259890K8993J05417N33797Q19494Q42752L07564m53931o99540l96532P1220
29297a00656O32451L86356m34987n87627j03550K00193N3566J09943M76139j82217
$$ plain form
29367 -3551 514493 738647 769717 547895 477105 862432 802366 596495 496024 625509
29357 625509 462436 -178185 -692231 -440738 -93181 -108036 -121750 -283565 -185255 -370247
29347 -370247 -282384 323618 611965 44685 -352910 -421700 -455623 -207239 -319212 -738502
29337 -738502 -1029692 -1082679 -1029477 -925860 -982208 -942821 -536362 -45627 -176484 -590533
29327 -590533 -1018472 -1364624 -2138429 -2277923 -1867748 -1387895 -729822 -601879 -992385 -872684
29317 -872684 -1152508 -1505885 -1592513 -1296954 -1330724 -1610193 -1330686 -777634 -851138 -1259890
29307 -1259890 -1230897 -1125480 -591683 227811 1070563 1378127 924196 224656 -171876 -100656
29297 -100656 531795 918151 483164 -104463 -208013 -7820 45746 155689 631828 449611
29287D49611l51939n7038j03795L49496q5077k7047j08632j96828l83426K07101
29277c07574J37156l57357k53334k99354K96954K64211J14768k1663L80859K34803
29267A89469J17184K7815J07413J64463m9151J2717K02451O3816O2081P736m6764
29256H59230j48317k27074P0136L77098l22628n28285k68954J67661J02799J9867
29246A01533n3594l23637Q237M98600J72679j33405n6719K75593N94901N0947
29236A135135n78235o42820K74036R48819K74482k1070L48575K6228j156233j394292
29226g85375m53626j74771J25522K66807M76735J042061P61183k68222m54701
29217E35613l11173m3923k70597j11642l61815M2226Q83369P82842M19357p42701
$$ plain form
29287 449611 97672 40634 -63161 286335 201258 174211 65579 -131249 -514675 -307574
29277 -307574 -170418 -527775 -781109 -1080463 -783509 -519298 -404530 -426193 -45334 189469
29267 189469 306653 334468 441881 606344 557193 569910 772361 836177 898258 905994 859230
29256 859230 710913 483839 553975 931073 608445 80160 -188794 -21133 81666 101533
29246 101533 47939 -275698 -267461 231139 403818 270413 213694 489287 1084188 1135135
29236 1135135 556900 -85920 188116 1136935 1411417 1390347 1738922 1765150 608917 -785375
29226 -785375 -1239001 -1413772 -1288250 -1021443 -544708 497353 1258536 990314 535613
29217 535613 224440 180517 -90080 -201722 -563537 -521311 362058 1144900 1564257 821556
29207H21556q95833k97335J77063O98976O18657M15468j65090j13644J14249k07676
29197A166391k36278N44090P21105J10049m77831p93623n45322m04613k66351
29188a82383j54513l8140J83475J04968l91625m20434j56165j78333j50701J823
29178a382028J68992M94657K90272r6681k78889l08928m00941M01326N99980N0092
29168d62148j90600m6643K07173j02806n05078j83952p250L8678P27057O39380
29158A13811k31283j85239J15599M10578j1054m03106J10958M49752k10699m00824
29148b41507k18860k11762L69603R75007M89966k52811r06970m38467k58990j16005
29138h10796L90798N70940K50853J82179m1356k36410l63313n04366J87396L71592
$$ plain form
29207 821556 -74277 -371612 -194549 504427 1123084 1538552 1373462 1259818 1374067 1166391
29197 1166391 930113 1474203 2195308 2305357 1827526 1033903 488581 83968 -182383
29188 -182383 -336896 -375036 -191561 -86593 -478218 -898652 -1054817 -1233150 -1383851 -1382028
29178 -1382028 -1213036 -718379 -428107 -524788 -803677 -1112605 -1513546 -1112220 -512240 -462148
29168 -462148 -652748 -699391 -492218 -595024 -1100102 -1284054 -1291304 -1252626 -525569 113811
29158 113811 -117472 -302711 -187112 223466 212412 -190694 -79736 370016 159317 -241507
29148 -241507 -460367 -672129 -302526 672481 1162447 909636 2666 -435801 -694791 -810796
29138 -810796 -419998 150942 401795 583974 542618 306208 -57105 -561471 -374075 -2483
29128b483j19072j74449Q1826p7159n65467m19749M32261j40603r06807j81690
29118b073392N36661M61112K29405L53155L17065L36139j23098o88721m6230J218292
29108E20388J13533n95433n39847k14190N08522L64385K19420o36306l92478M32309
29098b19697k31257n43816k21071k05847L89341K13733o4256O321M16489K35121
29088b24939R00K26916L64269L18608k91336l97256M56927O01816m69326j059392
29078d72813l37539J44367j84821j74226M57173M50364j86178p08784K8080K26998
29068g57379m8631l13073J82139M96891P1167m55707l81282L51225O59509K22852
29058B7711Q4874m02140k57967N8802j472M47695L32097m67550J5636J224474
$$ plain form
29128 -2483 -121555 -296004 -214178 -291337 -856804 -1276553 -844292 -984895 -1891702 -2073392
29118 -2073392 -1536731 -1075619 -846214 -493059 -175994 160145 37047 -651674 -697904 520388
29108 520388 633921 38488 -501359 -715549 -207027 157358 376778 -259528 -652006 -219697
29098 -219697 -450954 -994770 -1215841 -1421688 -1032347 -818614 -882870 -876549 -460060 -224939
29088 -224939 -224039 2877 367146 685754 394418 -2838 454089 1055905 586579 -472813
29078 -472813 -810352 -665985 -850806 -1025032 -567859 -117495 -303673 -1012457 -984377 -757379
29068 -757379 -806010 -1119083 -936944 -440053 -368886 -824593 -1205875 -854650 -195141 27711
29058 27711 112585 -289555 -547522 -488720 -490192 -42497 289600 -177950 -162314 1062160
29048A062160K14323q29797m23099Q5937m8198l1123J6852P4376J43315j14913
29038A49833k80734j64186l6395q8786k23424J29361K51492L25758L70785K34350
29028F68054k30169l03314j09867R3324L41650L58661O66565L87214j53525j5019
29018A703574M12178L46019k39080m33977q68907J41403O50224O21385J87727
29009B520546m82339l81840l4375j13583l98360m43751j67740K4391j74446m55100
28999a06597p02840m91463k28836j16042l9553L83087L17758M73567P14210N19468
28989G22759j20631k58349q05834n24735M79379P76251R02659M67713n29921j005150
28979A04141o45198j91961m80182R2481O50606P41525M20858m63202m91636J21740
$$ plain form
29048 1062160 1276483 446686 23587 109524 61326 30203 47055 121431 264746 149833
29038 149833 -130901 -295087 -331482 -420268 -643692 -514331 -262839 62919 433704 668054
29028 668054 437885 134571 24704 118028 459678 818339 1484904 1872118 1718593 1703574
29018 1703574 2115752 2461771 2222691 1788714 919807 1061210 1711434 2332819 2520546
29009 2520546 2038207 1656367 1621992 1508409 1110049 666298 498558 522949 348503 -106597
28999 -106597 -809437 -1300900 -1529736 -1645778 -1685331 -1302244 -984486 -510919 203291 722759
28989 722759 602128 343779 -462055 -986790 -507411 268840 1171499 1639212 1109291 104141
28979 104141 -541057 -733018 -1213200 -1120719 -470113 271412 692270 229068 -262568 -140828
28969a40828K64775l83126k59350N24589Q84650L34119l52971m53385r90313k70035
28959h41875j07654n68164m23249o6891M43461M07202M31101M34346m928J16915
28949a79736J18429j50225k05871J22946P1492m27404M11806L42789n80855n26828
28939a003457J8071N72709Q6094j62209L33451K98917k7556l18972J21211K7808
28929e3933l07220J18098j25337k23434K76807L01192J56972L6584N9766J30043
28919C69538O28142P57623J73572J71092m92905p21688q04488o60768K57932L52508
28909C0558m44749j78546J87601J33737Q6383O54614J026581r6259r89584k58931
28899A51405n44634n48515l87509n42492p34772R8625J426852P08436J35452J31587
$$ plain form
28969 -140828 123947 -259179 -518529 6060 890710 1224829 871858 418473 -571840 -841875
28959 -841875 -949529 -1517693 -1940942 -2007833 -1564372 -1157170 -726069 -291723 -296651 -179736
28949 -179736 -61307 -211532 -417403 -294457 -222965 -650369 -238563 104226 -476629 -1003457
28939 -1003457 -985386 -412677 -326583 -488792 -155341 143576 116020 -202952 -81741 -53933
28929 -53933 -361153 -243055 -368392 -591826 -315019 -13827 143145 179729 239495 369538
28919 369538 997680 1755303 1928875 2099967 1607062 885374 80886 -579882 -321950 30558
28909 30558 -414191 -592737 -405136 -271399 -185016 469598 1496179 1399920 410336 151405
28899 151405 -393229 -941744 -1329253 -1871745 -2606517 -2507892 -1081040 -372604 -237152 -105565
28889a05565j31310m71905m39475m4133M22992M56500o5776P2483J18625K81388
28879I3824K95882l86369m97831l75016k9078L65894J77367N2682J90882o23570
28869g35333m2821K61739j78732L67260J015585O19433L02496l54350r15671p65935
28859d26329m60715k83364R3851L74419j76638k95102K28139K52105m27066l23568
28849a444268P22198O92337M49534J46694J84113m35473n41147m3885M16075K32866
28839C79044L01330M30370J74590J85981l06601n03219K23719L95783l48083p38241
28829A94673n39318l24488J83979j4104N5629M43719R84541N08001l92417j27710
28819I72505m27284m16575k39979P0487L78535J04553r5294L33332M06087J43257
$$ plain form
28889 -105565 -236875 -708780 -1148255 -1192388 -769396 -312896 -378672 -306189 -187564 93824
28879 93824 389706 3337 -494494 -869510 -898588 -532694 -355327 -302645 -111763 -735333
28869 -735333 -778154 -516415 -695147 -327887 687698 1307131 1609627 1255277 339606 -426329
28859 -426329 -887044 -1170408 -1076557 -702138 -878776 -1173878 -945739 -693634 -1120700 -1444268
28849 -1444268 -722070 -29733 419801 566495 750608 315135 -226012 -269897 146178 379044
28839 379044 680374 1110744 1285334 1471315 1164714 661495 885214 1280997 932914 194673
28829 194673 -344645 -669133 -485154 -499258 -443629 90 984631 1492632 1100215 972505
28819 972505 545221 128646 -111333 -40846 337689 442242 346948 680280 1086367 1229624
28809A229624j40020J9031P27243O40930n14160j137527p07923n9349J13157L5925
28799B06931j15852o9632M38052N63043k09799m0170k48564m29149L23498J28325
28789E46683l87018j96152K24323K33160l28649o5664k9459m1752K76591N41330
28779G73393q7021m69476L71121j99049j5076K12739n84004j014221m34442M52368
28769i93668N59771L38855J17366M1821K69303J30362l3058K18833j38266L9616
28759E50935n2608n31494k24328j11680J27743J1400M87274N74440J39134Q6712
28749A057528K69713J70742q04500j401193L03912J075549O11463L11918k45262
28740A349870l56863m94788j40121m1613j14876l23217j27204O11685P12901j22876
$$ plain form
28809 1229624 1089604 1108635 1835878 2476808 1962648 825121 117198 57849 171006 206931
28799 206931 91079 21447 459499 1022542 812743 772573 524009 94860 418358 546683
28789 546683 159665 -36487 187836 420996 92347 26683 -2776 -44528 232063 773393
28779 773393 686372 216896 588017 388968 373892 586631 2627 -1011594 -1446036 -993668
28769 -993668 -433897 -95042 22324 64145 333448 463810 430752 649585 511319 550935
28759 550935 498327 -33167 -257495 -369175 -241432 -230032 257242 831682 970816 1057528
28749 1057528 1327241 1497983 693483 -707710 -403798 671751 1283214 1595132 1349870
28740 1349870 993007 498219 358098 316485 201609 -121608 -248812 362873 1075774 952898
28730I52898k66311Q0760n9115Q4387K06029j88696q27670j109610m13485K22953
28720a317860M58433N1847K1124j33815o93215n50824l61797j11353P28298P34646
28710a174516M66547K47441n44820j73754N47177Q28671M58143Q0207k19997R0053
28700F05152J98192j44765j50618J97413q9113q40052k12303K47904M64979L47854
28690F24643L3457M74320K06326m43956o75787p74202m78717N4843L80248J51162
28680d47663l7656K25808J14444L14739o2764l84784M5419j94644o52996l48118
28670a428215K28358N07313J70224m4009k69500o83365L3422O06488R09021Q69677
28660H99414n1000r47481r05580k23523N95391J74897l65394n8731L12193Q58695
$$ plain form
28730 952898 686587 767347 708232 792619 998648 809952 -17718 -1127328 -1540813 -1317860
28720 -1317860 -859427 -807580 -786456 -920271 -1613486 -2164310 -2526107 -2637460 -1909162 -1174516
28710 -1174516 -707969 -460528 -1005348 -1179102 -631925 196746 654889 735096 515099 605152
28700 605152 803344 658579 507961 705374 616261 -223791 -436094 -188190 276789 624643
28690 624643 658100 1132420 1338746 894790 219003 -555199 -1033916 -979073 -598825 -447663
28680 -447663 -485319 -259511 -145067 169672 106908 -277876 -232457 -427101 -1080097 -1428215
28670 -1428215 -1199857 -692544 -522320 -566329 -835829 -1519194 -1485772 -879284 29737 899414
28660 899414 848414 -99067 -1004647 -1228170 -632779 -457882 -823276 -882007 -569814 288881
28650B88881N15765k52846q74589o31058N041Q12921Q92440K03162l76329J29271
28640G12659K47096j86199j66306k48196o42277j054515n17808M25744J235568
28631a94234J093575N81243J87811r1389p8800m6230k1181k93156r3936J91893
28621A235596n32270p90596m33800k27388j50581O0544P47989P66528L05406K09541
28611A190969J6139p39812l45786L70733O87879P81535o8903k70945k45087m48005
28601I28717m61736j20598j0889o7805o31886n2393O11965M10719l77348q17691
28591e88945j27755K83853j5167k50244l15375J5504r5811L93226N63138K2995
28581a14581n26367j133150j022003j81948Q64746J063012R02878N02986n2142
$$ plain form
28650 288881 804646 551800 -322789 -953847 -948806 -135885 756555 959717 583388 712659
28640 712659 959755 773556 607250 359054 -283223 -1337738 -1855546 -1429802 -194234
28631 -194234 899341 1480584 1668395 1577006 1498206 1451976 1430795 1137639 1043703 1235596
28621 1235596 703326 -87270 -521070 -748458 -899039 -838495 -90506 676022 981428 1190969
28611 1190969 1207108 467296 121510 492243 1180122 1961657 1892754 1621809 1376722 928717
28601 928717 466981 346383 335494 267689 -364197 -416590 195375 606094 228746 -588945
28591 -588945 -716700 -432847 -448014 -698258 -1013633 -998129 -1093940 -700714 -137576 -114581
28581 -114581 -640948 -1774098 -2796101 -2978049 -2113303 -1050291 -147413 355573 303431
28572C03431o19505m56141k7818R71132R84325l84731k4001l1019J01272K78349
28562A095294j95831l64448Q4730j14226p52523n11994K72979Q229j069j13883
28552e92742l86881r4949J76279k41618k67240N9682P56262J016937K66636l95346
28542B97020n05436k64808K98498J49353J92439k74778j171248o97019k4832L88841
28532a611970M84383N94382L93963J84786j97525l70251m57110k07861O63200
28523e24003O95846J54320k97380p49328K04738j74472p46120m78287K902N17348
28513a394436k01659k37800N25831M05528l14683Q4410N20892k4246N2155N55739
28503b8269Q8939p9115J95234n11123o47111j42542P84834J096674P16687m6689
$$ plain form
28572 303431 -316074 -772215 -800033 171099 1155424 770693 746692 715673 816945 1095294
28562 1095294 899463 535015 619745 505519 -247004 -758998 -486019 -477790 -478859 -592742
28552 -592742 -979623 -1074572 -898293 -1139911 -1407151 -1347469 -591207 425730 692366 297020
28542 297020 -208416 -473224 -174726 -25373 167066 -107712 -1278960 -1975979 -2000811 -1611970
28532 -1611970 -1127587 -533205 -139242 45544 -151981 -522232 -979342 -1187203 -524003
28523 -524003 171843 326163 28783 -720545 -515807 -690279 -1436399 -1914686 -1911784 -1394436
28513 -1394436 -1596095 -1833895 -1308064 -902536 -1217219 -1132809 -611917 -636163 -584008 -28269
28503 -28269 60670 -18445 176789 -334334 -981445 -1123987 -339153 757521 1474208 1427519
28493A427519j06284n28954q64074o28572l33584K04108P85135J96784K06428
28484C58506K71188J76664r3319j105646r26344M3544O80869R7451k97724l35188
28474a129999L12609J040335L05087N79232Q06166q2876n30376J61061L57869
28465A819108o4322p08047p38511l43194L8844k71697m04392m28391n14351J25092
28455a489861N84142O20708O61960N01238j28964m45949p66673q71141j01417
28446a435957N08862J022160R33507J65688q20047j134145k82483L40912M67287
28437b34216J338j9138O89715O94272r31019p84164j18622j97124K33330N02926
28427a62702J8805k38820J62184J13842K65716M46620L29720j24355o75691p85867
$$ plain form
28493 1427519 1321235 792281 -71793 -700365 -1033949 -829841 -44706 152078 358506
28484 358506 629694 806358 713039 -392607 -1318951 -1275407 -594538 -497087 -794811 -1129999
28474 -1129999 -817390 222945 528032 1107264 1913430 1830554 1300178 1461239 1819108
28465 1819108 1754786 1046739 308228 -34966 3878 -267819 -672211 -1100602 -1614953 -1489861
28455 -1489861 -905719 -285011 376949 878187 749223 303274 -463399 -1334540 -1435957
28446 -1435957 -927095 95065 1028572 1194260 374213 -759932 -1042415 -701503 -234216
28437 -234216 -232878 -252016 437699 1131971 200952 -583212 -701834 -898958 -665628 -162702
28427 -162702 -143897 -382717 -220533 -106691 159025 605645 935365 811010 135319 -650548
28417f50548k18193J50950K79238K61705N37730M75639j18949r654o07570n61526
28407d61178m06617n96689m17314J2568K16211M84037O55433N97133J34186k82064
28397f4294m05424l01827q06540o73481N35100O39688L731K3303K03141M516l44816
28386a186903P3129M30632K48610N57569M37574j49565j81400J99798R8178l38100
28376A89522n32287p34366l70277L57107Q47539Q08266M92997M38525N0207k05356
28366A341877m78983p76629K04604N15035l15799j03469M48885k30404m19916
28357A85201L7749j78760p79271r15822p48M75853O40961L00680K89146J83910
28347B38899K04176R0488K74741J7724n29602o67635j63486j5665n34591l02353
$$ plain form
28417 -650548 -868741 -717791 -438553 -176848 360882 836521 717572 707918 100348 -461178
28407 -461178 -867795 -1464484 -1881798 -1869230 -1653019 -1168982 -513549 83584 217770 -64294
28397 -64294 -469718 -771545 -1578085 -2251566 -1716466 -1076778 -1073047 -1049744 -846603 -842087 -1186903
28386 -1186903 -1113774 -683142 -434532 123037 560611 411046 229646 429444 527622 189522
28376 189522 -342765 -1077131 -1447408 -1090301 -242762 565504 1058501 1497026 1547233 1341877
28366 1341877 862894 86265 290869 805904 490105 386636 835521 605117 185201
28357 185201 222950 44190 -735081 -1650903 -1651651 -1175798 -534837 -234157 54989 238899
28347 238899 443075 533563 808304 826028 296426 -371209 -534695 -550360 -1084951 -1387304
28337a387304P4847m9875J43691p197K24286P45929K47644n24184n74600l30389
28327a437152K76320K80218R8778L90464M10049j28528j94721J79019J61729j27262
28317i1086j9058N00188m17405j64010K75651o021l56349J33642N15678n45091
28307a73861j012834J54813J10506J61981K58494M4075K39252l5108p40610J27924
28297h65368M17018m11398M6225r5664n86882L89766R07793J39019j40375J64273
28287c5593K38490L47651M36870J99117K56915J25634O2116k96641j29490M9632
28277A254701j21047n0033l18890j92527K33621O48568m8606p55175o01283m13818
28267c64489R9848J26887l23487l81312l38194l98269J25134j96369l25674M66147
$$ plain form
28337 -1387304 -1312457 -1362332 -1218641 -1225838 -1001552 -255623 -7979 -532163 -1106763 -1437152
28327 -1437152 -1160832 -880614 -781836 -391372 18677 -109851 -304572 -125553 36176 -91086
28317 -91086 -110144 390044 -27361 -191371 84280 78259 -278090 -144448 371230 -173861
28307 -173861 -1186695 -1031882 -921376 -759395 -500901 -456826 -217574 -252682 -993292 -865368
28297 -865368 -448350 -859748 -813523 -909187 -1496069 -1106303 -198510 -59491 -199866 -35593
28287 -35593 202897 550548 987418 1186535 1443450 1569084 1631200 1334559 1205069 1254701
28277 1254701 1133654 1083621 764731 572204 805825 1454393 1405787 650612 49329 -364489
28267 -364489 -264641 -137754 -461241 -842553 -1180747 -1579016 -1453882 -1650251 -1975925 -1509778
28257a509778Q12305K81770j77829n95782m08890l1362L64144k32141j20376N62006
28247a055933M23012M83837M1597j33612k80970j16010J4951M5680N36435j0477
28237e1490J38193N99940J6774m18068q0386K01450N39966O36961k78776p81600
28227E22964k13929j28052n53305j19453M41722R02512O8344m69924j11868Q7343
28217D26354j65084J59878J20539k73751k90793l2905J23003o0699k80055p04549
28207i78062m27628O04132P49642j36860p53850o14409j73058l14719K37591R5549
28197a711672k98518j2734M39737N82643L12875j78854q0442J32226q1342R4349
28187h01732j03912L7220q1886J38586K94704P1238M35473J69596J75218N1459
$$ plain form
28257 -1509778 -697473 -415703 -593532 -1189314 -1598204 -1629566 -1265422 -1497563 -1617939 -1055933
28247 -1055933 -632921 -149084 -107487 -241099 -522069 -638079 -623128 -577448 -41013 -51490
28237 -51490 86703 686643 703417 285349 204963 406413 946379 1583340 1304564 522964
28227 522964 309035 180983 -372322 -491775 -50053 852459 920803 450879 339011 426354
28217 426354 261270 421148 541687 267936 -22857 -55762 67241 6542 -273513 -978062
28207 -978062 -1405690 -801558 -51916 -188776 -942626 -1557035 -1730093 -2044812 -1807221 -1711672
28197 -1711672 -2010190 -2022924 -1583187 -1000544 -687669 -866523 -946965 -814739 -896081 -801732
28187 -801732 -905644 -868424 -950310 -811724 -517020 -445782 -10309 159287 334505 385964
28177C85964n51356o01784K25657O64494l85440m85348J7533j60571J14267k44507
28167a021091q59580J72475J62434J52566K43679O02773P94722K8532j42344k41185
28157a07019j28968j63979j39681N5220j91403l24475K38646O3893M4297K15217
28147d38252n7312J78139L85687n61679o12964m33801o6558J199935P54466J5788
28137C63449L2165r6931k90346O7924M1787j19521J58687K58947j03074n15954
28127b02867R2474N98508K73153J31128j15362o7981m43332j07675J81074j97416
28117A41704l35453l86387j80059j04071m67325k63059L38578P95470N16841K4203
28107H0442J03272k74673L736N45881j04270o07305n4228P6802L29417M0555J27481
$$ plain form
28177 385964 -165392 -767176 -541519 122975 -262465 -747813 -730280 -890851 -776584 -1021091
28167 -1021091 -1880671 -1708196 -1545762 -1393196 -1149517 -546744 247978 276510 134166 -107019
28157 -107019 -235987 -399966 -539647 -484427 -675830 -1000305 -761659 -697766 -653469 -438252
28147 -438252 -495564 -317425 68262 -493417 -1106381 -1540182 -1606740 -406805 347661 363449
28137 363449 395614 298683 8337 76261 118048 -1473 157214 416161 313087 -202867
28127 -202867 -110393 488115 761268 892396 777034 709053 265721 158046 339120 141704
28117 141704 -193749 -580136 -760195 -864266 -1331591 -1594650 -1256072 -460602 56239 80442
28107 80442 183714 -90959 -87223 458658 354388 -252917 -307145 -230343 99074 139629 267110
28096B67110J23867J1063j03430o06961o35582k84354m58083K00742N48362L89819
28086e47447O82853Q08796N03990o8980r14920o74635r4065K59374J91657m10925
28076b64302l80123p1622N68637k3521J543j20087m68267l14123M08923J81255
28066d81687p66600r22448l82278J54535O04670M40015K86251J24003n8240M059
28056i97720P8348j25123l53770O45647J041288M05586o61634q93101r18094l06619
28046b085192N38201N03135L97476K95543K49289J31180N99057L85390Q9197O2417
28036A165693k72956n57893k318O62898l69287o18300m3410J26365M32361l6328
28026D86825l55373q74538m19867K62874L85797M40552j95775l99669p82005l96780
$$ plain form
28096 267110 390977 402040 298610 -308351 -943933 -1228287 -1686370 -1485628 -937266 -547447
28086 -547447 135406 944202 1448192 1379212 464292 -210343 -304408 -45034 146623 -264302
28076 -264302 -644425 -716047 -147410 -170931 -169388 -289475 -757742 -1071865 -662942 -481687
28066 -481687 -1248287 -2170735 -2553013 -2398478 -1793808 -1353793 -1067542 -943539 -1001779 -997720
28056 -997720 -919372 -1044495 -1398265 -752618 288670 694256 32622 -860479 -1778573 -2085192
28046 -2085192 -1546991 -1043856 -646380 -350837 -101548 29632 628689 1014079 1103276 1165693
28036 1165693 892737 334844 332526 995424 626137 7837 -35573 90792 523153 486825
28026 486825 131452 -743086 -1162953 -900079 -514282 -73730 -269505 -669174 -1451179 -1847959
28016a847959P26013N80730N66540Q07325k09181p24759J04511Q12187M35120
28007A250527k82317k29326j80322j35283l34031m78771l2739M22286l5158q38731
27997h73865k75205K53871j37572J7695J87669N16148N25035L11080j1293m29839
27987H3724j08395j77021j41555j04050K19855k38449n27316j6564m55K28376
27977g81850J179051L23087K2679J72087n58255J14741N41494J6301k5552j98345
27967H05438j40216r2535q38414q29622j8812K32955M20150L47748j1938J07614
27957a7632J71291L13517J12124l2086j33539M43919M85383m1355L1315m7695
27947A285242m20821r17951l09225K04298L37770N70193j68382p80410j17125
$$ plain form
28016 -1847959 -1121946 -541216 25324 832649 623468 -101291 3220 815407 1250527
28007 1250527 968210 738884 558562 423279 89248 -389523 -422262 24 -35134 -873865
27997 -873865 -1149070 -895199 -1032771 -1015076 -827407 -311259 213776 524856 513563 83724
27987 83724 -24671 -201692 -343247 -447297 -227442 -465891 -993207 -1009771 -1010226 -781850
27977 -781850 397201 720288 742967 915054 356799 471540 1013034 1029335 1003783 805438
27967 805438 665222 572687 -265727 -1095349 -1114161 -881206 -461056 -113308 -125246 -17632
27957 -17632 153659 467176 579300 547214 413675 857594 1342977 1301622 1332937 1285242
27947 1285242 864421 -53530 -362755 -158457 179313 749506 581124 -199286 -316411
27938c16411J05072L14510K84055o96441j053048j56974O87707J44946p08960
27929a395544q759K94760L37270j1352l68135k05506j5936M96147O86551J51042
27919c9462l27850p01346l4583R02695o8972p42834M2610j17338J94939K4543
27909h67598J27963K66593L18255O38276L31866K56231M24980j28776q32406l88643
27899A46741N62816N84175n1598k60684k68618J69431k95941q31944p30744k40627
27889a216993K28635N78844M63829m42301m24813K97118L96413J51081n16542
27880d84729l3540l1057J40276L55075l54004k71003N02206P26426K05862k71267
27870D84245r2879k99935m44169r6493l03178n94818j10486N62049L24821j58974
$$ plain form
27938 -316411 -211339 103171 387226 -309215 -1362263 -1519237 -831530 -686584 -1395544
27929 -1395544 -1404303 -1109543 -772273 -783625 -1151760 -1357266 -1373202 -877055 -190504 -39462
27919 -39462 -367312 -1068658 -1103241 -200546 -269518 -1012352 -969742 -1087080 -892141 -867598
27909 -867598 -739635 -473042 -154787 483489 815355 1071586 1496566 1367790 535384 146741
27899 146741 709557 1293732 1242134 981450 712832 882263 586322 -245622 -976366 -1216993
27889 -1216993 -988358 -409514 54315 -387986 -812799 -515681 -119268 31813 -484729
27880 -484729 -518269 -549326 -409050 -53975 -407979 -678982 -176776 549650 755512 484245
27870 484245 391366 91431 -352738 -449231 -752409 -1347227 -1457713 -895664 -570843 -729817
27860g29817J05621J98621O6112K69295K14387M54112L59212o01183n74391J05916
27850a32115O3077K71827M47853L86122m80275j029919p36137k97937Q2028Q68243
27840e57233J062060M97692j22763n65645o13330l38355l4793J95345L00405l02630
27830d79247K64662J92677J6881L1578P508K41069J182K87890j18444m91331L6210
27819i365L48258L12404N8514m18627l46126l0470K11618K92412k13286J67245
27809C72577K85977P8622J62472J51234m04420m03629K01361N83242M78696m66354
27799A039778r26399K08165P46846j54152l34474k21512l20623l53172k61351
27790e76894O5905K45801j37472l63437L37191O04160N87523J12971P1538m64952
$$ plain form
27860 -729817 -624196 -425575 -359463 -90168 124219 578331 937543 336360 -238031 -132115
27850 -132115 -69038 202789 650642 1036764 556489 -473430 -1209567 -1507504 -1425476 -557233
27840 -557233 504827 1002519 879756 314111 -299219 -637574 -672367 -477022 -176617 -479247
27830 -479247 -214585 -21908 -5027 26551 34059 275128 276310 564200 445756 -45575 -9365
27819 -9365 338893 651297 709811 291184 -54942 -85412 126206 418618 205332 372577
27809 372577 658554 737176 899648 1050882 646462 242833 444194 1027436 1506132 1039778
27799 1039778 113379 321544 1068390 914238 579764 358252 37629 -315543 -576894
27790 -576894 -510989 -265188 -402660 -766097 -428906 175254 762777 875748 947286 482334
27780D82334j133492j125587M7145O95771R15234k2348o86521K10203M89873j5589
27770a42977J02506L87952K26938L0753p9478k07051K16064J40146J8159j66667
27760E26345m24723o3821P82969M56814J61099K09192o12875q53014k2481J29542
27750B89047k80402l26027k58109J12267L81843R3259k39415n39K22910J8179
27740A3013k16323m25507o36019l7400J141738Q44264j62962p05138o76085l1069
27730h91488J89371K00933J72809n03646l70841J73213O73153M55908l20616j08477
27720c29681J45323j39247J20313P7505K61501K50159k57920J87119K7331L15807
27710F58210j25085l24635k01464k00398l2029N35827O26144j26448o62112l32639
$$ plain form
27780 482334 -651158 -1776745 -1729600 -1033829 -118595 -140943 -827464 -617261 -127388 -142977
27770 -142977 -40471 347481 574419 605172 525694 318643 534707 674853 693012 526345
27760 526345 101622 37801 820770 1277584 1438683 1647875 1035000 181986 159505 289047
27750 289047 8645 -317382 -575491 -463224 -81381 11878 -227537 -228076 -5166 13013
27740 13013 -203310 -628817 -1264836 -1302236 -160498 683766 520804 -184334 -860419 -891488
27730 -891488 -702117 -501184 -328375 -832021 -1202862 -1029649 -356496 99412 -221204 -329681
27720 -329681 -184358 -323605 -203292 -125787 135714 385873 127953 315072 342403 658210
27710 658210 533125 208490 7026 -193372 -225401 310426 936570 810122 148010 -184629
27700a84629N6535k12621J34599K23753k29627n5221k66078m09578P3734N01236
27690c67897M64968K59702k33939m5780M78725L89344Q5572J95297l48382j119987
27680b42377o33957k8436K7394M14494M53018m4340k47757J04473N762J14983
27670g6743k59471m29058Q1142O76930P9205j67828L04983P30455O08989l84504
27660A164100l40247m4409l57837m71575M64987N63162l26375n91585k58153J4991
27650a82941J39877j47873j68954L57839P01348M30020m9328j43166l44353Q217
27640F00686m6280k54784j33203Q9731L46646j76921l18383J64871K28879L37282
27630H38524K44273k75660p92829n86522J1134l93813j126950o40909Q4644O27974
$$ plain form
27700 -184629 -128094 -340715 -206116 17637 -211990 -267211 -533289 -942867 -869133 -367897
27690 -367897 97071 356773 122834 77054 555779 945123 1030695 1225992 877610 -242377
27680 -242377 -876334 -904770 -877376 -462882 -9864 -54204 -301961 -197488 -191726 -76743
27670 -76743 -336214 -765272 -684130 -7200 72005 -95823 209160 939615 1548604 1164100
27660 1164100 823853 779444 421607 -49968 415019 978181 651806 60221 -197932 -182941
27650 -182941 -43064 -190937 -359891 -2052 699296 1129316 1079988 936822 592469 600686
27640 600686 554406 299622 166419 256150 602796 425875 107492 272363 501242 838524
27630 838524 1082797 807137 14308 -572214 -561080 -954893 -2081843 -2722752 -2638108 -2010134
27620b010134j21184l97436L25980J028141Q18313Q16561m8542m53185N98640
27611E57154J52380K6548M62653J71642k35135l44978n80789l18320J5124l88638
27601d82359l6688K93847L83633L41527L46819k69928m92158k93499l8749K86963
27591C9408J50327K50737N84010J28446n675J90552o2086m83280q21062n02619
27581e31242M88808R71160M49847Q2386l04281r22210o71919j95243k71034q2763
27571i86491n8021J967L17643J90218O58364Q30799l1086j029958r13806K76311
27561g44060N26116L60945J1373m05662l55634n12547k54021P2090J17104o4032
27551a248328j3308P26811J105556J302386R33429p41059j146946l9553P95057
$$ plain form
27620 -2010134 -2131318 -2528754 -2202774 -1174633 -356320 460241 411699 -41486 557154
27611 557154 709534 736082 1198735 1370377 1135242 790264 209475 -108845 -93721 -482359
27601 -482359 -519047 -225200 158433 499960 846779 576851 84693 -208806 -247555 39408
27591 39408 189735 440472 1024482 1152928 1147253 1337805 1275719 792439 -28623 -531242
27581 -531242 -42434 928726 1378573 1460959 1156678 234468 -437451 -632694 -903728 -986491
27571 -986491 -1044512 -1042545 -724902 -534684 123680 954479 923393 -106565 -1020371 -744060
27561 -744060 -217944 143001 154374 -251288 -606922 -1119469 -1373490 -1301400 -1184296 -1248328
27551 -1248328 -1261636 -534825 570731 1873117 2806546 2065487 918541 878988 1674045
27542A674045O70312N7969n28599j029866j028421m06137K60406L32755j04616
27533a02152o21039K36579J29690p1102N30904K67015n05235J53622L8441l18089
27523b61366j83689R2659L46020M68228N71664M32914K03885j97779j47762l40793
27513I83981k63478l51409k64776O2390J22025J44005L26791L46814J50589j68686
27503A088246o08351n36397k95009N41016M79189q5370m28472k36437l2026j43803
27493b57414K44568m9264J35024N71441l25137r80634q9770R0200O6057M09445
27483a85484L00411M84727J17110k61678n47318m89740O10298P70685K37665M66342
27473A503018K61746k97421k69665K85241l2997n71301n17137l26302K22178M14992
$$ plain form
27542 1674045 2344357 2402326 1873727 843861 -184560 -590697 -330291 2464 -102152
27533 -102152 -723191 -486612 -356922 -428024 102880 369895 -135340 18282 56723 -261366
27523 -261366 -445055 -352396 -6376 461852 1033516 1466430 1670315 1472536 1324774 983981
27513 983981 720503 369094 104318 166708 288733 432738 759529 1106343 1256932 1088246
27503 1088246 479895 -56502 -351511 189505 668694 583324 154852 -81585 -113611 -257414
27493 -257414 -12846 -62110 72914 644355 319218 -661416 -751186 -660986 -594929 -185484
27483 -185484 114927 599654 716764 455086 -92232 -581972 28326 799011 1036676 1503018
27473 1503018 1764764 1467343 1197678 1482919 1449922 878621 361484 35182 257360 672352
27463F72352J80592k20857l02897m22490j83521j12535j004888n44141L39358
27454a599027N54209K48724J96759L70160K00247m7097J73495L19017M74462j2172
27444H78777n17357L60074K89223J72983L9934q82694o22052K0819k93308L14321
27434b39280L62140J51498M09048j07006J93153j08575n61329l70862k95609j13653
27424f80475L25503N79197J45810o7245l55042k70230M8253n22242r1675O55457
27414b32689L26511l67826K56346M26085k52064m00351l18383k13566K47321L04393
27404b24223N4956m92426k4601K5360K31976N10110M83388p3058j17188J84734
27394E59028N2479k40766m5468n90726k89757P87922J18809n3927J49000R0995
$$ plain form
27463 672352 852944 632087 329190 -93300 -276821 -389356 -1394244 -1938385 -1599027
27454 -1599027 -1044818 -796094 -599335 -229175 -28928 -76025 97470 416487 890949 878777
27444 878777 361420 721494 1010717 1183700 1223634 340940 -281112 -260293 -553601 -239280
27434 -239280 122860 274358 683406 576400 769553 660978 99649 -271213 -566822 -680475
27424 -680475 -354972 224225 370035 302790 -52252 -322482 -274229 -796471 -888146 -232689
27414 -232689 93822 -274004 -17658 408427 156363 -243988 -562371 -775937 -528616 -224223
27404 -224223 -169267 -661693 -686294 -660934 -428958 81152 564540 491482 374294 559028
27394 559028 611507 370741 325273 -265453 -555210 232712 351521 297594 446594 537589
27384E37589K54157k69285r48359n12624M33531O45834n2228j83911J43577o2623
27374a4342q16037l64624J55101N622j64814J47323O66215N30057N92409M93169
27364A230079j19172l17341N9296q764m84606m23277M13340M32044l42673o94816
27354b55890k73287J87240O7637k13692n31076J85186L7501J99932n1307l72669
27344a020425n5845J13918O96565L65037L45796P9676l96088K55242P26546L61595
27334A472017j99646j83178J8764j96224o01340j35550j58247K52528P26014O99833
27324A694971N82597O6509l19425k36824m60146j09618K89440j35764q16191p44770
27314a89221m61695N82655Q05326r9807K9401o52067l38785K89797K84896N43091
$$ plain form
27384 537589 791746 522461 -425898 -938522 -504991 140843 88615 -95296 48281 -14342
27374 -14342 -830379 -1195003 -1039902 -1034280 -1199094 -1051771 -385556 144501 736910 1230079
27364 1230079 1110907 793566 852862 844098 359492 -63785 349555 781599 438926 -255890
27354 -255890 -529177 -341937 -274300 -487992 -1019068 -833882 -796381 -596449 -647756 -1020425
27344 -1020425 -1076270 -962352 -265787 99250 445046 524722 128634 383876 1110422 1472017
27334 1472017 1272371 1089193 1107957 911733 310393 174843 16596 269124 995138 1694971
27324 1694971 2277568 2344077 2024652 1787828 1327682 1218064 1507504 1371740 555549 -189221
27314 -189221 -650916 -68261 737065 637258 666659 14592 -324193 -34396 250500 793591
27304G93591R01130k45950o60136k95352k48273L18436l8540n53564j07724L8212
27294i8170j36057o28156m77772N75261L25292j56054L34750K35830l20324k87887
27284f33287j32854J11987P30096O97073K0156o90714r67886o37328l98237j05534
27274b006528J16854K33204M20617j35190j98294j36721K50844L66288K43199
27265h45727K34440L72521l7661k03779J40623j52333l34994l44622K28300R75700
27255C2468R03369j68349j91857j54742N50389K75834o80377j036066m17814m6453
27245i33598k65959r9004R27040O28477k17239l51378k71066K55287J77604n06285
27235f56121k12711K04740K42733L79694J59314L90810L19265J1578L09872J37317
$$ plain form
27304 793591 1694721 1448771 788635 493283 245010 563446 524906 -28658 -136382 -98170
27294 -98170 -234227 -862383 -1340155 -764894 -439602 -595656 -260906 -25076 -345400 -633287
27284 -633287 -766141 -654154 75942 773015 793171 102457 -865429 -1502757 -1900994 -2006528
27274 -2006528 -1889674 -1656470 -1235853 -1371043 -1569337 -1706058 -1455214 -1088926 -845727
27265 -845727 -611287 -238766 -276427 -480206 -339583 -491916 -826910 -1171532 -943232 32468
27255 32468 935837 767488 575631 420889 971278 1247112 566735 -469331 -887145 -933598
27245 -933598 -1199557 -1298561 -371521 256956 39717 -311661 -582727 -327440 -149836 -656121
27235 -656121 -868832 -664092 -421359 -41665 117649 508459 827724 839302 1149174 1286491
27225A286491o91335p48185q32586m09188N84934M68959p4939L5421k02837n40797
27215a124062k12831R9896J43198Q8422j34366O6883r982L82348K30587k23505
27205f93412k44897l70165J7625J43332j03327P441l21264n1219N46633N03786
27195e65467M17080O24036O00539J49747r8927n96679n76919r7114O34174P31497
27185A221967L88767o51789j013982j87010K19012n02661n03823O27277O69176
27176B66934M37558K22170n35679o34535L17699K65661j24983m59955o15668k51134
27166a111932M5905L66298J73217L3878L46219O07662J50207o43048n48003J02301
27156d77296M40522J06737O972R6333m27899m8608k28510j20745M61926j39951
$$ plain form
27225 1286491 595156 -153029 -985615 -1394803 -809869 -340910 -415849 -380428 -583265 -1124062
27215 -1124062 -1336893 -1236997 -1093799 -1005377 -1139743 -1072860 -1082842 -700494 -469907 -693412
27205 -693412 -938309 -1308474 -1290849 -1147517 -1250844 -1243403 -1564667 -1615886 -1069253 -565467
27195 -565467 -148387 475649 1076188 1225935 1127008 530329 -46590 -143704 490470 1221967
27185 1221967 1610734 958945 -55037 -242047 -23035 -525696 -1029519 -402242 266934
27176 266934 704492 926662 390983 -243552 74147 339808 214825 -245130 -860798 -1111932
27166 -1111932 -1066027 -699729 -526512 -492634 -146415 461247 611454 -31594 -579597 -477296
27156 -477296 -36774 69963 76935 173268 -254631 -303239 -531749 -652494 -190568 -330519
27146c30519k21095Q1144O9882L72528R6963j50507o31411J10172P92245p3387
27136A16015l23642N30605O74712L86153J81127j90401j53270l1610n3350k33935
27126I02404K2066k44775r01024p50477m35664k04058K31484N69771N66576L41906
27116I8209M7757P1669Q51546P0837m35610r8276O100k74945m44882j27082K34826
27105A49j95265K6166L41550K51176Q7554j153K88067m98930m6436P39980L01157
27094A294015n36485n85838J05306J39156o4402o71915o30567N60724L00076J62014
27084G2084m63182m68015j01938m43197l68834M16767L86971k22454o15401K52627
27074a554572J057208N86016L87248O36565J47902K1427k28980p83818n98512
$$ plain form
27146 -330519 -551614 -470470 -400588 -28060 68903 -81604 -713015 -602843 189402 116015
27136 116015 -207627 322978 997690 1383843 1564970 1374569 1221299 1189689 1136339 902404
27126 902404 924470 679695 -221329 -971806 -1407470 -1611528 -1380044 -810273 -243697 98209
27116 98209 145966 217635 1069181 1140018 704408 606132 612232 337287 -107595 -234677 149
27105 149 -195116 -168950 172600 423776 511330 510177 798244 299314 252878 992858 1294015
27094 1294015 757530 171692 276998 416154 351752 -320163 -950730 -390006 -89930 72084
27084 72084 -391098 -859113 -961051 -1404248 -1773082 -1356315 -969344 -1191798 -1807199 -1554572
27074 -1554572 -497364 88652 475900 1112465 1260367 1281794 1052814 268996 -329516
27065c29516J82543N23429N17353L31132k88680p89078p82920r9593k48094l68844
27055a352268M48905O09065M2103K10399M9776J16176J76525K02170J70819o87687
27045a4017q05322j25650K34626M89374J01721n52448N93013R91231K39600L00858
27035A452986L15686J55207k58295o93911l57844L43421J69633j69698o8128j23500
27025G65557m42664m39737k92227n43183l16996M6819J18370J85877J8118l002
27015i03068j74685N1317J79623Q2450N03718N94634N93682L20224o95672n96627
27005d4404k76604n80864n80673q1264K46793M33876J46654L27522Q64218L0431
26995D85685m99608n74719k55153M6095K3203j43658k96484L62401O65358j59181
$$ plain form
27065 -329516 -146973 376456 893809 1224941 936261 147183 -635737 -735330 -983424 -1352268
27055 -1352268 -903363 -294298 -252195 -41796 7980 124156 300681 502851 673670 -14017
27045 -14017 -819339 -944989 -710363 -220989 -119268 -671716 -78703 912528 1152128 1452986
27035 1452986 1768672 1923879 1665584 971673 613829 957250 1126883 957185 889057 765557
27025 765557 322893 -116844 -409071 -952254 -1269250 -1222431 -1104061 -918184 -900066 -903068
27015 -903068 -1077753 -1026436 -846813 -764363 -260645 333989 927671 1247895 552223 -44404
27005 -44404 -321008 -901872 -1482545 -1563809 -1317016 -883140 -736486 -408964 455254 485685
26995 485685 -13923 -588642 -843795 -797700 -774497 -918155 -1214639 -852238 -186880 -346061
26985c46061p02471k28561Q80705Q39061m53716j054591j13839P91778J033319
26976F45624L06022k89263l48821j74172L67121l30687q78355p11074j71925N93159
26966i92371N14285K71774J06336K4619J02384K57625O25799L3161n50763o41123
26956b48274L10066J32950J2009J20771l165J07562K46367j39401j2666M5900
$$ plain form
26985 -346061 -1048532 -1277093 -396388 442673 -11043 -1065634 -1179473 -387695 645624
26976 645624 951646 662383 313562 139390 506511 175824 -702531 -1413605 -1585530 -992371
26966 -992371 -478086 -206312 -99976 -75357 27027 284652 910451 943612 392849 -248274
26956 -248274 61792 194742 206751 327522 324357 431919 678286 538885 526219 572119
$$ [...]
##END NTUPLES=NMR SPECTRUM
##END=
