##TITLE=C13_DDQ-easychem(+1)
 aceton, 1800 sc

 27.9.2019
##JCAMPDX= 6.0         $$ Bruker NMR JCAMP-DX V2.0
##DATA TYPE= NMR SPECTRUM
##DATA CLASS= NTUPLES
##ORIGIN= UXNMR, Bruker Analytische Messtechnik GmbH
##OWNER= root
$$ XWIN-NMR		Version 3.5
$$ Fri Sep 27 16:41:28 2019 Russian Standard Time (UT+4h)  she@DPX200
##.OBSERVE FREQUENCY= 50.327896
##.OBSERVE NUCLEUS= ^13C
##.ACQUISITION MODE= SIMULTANEOUS
##.ACQUISITION SCHEME= undefined
##.AVERAGES= 1800
##.DIGITISER RES= 17
##SPECTROMETER/DATA SYSTEM= spect
##.PULSE SEQUENCE= zgpg30
##.SOLVENT NAME= DMSO
##.SHIFT REFERENCE= (INTERNAL, DMSO, 0, 222.624)
##AUDIT TRAIL= $$ (NUMBER, WHEN, WHO, WHERE, WHAT)
$$ ##TITLE= Audit trail, XWIN-NMR		Version 3.5
$$ ##JCAMPDX= 5.01
$$ ##ORIGIN= Bruker BioSpin GmbH
$$ ##OWNER= she
$$ F:/spectra/data/she/nmr/c13/1/pdata/1/auditp.txt
$$ ##AUDIT TRAIL=  $$ (NUMBER, WHEN, WHO, WHERE, WHAT)
(   1,<2019-09-27 16:40:29.35 +0400>,<she>,<DPX200>,
      <created by zg, POWCHK disabled, PULCHK disabled
       terminated by command 'halt'
       configuration hash MD5:
       00 E9 B6 7A A2 85 ED C7 34 08 36 98 17 FE 4E 26
       data hash MD5: 32K
       D9 50 86 5A 17 89 EB F2 25 B5 40 45 A7 24 76 8C>)
(   2,<2019-09-27 16:40:31.75 +0400>,<she>,<DPX200>,
      <Start of raw data processing
       efp BC_mod = 2 LB = 1 FT_mod = 6 PKNL = 1 PHC0 = -372.642 PHC1 = 25.20636 SI = 32K 
       data hash MD5: 32K
       58 B7 BD F3 47 EA 8D 10 08 CD E5 78 D5 81 FC 2C>)
(   3,<2019-09-27 16:40:34.43 +0400>,<she>,<DPX200>,
      <abs ABSG = 5 
       data hash MD5: 32K
       7F 4A F8 16 DA 12 BF 90 B9 2B 07 C1 04 5D 6C 21>)
(   4,<2019-09-27 16:40:47.90 +0400>,<she>,<DPX200>,
      <pk PHC0 = -1.128965 PHC1 = 0.6 
       data hash MD5: 32K
       95 57 99 36 69 6F 53 A9 4D DF 1C 79 93 32 F6 37>)
(   5,<2019-09-27 16:40:51.46 +0400>,<she>,<DPX200>,
      <abs ABSG = 5 
       data hash MD5: 32K
       61 C5 61 33 94 CC 0D 6F 7A 31 36 62 6C 72 DE 34>)
$$ ##END=
$$ 
$$ hash MD5
$$ B4 D8 B2 22 26 33 51 D5 49 43 6B A4 E2 5D 54 15
##$RELAX= 
##$RELAX= 
##$RELAX= 
##$RELAX= 
##$RELAX= 
##$RELAX= 
##$RELAX= 
##$RELAX= 
$$ Bruker specific parameters
$$ --------------------------
##$DU= <F:/spectra>
##$EXPNO= 1
##$NAME= <c13>
##$PROCNO= 1
##$TYPE= <nmr>
##$USER= <she>
##$AMP= (0..31)
100 100 100 100 100 100 100 100 100 100 100 100 100 100 100 100 100 100 
100 100 100 100 100 100 100 100 100 100 100 100 100 100 
##$AQSEQ= 0
##$AQ_mod= 1
##$AUNM= <au_zg>
##$AUTOPOS= <>
##$BF1= 50.322709
##$BF2= 200.13
##$BF3= 50.322709
##$BF4= 500.13
##$BF5= 500.13
##$BF6= 500.13
##$BF7= 500.13
##$BF8= 500.13
##$BYTORDA= 1
##$CFDGTYP= 0
##$CFRGTYP= 5
##$CHEMSTR= <none>
##$CNST= (0..31)
1 1 145 1 1 1 1 1 1 1 1 1 1 1 1 1 1 1 1 1 1 1 1 1 1 1 1 1 1 1 1 1 
##$CPDPRG= <waltz16>
##$CPDPRG1= <>
##$CPDPRG2= <waltz16>
##$CPDPRG3= <>
##$CPDPRG4= <mlev>
##$CPDPRG5= <mlev>
##$CPDPRG6= <mlev>
##$CPDPRG7= <mlev>
##$CPDPRG8= <mlev>
##$CPDPRGB= <>
##$CPDPRGT= <>
##$D= (0..31)
$$ [...]
##$SUBNAM4= <"">
##$SUBNAM5= <"">
##$SUBNAM6= <"">
##$SUBNAM7= <"">
##$SUBNAM8= <"">
##$SUBNAM9= <"">
##$SW= 239.972175391363
##$SWIBOX= (0..15)
0 1 3 0 0 0 0 0 0 0 0 0 0 0 0 0 
##$SW_h= 12077.2946859903
##$TD= 32768
##$TD0= 1
##$TE= 0
##$TE2= 300
##$TE3= 300
##$TEG= 300
##$TL= (0..7)
120 120 120 120 120 120 120 120 
##$TP= (0..7)
150 150 150 150 150 150 150 150 
##$TP07= 0
##$TPNAME0= <>
##$TPNAME1= <>
##$TPNAME2= <>
##$TPNAME3= <>
##$TPNAME4= <>
##$TPNAME5= <>
##$TPNAME6= <>
##$TPNAME7= <>
##$TPOAL= (0..7)
0.5 0.5 0.5 0.5 0.5 0.5 0.5 0.5 
##$TPOFFS= (0..7)
0 0 0 0 0 0 0 0 
##$TUNHIN= 0
##$TUNHOUT= 0
##$TUNXOUT= 0
##$USERA1= <user>
##$USERA2= <user>
##$USERA3= <user>
##$USERA4= <user>
##$USERA5= <user>
##$V9= 5
##$VALIST= <valist>
##$VCLIST= <CCCCCCCCCCCCCCC>
##$VD= 0
##$VDLIST= <DDDDDDDDDDDDDDD>
##$VPLIST= <PPPPPPPPPPPPPPP>
##$VTLIST= <TTTTTTTTTTTTTTT>
##$WBST= 1024
##$WBSW= 4
##$XGAIN= (0..3)
0 0 0 0 
##$XL= 0
##$YL= 0
##$YMAX_a= 11071244
##$YMIN_a= -9525845
##$ZGOPTNS= <>
##$ZL1= 120
##$ZL2= 120
##$ZL3= 120
##$ZL4= 120
##$ABSF1= 222.624
##$ABSF2= -17.3728
##$ABSG= 5
##$ABSL= 3
##$ALPHA= 0
##$AQORDER= 0
##$ASSFAC= 0
##$ASSFACI= 0
##$ASSFACX= 0
##$ASSWID= 0
##$AUNMP= <proc_1d>
##$AZFE= 0.1
##$AZFW= 0.5
##$BCFW= 0
##$BC_mod= 2
##$BYTORDP= 0
##$COROFFS= 0
##$CY= -3
##$DATMOD= 1
##$DC= 0
##$DFILT= <>
##$DTYPP= 0
##$F1P= 0
##$F2P= 0
##$FCOR= 0.5
##$FTSIZE= 32768
##$FT_mod= 6
##$GAMMA= 0
##$GB= 0
##$INTBC= 1
##$INTSCL= 4.134877e-10
##$ISEN= 128
##$LB= 1
##$LEV0= 0
##$LPBIN= 0
##$MAXI= 10000
##$MC2= 0
##$MEAN= 0
##$ME_mod= 0
##$MI= 0.1934396
##$NCOEF= 0
##$NC_proc= 0
##$NLEV= 6
##$NOISF1= 120.0001
##$NOISF2= 80.00006
##$NSP= 0
##$NTH_PI= 0
##$NZP= 0
##$OFFSET= 222.624
##$PC= 1.4
##$PHC0= -373.771
##$PHC1= 25.80636
##$PH_mod= 1
##$PKNL= yes
##$PPARMOD= 0
##$PSCAL= 0
##$PSIGN= 0
##$REVERSE= no
##$SF= 50.3227315989248
##$SI= 32768
##$SIGF1= 140
##$SIGF2= 120
##$SINO= 11.81781
##$SIOLD= 32768
##$SREGLST= <13C.CDCl3>
##$SSB= 0
##$STSI= 32768
##$STSR= 0
##$SW_p= 12077.2946859903
##$SYMM= 0
##$S_DEV= 0
##$TDeff= 32768
##$TDoff= 0
##$TI= <>
##$TILT= no
##$TM1= 0
##$TM2= 0
##$TOPLEV= 0
##$USERP1= <user>
##$USERP2= <user>
##$USERP3= <user>
##$USERP4= <user>
##$USERP5= <user>
##$WDW= 1
##$XDIM= 32768
##$YMAX_p= 457994679
##$YMIN_p= -3548181
$$ End of Bruker specific parameters
$$ ---------------------------------
##NTUPLES= NMR SPECTRUM
##VAR_NAME=  FREQUENCY,     SPECTRUM/REAL,   SPECTRUM/IMAG
##SYMBOL=    X,             R,               I
##VAR_TYPE=  INDEPENDENT,   DEPENDENT,       DEPENDENT
##VAR_FORM=  AFFN,          ASDF,            ASDF
##VAR_DIM=   32768,         32768,           32768
##UNITS=     HZ,            ARBITRARY UNITS, ARBITRARY UNITS
##FACTOR=    0.368581032318806, 1,           1
##FIRST=     11203.0474431902, 0,            0
##LAST=      -874.247242800138, 0,           0
##MIN=       -874.247242800138, -3548181,    0
##MAX=       11203.0474431902, 457994679,    0
$$ Real data points
##PAGE= N=1
##DATA TABLE= (X++(R..R)), XYDATA
$$ [...]
9312a278379N62401M62109j56841j38380N8187J13552N06874J69975l27098J89181
9302A61581J07746m7730j58154n86963l30237o1128J11131J62450J72337k08063
9292f77030k56892J92532N41594Q4370j17066L59781K45922n8298l34501j90268
9282b09856J75945R7445J19324M03791K12029J6318k09346m93548l96857p3597
9272c58352K29805J49178M60287R07479L49732k83261l13854j0629k38447o36312
9262B55626o44853l18582P2307K17031l2613j86477J2025N6835j6172K41662N64157
9251B20946Q9888l84907j0961o96125j055371J1769O85188R88367M85183M09702
9241G43679K43858o26993q64292m67768K40017M85586N48316j83382q52142L07311
$$ y = [-1278379, -715978, -253869, -410710, -549090, -490903, -377351, 129523, 299498, -27600, 161581, 269327, 221597, 63443, -523520, -853757, -914885, -803754, -641304, -468967, -677030, -933922, -741390, -199796, -115426, -232492, 127289, 373211, 314913, -19588, -209856, -33911, 63534, 182858, 586649, 798678, 814996, 605650, 112102, -284755, -358352, -128547, 20631, 480918, 1388397, 1738129, 1454868, 1141014, 1130385, 891938, 255626, -389227, -707809, -635502, -418471, -451084, -637561, -625536, -568701, -584873, -343211, 220946, 310834, -74073, -85034, -781159, -1836530, -1824761, -1139573, -151206, 333977, 743679, 987537, 360544, -503748, -971516, -731499, -245913, 302403, 119021, -733121, -425810]
9231d25810N45629m7846o1886m36482j48989K34567K61970M0926l82395m76662
9221h96978k92379J72381K67616P2968j2080k20474j97364j1846M46101l6912
9211g08967n00409m11380K15857M27830O863M4773L07600J91568J99406n2604
9201b79463l54233J60536J81660m3632k79343j5209J04179M02473l3804l47892
9191e04728R157M03269O81549K71575K74556L81705k34793n65653l25973k75967
9181A14697l15267n15039k29238N50655M10382M19865K39247n23067n82317m6491
9171d76573K80412L92826J50218L26634r6375k94505o3211k66746k53922n7208
9161c58450L8774J44940K7630K74974M26369M2451j2694J79418o91863j027004
$$ y = [-425810, 119819, 71973, 10087, -426395, -575384, -340817, -78847, -37921, -420316, -896978, -1189357, -1016976, -749360, -676392, -688472, -908946, -1106310, -1118156, -672055, -708967, -1209376, -1620756, -1404899, -977069, -970206, -925433, -617833, -426265, -226859, -279463, -633696, -473160, -291500, -335132, -614475, -629684, -525505, -123032, -156836, -504728, -495571, -92302, 589247, 860822, 1135378, 1517083, 1282290, 716637, 390664, 114697, -200570, -715609, -944847, -394192, 16190, 436055, 675302, 152235, -430082, -476573, -196161, 196665, 346883, 673517, 577142, 282637, 219426, -47320, -301242, -358450, -319676, -174736, -147106, 127868, 554237, 596688, 583994, 763412, 71549, -955455]
9151i55455j22164q7029J19060N45841P32218K82556k3923k99450k35624K79967
9141B35997K72839L11314K11229J79743L02558j33345o17358p05782l25521N03288
9131B34962Q3834r3864K67385O02689j02269p58530q5076M57628J91391K6089
9121H24239j85353o26109k34490j19342r1855j73334K02880J67356j12611j5089
9111c63708j09049j76066K80210O64034P6983m58941J50991L03279Q6500M78498
9101I32731J07996q9965m4993j12672l09818k28378L06637N52842K63661l55666
9091A022375p72851l63529n49370l40239L67327J99294L0682P6864K60735J7864
9081e0848j1640K67394J23050O3195l86204o82823o78213k58351O3051L32074
$$ y = [-955455, -1077619, -1164648, -1045588, -499747, 232471, 515027, 491104, 191654, -43970, 235997, 508836, 820150, 1031379, 1211122, 1513680, 1380335, 762977, 57195, -268326, 234962, 318796, 224932, 492317, 1095006, 992737, 234207, 149131, 606759, 798150, 824239, 638886, 12777, -221713, -341055, -432910, -606244, -403364, -236008, -348619, -363708, -472757, -648823, -368613, 295421, 372404, -86537, 64454, 367733, 454233, 932731, 1040727, 950762, 905769, 793097, 483279, 254901, 561538, 1114380, 1378041, 1022375, 249524, -114005, -663375, -1003614, -636287, -436993, -406311, -329447, -68712, -50848, -62488, 204906, 327956, 391151, 4947, -677876, -1356089, -1614440, -1551389, -1219315]
9071a219315Q60874N43269j64246k14582J36570R4402n0477K41373K90964j21974
9061C96858p63780j76401M34323K01629M1176k14044K90096L78629O7424N7034
9051G12944k58065l99829L13086M0290j52528Q1094L2777k87301j85344N3636
9041d9240j8095r3170P7781j28395M514J82482k82865j52070L43085K16813J13299
9030B14139j45488p641K61083K72732j40271l13916k93327l02553j2083K79161
9020a88164M4768k61698l64996m6315K65213L53998K62186L20836K31972n1029
9010E66771o207k00922o51548n65788o00667l92273M58466P89394P28170J21122
9000B46518l35267m3971p1837j85374k69311k67514J60537J77568j79703k80585
$$ y = [-1219315, -358441, 184828, 20582, -194000, -57430, 36972, -13505, 227868, 518832, 396858, -366922, -543323, -109000, 92629, 133805, -80239, 209857, 588486, 655910, 712944, 454879, 55050, 368136, 408426, 255898, 336992, 369769, 82468, -102876, -49240, -67335, -160505, -82724, -211119, -206605, -24123, -306988, -459058, -115973, 100840, 214139, 68651, 61010, 322093, 594825, 454554, 140638, -152689, -455242, -467325, -188164, -143396, -405094, -770090, -816405, -551192, -197194, 64992, 385828, 617800, 566771, 560564, 359642, -291906, -857694, -1458361, -1850634, -1392168, -602774, 125396, 246518, -88749, -132720, -204557, -389931, -659242, -926756, -766219, -588651, -768354, -1048939]
8990a048939L84032J052151M34802n7477R7824l86847m55965l3220J59246M96457
8980F42064O51351n0634p23981M8783L35202m10006m51138k26744o8803N6056
8970a97850L19276k22036n1786N6573n03941m53722J46289M5301k09312j41442
8960a212650K04143K47977k16756m22343K19454j59538k10614N33117Q77635N41378
8950D01803J9062l47393m39760j28666L63259J22494j92114j75385q8718n1082
8940e16500J03464L55272k34004j78977J1652K26053N54376o861m40411q4705
8930b10641K56428n1653j0931O59451K85878m45829J0791Q5861l28462j30029
8920A20864O2280j8172j28025K25165k747m35391O2324P63168K39925j56779o06509
$$ y = [-1048939, -664907, 387244, 822046, 764569, 862393, 475546, 19581, -13639, 145607, 642064, 1293415, 1242781, 518800, 567583, 902785, 492779, 41641, -185103, -253906, -197850, 121426, -100610, -152396, -95823, -599764, -1053486, -907197, -861896, -1071208, -1212650, -1008507, -760530, -977286, -1399629, -1180175, -1339713, -1550327, -1017210, -139575, 401803, 420865, 73472, -366288, -494954, -131695, -9201, -201315, -376700, -465418, -516500, -413036, -57764, -291768, -470745, -459093, -233040, 321336, 314475, -125936, -210641, 45787, -5866, -16797, 642654, 928532, 482703, 493494, 579355, 250893, 120864, 183144, 164972, 36947, 262112, 259365, -176026, -113702, 649466, 889391, 732612, 126103]
8909A26103o71257k34983P5104J63599K66108O17986L00293j84021l66681l05381
8899b13130M9895J89874J04702j48150j79175K26595J87601p2846l06141K19544
8889E8769L31431p2059o504q3121K39654L0040m46361Q9000J13567p8580k84727
8878a08891l3231J31404m2789o03709J63754O86092k1742j17462l28508m81896
8868g56978J61351P37922M13203K33342J93641P7349j02060m57267m4418l09306
8858A46779j32464J58556K81648J83172k81112n2032O4012l25059o90769k66319
8848i13588q6875L32815N3964m63451K51818O80635m4322n0709L51541L61537
8838D73365L56361L86712L60867j00138j35422m17614o18745k20504M97986N64849
$$ y = [126103, -545154, -780137, -705033, -541434, -275326, 342660, 642953, 458932, 92251, -213130, -163235, 26639, 131341, -16809, -195984, 30611, 218212, 145366, -160775, 58769, 390200, 318141, 311637, 228516, 468170, 498210, 51849, 140849, 254416, 175836, -108891, -142122, -10718, -53507, -657216, -493462, 192630, 170888, 53426, -275082, -756978, -595627, 142295, 555498, 788840, 982481, 1059830, 957770, 500503, 456085, 146779, 14315, 172871, 454519, 637691, 356579, 304547, 368559, 43500, -647269, -913588, -1000463, -667648, -613684, -1077135, -825317, -144682, -189004, -239713, 111828, 473365, 829726, 1216438, 1577305, 1477167, 1341745, 924131, 305386, 84882, 582868, 1147717]
8828A147717J84188O7357m22468j085260o35199K57313J02587j0686L22010K7668
8818d4773l39483l65995j36767q0006l8993K41562l64015k80228K55146L46417
8808h07135l3218k8582L6865k21901n486P4021J30391O21105K97035L39543O8035
8797D70673j62794m5895j90628M5242N21414L26335j22304n0354j33013n81249
8787G7427j92064J97106k8765K87088k5773k1831N7130J17370K98734j58421k45746
8776C62255K64159j8464k85990L05211K50581r6471k70515j52925j91303J37674
8766C04212j18504j91139m4580L94953N23134L17026J99429j98656o76909r91998
8756d83032l39494J56919j79487k0206J32870j93471j00232K23588M57053m5213
$$ y = [1147717, 1331905, 1399262, 976794, -108466, -743665, -486352, -383765, -394451, -72441, -44773, -384256, -750251, -887018, -967024, -1006017, -764455, -1128470, -1408698, -1153552, -807135, -840353, -868935, -832070, -1053971, -1059457, -985436, -855045, -233940, 63095, 402638, 470673, 307879, 261984, 71356, 116598, 638012, 964347, 842043, 791689, 658676, 77427, -114637, 82469, 53704, 340792, 315019, 293188, 350318, 467688, 766422, 608001, 362255, 626414, 607950, 321960, 627171, 877752, 781281, 510766, 357841, 166538, 304212, 185708, -5431, -50011, 344942, 868076, 1185102, 1384531, 1185875, 508966, -483032, -822526, -665607, -845094, -865300, -732430, -925901, -1026133, -802545, -345492, -390705]
8746c90705J1200J93207l33656l13232J54827M45703k03995p3989L09241J42862
8736e8537n6605o5472j41844j45654l5652O4741L24961J43958l00171j72631M61580
8725A8674M14367K26231J12514p9324N8113o0964j38080Q6302J61236J73617L63998
8714A336684K24409j38685k91003m95763Q5485N11867j40787r25343m82091J54670
8704a60557K10346m5816J00485J11395l01690m03873L12377M56297J39742k16787
8694B01919r4915r1770n9332K80300J41348j21413Q815M70318K73824j93048l19638
8683D96408n83741k69847K54351O16733P15190L79511j79166l39178Q7186j03279
8673A074168n07929j18045L21161N52451L73806n56557j033021p18435k10809
$$ y = [-390705, -379505, -186298, -519954, -833186, -678359, -232656, -436651, -510640, -201399, -58537, -115142, -180614, -322458, -468112, -503764, -439023, -114062, 29896, -270275, -442906, 18674, 433041, 659272, 771786, 692462, 750575, 689611, 551531, 637833, 799069, 972686, 1336684, 1561093, 1422408, 1131405, 635642, 721127, 1232994, 1092207, 166864, -315227, -160557, 49789, 3973, 104458, 215853, -85837, -489710, -177333, 278964, 418706, 201919, 107004, 15234, -44098, 236202, 377550, 256137, 264952, 735270, 1009094, 816046, 496408, -87333, -357180, -102829, 513904, 1229094, 1608605, 1429439, 1090261, 1177447, 1074168, 566239, 448194, 769355, 1321806, 1695612, 1139055, 106034, -612401, -823210]
8664h23210K41375P83480L13129M04577K06824l43510m70079j60829J18982L2162
8654C02901j60981j71566k01766j02567J1484L77265p8254m85659k3724J10456
8644d22411O8581L88263M57402J66259k94265k94047k83639m08927O0287K13335
8634c49162M57597K52976k50365p58892l34481M21405Q2313j27029n16963k11882
8624a334483L16709K82959J71625K79825M59338J55216m19036j21947n52529n01098
8614a263421L08635N80640K09158k83257l17598k53226j19634L12847N31930O3868
8604b30058k53159o44923l85896J97154N65832J38355l11108p6963K50585j12745
8594h62926J55476L62668J34665J99020L07066j57271m79969k67820K62122L03710
$$ y = [-823210, -581835, 201645, 514774, 919351, 1126175, 782665, 312586, 151757, 270739, 302901, 141920, -29646, -231412, -333979, -322495, 54770, -23484, -509143, -532867, -422411, -353830, 34433, 491835, 658094, 363829, 69782, -213857, -622784, -562497, -349162, 108435, 361411, 111046, -647846, -982327, -560922, -478609, -605638, -1122601, -1334483, -1017774, -734815, -563190, -283365, 175973, 331189, -87847, -209794, -762323, -1263421, -954786, -374146, -164988, -448245, -765843, -1019069, -1138703, -825856, -293926, -230058, -483217, -1128140, -1514036, -1316882, -751050, -612695, -923803, -1000766, -750181, -862926, -707450, -344782, -210117, -11097, 295969, 138698, -341271, -609091, -346969, -43259]
8584d3259o957j72620L37453O396j60275k3663j46357o5125J28584J60661l28265
8573c13427j09340j921k61799j30603p775J94371K53549k81001p672L02173L12541
8562e0904K20688j33395j50634m32804j47727M46937M5663P4242N22156N21146
8552I15368L3075K6906J54392L05466J43010j00399m56575m68836k35506o9761
8542B47140K79092M35196n12960j271002j021594m8481N27500R82468R60637K43220
8532H21216m73900p88598K0899L86255K63031m9116m2517k32890j63933Q1704
8522a77849J63215J02368o17920m18307L66929K17451R3042R4524K85143L48623
8512D57219K37933J38534K3205q7871M4795j21488m45650l25521j16361k5698
$$ y = [-43259, -50216, -222836, 114617, 121013, -39262, -62925, -209282, -274407, -145823, 14838, -313427, -422767, -424688, -686487, -817090, -824865, -630494, -376945, -657946, -665618, -363445, -50904, 169784, 36389, -114245, -547049, -694776, -247839, -202176, -127934, 394222, 915368, 948443, 975349, 1129741, 1435207, 1578217, 1477818, 1021243, 552407, 316901, 247140, 526232, 961428, 448468, -822534, -1844128, -1892609, -1365109, -382641, 577996, 821216, 347316, -441282, -420383, -34128, 228903, 179787, 137270, -95620, -259553, -177849, -14634, 87734, -530186, -948493, -581564, -364113, -271071, -176547, 108596, 457219, 695152, 833686, 856891, 769020, 813815, 692327, 246677, -78844, -195205, -220903]
8502b20903j70002n75226m35719K98096K31175K36319N44897L06643K46796J02767
8492E64843j82216q01868o17875j7519L58764L09686N9513m6861l17078K2970
8482f67641M38452J4015k46929j97010L649J9146r3928q7517J9845k33467J50240
8471h81145M16834l50230m16343P28101P22501O28884K31687j51947j41993J96042
8461I82391J21808k22208m28396l95243j62172j45416O050m95534n87112k16607
8451a542439L43124Q97085P76020J44815m12333k79552m22259l04141M57640Q30288
8441D88248M31479k58773l22568o13085m58009O3105J91503O0431K43638L41328
8431A67297K83721k35799l76930N00921M45200K30481n078k69677k34253l32256
$$ y = [-220903, -390905, -966131, -1401850, -1103754, -872579, -636260, -91363, 215280, 462076, 564843, 382627, -419241, -1037116, -1054635, -695871, -386185, -326672, -373533, -690611, -667641, -229189, -215174, -462103, -659113, -655464, -636318, -730246, -817763, -797918, -1031385, -881145, -464311, -814541, -1230884, -502783, 219718, 848602, 1080289, 928342, 786349, 982391, 1104199, 881991, 453595, 58352, -103820, -249236, -243186, -738720, -1325832, -1542439, -1199315, -302230, 473790, 618605, 206272, -73280, -495539, -799680, -342040, 488248, 919727, 660954, 338386, -274699, -732708, -669603, -478100, -417669, -174031, 167297, 451018, 215219, -161711, 339210, 784410, 1014891, 1009813, 740136, 505883, 173627]
8421A73627k12808o2573j7507j67694P3291J48610J77936M57171N6371J13613
8411G40037m0161j66191l12124k10492l01235j62577j43131l45703j05634L28978
8401g18233N93886L03868O85307J37444J36396P8788l93025m25497l26033j64931
8391i2030l51365L8520P65818N92938n19772o11991l30617k43133n9476K14334
8381e96774K61024J26172k67923m05614J51139L68409l54075k46311M71904L02594
8371a89455n69116k48859O22239P27024J28560J09877n3657k0030J40513k78367
8361C68729l25628L28460M14584m86422q4165L07164j28158k0339l3406P711j43740
8350B04790l17812J29125J06171J96743K89613J10603m49443o48600o16956j27895
$$ y = [173627, -39181, -101754, -119261, -286955, -213664, -65054, 112882, 570053, 626424, 740037, 699876, 533685, 221561, 11069, -290166, -452743, -595874, -941577, -1047211, -718233, -124347, 179521, 864828, 1002272, 1138668, 1217456, 824431, 398934, 72901, -92030, -443395, -404875, 360943, 953881, 434109, -177882, -508499, -751632, -811108, -596774, -335750, -209578, -477501, -883115, -731976, -363567, -717642, -963953, -492049, -189455, -758571, -1007430, -385191, 341833, 470393, 580270, 526613, 506583, 647096, 368729, 43101, 371561, 786145, 299723, 215558, 522722, 394564, 374225, 340819, 348530, 204790, -113022, 16103, 122274, 319017, 608630, 719233, 269790, -378810, -995766, -1123661]
8340a123661O76782K79192l84304K78223K31412L9846K92901N32955J49133j56044
8330H16435j46748l60939j87244K60006k8607j24744j57471j14093R2248K76547
8320C25390L58998Q8358k16464R72N21448N17430J1413j61737k25420l00576m7997
8309H71815l82482p93226m03998m65689j91082N47033N77705M79817N21760l25596
8299D36057l02258k1732R828l41006l10983K48397L12297k69474k85829j32234
8289f56937M47660L75328K82744O34225Q06845j82408p02708m97725P3519j29244
8279D51299l99397p3223l3479j18144m20675j12158L80307K08734k16876J93532
8269a40080j31100l02129J4604L01376k06937k76871L87515N42290M50816L60899
$$ y = [-1123661, -446879, -167687, -551991, -273768, -42356, -2510, 290391, 823346, 972479, 816435, 669687, 308748, 121504, 381510, 352903, 228159, 70688, -43405, 48843, 325390, 684388, 772746, 556282, 557254, 1078702, 1596132, 1607545, 1445808, 1220388, 919812, 871815, 489333, -303893, -707891, -1173580, -1364662, -817629, -239924, 239893, 761653, 436057, 133799, 112067, 121895, -219111, -530094, -281697, 30600, -238874, -524703, -656937, -209277, 166051, 448795, 1083020, 1889865, 1707457, 1004749, 507024, 580543, 451299, 51902, -21321, -54800, -172944, -593619, -705777, -325470, -116736, -333612, -140080, -271180, -573309, -558705, -257329, -464266, -741137, -353622, 188668, 639484, 1000383]
8259A000383j62590o07767k57682K36080q5074j10536j63601k79298l2226j8863
8249d81174m2664m532k25209j08967J12382P489L15184L23446n9854l75466J11058
8238d28307R46628M76056p42013o90831k80836L21239K32916j09126j95406j78927
8228f48607K45322n406q625O11688L86542l31376l88243K78842N9107k84297k93218
8217c78271K0061L74594J30969J86905r1220o8464O8366j43296k68054l27573
8207d95983k25162K63089O98977K44091l51407j53679k37790J02038J31909l05939
8197c29856p13195k32779L11123N32362N23057O7711k03849m7517k74027m8588
8187d15558L53360P7871j56330l363L4471J2868Q9203K7413k01509L9446M49150
$$ y = [1000383, 837793, 230026, -27656, 208424, 123350, 12814, -150787, -430085, -462311, -481174, -523838, -528370, -753579, -862546, -750164, -742675, -427491, -104045, -163899, -539365, -428307, 518321, 994377, 252364, -438467, -719303, -398064, -165148, -274274, -469680, -648607, -403285, -408691, -417316, 194372, 580914, 249538, -138705, 140137, 199244, -85053, -378271, -358210, 16384, 147353, 334258, 243038, 174574, 242940, 99644, -168410, -495983, -721145, -458056, 240921, 485012, 133605, -20074, -257864, -155826, -23917, -329856, -1043051, -1275830, -964707, -432345, 90712, 158423, -45426, -92943, -366970, -415558, -62198, 15673, -140657, -144020, -109549, -96681, -7478, 19935, -181574, -142128, 307022]
8176C07022N98215M5702l05222k88001l59648l5082j46438j87693j55959N11905
8166a5199P11917l57465q82234j75438L44252N7725M02707N44715j90775p3117
8156C67088M32978M1215j92255l84641q2711J72401J44545K70319L96438j54311
8146A011066l64341k06410l59874R1662j55834m38097l09087l5745K15025L67729
8136a83906M18743J85429l6612J19890M1628n85982k96140K35568K15957k10882
8126i6307M4850M01001L86163P0995K6233r6896j21938j58178p8698J36248n7197
8115D56276N276L34771R7262k4609M9484n63275n61437k9261k0429J60340K61726
8104A66124R311j53872J39142j61814k51954j17134k66727k73851n8147P9269
$$ y = [307022, 905237, 950939, 645717, 357716, -1932, -37014, -183452, -371145, -527104, -15199, 696718, 339253, -542981, -718419, -374167, -316442, 86265, 630980, 440205, 367088, 800066, 841281, 649026, 264385, 181674, 354075, 498620, 768939, 1165377, 1011066, 646725, 440315, 80441, 172103, 16269, -421828, -730915, -766660, -551635, -183906, 234837, 420266, 383654, 503544, 545172, -40810, -336950, -101382, 114575, -96307, -51457, 349544, 735707, 806702, 832935, 736039, 614101, 455923, 377225, 513473, 456276, 461552, 796323, 893585, 868976, 918460, 355185, -206252, -235513, -255942, -95602, 166124, 175435, 21563, 160705, -1109, -253063, -370197, -636924, -910775, -968922, -889653]
8094h89653K84685M39733M24169J42863j12348k48682m10376n84801m59160M2681
8084a370889J72636L16151P83415O15322J43492l30113n38741l55687m31850l14292
8074a310556K49834M24065J11606M52131N59307J51965j90922m47674m48141K75017
8064a73368J72723K6412k88216l02133J11840N08663K38403o8168K22401K29233
8054F77790J20425K03461q1386l58428q35514p21251M44220L54820k23968l89532
8044h09363q9877J49289k42087P3429L30843L09333K32915M6952k30608l58449
8034e87623l57971m2135j804K58557O43149M00631J33444j64442k44174J07401
8024A45033J99315j24818n03804j41689J25994j06196j82051m8351J45310J65309
$$ y = [-889653, -604968, -165235, 258934, 401797, 289449, 40767, -369609, -954410, -1413570, -1370889, -1198253, -882102, -98687, 516635, 660127, 330014, -208727, -564414, -996264, -1310556, -1060722, -636657, -525051, -72920, 486387, 638352, 447430, -244, -448385, -173368, -645, 25767, -262449, -564582, -452742, 55921, 294324, 226156, 448557, 677790, 798215, 1001676, 920290, 561862, -273652, -994903, -550683, -195863, -419831, -809363, -899240, -749951, -992038, -918609, -587766, -278433, -45518, 1434, -229174, -587623, -945594, -987729, -989533, -730976, -87827, 312804, 446248, 281806, 37632, 145033, 344348, 219530, -284274, -425963, -299969, -406165, -588216, -636567, -491257, -325948]
8014c25948L74917L88718j85830l53584K0282M3538M9091K07076k48404m38657
8004d68801k08194O9370J93525r4559L12304M46109k71786j37788L13730j19919
7994C3991k44877j19949l4490r4332N65698O36105L9276j18208j63446M9277l32050
7983B16995p37703m2262N83208K65474O6109N5692r5496k75014j84279l35129
7973d82405J80720N43210j14167l73972j79745K33275J82368j55553l58038j24409
7963f48716j86125j67834N46023R23640O73582k04756k42612J23837j41426k02034
7953D73579j95066q2478J570k8395L24294L85467J7484M0761K79447J86471R9985
7942A503119P9073L2650M2808j23961j72598l52012k80170j29475O5528J12465
$$ y = [-325948, 48969, 437687, 251857, -101727, -81445, -37907, 11184, 218260, -30144, -468801, -676995, -607625, -414100, -508659, -196355, 249754, -22032, -159820, 153910, 33991, -210886, -330835, -365325, -459657, 106041, 742146, 781422, 663214, 499768, 549045, 216995, -520708, -562970, 20238, 285712, 351821, 407513, 312017, 37003, -147276, -482405, -301685, 241525, 127358, -246614, -426359, -193084, -10716, -166269, -524307, -648716, -834841, -1002675, -456652, 466988, 1140570, 935814, 693202, 817039, 675613, 473579, 278513, 196035, 197605, 169210, 493504, 878971, 896455, 937216, 1216663, 1403134, 1503119, 1582192, 1614842, 1657650, 1533689, 1361091, 1009079, 728909, 599434, 664962, 777427]
7932G77427n43117o16174k11520K22312J14258l52027k98160o48106q74924o51739
7922c081770m66411L78163Q43266O24605L29035N29301J90712K77728M32265O2943
7912A19837J53401n5700j63984j49669J05513K70767L50856q0763m96659k21307
7902a67708l28592n85638p1131K82601J68256k89798l76118l4106K01219L00112
7892i00903M83702J85111j46444l93309J8564J44109L71029P0332l99128k54584
7882h21521K76509P9795l44260J34828N58890N04941K05548J57718k59933m68400
7872B4115M4363j7944O3481P3684j62169p573O886J83532j5447l07275L8285K48437
7860A72375j40733j16185M5718j04374k74882K46590J40950m30207m49025k83254
$$ y = [777427, 234310, -381864, -593384, -371072, -256814, -608841, -907001, -1555107, -2430031, -3081770, -3548181, -3170018, -2326752, -1702147, -1373112, -843811, -653099, -375371, 56894, 119837, 273238, 217538, 53554, -96115, 9398, 280165, 631021, 550258, 53599, -167708, -496300, -1081938, -1153069, -870468, -702212, -992010, -1368128, -1402234, -1201015, -900903, -417201, -232090, -378534, -771843, -753279, -609170, -238141, -167809, -566937, -821521, -545012, -465217, -809477, -674649, -115759, 389182, 594730, 752448, 492515, 24115, 68478, 50534, 114015, 187699, 25530, 17957, 24843, 208375, 192928, -114347, -76062, 172375, 31642, -84543, -38825, -143199, -418081, -171491, -30541, -460748, -909773, -1193027]
7850a193027j11505M44675J30922J5401L55111K05520J50365J16169j23464k11174
7840b21007k70553k17652l05677K35757O20381P72197J00025n18598k73846J68862
7830H9889L0386k39414k03707k55726J64441K30002L6748L63863P15217L92657
7820A324356L52103J93006k65160k35627J44126l29168m53259j93653O5202K04614
7810H06540J99943l42854k63527J41297J12582k39930k92046k90097l4383J83273
7800a9202j35572q4496l05047q3209K25728J19200j92918l19671J96870L04194
7790b94123J67481K10590K16388P2454l810j54444k85314n1432k05035R2369K52950
7779A8074K71157m8267l4978N67905N67144o8654p54988m57434n7228L77749R3448
$$ y = [-1193027, -1304532, -859857, -728935, -713534, -358423, -152903, -2538, 113631, -9833, -221007, -491560, -709212, -1014889, -779132, -158751, 613446, 713471, 194873, -78973, 89889, 120275, -119139, -322846, -578572, -414131, -184129, -147381, 216482, 931699, 1324356, 1676459, 1869465, 1604305, 1368678, 1512804, 1183636, 730377, 536724, 601926, 806540, 1006483, 663629, 400102, 541399, 653981, 414051, 122005, -168092, -202475, -19202, -154774, -239270, -544317, -627526, -401798, -282598, -475516, -795187, -598317, -294123, -126642, 83948, 300336, 372790, 368980, 214536, -70778, -122210, -327245, -234876, 18074, 289231, 240964, 205986, 773891, 1341035, 1272381, 517393, 59959, 2731, 380480, 473928]
7768D73928o83K51497J34222k87300m12528k71119l31337m86394j40995J5798
7758a054911k09598k40697k33455L86364P59659N79103J49040m9441j49017j029630
7748a092583q91541n1663K15967M30867Q03984M77457K30068K3732J20129L75083
7738F41500j27776l69485j72343j49754l83540k98526J01798J48752J83550L44650
7728h1174n601j77295K18704J62918q5232K8107j79314m66241m84312k40667J64655
7717a145452N47255J51998L7916M03144K64124r7618k3943J35370k98641j72813
7707a98660R7654j52884Q1080N468j09976N0655R1651m46057m82438N35792J76743
7696c50972j38620M34402M67351K15300r7151o22341m71850j33796J71017M36279
$$ y = [473928, 473245, 724742, 858964, 571664, 159136, -111983, -443320, -929714, -1070709, -1054911, -1264509, -1505206, -1738661, -1352297, -592638, -13535, 135505, 86064, -62953, -1092583, -1984124, -2035787, -1819820, -1388953, -584969, -107512, 122556, 146288, 266417, 641500, 513724, 144239, -28104, -177858, -561398, -859924, -758126, -609374, -425824, -81174, -86775, -264070, -45366, 117552, 32320, 60427, -118887, -585128, -1069440, -1310107, -1145452, -598197, -446199, -408283, -5139, 258985, 161367, 137424, 272794, -25847, -198660, -101006, -253890, -172810, -167342, -277318, -226663, -135012, -581069, -1063507, -527715, -350972, -489592, -55190, 412161, 627461, 530310, -92031, -563881, -697677, -526660, -90381]
7686i0381N31869N70660R8937p47720o43002J07879m37593l14396O43610M53249
7676A73112k21379l92714k93854j65014J34990n6669k23444L82233M97421K01227
7666C5909M49070M31544M0886J92413l93673l92541j3905j11182P621K75866m4892
7655D77116l1364K83708L75331K96529m00261l97137j18765l59689l53852J91926
7645c6458K20634l15003k87821n2115N35872L00731L1387k90460k68468j03172
7635b64873K16269K67317N5922J81338L98666r6650j40751K09990q607n00538
7625C18083k41330N6579m34458n19956K1043L9418O47583N41647l14968m65232
7615c51591k24172L33746L92761J66152R1665l08987j10273j44352j23853J70314
$$ y = [-90381, 441488, 1012148, 1111085, 363365, -279637, -171758, -609351, -923747, -280137, 173112, -48267, -440981, -734835, -899849, -764859, -821528, -1044972, -662739, -165318, 35909, 484979, 916523, 957409, 1149822, 756149, 363608, 349703, 238521, 246142, 522008, 477116, 445752, 729460, 1104791, 1401320, 1001059, 603922, 485157, 125468, -228384, -36458, 184176, -130827, -418648, -470763, 65109, 365840, 397227, 106767, -161701, -264873, -48604, 218713, 274635, 455973, 854639, 757989, 617238, 827228, 818621, 318083, 76753, 133332, -301126, -821082, -800039, -760621, -113038, 428609, 113641, -351591, -575763, -242017, 150744, 316896, 408561, 99574, -10699, -155051, -278904, -108590]
7605a08590J98892J83240m38120l55598M3314j57777j35408j3540L59375P10991
7595B86779r0256o98404l01868j93354n0252L30521M02098K88528J10598K9426
7585A13816M830N20330J33558p4371m41253n81579j30637m25827l10197L22748
7575h68582K63697K67713R0768J45192J19836K21803K19347p9538J89001K11144
7565G80381J856j2488j56019q3766k94320j5265j6371k66056N8807M13314L50607
7554G60680J92303r1310J52377K25352k87362n87912m02237L27084q5782j84296
7544A8897l15625n3779o4841k77660M63767O24613M20431k56635k71696k01914
7534H5558q7529J0659l89358J58930N20856j533m74428k29923M50184L09600L38356
$$ y = [-108590, 90302, 273542, -164578, -520176, -476862, -634639, -770047, -783587, -424212, 286779, 196523, -501881, -803749, -997103, -1047355, -716834, -314736, -26208, 84390, 113816, 118646, 638976, 772534, 698163, 256910, -324669, -455306, -881133, -1191330, -868582, -604885, -337172, -246404, -101212, 18624, 240427, 459774, 380236, 569237, 780381, 782237, 769749, 613730, 529964, 235644, 220379, 204008, -62048, -3241, 410073, 760680, 952983, 861673, 1014050, 1239402, 952040, 364128, -38109, 288975, 203193, 18897, -296728, -350507, -415348, -693008, -229241, 395372, 815803, 559168, 287472, 85558, -1971, 8688, -380670, -221740, 299116, 297583, -176845, -406768, 43416, 353016, 691372]
7523F91372K0581l87597k42673K46751r9069o52591j38444L16526J7795J90603
7513c6746M25512K39211R0079n4154J07279M5821k74933j6694P6146k23076j10102
7502B68343l865m21121q70657m83811K54160J83438R4297N78467K73936j36844
7492b63657k57983m29970n04773j80272J45590K29307O7414N90091Q99227j43742
7482A51232n39929l97341j05232L73086L19112L48429K11521j33866m55119l66745
7472e94852k40684p2761J24546L24542J07362Q3026L83848L10583p4472j67322
7462A83816m15623l18642J66162J73638J5655n73765j90489K4737J47901L45028
7452d41582J77869k9165j15450j71898n08882m35501l4850K82081K22202M17832
$$ y = [691372, 711953, 324356, 81683, 328434, 229365, -423226, -561670, -245144, -227349, -36746, 388766, 627977, 718056, 663902, 771181, 817002, 542069, 525375, 601521, 378445, 268343, 264478, -156643, -1027300, -1511111, -1256951, -1073513, -979216, -400749, -126813, -263657, -521640, -951610, -1456383, -1636655, -1491065, -1261758, -1194344, -604253, 294974, 151232, -388697, -786038, -891270, -518184, -199072, 149357, 360878, 227012, -228107, -594852, -835536, -908297, -783751, -459209, -351847, -268821, 115027, 425610, 351138, 183816, -231807, -550449, -384287, -210649, -194994, -768759, -959248, -934511, -786610, -441582, -263713, -292878, -408328, -580226, -1089108, -1524609, -1559459, -1277378, -1055176, -637344]
7442f37344J62809N17249O26453l8473l50238K407J95576L9085o02315j313015
7432a397806n53919J8613n1943K93548M23592J87307J16355L4498R6563M2126
7422g91066M85163O33312K41826L97690Q8544j92833J91500j44027m82884n07831
7412h0606j77189O4336Q9162q3202k68213l35026m3532R4449L8612M1113M21781
7401b38315N49284L62523o323j38640j84890m41307q37923j29357L78007J00147
7391e86794j51057M27674N60310k61098m60984j56222K29458O55486J20030k82964
7381I3839J03473K84677M08329J72541m24726n96954J91459O72492K43071k83542
7371H64659m2525l02355m68453k64549N068J09664K27127j2882O1955N6679k74581
$$ y = [-637344, -474535, 42714, 669167, 630694, 280456, 282863, 478439, 517524, -84791, -1397806, -1951725, -1933112, -1985055, -1691507, -1267915, -1080608, -964253, -929755, -833192, -791066, -305903, 327409, 569235, 966925, 1055469, 862636, 1054136, 910109, 427225, -80606, -257795, -193459, -104297, -187499, -455712, -790738, -834270, -739821, -701209, -660096, -238315, 310969, 673492, 667169, 528529, 343639, -97668, -935591, -1064948, -686941, -586794, -737851, -310177, 250133, -10965, -471949, -628171, -398713, 256773, 376803, 93839, 197312, 481989, 890318, 1062859, 638133, 41179, 232638, 905130, 1148201, 864659, 822134, 519779, 51326, -213223, -208155, -98491, 128636, 115754, 177709, 234388, -40193]
7360d0193o3864O1773k2005J2356N0012K21977K30493N8648k0793l00238l76241
7349a88075l37874j9034J80627J38707j68221k08779L93064L30532j90234R6348
7339B7061P57348N37462m21259p91542k2476Q4435N6399K78623J90596l82327
7329C14320r22391q50240n514M62117K69970J12708R7491q0716L19234J24768
7319a58253j56787L12564J7137n01943l57013L47234L49035P5251r6619l803M0342
7308a32855L42920N58332j31781o63925j77413R7210K88425J60457K35043L51582
7298I27995J7721n475K46031M2022j28848j92001m95091l88183k86153j42440
7288d04422K11956M6347n39903l85564j42446P62284O81773J05446K7828l41390
$$ y = [-40193, -104057, -42284, -64289, -51933, -1921, 220056, 450549, 509197, 488404, 188166, -188075, -525949, -544983, -364356, -225649, -393870, -602649, -209585, 120947, -69287, 27061, 784409, 1321871, 900612, 109070, 86594, 171029, 227428, 506051, 696647, 314320, -608071, -1458311, -1463825, -1001708, -731738, -619030, -521539, -602255, -283021, -158253, -315040, -2476, 14661, -487282, -844295, -497061, -148026, -72775, -169394, -173197, -132855, 210065, 768397, 636616, -27309, -204722, -107512, 180913, 341370, 576413, 927995, 945716, 940241, 1186272, 1228294, 1099446, 907445, 412354, 24171, -261982, -404422, -192466, -146119, -686022, -1071586, -1214032, -451748, 230025, 335471, 363299, 21909]
7278B1909j68599l16105j78729l4730j91945m5213j25756J00935j05633l20257
7268a364123J51229K68216L01842j79880j44734P3439K47663M58433M10281j2850
7258B09516m82173l10495m9638J47465K97909M31441K54396K4944L8889j33204
7248D29050j095J13123J31786K64798N06845M46568l70596o07763j67889q531
7238G36296J08095L17126J80547j95014j86642l96145k9507L52589j71823m16624
7228B98898m60482O3938L35187j5361j74783j1925L7450r9955k0459j65172k71106
7217d83770M48651L13342J74299J19912k00196l42192j2964N16549L32563k7108
7207H39086k68054j15191o0278K92656K83531P8963l75010l95833p11152p04135
$$ y = [21909, -146690, -462795, -641524, -676254, -868199, -913412, -1039168, -938233, -1043866, -1364123, -1212894, -944678, -642836, -822716, -967450, -894011, -646348, -187915, 222366, 209516, -272657, -583152, -632790, -485325, -187416, 244025, 498421, 523365, 562254, 429050, 427955, 541078, 672864, 937662, 1444507, 1891075, 1520479, 912716, 744827, 736296, 844391, 1161517, 1342064, 1147050, 960408, 564263, 534756, 887345, 715522, 298898, -161584, -97646, 237541, 222180, 47397, 35472, 72922, -27033, -47492, -212664, -483770, -35119, 278223, 452522, 572434, 372238, 30046, 17082, 533631, 866194, 839086, 571032, 455841, 395563, 688219, 971750, 1050713, 675703, 279870, -431282, -1135417]
7197a135417K27668M88164K15710l35493n11472p8617K84976L01324n1376J45734
7187d48799J6340p7242o8918j86018K90078r2992J99102N06556J46883j41546
7177A43444n51212o49724K66800Q53951K57289o04964k55403O5438j67879O02308
7167c9952L63392k06001l50768J9754j41099l2813n357M0926K91963Q0726j64694
7156a43923n86083k36013l5149J68211P46029N09655J94727j05496n07055o8837
7146f3934K2683L07509N13771J57410j77637O4113r7338o61528n59032k86611
7136g80594J78709N91299M31713j87574p13513o92320r2595N16302M03843j07506
7126d52236j45994N4926j75124k88212J34631O40509L77428q0801l18442q4523
$$ y = [-1135417, -907749, -419585, -203875, -539368, -1050840, -1129457, -844481, -543157, -594533, -448799, -432459, -509701, -578619, -764637, -474559, -567551, -368449, 138107, 284990, 143444, -407768, -1057492, -790692, 63259, 320548, -284416, -539819, -474381, -642260, -39952, 323440, 117439, -233329, -213575, -354674, -387487, -392844, -351918, -59955, 20771, -143923, -730006, -966019, -1001168, -832957, -86928, 422727, 617454, 511958, 4903, -63934, -41251, 266258, 780029, 937439, 759802, 823915, 726577, 65049, -493983, -780594, -601885, -10586, 421127, 233553, -479960, -1172280, -1264875, -748573, -344730, -452236, -598230, -543304, -718428, -1006640, -872009, -231500, 145928, 65127, -253315, -337838]
7116c37838k81580j89877L06562K27374l44457l16925p1768M50548O42892o4358
7106B0573l44761K11350n786o0953j74613L7168L89012O01561K96361L9554J50265
7095A159731P5706k37719o12422l17502J35113j28008o11496l95147k31377k28483
7085a391604j02798k7691R3620K09264q5759o8912J180l82867j42938O47004M27376
7074h24125n10318j41191N67111l4089m41502M4046K32401K00505K21519J64858
7064e20785l61456l08427J6281K84495J47654M4340K8858P1838L17211O33412
7054C53421M51351n6295j69157M8932q9403l62335o71756k93911L94971O23140
7044B28958L17856j69801j75552j09455q49K28797J93457J89887K99753k50427
$$ y = [-337838, -619418, -809295, -502733, -275359, -619816, -936741, -1008509, -557961, 84931, 20573, -324188, -112838, -118624, -179577, -354190, -317022, 71990, 673551, 969912, 1009466, 1159731, 1235437, 997718, 385296, 67794, 202907, 74899, -536597, -931744, -1163121, -1391604, -1494402, -1522093, -1428473, -1219209, -1304968, -1373880, -1372700, -1755567, -1898505, -1251501, -824125, -1334443, -1475634, -908523, -942612, -1384114, -1340068, -1107667, -907162, -685643, -520785, -882241, -1190668, -1174387, -889892, -742238, -697898, -669040, -597202, -279991, 353421, 804772, 748477, 579320, 628252, 538849, 176514, -495242, -789153, -394182, 228958, 546814, 377013, 201461, 92006, 91157, 319954, 513411, 703298, 1003051, 752624]
7034G52624k69973O7914K157J61256m2944N7897J9778J85967M91821J42401m7817
7023A521081K84432N7685m07711o39294k42082j54105k47702j03351l46555j2581
7013b90183j69656j90826L50787O52389M13909J35447l7894k66820l77366j86311
7003C3476J1385K73652N0757J96251M5856n55498j5124M91205K23121N4635L46725
6992A156441J12025j22760M1063R960l23271q84268n39782K93891L89445J26733
6982B59477L47612K36776J2206l69191k87996o2522j40556m98421j50119N57401
6972i5333M85729M40327J96211j40355k45524j86688J81477J95855L35194J33327
6962A300220o5845k55173l44511j07848N26696J22539m44200j61038L23054N9769
$$ y = [752624, 482651, 550565, 552722, 713978, 671034, 728931, 748709, 934676, 1426497, 1568898, 1521081, 1805513, 1863198, 1455487, 816193, 574111, 420006, 172304, 68953, -277602, -290183, -459839, -650665, -299878, 352511, 766420, 901867, 863973, 597153, 219787, 33476, 44861, 318513, 369270, 565521, 611377, 55879, 40755, 531960, 755081, 809716, 1156441, 1268466, 1145706, 1186769, 1196729, 873458, -10810, -550592, -256701, 132744, 259477, 607089, 843865, 856071, 486880, 198884, 136362, -4194, -502615, -652734, -95333, 390396, 830723, 1026934, 886579, 641055, 454367, 635844, 831699, 1166893, 1300220, 1234375, 979202, 634691, 526843, 1053539, 1176078, 731878, 570840, 893894, 953663]
6952I53663j86846l13777k79528j51372l422j97766k12549k14889J73679M33223
6942D16K32009L8734J16645j13419l50169M51722J18150l95209j77412m42765
6932e21298O1315J98124K0077o0564m22160k80408K29827M19268N17441K48235
6922D09857R4113K47660r3028m74431k38215J22052l4537l33525M8576N46167
6912B94689J17272K78442k0431n93212m82296J38836M55080j4003l08551J45248
6902A1074M34837K49895J96366O6598J52311l02400k98846j50983K36823p818
6892E87857o01401K10044J50893n02765m57133l4077L12379O3083K4910J52336
6882i3874K75517J5493M6857R3681J48653k59952p78461n52996K97439J158400
$$ y = [953663, 766817, 453040, 173512, 22140, 18718, -179048, -391597, -606486, -432807, 416, 232425, 271159, 387804, 274385, -75784, 375938, 494088, 98879, -78533, -521298, -459983, -261859, -241782, -302346, -724506, -1004914, -775087, -355819, 161622, 409857, 503970, 751630, 658602, 184171, -54044, 68008, 33471, -300054, -251478, 294689, 411961, 690403, 669972, 76760, -405536, -266700, 188380, 174377, -134174, 11074, 445911, 695806, 892172, 958770, 1111081, 808681, 509835, 358852, 595675, 587857, -13544, 196500, 347393, -155372, -612505, -646582, -334203, -271120, -246210, -93874, 181643, 197136, 243993, 337674, 486327, 226375, -552086, -1105082, -807643, 350757]
6872C50757R29282L75225j45320n02752k19362P7660o8422k02643j97531j25485
6862B71409K19223J82232l21284r5692K41346o7435r9937l24194k4363J57925
6852A39230K62146J67525p0516J56806K99963L50397j43256l03030J3708N15026
6842A387999l3898n06045J3588K69760J3503m39353k14019k77746M1076M96289
6832G51154K9590j44220k28742j4910K34921M44052J54187j54758k90300q3666
6822F97308l0671k44866k88569j45772J70384j49982k34577J83440L49269k8219
6812B77745J05920j96252o5466N51938P39411K07002j40614l54090n11395j73438
6802D40761K07696k14226j43736Q3388o5012J35803k65802o9643J87660N295k52544
$$ y = [350757, 1280039, 1655264, 1509944, 1007192, 787830, 865490, 797068, 594425, 396894, 271409, 490632, 672864, 351580, 255888, 497234, 429799, 329862, 5668, -18695, 139230, 401376, 568901, 498385, 655191, 955154, 1305551, 1162295, 859265, 872973, 1387999, 1354101, 848056, 861644, 1131404, 1144907, 705554, 491535, 213789, 254865, 751154, 780744, 636524, 407782, 392872, 627793, 1071845, 1226032, 1071274, 780974, 697308, 666637, 421771, 133202, -12570, 157814, 7832, -226745, -43305, 305964, 277745, 383665, 187413, 121947, 673885, 1413296, 1620298, 1479684, 1125594, 614199, 440761, 648457, 434231, 290495, 373883, 308871, 444674, 178872, 109229, 296889, 302184, 49640]
6791D9640K5549K87860K23025M07609L15991N974j45009L0957j35649k96992l05564
6780D63391N2369j30903j15067K51305l02798q24901J18142N70351L77495K00416
6770F59800k04653J22311J40696J66165l20421p65469j035058l43340J90167N20598
6760h69204N70947J20355n2220J08261R3151L52098J77778m69389j010341j94802
6750a173366P69720N29283k01702n0619p5512K21129L43261l198J29597J04737
6740E93330J76793J25427J94019k88046r26215o80556n3947N11033N90817K76247
6730E18902j37120m01139j57522J40539l0388J09979J58222m6936K45170M65680
6720H65387q1095l40710o619M22788M29146L8301k49867k35996l40512K04819
$$ y = [49640, 75189, 363049, 586074, 993683, 1309674, 1315648, 1170639, 1201596, 1065947, 768955, 463391, 515760, 384857, 269790, 521095, 218297, -606604, -488462, 81889, 459384, 659800, 455147, 577458, 718154, 884319, 563898, -201571, -1236629, -1579969, -1389802, -869204, -298257, -177902, -230122, -121861, -28710, 323388, 501166, 31777, -978564, -1173366, -403646, 125637, -76065, -126684, -202196, 18933, 362194, 358996, 488593, 593330, 770123, 895550, 1089569, 801523, -124692, -805248, -859195, -348162, 242655, 518902, 381782, -19357, -176879, -36340, -66728, 43251, 201473, 154537, 399707, 865387, 784292, 443582, 436963, 859751, 1288897, 1327198, 1077331, 841335, 500823, 705642]
6710G05642L24401L9909j82329k74506m20430j64875N82379M29728k59287j50041
6700F30591m08264l78638M45444M75862k5206O605j52045l73949n7875J7766j44722
6689C5569j64708r2871L06949K61052L70869P23295M32392l20559o20028J94472
6679A126432J39740j72730k13528L01733P66593J76502p1072m01929m59259j62179
6669A030303k79884k18437O13012R15750K51784o28235m30632l99834o3061L04478
6659A095244q1066l97925J97733L10852M8137q5815k17938k19854l61902o43891
6649c56425l39406M97138M52247k83164J73313M33803J44392l65163k51858K64740
6639C69617J65954K49582L56941K59332K30041K66016R2259o6141N8721M0999
$$ y = [705642, 1030043, 1069952, 887623, 613117, 192687, 27812, 610191, 1039919, 780632, 630591, 222327, -156311, 289133, 764995, 739789, 746394, 594349, 220400, 162525, 180291, 35569, -129139, -222010, 84939, 345991, 716860, 1440155, 1872547, 1551988, 931960, 1126432, 1266172, 1093442, 879914, 1181647, 1948240, 2124742, 2053670, 1651741, 1192482, 1030303, 750419, 531982, 1144994, 2060744, 2312528, 1684293, 1253661, 853827, 790766, 1095244, 1014178, 616253, 813986, 1124838, 1172975, 1087160, 869222, 649368, 287466, -356425, -695831, -198693, 253554, -29610, 143703, 577506, 721898, 356735, 104877, 369617, 535571, 785153, 1142094, 1401426, 1631467, 1897483, 1989742, 1923601, 1982322, 2023321]
6629B023321P3404K2076n8588l1234k70054j90079L16255L06840J85403J08605
6619B485949m80688n44043J22572M84066j29537p92240j009336k76679P7868j98383
6609b60451l877P71694N91895J27798m01724m71497Q6248q958p0344M99969J19647
6598I80400n57104n17327r3135N67608P35108P0618o39803l10294J76895O47610
6588A060576O86967N24828Q1547J35695Q01k48544J33224j12401J61692P2404
6578B496789k17607p28233l92871K3130k5010j65864j42394m9144m6304k26410
6568E26082q322K4293j43417K88246M76666J21475M26949q124k30001j63285K24689
6557A535251k10933k71288L69241O1839J67294J44077l03995m9567L46101J20636
$$ y = [2023321, 2096725, 2118801, 2060213, 2028979, 1758925, 1568846, 1885101, 2191941, 2377344, 2485949, 2005261, 1461218, 1583790, 2067856, 1938319, 1146079, 136743, -139936, -62068, -260451, -264328, 507366, 1099261, 1227059, 825335, 353838, 440086, 431128, 360784, 860753, 980400, 423296, -94031, -187166, 380442, 1115550, 1186168, 546365, 236071, 412966, 1060576, 1747543, 2272371, 2353918, 2489613, 2490414, 2241870, 2375094, 2262693, 2424385, 2496789, 2279182, 1550949, 1158078, 1181208, 1156198, 990334, 847940, 798796, 752492, 526082, 517760, 542053, 398636, 686882, 1163548, 1285023, 1711972, 1703848, 1473847, 1310562, 1535251, 1324318, 1053030, 1422271, 1484110, 1651404, 1795481, 1491486, 1441919, 1788020, 1908656]
6547A908656m18084k34436M76K68384K34383o72782o47788N1920L92401L57830
6537A240960k92141l91816k42610j71537R9115J50984N28472K49718P3500M68073
6527A712718N47337K09850k16326p19531n26745j49341K06669L5445l12709j12810
6517F74557N11284O94282P10739J03116k89841L8934L10680K78578O00212L12312
6507C944853j06698l4959p8255J26433L24951M33361Q46012Q02427P18276J274730
6497H251131J802468K539112L842103O291649J0801235J6270741J4679690J165393
6489F5643522j2865319j5468796j1186671o712451m488475l010615j756875j177217
6481H977103n32973k96699k76867l19868k90056K21251P65035J628176K052699
$$ y = [1908656, 1490572, 1256136, 1256612, 1524996, 1759379, 1086597, 438809, 490729, 883130, 1240960, 948819, 557003, 314393, 142856, 241971, 392955, 921427, 1171145, 1244645, 1712718, 2260055, 2469905, 2253579, 1534048, 1007303, 857962, 1064631, 1100076, 787367, 674557, 1185841, 1880123, 2590862, 2693978, 2404137, 2443071, 2753751, 3032329, 3632541, 3944853, 3838155, 3803196, 3724941, 3851374, 4176325, 4609686, 5455698, 6258125, 6976401, 8251131, 10053599, 12592711, 16434814, 22726463, 33527698, 49798439, 64478129, 65643522, 52778203, 37309407, 26122736, 19410285, 14921810, 11911195, 10154320, 8977103, 8444130, 8147431, 7870564, 7550696, 7260640, 7481891, 8246926, 9875102, 11927801]
6472A1927801P09446j844892k812077k046074j200420n35539j00743O405J55012
6463D258919K56406N85732N99209M12450N95773K08071j44378P098J4942J95918
6453F990140M72608N02311o4736M83662J255737J663697K134347L530144M835850
6444B1803760O599856R823735J4816563K5090845M1262439N1146723K9528365
6437B00072286j8314628m7366486m3241293k8400740j6986790j0417765p191303
6430B8153281m930979l723123k590465j737341j249659m49241N46767J050151
6422A5069391K049091L209975K810465o20177m136597m387474l108245j871892
6414I014537p71837n3236J01993M13650L28305J31948j0831Q0391N00307R49607
$$ y = [11927801, 12637247, 10792355, 7980278, 5934204, 4733784, 4198245, 4097502, 4103907, 4258919, 4515325, 5101057, 5700266, 6112716, 6708489, 6916560, 6772182, 6779280, 6794222, 6990140, 7462748, 7965059, 7900323, 8383985, 9639722, 11303419, 13437766, 16967910, 21803760, 28403616, 38227351, 53043914, 78134759, 119397198, 170543921, 200072286, 181757658, 134391172, 91149879, 62749139, 45762349, 35344584, 28153281, 23222302, 19499179, 16908714, 15171373, 13921714, 13472473, 14019240, 15069391, 17118482, 20328457, 23138922, 22518745, 18382148, 13994674, 10886429, 9014537, 8242700, 8189464, 8291457, 8705107, 9033412, 9165360, 9154529, 9234920, 9735227, 10684834]
6404A0684834L53435J78498J007375J429386Q85018K30647J253906J891782K132499
6395B0047380L158777N133886P169099J0266346J4869939K3001346L8417513O4275667
6387A86339953R5220459R1928857J6521381p3018241r7258886p2317189m4435823
6380A02980511k7399529j7367172j1395830q057577o100457l676830k414209j824964
6372B4743943j020111j53352J072797L506493N184615K880378k869076o513828
6364B6831859n975539l889515k354696j706274j103630l59559n18642m64476l07782
6355A0151746k1504L27701N38653N96185L88636J021167J708281J674347J364004
6346A7749216P36590J202297K316351L398445M880153O880211R831810J4142624
$$ y = [10684834, 11038269, 11216767, 12224142, 13653528, 14538546, 14769193, 16023099, 17914881, 20047380, 23206157, 28340043, 35509142, 45775488, 60645427, 83646773, 122064286, 186339953, 281560412, 373489269, 390010650, 316992409, 219733523, 147416334, 102980511, 75580982, 58213810, 46817980, 38760403, 32659946, 28983116, 26568907, 24743943, 23723832, 23570480, 24643277, 28149770, 33334385, 36214763, 33345687, 26831859, 20856320, 16966805, 14612109, 12905835, 11802205, 11442646, 10924004, 10459528, 10151746, 10130242, 10457943, 10996596, 11592781, 11981417, 13002584, 14710865, 16385212, 17749216, 18485806, 19688103, 22004454, 25402899, 30283052, 37163263, 46995073, 61137697]
6338F1137697K1323002L3815096N5839689R1488509J17975613P6415073l3461127
6331D24533552j09446092j03301942o7699052m1185870k5589107j6373500j1642236
6324D9295753q430851o024714m656947l144521k388288j624121k48728O89168
6316B3466751J755043K730914P48222k921357m816019l898966k764378j883887
6308A2416323j077822o95494l11038m41922n63105j53183Q4379J01553N00167
6299I859858O14698N34312K50998L57181R30479J391966J921873K175821K293160
6290B0330346L136956M635415O508993R285571J4330991K2785144L6805059O0846298
6282A78664773R1837709R3763238K5744740o5893600r7672037p5248930m6572496
$$ y = [61137697, 82460699, 116275795, 172115484, 263603993, 381579606, 457994679, 424533552, 315087460, 211785518, 144086466, 102900596, 77311489, 60937989, 49295753, 40864902, 34840188, 30183241, 27038720, 24650432, 23026311, 22777583, 23466751, 25221794, 27952708, 28700930, 25779573, 20963554, 17064588, 14300210, 12416323, 11338501, 10643007, 10331969, 9890047, 9326942, 9173759, 9258138, 9359691, 9859858, 10474556, 11008868, 11259866, 11617047, 12547526, 13939492, 15861365, 18037186, 20330346, 23467302, 28102717, 34611710, 43897281, 58228272, 81013416, 117818475, 178664773, 270502482, 364265720, 390010460, 324116860, 226444823, 151195893, 104623397]
6275A04623397k8302743j8365362j2590324q711852o179986m792790l517242k860689
6267A9302409k112879j169189m47990J88335Q84937Q95267m18497k179274k461787
6258A2481332j734899j184799j209482n36978k70522n47069q00651k65559N55122
6249F486495J56579j58682M76618L60836Q7058Q6465J49562K11611N19341Q55957
6239I231840Q76968J329383J948817K999839M317218O381232R073873J3689728
6231D9848898K2721386L7664767M9737026L5291032j0090304m5402880m4946211
6224I4823714k9939681j9057014j2096852p305778n214152m094784l033687k278857
6216A1802909j687394j397290o22021o70889j292415p51358m32193j90749j48733
$$ y = [104623397, 76320654, 57955292, 45364968, 36653116, 30473130, 25680340, 22163098, 19302409, 17189530, 16020341, 15572351, 15760686, 16645623, 17540890, 17122393, 14943119, 12481332, 10746433, 9561634, 8352152, 7815174, 7544652, 6997583, 6196932, 5931373, 6486495, 6643074, 6484392, 6961010, 7321846, 7408904, 7495369, 7644931, 7856542, 8375883, 9231840, 10108808, 11438191, 13387008, 16386847, 20704065, 27085297, 36159170, 49848898, 72570284, 110235051, 159972077, 195263109, 185172805, 139769925, 94823714, 64884033, 45827019, 33730167, 26424389, 21210237, 17115453, 14081766, 11802909, 10115515, 8718225, 8096204, 7425315, 6132900, 5381542, 4949349, 4758600, 4609867]
6207D609867j36245M10838K61503j10840n78953q39287l24196j24613l98674j41487
6197B627913L78865O5772l97043j77993N5968N09573P27618K72523j66157n11566
6187C385473m8357M73731J85705P08702J928135J817716K167284L399821N203723
6178A9221933R052689J4613400J5408972N057816r814083j5167096j2274739q213980
6170A7884912n330359l200324j948468j453957r99514p46606j021949q26360l49162
6161B008213m89342j80672N4756o4529O1987J24106K37344P5866k11188m20059
6151A196482j82227R0871l90694l00266P35035R68834k60940j107396p06567p7084
6141c3952L40634L93587P5200O3400M02590J26852m03065m80320k33810J0140
$$ y = [4609867, 4473622, 4884460, 5145963, 5035123, 4456170, 3616883, 3292687, 3168074, 2769400, 2627913, 3006778, 3072550, 2675507, 2497514, 2553482, 3063055, 3790673, 4063196, 3897039, 3385473, 3337116, 3810847, 3996552, 4705254, 6633389, 8451105, 10618389, 14018210, 19221933, 28274622, 42888022, 58296994, 63354810, 53540727, 38373631, 26098892, 17884912, 12554553, 9354229, 7405761, 5951804, 4952290, 4205684, 3183735, 2357375, 2008213, 1518871, 1338199, 1392955, 1328426, 1390413, 1514519, 1751863, 1827729, 1616541, 1196482, 1014255, 1105126, 714432, 414166, 1149201, 2118035, 1857095, 749699, 43132, -33952, 306682, 700269, 775469, 838869, 1241459, 1368311, 965246, 484926, 251116, 261256]
6131B61256K22348q2596l0189N51847K78725l42483p31841o3751K7655k30253
6121a39282L24476O05144o6325l80568k55864L59496J62521p952J34583J36307
6111H72536n4386j56876m12664m55627m94147O5474L26443K74086r9371J23620
6101a0912N23482m0660J80541J86913j611j03332k93555m87456K2495L92036J71428
6090E39369l08875j33811J82813J58322L21426j51214l98824n02444m16044j79637
6080h88919K15730O10704N45952P3873k64463k16430M4735O29055Q13786K30927
6070A794950k75262k09824N47930J28409l93719j51322j94535l64746m43618k29754
6060B08509Q446J0226J46909K8923n2893k94711J16647L6352l23179m03587P6453
$$ y = [261256, 483604, 401008, 370819, 922666, 1201391, 858908, 127067, 63316, 90971, -139282, 185194, 790338, 724013, 343445, 87581, 447077, 609598, 601646, 736229, 872536, 818150, 661274, 248610, -207017, -701164, -635690, -309247, -35161, -134532, -10912, 512570, 471910, 652451, 839364, 837753, 734421, 440866, -46590, -24095, 367941, 539369, 230494, 96683, 279496, 437818, 759244, 608030, 209206, -293238, -709282, -888919, -673189, -62485, 483467, 557340, 292877, 76447, 121182, 750237, 1564023, 1794950, 1519688, 1309864, 1857794, 1986203, 1592484, 1441162, 1246627, 881881, 438263, 208509, 216955, 227181, 374090, 403013, 350120, 55409, 172056, 208408, -114771, -518358, -441905]
6049d41905L02230J72230l26594j55613K78588N09352M362l17246l02684l31645
6039f08925M7803M07126K87033j16342n26701l29868L585J15692M46977Q8361
6029a85259l6915J35420k58932m25646k73707k7879L67702N26452J60435j73225
6019a91554P2634J70696L90469N55752k0790l66639k87932o3791p8245j51521
6009B9079l83961l82786o0814K52282Q5497j95371L569P3387j7392r096K23478
5998c82128J73906J43417J52249j11640L72692P28688j33155j70428k68817l11443
5988A93341K54041L14229j36204j80706l1829j40688m72819m39178k36948k53139
5978a129900j72825L60984O27178R8616l12524k10077j07279j37544j71317L66649
$$ y = [-441905, -139675, 32555, -294039, -449652, -171064, 338288, 342650, 25404, -277280, -608925, -561122, -153996, 133037, 16695, -510006, -839874, -836289, -720597, -273620, -185259, -222174, -86754, -345686, -771332, -1045039, -1072918, -705216, -178764, -18329, -191554, -118920, 51776, 442245, 997997, 977207, 610568, 322636, 258845, 180600, 29079, -354882, -737668, -798482, -546200, -460703, -656074, -652505, -579118, -596510, -605606, -382128, -208222, -64805, 87444, -24196, 348496, 1077184, 944029, 773601, 504784, 193341, 447382, 761611, 625407, 444701, 412872, 272184, -200635, -639813, -876761, -1129900, -1302725, -941741, -314563, -215947, -528471, -738548, -845827, -983371, -1154688, -788039]
5968g88039P29236J49823k88694j6481Q3588k27724l51703r6102m0489K9818N16595
5957c00172O74130L85291K3877N999j63482j0162P1663O4315o6595o20572p46325
5946f82033k05554L77341O92136O18506M79725L44898k09221k03299k88397k05857
5936G18245m99844o32060k18707J77789M29174M05716R5933K06841K83767j98012
5926G68842j61146J42250L54557K97990O4500l11317o71983o17723j8500M38194
5916B85664J64639M1136M40480K1828n52938k58115j26656k19974j02666l3771
5906c40373k29817m1179L0470L46151Q95051O52000l51181n88148k73120k25097
5896a25243k7380K15006k68550j22868K73872Q9556M5892J17124m32100n19048
$$ y = [-788039, -58803, 91020, -197674, -214155, -130567, -358291, -709994, -806096, -846585, -816767, -300172, 373958, 759249, 783126, 789125, 625643, 615481, 687144, 751459, 684864, 64292, -682033, -887587, -510246, 181890, 800396, 1280121, 1625019, 1415798, 1212499, 924102, 718245, 218401, -413659, -632366, -454577, -25403, 380313, 476246, 683087, 966854, 768842, 607696, 749946, 1104503, 1402493, 1466993, 1155676, 483693, -134030, -152530, 285664, 450303, 491439, 931919, 953747, 400809, 142694, 16038, -203936, -306602, -340373, -570190, -611369, -580899, -234748, 660303, 1312303, 961122, 372974, 99854, -125243, -152623, 62383, -206167, -329035, -55163, 34393, 80285, 197409, -234691, -753739]
5886g53739N478J03950M1706M07083K92543K87767j55718m06446j53065L01817
5876b8624L99170K87943k21686l29773N3218J89199J70436l29953l37991J12049
5866c6012j93967j65207k43433m04849J13256L9070J93888O37010N24811N25698
5856I90265K95851k26964j52455P845j88714l28411l08734N1518N43602M40522
5846A124325j68862J3368R8168o33498m93005N2904M35162L8033j28635K50423
5836E88383k8232l00107j66278k30608K59642L71127k162k3659J58087k56879
5826C69314j90230L284m99127m07690k96850R7466N95954N57541K23652j71552
5816B81762m14777j95400m63124M4685O83276L7544K16212J92194j35696K80330
$$ y = [-753739, -748261, -644311, -602605, -195522, 97021, 384788, 229070, -177376, -330441, -28624, 370546, 658489, 436803, 107030, 160248, 349447, 519883, 189930, -148061, -36012, -229979, -395186, -638619, -1043468, -930212, -891142, -697254, -60244, 464567, 990265, 1286116, 1059152, 906697, 914542, 725828, 397417, 88683, 140201, 683803, 1124325, 955463, 968831, 1066999, 433501, -59504, -6600, 428562, 466595, 337960, 588383, 560151, 260044, 93766, -136842, 122800, 493927, 491765, 468106, 626193, 369314, 179084, 182368, -316759, -724449, -1021299, -923833, -327879, 229662, 453314, 281762, -133015, -328415, -791539, -746854, -63578, -26034, 190178, 382372, 246676, 527006]
5806E27006M13170k699n89192n14361r2258l8468m36706o7943N21646L67368l42259
5795b54696j71183R05907O27485o3423J21148K71261j26599K29256J75262L7405
5785A751823L72719K8308n93541p17686j098688p63942m8394M7933J01495K36851
5775f83122O0520k05625j33735o3419M75518K26197L27490L67831K04466K81772
5765H57893J49150k15915l58604l12111M32568L24000l56685J31950J63323K02820
5755A018389L4720k09131l5359l2285k44371m58507o2482L15659Q1221m0878K26790
5744E93766L89967J50385m79590o28671k51429O8384j42727n07087k7750J64220
5734f70532j22128k92437j12973M19763J49115k76715O53274P16368L68057k28453
$$ y = [527006, 940176, 937477, 348285, -166076, -258334, -296802, -733508, -801451, -279805, 87563, -254696, -425879, 480028, 1107513, 1044090, 1165238, 1436499, 1309900, 1539156, 1714418, 1751823, 2124542, 2152850, 1559309, 841623, -257065, -1021007, -1069401, -1021468, -919973, -683122, -622602, -828227, -961962, -1025381, -549863, -323666, 3824, 371655, 576121, 857893, 1007043, 791128, 432524, 120413, 552981, 876981, 520296, 652246, 815569, 1018389, 1053109, 843978, 808619, 776334, 531963, 73456, 10974, 326633, 407854, 366976, 593766, 983733, 1134118, 654528, 25857, -225572, -157188, -299915, -807002, -834752, -670532, -792660, -1085097, -1198070, -778307, -629192, -905907, -252633, 463735, 831792, 603339]
5724F03339m46041R5306K4093J53658N3939k19999L5363R3224p3201l30388m62019
5713d72726j74544j13820k98765J51228J34500K4365P6218L40791P51540O51971
5703A070758K96848j08144k60948o8059J40780k84864l78036j50853K19206N68933
5693A045621R585k82069m11394k89918j01908N9455R4313k76996k40787M04128
5683A0030M90199K34569J31426j13544k83746J68910K04098j13979j28717k70536
5673C28710l85118K8437L55925M48509N9047k74464j57220M79869M71403j12296
5663A242802m22885m68415l8044J68919J8574q538J42179J64540j27080J3649
5653F85701O9511k72670J90155L13701n73933m85061l61220o34463j55308L87892
$$ y = [603339, 157298, 252604, 276697, 430355, 484294, 264295, 299658, 392882, 319681, -10707, -472726, -647270, -761090, -1059855, -908627, -774127, -749762, -673544, -332753, 418787, 1070758, 1367606, 1259462, 998514, 930455, 1071235, 786371, 408335, 257482, 476688, 1045621, 1055206, 773137, 361743, 71825, -30083, 29372, 123685, -153311, -394098, 10030, 500229, 734798, 866224, 752680, 468934, 637844, 841942, 727963, 599246, 328710, -56408, -27971, 327954, 776463, 835510, 561046, 403826, 883695, 1355098, 1242802, 819917, 351502, 313458, 482377, 500951, 492413, 634592, 799132, 672052, 685701, 755212, 482542, 672697, 986398, 412465, -72596, -433816, -1068279, -1223587, -835695]
5643h35695M10744J68779k69823Q9183p890n28761K28600M98747J17506j83840
5633c12450M5805N8040J64858M59919K40907m25296k21348J33390J98761l2565
5623C10021j25041J29361j7174o8903J30496J97461j35632j63556j61022k18444
5613a22433k9152O01837O01214j87907l92551j37348R6836O5908J4842o0164j77823
5602B73259l75042n82969K36850Q44329o1529k57380J896j51224j0425m2074J87847
5591F3538L84213M62690K79053l48068j40597m00497n92366K52781N05103L13953
5581G79803j95333k57749M17920N46151l75636o25206k68304o1265l09339o5242
5571d14200K85898K27654j25386j37958R6411m01405L4817M4264j40284r661N52454
$$ y = [-835695, -424951, -256172, -525995, -436812, -444702, -973463, -744863, -246116, -128610, -312450, -266645, -208605, -43747, 416172, 657079, 231783, 10435, 143825, 342586, 310021, 184980, 314341, 297167, 228264, 358760, 556221, 420589, 257033, 96011, -122433, -151585, 450252, 1051466, 863559, 471008, 333660, 430496, 496404, 511246, 451082, 273259, -101783, -684752, -447902, 396427, 334898, 77518, 79414, -71810, -82235, -124309, 63538, 447751, 910441, 1189494, 841426, 700829, 300332, -292034, -39253, 465850, 779803, 584470, 326721, 744641, 1290792, 915156, 289950, 21646, -39619, -348958, -414200, -128302, 99352, -26034, -163992, -67581, -468986, -434169, -389905, -530189, -539850, 12604]
5560A2604N81547L9210N2719k29828j19708J00610M16596K95507j47006k00777
5550H01474j89562k99130m47809j30961M91353P60796L79052Q9936k25203m65986
5540G63960p37572m40339K45793M20081M62231J09573j94042N5220P1119l52218
5530D03806j60798J4806M3867j60282l75826j63287N129j27376K5891q7101K00384
5519c80787J92962k55451j55411k2290J21251N38058K08349Q6934j79087j97680
5509d3152k1406J98783K68602j45305j98808J61396J4480n2696N19077L91551
5499A092522n51170n42783j09977j2041J60625K23766o4364p75687k63706J96371
5489f46444K35751Q5571N20071J87606k06560k96205k89411k06987q4365l342
$$ y = [12604, 594151, 633361, 686080, 456252, 336544, 437154, 853750, 1149257, 1002251, 801474, 611912, 312782, -135027, -265988, 225365, 986161, 1365213, 1455149, 1229946, 763960, 26388, -413951, -168158, 251923, 714154, 823727, 629685, 684905, 756024, 403806, 243008, 257814, 301681, 141399, -234427, -397714, -392585, -519961, -494070, -581171, -380787, -187825, -443276, -598687, -620977, -499726, 38332, 246681, 333615, 154528, -43152, -64558, 134225, 402827, 257522, 58714, 220110, 234590, 181894, 700971, 1092522, 541352, -1431, -111408, -123449, 37176, 260942, 196578, -579109, -842815, -646444, -410693, -325122, 194949, 382555, 175995, -120210, -409621, -616608, -700973, -704315]
5479g04315J77267M61762N14381j97146n31833p7912M18914p3922l32637l72336
5469g17777k42661K32206M36373M5574j25886J74408J61760q4862Q1780m18924
5459d58009k82728K82456M34301n7428n39818k01174L92735L28811L99433M590
5449C03169N4235N36507L7378j32447n31927o20133k88075j6401M20662L32048
5439I5016j45037q181M69728M36823k31453j31340o033K905K10636j60416j86635
5428C46013K61738K29958J45171L63424j91971r34301o39048k77311K32941L30121
5418a33265j96628j86659L64307P90093l15361l98131J35092j65597r8491j37598
5408c42238J52402j0365n69549k08882L06345m6748m58080R3246Q66950L92449
$$ y = [-704315, -527048, -65286, 449095, 251949, -279884, -357796, 61118, -12804, -345441, -717777, -960438, -728232, -291859, -246285, -372171, -197763, -36003, -120865, -39085, -458009, -740737, -458281, -23980, -81408, -621226, -822400, -429665, -100854, 298579, 303169, 357404, 893911, 931289, 798842, 266915, -353218, -641293, -657694, -237032, 95016, -50021, -58202, 411526, 848349, 616896, 485556, 479523, 482428, 693064, 532648, 346013, 607751, 837709, 982880, 1346304, 1154333, 220032, -419016, -696327, -463386, -133265, -329893, -516552, -152245, 637848, 322487, -75644, 59448, -106149, -204640, -342238, -189836, -200201, -769750, -978632, -672287, -719035, -1177115, -1083869, -216919, 175530]
5398A75530J60690J80823k37302p74656m25333K23070j62583n02288k91773P1601
5388a582221J07659K55189P12087O56823q090k61974R5524M49153L313k40123
5378A87340l98862m97607L9423k94531k32360Q72051O44161k14019m66461K71345
5368h9520K31724l38277l00564J71927L23884L242r3048n87410o6730K44596M6862
5357d53314l95632j07063K64776n0019k07459O0542L51859Q7640j85484j3093
5347f47247j38063j0881P90056J54732o41386n06773l39957J18569M41959O41011
5337a37980J62453j16115n8402M1805K79763R8514m6048J47282k29359n83546
5327d41633J8388j18788l5179K71628M12836K74309M43392N41809J88580k59309
$$ y = [175530, 336220, 517043, 279741, -494915, -920248, -697178, -859761, -1362049, -1653822, -1582221, -1474562, -1219373, -507286, 149537, 141447, -120527, -25003, 424150, 427463, 187340, -211522, -709129, -669706, -964237, -1196597, -324546, 319615, 105596, -360865, -89520, 142204, -196073, -496637, -324710, -826, 2416, -90632, -678042, -744772, -500176, -453314, -848946, -956009, -691233, -741252, -948711, -888169, -536310, -448670, -634154, -647247, -785310, -796191, -6135, 148597, -492789, -999562, -1339519, -1220950, -778991, -137980, 24473, -91642, -150044, -108239, 171524, 270038, 223990, 371272, 141913, -441633, -423245, -542033, -577212, -305584, 107252, 381561, 824953, 1366762, 1555342, 1296033]
5317A296033n75256l59200j7821L80214K38157l46187q67233o77589m05427J34670
5307a199639J82483K9558O5229L0370k03949J12840P09711O01269J55307j99445
5297B83734j67563M23707L62073j18537k38114m1889k8089l72201n58304l98464
5287h53647Q2996J96822o9934l79683k03216K06739M66274O13592n7261j63767
5277a61085L45174O6446j08296m3433J05368k82029k18493J56945n8028j16341
5267c13772k21985j79942K38604K17781j78273k18390J87488L56093L60694J56194
5257D04492n78824o73351l84481j9631L76577K72347L20812K89238L6385M0144
5247H3708j73863o4636J99013L05716J74932K74790j65943l48735o98060o37054
$$ y = [1296033, 720777, 361577, 343756, 723970, 962127, 615940, -251293, -928882, -1334309, -1199639, -1017156, -987598, -922369, -891999, -1095948, -983108, -273397, 327872, 483179, 283734, 116171, 539878, 901951, 783414, 545300, 503411, 475322, 103121, -455183, -853647, -770651, -573829, -643763, -1023446, -1226662, -1019923, -553649, 59943, 2682, -161085, 184089, 250535, 142239, 98806, 204174, -77855, -296348, -139403, -197431, -313772, -535757, -715699, -477095, -259314, -437587, -655977, -468489, -112396, 248298, 404492, -174332, -847683, -1232164, -1251795, -875218, -602871, -282059, 7179, 43564, 83708, -90155, -154791, 44222, 349938, 524870, 799660, 633717, 284982, -413078, -1050132]
5237a050132P9870M06859L90143K42004K35789K34969j97382l94173K26745M87819
5227F62511R9803n6566m0457J17920J66163k88947l15015k75950m27561k99283
5217f57382J77217M37717K64359j16228O21699M95636m84426p47982j75153j34141
5207c18684k67047l9786l08492k03750L79248J022586Q69838Q4385m29785m51973
5197C36540k82870q2746K56122K27634j87402j08411K0419k5268L5753K71540
5187D61311N31653J01754n8193K289l35405p9991l05110l18470j49071k4750k95279
5176d69262k9989L23646N29101L55199k01555k30746J60394L61550J70257j29293
5166H39302l44613l93269J37503K49847j25696n37834n08332o33341q08517j39426
$$ y = [-1050132, -970262, -563403, -173260, 68744, 304533, 539502, 342120, -52053, 174692, 662511, 762314, 705748, 665291, 783211, 949374, 660427, 345412, 69462, -358099, -657382, -480165, -42448, 221911, 105683, 727382, 1223018, 738592, -9390, -184543, -318684, -585731, -625517, -934009, -1137759, -758511, 264075, 1133913, 1218298, 788513, 336540, 53670, -29076, 227046, 454680, 267278, 158867, 179286, 154018, 189771, 461311, 992964, 1094718, 1036525, 1038814, 703409, 623418, 318308, -162, -149233, -173983, -469262, -499251, -175605, 353496, 708695, 507140, 276394, 436788, 798338, 968595, 839302, 494689, 101420, 238923, 488770, 363074, -174760, -683092, -1316433, -2124950, -2264376]
5156b264376N54158M73347L64929L1253j70783M46527L02536j91138J88953M7098
5146b17496L58036N04671k72119j96063J43447r6949k79212J25067o6254j29417
5136a26289J49959j24069m39470k60577M9609j08105k44318L59818M45608K16979
5126h0855k85586k88488o6490n7462J35409L96244l21112n70903n33825l1119
5116a704187L67962m9145k93760O29216M24882r6294k66182J04919l63936k12493
5106a459018O68612M4454J75154L94979J12621l95824O2506M78745K11957j2172
5096B82014r0526k53156J20062j32204l29565L5436K41622j1745n98488l98785
5086a135335K38635N76372L72839N97393O39426j4112k27514L39161M33379j08443
$$ y = [-2264376, -1710218, -1236871, -871942, -840689, -1011472, -564945, -262409, -453547, -264594, -217496, 140540, 645211, 373092, 177029, 320476, 223527, -55685, 69382, 3128, -126289, 23670, -100399, -539869, -800446, -750837, -858942, -1103260, -743442, -297834, -80855, -366441, -654929, -721419, -778881, -643472, -247228, -568340, -1139243, -1673068, -1704187, -1336225, -1385370, -1679130, -1049914, -625032, -721326, -987508, -882589, -1246525, -1459018, -790406, -745952, -570798, -175819, -63198, -459022, -396516, 82229, 294186, 282014, 191488, -61668, 58394, -73810, -403375, -367939, -126317, -138062, -736550, -1135335, -896700, -320328, 52511, 649904, 1289330, 1275218, 1047704, 1386865, 1820244, 1711801]
5076A711801o30066l64970j4149l75058j39075L03454m5918n62351k75690m7769
5066d39791j18089k0139N42977K70753l32163l61798l5446L6682K05215J13453
5056a38346q3554l89245k4016L64680l54938m38744K13106K66791L60506M05525
5046A81765K49606J48404j20017n006n14151r03398L72169Q51498J55799J8746
5036D35415K90074L9763j30338k18008m72090l79829N5636M070l93086k89639
5026a058032j35555k50673l39714L97077Q50273L34492N941K8633o3805J05650
5016a25713m86185K3113K14018J57896K98300L51502L31130J23320o1471j23189
5006G02721o98555m95218J81705L39884J72613n97565p83826q9721K16851p2773
$$ y = [1711801, 1081735, 716765, 702616, 327558, 188483, 491937, 446019, -116332, -392022, -439791, -557880, -578019, -35042, 235711, -96452, -458250, -493696, -457014, -251799, -138346, -221900, -611145, -635161, -270481, -625419, -1064163, -851057, -584266, -223760, 181765, 431371, 579775, 459758, 454752, -59399, -962797, -590628, 260870, 416669, 435415, 725489, 765252, 634914, 416906, -55184, -435013, -379377, -375307, -768393, -1058032, -1193587, -1444260, -1783974, -1386897, -536624, -202132, -196191, -167558, -231363, -125713, -611898, -588785, -374767, -216871, 81429, 432931, 764061, 887381, 825910, 702721, 4166, -491052, -309347, 30537, 203150, -394415, -1178241, -1267962, -1051111, -1123884]
4996a123884k57418L42418l6298m33518j48683J46783L76724N93777N57167N41447
4986E58515k6676k65601k29802j57665j10315l48812j5756R1095J09599j38442
4976e33860M74135K78009n09893K19688J71030j45237k07066J35497M69899J70239
4966E22441o74769l12302L20203N06688K77579k5601l69245n11147r6297L22002
4956d0448K75228J26380k22148k90067j06429Q614N83119M89042k37329l34785
4946B51177p5492K8435j44210n42679n202K55952k1763k35862l97692j71676N86807
4935d72205P48856K66134j86827r9777q2043n935L87224N26960K77090j32739
4925A226738k32455k76845m63427O4785p6102K0077n01838o13558J28045L23730
$$ y = [-1123884, -1381302, -1038884, -1075182, -1508700, -1657383, -1510600, -1133876, -540099, 17068, 558515, 531839, 266238, 36436, -121229, -231544, -580356, -596112, -505017, -395418, -533860, -59725, 218284, -291609, -71921, 99109, -46128, -253194, -117697, 352202, 522441, -152328, -464630, -144427, 362261, 639840, 614239, 244994, -266153, -362450, -40448, 234780, 361160, 139012, -151055, -257484, -248870, 334249, 823291, 585962, 251177, 175685, 204120, 59910, -482769, -487971, -232019, -253782, -489644, -887336, -1059012, -472205, 276651, 542785, 355958, 256181, 174138, 168203, 555427, 1082387, 1359477, 1226738, 994283, 717438, 254011, 318796, 242694, 262771, -239067, -852625, -724580, -400850]
4915d00850L65245M62624N07787P8741O8645M20434p6304q28755o96722K67829
4905A68674J67418m42973k31986l04244j04408L76016K00436K52809J15811K67669
4895D65222N91678K15639Q8248n4666m66504m64627n26509l66900k3996M68578
4885g3837K15827q08453p05920O1608O69317O03179L03596K03106L2545K12661
4875G13629K78153k83167o48984k97196n8962J14463M74228L52024O1155J2018
4865G17361K76508L28179m88132k07535J91169k48526k24956k03123k91650j43808
4855b94513K22948L06275L25663L23876j14200m39016l69261J96765j568k86517
4845a29548L93342o0419o46649k64754j71791M5560K63554J84406J57783L16194
$$ y = [-400850, -35605, 427019, 934806, 1013547, 1082192, 1502626, 1426322, 597567, -99155, 168674, 336092, -106881, -338867, -643111, -747519, -371503, -171067, 81742, 197553, 465222, 1056900, 1272539, 1360787, 1306121, 839617, 374990, -151519, -518419, -542415, -73837, 141990, -666463, -1372383, -1310775, -641458, -38279, 265317, 468423, 500968, 713629, 991782, 708615, 59631, -237565, -296527, -182064, 292164, 644188, 705343, 717361, 993869, 1322048, 833916, 626381, 817550, 569024, 344068, 140945, -150705, -294513, -71565, 234710, 560373, 884249, 770049, 331033, -38228, 158537, 156969, -129548, 263794, 203375, -443274, -708028, -879819, -834259, -570705, -386299, -228516, 87678]
4835H7678N35523q6491p32079p06503N1551J19585k88844n09595p473Q1865l73563
4824a828346J39334K52513L21364L03795L71397M98163n60n57844L5800J28691
4814c35693K31111L07118L9213j0039k88363k81225L7600R6144K94758J38702
4804B29326L99744N67310K27624J7645J7683j54455k83458l10234k4906o0488
4794F25791j76801K3438n1184K59124P7342j30277j7923j20545j70619Q5584K30011
4783F33941m8402q2403q7080k24386j93403R4229k0941L48327K72849j36770L4049
4772E90010N9080l93387k27961J01708L1092P8230N369k17979j55904J41435L87063
4761C98756j66066l82041m3483j86333m38081o6501J39392m3270J58221L22143
$$ y = [87678, 623201, 536710, -195369, -901872, -850321, -730736, -1019580, -1529175, -1536648, -1454783, -1828346, -1689012, -1436499, -1115135, -811340, -439943, 58220, 57660, -500184, -464384, -335693, -104582, 202536, 241749, 231710, -56653, -337878, -300278, -204134, 90624, 229326, 629070, 1196380, 1424004, 1441649, 1459332, 1304877, 1021419, 711185, 686279, 625791, 448990, 472428, 421244, 680368, 757710, 627433, 609510, 488965, 318346, 403930, 633941, 585539, 503136, 416056, 191670, -1733, 92496, 71555, 419882, 692731, 555961, 590010, 649090, 255703, 27742, 129450, 160542, 238772, 244141, 26162, -129742, 11693, 398756, 232690, -149351, -192834, -379167, -817248, -883749, -744357, -787627, -629406, -307263]
4751c07263L05816K56123L30699P6556k35786m60067j49339K91487M31738N9780
4741E99744r0138J46350N22245O58312J72865n71562r90945n88801P0295k296
4731g3931q0731K2346R6869k48330l12516J79866J51214L11460K24175j05217
4721A65205J78005M65102K22252l28134k37423J4022m56831j47825k4716m5856
4711a96199J06039R7697K44410K8363j34428p840L66187L38725J96929N6178j50983
4700I45078J8212J46022O6349j8384K57532K2819l47973j91698j51658l62863
4690C83436q39066n93258J92847M81048J6795j98734j69733J14824K30594l21260
4680g02507n84668J93800J96346N4404k69324m26858k18135L30992N74890q246
$$ y = [-307263, -1447, 254676, 585375, 661931, 426145, -33922, -183261, 108226, 539964, 599744, 509606, 655956, 1178201, 1836513, 2009378, 1437816, 446871, -141930, -71635, -73931, -154662, -132316, -35447, -283777, -596293, -416427, -265213, 46247, 270422, 165205, 343210, 808312, 1030564, 702430, 465007, 479029, 22198, -125627, -150343, -196199, -90160, 7537, 251947, 280310, 145882, 138042, 504229, 842954, 1039883, 1096061, 945078, 963290, 1109312, 1175661, 1157277, 1414809, 1437628, 1089655, 897957, 746299, 383436, -455630, -1048888, -856041, -374993, -358198, -556932, -726665, -611841, -381247, -702507, -1287175, -1093375, -897029, -842625, -1111949, -1538807, -1756942, -1425950, -851060, -859306]
4670h59306l63678j65115K20449M18976L58537L37444K42575M01145M48880J81665
4660A221572o3226j39838k31331l31000l66152j90959L2717O4335J20396L87768
4650E04282J64356J7309l6899K07903P0145m60216o70338l77578K07072P13603
4640C39639n6920m76471l81244J14668O47910O88465J49401p32503n34123J57691
4630h3487L97875J36026l19202k81561j37835j70536R4439j75361J16014J57469
4620b66159r3910k768k06685m10629n7023K36449J67525j02963o5036r7874K8190
4609h70883j8638N1072K70548J89205j02238J46452L89831J08945j8029j49961
4599c696n46113l70477N2267J96756M30004M8330J38727N44661L05524r7595m01035
$$ y = [-859306, -1222984, -1388099, -1167650, -748674, -390137, -52693, 189882, 591027, 1039907, 1221572, 1158346, 1018508, 787177, 456177, 90025, -100934, -68217, -3882, 116514, 504282, 668638, 685947, 649048, 856951, 927096, 466880, -203458, -581036, -373964, 339639, 282719, -193752, -574996, -460328, 187582, 876047, 1025448, 292945, -241178, -83487, 314388, 450414, 131212, -150349, -288184, -458720, -364281, -539642, -423628, -266159, -360069, -362837, -569522, -980151, -1037174, -800725, -633200, -736163, -801199, -899073, -870883, -889521, -838449, -567901, -378696, -480934, -334482, 55349, 164294, 146265, -3696, -549809, -920286, -868019, -671263, -241259, -192929, -54202, 490459, 795983, 698388, 297353]
4588B97353k86273m64839r77293l64894M21511K53088j7536j53063j05765j15907
4578a513618o3030K62383N16977M85821L79020J3208l03086J78102m5906j90166
4568b80295Q7651j85588j04660N67768P52455K6167l46102j90728k04845k67674
4558a45851k93406m11240J09984O46193k2816l42503j62717k16005K23799L85275
4548b29287k00264n48785j103875o71359M32051N78257O38944N00152M31094J1599
4538a61473q27635m38197L93004L78005K55877j43935k10406j20702l18427k61284
4528a455173J17281N152k31155m7861P33496O41343K57974K52366k18457M3050
4518I8016N53161l8512J70751K10413N1531j71526l75246k79688l54959n4563
$$ y = [297353, 11080, -453759, -1431052, -1795946, -1374435, -1121347, -1138883, -1291946, -1397711, -1513618, -1576648, -1314265, -797288, -311467, 67553, 80761, -222325, -44223, -90129, -280295, -192644, -378232, -482892, 84876, 837331, 863498, 517396, 326668, 121823, -145851, -439257, -850497, -740513, -94320, -117136, -459639, -622356, -838361, -614562, -229287, -429551, -978336, -2082211, -2753570, -2321519, -1743262, -1104318, -604166, -173072, -161473, -989108, -1427305, -1034301, -656296, -400419, -544354, -754760, -875462, -1193889, -1455173, -1337892, -1332740, -1563895, -1611756, -878260, -236917, 21057, 273423, 54966, 98016, 651177, 612665, 783416, 993829, 1045360, 873834, 498588, 218900, -136059, -190622]
4508a90622N17722M17982k43623l80855k3621O71459M36625K26067k07834l76760
4498H46540k94798O2606j44973j34625o3155l36614J11913L78468J50631k95762
4488B80231l15312j54080R616l38853j72421J08311J61840J20438R1711J95438
4478a3081P547O7386K41187r4526k42641J93914N62965N58252L9030l04223m5751
4467I70059K94990J01977o49n34791o65965j8173O91849J17181l68971k98885
4457B88622j55820L0471R8564M6462J98302O0195j83617l31764n56121m67318
4447i72024r7906N0047k12887j9399M39120K75142K0600K58177M18352j22835
4437C6387p67221n04545o9264k7368J82847L33932J63379K05363O8791k48123
$$ y = [-190622, 327100, 745082, 501459, 120604, 96983, 768442, 1205067, 1431134, 1223300, 846540, 551742, 614348, 469375, 334750, 271595, -65019, 46894, 425362, 575993, 280231, -35081, -189161, -179545, -518398, -690819, -582508, -420668, -300230, -208519, -13081, -5534, 61852, 303039, 208513, -34128, 159786, 722751, 1281003, 1320033, 1015810, 970059, 1265049, 1367026, 1366377, 831586, 165621, 147448, 839297, 956478, 587507, 288622, 132802, 163273, 261837, 308299, 506601, 566796, 383179, 51415, -504706, -972024, -1069930, -1019883, -1232770, -1252169, -813049, -537907, -517307, -259130, 159222, 36387, -730834, -1235379, -1304643, -1332011, -1149164, -815232, -651853, -446490, -377699, -625822]
4427f25822k09085j93082J21223L65024L77421R0879k19439l0039L6975J38386
4417a47559K26052J20954l0971j40617m27445o17025n20969L1322L92384M61457
4407f52417P03618O84173j82129k27674M40754N35429J09286n05225j75786J07366
4397H37395J74895O6163m96724p40069p10989m0599L38810M6241m53867n16137
4387a494881r1542M64447K16018j20757Q8054L65651N58077N04306J65623m48281
4377B06715m10787N2470L18811J96823k9970K56377L05985j23980m45501m32550
4367a05607k10765N9974N16980O79563J84945l33169k11151N7j99627k3060L41246
4356F99386n7737l07146k69995j5947L4221L36132M58242L39282l4111p75917
$$ y = [-625822, -834907, -1027989, -906766, -541742, -164321, -73442, -292881, -322920, -285945, -147559, 78493, 199447, 168476, 27859, -399586, -1016611, -1537580, -1506258, -1113874, -652417, 51201, 735374, 553245, 325571, 766325, 1301754, 1411040, 905815, 730029, 837395, 1012290, 1078453, 581729, -158340, -869329, -909928, -571118, -524877, -978744, -1494881, -1586423, -1121976, -905958, -1026715, -938661, -573010, -14933, 489373, 654996, 206715, -204072, -151602, 167209, 364032, 334062, 590439, 896424, 772444, 326943, -105607, -316372, -256398, 260582, 940145, 1125090, 791921, 580770, 580827, 381200, 358140, 699386, 641649, 334503, 64508, 48561, 82782, 418914, 877156, 1216438, 1182327, 406410]
4346D06410k46714J10516k89995o95756o6654j8363l02805J38576Q3992L84677
4336d96116N50246K37457K68248O7184j48193j9618P8332l54568n47983k30088
4326e95099J13234L61145M67835k3183j65550L05354J59524k22061K19089J59776
4316G80064j21887m02322m06747k95779m68J01748j2228O5716M63624K40511N2869
4305D65101N6167k04806k05115J45375K60621L34027j62267q81138n22880o921
4295g21836J39284j09473k80323L14022L54953N6224O2424L60883P13102l07563
4285E81697j045617p9588N26204J35604o4701l30171p4487L36585K00548P9090
4275B65164j17124l90273R6111O87448J46196j47575R4156m4824L4191R7112l68688
$$ y = [406410, 159696, 270212, -19783, -715539, -782193, -800556, -1103361, -964785, -880793, -496116, 54130, 291587, 559835, 627019, 478826, 459208, 537540, 182972, -365011, -595099, -481865, -120720, 347115, 323932, 158382, 463736, 623260, 401199, 620288, 780064, 658177, 255855, -150892, -446671, -447139, -345391, -357619, -291903, 171721, 412232, 465101, 521268, 316462, 111347, 256722, 517343, 851370, 689103, -192035, -714915, -721836, -582552, -692025, -972348, -658326, -303373, -247149, -184725, 176158, 889260, 581697, -463920, -543508, -17304, 118300, 53599, -276572, -351059, -14474, 186074, 265164, 148040, -242233, -146122, 541326, 687522, 539947, 634103, 589279, 623470, 720582, 351894]
4264C51894l94179J65840J82515K73516L07871l38344k85722j86398k1838k77931
4254b22776m28501J16772N26157j1533p59369k45689K21117k835j52736K9633
4244i29760k92069J69220O01353N74434K64892J40182R9745J44708L35355K10546
4234A318606O7159k90639l21016l16364k06561l5209J60505n72124o23778J33714
4224f85707K41757M20970N39243j05958k59883K24329j454j28355M25892P38663
4214A409497O03017j5519l01799k97660n91187k00663R0220j6245l38941k18136
4204A22584l51044J60185N96443K19387q4841j15094k69583m28833J08768r4203
4194a36231K83915N15421N4860j10887k4905J60354J59028m06028n27914k38596
$$ y = [351894, -42285, 123555, 306070, 579586, 887457, 549113, 263391, 76993, 55155, -222776, -651277, -534505, -8348, -19881, -779250, -1024939, -803822, -806657, -959393, -929760, -1221829, -1052609, -451256, 123178, 388070, 528252, 627997, 772705, 1108060, 1318606, 1385765, 1095126, 774110, 457746, 251185, 215976, 376481, -195643, -819421, -685707, -443950, -22980, 516263, 410305, 150422, 374751, 373297, 244942, 670834, 1409497, 2012514, 1996995, 1695196, 1397536, 806349, 605686, 695906, 679661, 340720, 122584, -228460, -68275, 528168, 747555, 662714, 547620, 278037, -150796, -42028, -136231, 147684, 663105, 717965, 607078, 582173, 742527, 901555, 495527, -32387, -270983]
4184b70983n9370j9171K77306L60637K89670L55445K1488j93563n71205k79636
4174h9382J12588P95593J26309l44117n98946n71862k11712P36994R00401j08817
4164G47049o04527k51544m73227j44146N98388Q19393R8215n63353N3869Q1099
4154C61216j84782j60726j81262J11568n221n20340l04469J14016j33631J83787
4144g19844N19449O83394k486p92091l03878k90122L01064N40852K65247J46608
4134C48193k41122P9893J87723j24858l99805j77565K42506L60225M9287k11118
4124A13359j42347J94718J55450j11263J11020J93053J19701k77478n87679l39939
4114e71405J97009n1421k00131N9111M09305L88863J87049L63334L21238j7752
$$ y = [-270983, -330353, -349524, -72218, 288419, 578089, 933534, 955022, 761459, 190254, -89382, 23206, 818799, 945108, 600991, 2045, -569817, -781529, -44535, 855866, 747049, 142522, -109022, -582249, -726395, -128007, 691386, 789601, 226248, 280117, 361216, 176434, 15708, -165554, -53986, -59207, -579547, -884016, -770000, -903631, -719844, -200395, 482999, 480513, -311578, -615456, -905578, -604514, -63662, 201585, 348193, 107071, 186964, 374687, 249829, -149976, -327541, -85035, 275190, 324477, 113359, -28988, 165730, 321180, 209917, 320937, 513990, 633691, 356213, -231466, -571405, -374396, -425817, -625948, -566837, -157532, 231331, 418380, 781714, 1102952, 1085200]
4104A085200o85156k56298J81371l11661r0314L16543J50586j20339M27329P79685
4094A476946P8417n73457j11554J11297k08416j44559j1550J87286R9023L4835
4084I38268L39434K02446l56507l27350p6295J37159L78005r6500p23503m47412
4074c2255n35720J52327N62262M58407j03569l23127p5813k32716m30858j10980
4064f72042K16092N70722q6491M5576L31343n73497m71043k78895J08351J18539
4054f91345Q2936K39923M38060K50804k85530o98354k84857J17718N77041N72500
4044C18896j73374m06739K80700J51116q0851r2268p8041n6250J39413o2575m7294
4033a07267n8791n24302k29851K82499K97601N65735K67396k74146l41818l55489
$$ y = [1085200, 400044, 143746, 325117, 13456, -76858, 239685, 390271, 269932, 697261, 1476946, 1555363, 981906, 870352, 981649, 773233, 628674, 617124, 804410, 903433, 938268, 1277702, 1480148, 1123641, 796291, 719996, 857155, 1235160, 1138660, 415157, -32255, -567975, -415648, 146614, 605021, 501452, 178325, 102512, -130204, -561062, -672042, -455950, 114772, 28281, 73857, 405200, -168297, -639340, -918235, -809884, -691345, -608409, -368486, 69574, 320378, 34848, -663506, -948363, -830645, -253604, 318896, 145522, -261217, 19483, 170599, 89748, -2520, -80561, -136811, 2602, -59973, -107267, -166058, -690360, -920211, -637712, -340111, 225624, 493020, 218874, -122944, -478433]
4023d78433n78322J13405N58124K46645M04924J31206m15089l24446q7569k73380
4013g02935j01487q6377r2550K04264M06650K67712M7062m03655m03358J19874
4003g44800J38870k64783l38352j15498K40398Q23834O21642K45993o8756n57950
3993a9402p80959l62503M22271J32236P5558K42228j45357K54014N00149L87032
3983G05267M21273J17028j21507j24450j35160J2244k00334n93821K11083M66464
3973G58087k55740p08651m71370O288m13908j01934R73456O39206l94503n20262
3963d89331j80816K3570K75524Q76559L62022k56085k25080k98574l12373P3633
3953a50951k70465J38138K56834j31061q1522l92513k52647J09904L59422O48224
$$ y = [-478433, -1056755, -943350, -385226, -138581, 266343, 397549, -17540, -341986, -429555, -702935, -804422, -890799, -983349, -779085, -372435, -104723, -57661, -461316, -864674, -744800, -605930, -870713, -1209065, -1324563, -1084165, -260331, 361311, 607304, 538548, -19402, -800361, -1162864, -740593, -608357, -532799, -290571, -435928, -181914, 318235, 705267, 1126540, 1243568, 1122061, 997611, 862451, 874695, 674361, 80540, 291623, 758087, 502347, -206304, -677674, -671386, -1085294, -1187228, -213772, 425434, 30931, -489331, -670147, -646577, -371053, 505506, 867528, 611443, 386363, 87789, -224584, -150951, -421416, -283278, -26444, -157505, -239027, -631540, -884187, -774283, -414861, 233363]
3943B33363j31489l25082n3250j25670l66585o9223M43218O21086O03968M46675
3933A277011m19924p68009j30005j24387J04938M18262N51956K62428n19031p09412
3923e6173m36038Q700q609l91469K6589o7457n5311r4741m66691K84317Q72645
3912c84238O81575J29880M6115k58066q98378m25050L18670K89343O73267O37129
3902H10247j87271n28750L55832M03771m51423k30284L05471O3887O8979M08372
3892A018831J16402l14372j00658L52465k74772k60155j3752O0858L321J17097
3882G05265j42584l01390M2673K61146J3284L07K4408o8259J09438J85210K59851
3871A089349L0501k46076n01738k21320j03755o32764p73582k29731P01870J075788
$$ y = [233363, 101874, -223208, -276458, -402128, -768713, -837936, -394718, 226368, 830336, 1277011, 857087, 89078, -40927, -165314, -60376, 357886, 909842, 1172270, 653239, -56173, -492211, -483511, -492120, -883589, -857000, -924457, -979768, -1074509, -1541200, -1256883, -384238, 297337, 427217, 473332, 215266, -683112, -1108162, -789492, -500149, 173118, 810247, 622976, 94226, 450058, 853829, 402406, 172122, 477593, 541480, 610459, 1018831, 1135233, 820861, 720203, 1072668, 797896, 537741, 523989, 584847, 588168, 705265, 562681, 261291, 303964, 565110, 578394, 578701, 603109, 534850, 644288, 829498, 1089349, 1119850, 873774, 372036, 150716, 46961, -585803, -1359385, -1589116, -887246, 188542]
3861A88542J40283o45999n31704k51919L61956O45083K27176m4622O9169k90692
3851a32727n36054m18336P980k34832j47852J76716O0452L45288N70190L02185
3841f990J4945l72090j22215K06130j37113j27736n01591j45547M12052M31480
3831c48675P38747O13840l3226o61138m77372m66074l05315M30442J00281n01832
3821i10322j01159j26753P4753m0971N7928M91465M07046J42749J92130l02551
3811a15685j91783K89646Q42581J55953k47105m95295n00459N10704N7048m59943
3801a54338J07774J37700N6930M8635j38389m36036j6020Q7482J74789L45768
3791B14295J15506K31400R6597l10962m27303n65284j0549P27133J93271j2456
$$ y = [188542, 328825, -317174, -848878, -1100797, -738841, -93758, 133418, 88796, 157965, -132727, -668781, -1087117, -1079137, -1313969, -1461821, -1285105, -1224653, -879365, -309175, -6990, 7955, -364135, -486350, -280220, -417333, -545069, -1046660, -1192207, -780155, -348675, 390072, 1003912, 970686, 309548, -167824, -633898, -939213, -508771, -408490, -910322, -1011481, -1138234, -1063481, -1104452, -1046524, -555059, -148013, -5264, 186866, -115685, -307468, -17822, 824759, 980712, 733607, 238312, -262147, 248557, 305605, -154338, -46564, 91136, 148066, 196701, 58312, -377724, -393744, -306262, -131473, 214295, 329801, 561201, 657798, 346836, -80467, -645751, -656300, 70833, 264104, 251648]
3781B51648J87575O022k32480J22186o6258j0531j22024J57106J59696l91300
3771F1640l49760K20277K3258l35786p1542Q7440M2498L31486M42010n5215M079
3760D00385j61436p96256m73123K55678L63283L16481P6461J3172j60126k99544
3750d65025n3179K65060M26820j78118m36834j27364J78235N44668K08842n25082
3740a61977n90811q3475j65563o0439J62131j22173j79192j19095J33507J24952
3730a062135L40297M69129J4363n33939k54484M05116K88154Q3725j1596k67943
3720e29313j00551K1189K51327N01841L48550K10590K38958l07717l53117K27702
3710E09459r8891m00555n60978r2648M66744J00550O7966J86885o8614o04109
$$ y = [251648, 439223, 445245, 212765, 334951, 268693, 258162, 136138, 293244, 452940, 61640, -288120, -67843, -44585, -380371, -451913, -364473, -321975, 9511, 451521, 396306, 400385, 238949, -557307, -1030430, -774752, -411469, -94988, -18527, -5355, -165481, -465025, -518204, -253144, 173676, -4442, -441276, -568640, -390405, 154263, 363105, -161977, -752788, -836263, -1001826, -1062265, -900134, -1022307, -1201499, -1320594, -1187087, -1062135, -721838, -252709, -238346, -772285, -1026769, -621653, -333499, -249774, -261370, -529313, -629864, -608675, -357348, 144493, 493043, 703633, 942591, 634874, 281757, 509459, 410568, 10013, -550965, -643613, -176869, -76319, -8353, 178532, 109918, -494191]
3700d94191m02440K32632N93979M09922k2789l81679j16333j89375o69420o89132
3690a728826j82047L74289O37682L44252j25474l48245m34385K29321N32765K74650
3680d26018M286j86476m1982l41772j32737O13057N70915p2070l35105j67022
3670e14924K97469N19215N38690M9321j58963m51662m49326j10422M08014O99457
3660H26869L31431J49799P2384k65891r3667l99468m51823N0090M20041L79565
3650A019330k85406n03531j89616M82743K41199n5158j63600p4902L92938J54927
3640A018924m30808k94042l6153P9552J689l03321j55324M57220P00981M80276
3630A518994n20511o33430k43727j37271J58508J8299j81916J86027M31079J23989
$$ y = [-494191, -896631, -663999, -70020, 339902, 317113, -64566, -180899, -370274, -1039694, -1728826, -1910873, -1536584, -898902, -554650, -680124, -1028369, -1462754, -1233433, -700668, -426018, -421732, -608208, -650190, -991962, -1124699, -511642, 59273, -12797, -347902, -514924, -217455, 301760, 840450, 889771, 730808, 279146, -170180, -280602, 127412, 826869, 1158300, 1308099, 1380483, 1114592, 1020925, 621457, 169634, 219724, 639765, 1019330, 733924, 230393, 40777, 523520, 764719, 709561, 545961, 471059, 863997, 1018924, 588116, 294074, 257921, 337473, 339162, 35841, -119483, 337737, 1038718, 1518994, 998483, 365053, 121326, -15945, 142563, 160862, -21054, 164973, 596052, 720041]
3620G20041O0059J06773m9371k54712j81567K17228p4081j17341k57741l28099
3610a58811M1271L42295L51071L38600J48574l7059l12045k78587K69K43084J36022
3599H14684k39625j63884j94294k92399k87495l70569R6788K22398l53183l43631
3589a111210l21591l84088n63795P888O82786O68056L64934K53419M72059M85282
3579E53740L9711k16884J9757k6984J67160K09548k06550m00670o79400K37764
3569c02808K28194m20393j03415N27253M42755K77936R284m3970j86613m84374
3559e6151l18413j43993M6118P6270L97018K41410n5448K06879j5700N5640K71822
3548G05452l7584n83766m85825N49486N91088J04917k13456m8451q6806l74021
$$ y = [720041, 780100, 886873, 837502, 582790, 401223, 618451, 544370, 427029, 169288, -158811, -117540, 224755, 575826, 914426, 1063000, 1025941, 713896, 435309, 435578, 678662, 814684, 575059, 411175, 216881, -75518, -363013, -733582, -636794, -414396, -767579, -1111210, -1432801, -1816889, -2380684, -2372796, -1690010, -1021954, -657020, -403601, 68458, 553740, 593451, 376567, 396324, 369340, 536500, 746048, 539498, 138828, -540572, -302808, -74614, -495007, -598422, -71169, 371586, 649522, 658806, 614836, 428223, -56151, -374564, -518557, -472439, -396169, 849, 242259, 186811, 393690, 377990, 433630, 705452, 667868, 84102, -401723, 147763, 738851, 843768, 630312, 581861, 495055, 121034]
3538A21034k35440K89528K97548J12562K55582L97752k18955l93580p11141n10127
3528e95237k10938m20682o03579l04956R0172J02786M54527L57162P01564L82357
3518d6824j93866l60839k66295J21193j15545k41879Q459M65750P6349j01192
3508f54689L36799J04150M36170l6135m8711N70393K84549K5069j76657l65233
3498D75705l9211M62212k12961l69362K21117K9349m77014p11644J63259Q83771
3488D25221Q6923k06093l6685Q93l48r8951k44165j79237L29680J97354J48024
3477D22616J02510m49600o14945k21346M00743J73357j35674n3316K12495M229
3467a58931k31073m1750N5738k30538k96371p3491j81326Q7533K8020J04890N3837
$$ y = [121034, -114406, 175122, 472670, 585232, 840814, 1238566, 1019611, 626031, -85110, -595237, -806175, -1226857, -1830436, -2135392, -2045220, -1942434, -1487907, -1130745, -429181, -46824, -240690, -601529, -867824, -746631, -862176, -1104055, -1095596, -629846, -553497, -654689, -317890, -213740, 222430, 186295, 137584, 707977, 992526, 1017595, 840938, 475705, 436494, 898706, 685745, 316383, 537500, 566849, 89835, -621809, -458550, 425221, 512144, 306051, 269366, 270259, 269911, 170960, -73205, -252442, 77238, 274592, 422616, 525126, 75526, -539419, -760765, -360022, -186665, -322339, -375655, -163160, -158931, -390004, -431754, -376016, -606554, -902925, -976416, -1157742, -1070209, -1042189, -937299, -883462]
3456h83462k2334J29480L02613M59245M58492N8920o20489N3748M73739J29784
3446E39736P6049K16714M32649j76980p11498j54917k25594m63859m7393l0735
3436e45828j54722j20191Q809N6618J69601J2501l32034l41621O07K05912l802
3425a044150o2485M22634N32449q9772l75418j88724M36859O21428k35964l24997
3415c08140J91910L36686K31444L92211K72895m73977k09355q0092o5745K87253
3405E75090j22452k93034p5660k60978n55K90076n7822n50424m37838j63701K03203
3394h94095L97745J6969o1267m2311J34872K77598N7594o0327m7374K91299k09821
3383a39118j004082j552862j60097J784277R02892L42319L43575j38358j30566
$$ y = [-883462, -905796, -776316, -473703, -14458, 444034, 502954, -117535, -63787, 409952, 539736, 615785, 832499, 1265148, 1088168, 376670, 221753, -3841, -467700, -515093, -545828, -700550, -820741, -811932, -755314, -585713, -573212, -905246, -1246867, -1246260, -1040348, -1044150, -1106635, -684001, -151552, -241324, -616742, -805466, -368607, 252821, 16857, -308140, -116230, 220456, 451900, 844111, 1117006, 643029, 433674, 353582, 287837, 575090, 452638, 159604, 83944, -177034, -177589, 112487, 54665, -495759, -933597, -1097298, -894095, -496350, -479381, -540648, -582959, -448087, -170489, -112895, -173222, -220596, 70703, -139118, -1143200, -2696062, -2856159, -1071882, -168990, 173329, 516904, 378546, 247980]
3374B47980j3822k74660l40795j00621j14880j84095l3018J74603N27405M51353
3364C39450J67783l98227m61991l54919p9181M1289L6109o601m8592K67074N45696
3353D7890O38932L41677L89550J02939n60284l76207n05917l88027R9253j67133
3343c77327N0879K44331L23115J55509k16916m45448J8290m7833j84879l7706
$$ y = [247980, 234158, -40502, -381297, -481918, -596798, -780893, -813911, -639308, -111903, 339450, 507233, 109006, -352985, -707904, -787085, -745796, -709687, -716288, -764880, -497806, 47890, 686822, 1028499, 1418049, 1520988, 960704, 584497, 78580, -309447, -210194, -377327, -326448, -82117, 240998, 396507, 179591, -265857, -247567, -295400, -480279, -517985]
$$ [...]
##END NTUPLES=NMR SPECTRUM
##END=
