##TITLE=C13_AdMeOH(from Grignard)
 CDCl3, 22100 sc

 23.3.2023
##JCAMPDX= 6.0         $$ Bruker NMR JCAMP-DX V2.0
##DATA TYPE= NMR SPECTRUM
##DATA CLASS= NTUPLES
##ORIGIN= UXNMR, Bruker Analytische Messtechnik GmbH
##OWNER= root
$$ XWIN-NMR		Version 3.5
$$ Fri Mar 24 13:43:11 2023 Russian Standard Time (UT+4h)  she@DPX200
##.OBSERVE FREQUENCY= 50.327896
##.OBSERVE NUCLEUS= ^13C
##.ACQUISITION MODE= SIMULTANEOUS
##.ACQUISITION SCHEME= undefined
##.AVERAGES= 22101
##.DIGITISER RES= 17
##SPECTROMETER/DATA SYSTEM= spect
##.PULSE SEQUENCE= zgpg30
##.SOLVENT NAME= CDCl3
##.SHIFT REFERENCE= (INTERNAL, CDCl3, 0, 222.624)
##AUDIT TRAIL= $$ (NUMBER, WHEN, WHO, WHERE, WHAT)
$$ ##TITLE= Audit trail, XWIN-NMR		Version 3.5
$$ ##JCAMPDX= 5.01
$$ ##ORIGIN= Bruker BioSpin GmbH
$$ ##OWNER= she
$$ F:/spectra/data/she/nmr/c13/1/pdata/1/auditp.txt
$$ ##AUDIT TRAIL=  $$ (NUMBER, WHEN, WHO, WHERE, WHAT)
(   1,<2023-03-24 13:40:44.23 +0400>,<she>,<DPX200>,
      <created by zg, POWCHK disabled, PULCHK disabled
       terminated by command 'halt'
       configuration hash MD5:
       00 E9 B6 7A A2 85 ED C7 34 08 36 98 17 FE 4E 26
       data hash MD5: 32K
       24 CD B4 55 0E F6 01 08 C6 D8 D1 4E D7 3F 0F 64>)
(   2,<2023-03-24 13:40:49.09 +0400>,<she>,<DPX200>,
      <Start of raw data processing
       efp BC_mod = 2 LB = 2 FT_mod = 6 PKNL = 1 PHC0 = -327.6924 PHC1 = 39.01809 SI = 32K 
       data hash MD5: 32K
       8B 49 02 F7 58 73 80 6C 8D 22 07 65 EC E5 0C B5>)
(   3,<2023-03-24 13:41:34.65 +0400>,<she>,<DPX200>,
      <pk PHC0 = 20.1025 PHC1 = -15.6 
       data hash MD5: 32K
       C5 2B 1E 3C 9C 79 27 AC 05 49 6A D9 0F 0E 83 27>)
(   4,<2023-03-24 13:41:38.31 +0400>,<she>,<DPX200>,
      <abs ABSG = 5 
       data hash MD5: 32K
       27 42 89 1C 64 81 EF DA 4F 77 03 DA DE 75 D8 2D>)
(   5,<2023-03-24 13:42:16.93 +0400>,<she>,<DPX200>,
      <pk PHC0 = -0.9552951 PHC1 = 2.2 
       data hash MD5: 32K
       C4 7A 27 1B 16 65 E5 62 85 37 85 99 03 B2 8E 05>)
(   6,<2023-03-24 13:42:20.35 +0400>,<she>,<DPX200>,
      <abs ABSG = 5 
       data hash MD5: 32K
       72 54 79 B9 D0 C3 C5 74 DF C0 15 17 71 92 A4 54>)
$$ ##END=
$$ 
$$ hash MD5
$$ E8 A7 A9 18 A7 FC 0A C2 15 87 52 8C 71 D0 EC 0C
##$RELAX= 
##$RELAX= 
##$RELAX= 
##$RELAX= 
##$RELAX= 
##$RELAX= 
##$RELAX= 
##$RELAX= 
$$ Bruker specific parameters
$$ --------------------------
##$DU= <F:/spectra>
##$EXPNO= 1
##$NAME= <c13>
##$PROCNO= 1
##$TYPE= <nmr>
##$USER= <she>
##$AMP= (0..31)
100 100 100 100 100 100 100 100 100 100 100 100 100 100 100 100 100 100 
100 100 100 100 100 100 100 100 100 100 100 100 100 100 
##$AQSEQ= 0
##$AQ_mod= 1
##$AUNM= <au_zg>
##$AUTOPOS= <>
##$BF1= 50.322709
##$BF2= 200.13
##$BF3= 50.322709
##$BF4= 500.13
##$BF5= 500.13
##$BF6= 500.13
##$BF7= 500.13
##$BF8= 500.13
##$BYTORDA= 1
##$CFDGTYP= 0
##$CFRGTYP= 5
##$CHEMSTR= <none>
##$CNST= (0..31)
1 1 145 1 1 1 1 1 1 1 1 1 1 1 1 1 1 1 1 1 1 1 1 1 1 1 1 1 1 1 1 1 
##$CPDPRG= <waltz16>
##$CPDPRG1= <>
##$CPDPRG2= <waltz16>
##$CPDPRG3= <>
$$ [...]
##$SUBNAM4= <"">
##$SUBNAM5= <"">
##$SUBNAM6= <"">
##$SUBNAM7= <"">
##$SUBNAM8= <"">
##$SUBNAM9= <"">
##$SW= 239.972175391363
##$SWIBOX= (0..15)
0 1 3 0 0 0 0 0 0 0 0 0 0 0 0 0 
##$SW_h= 12077.2946859903
##$TD= 32768
##$TD0= 1
##$TE= 0
##$TE2= 300
##$TE3= 300
##$TEG= 300
##$TL= (0..7)
120 120 120 120 120 120 120 120 
##$TP= (0..7)
150 150 150 150 150 150 150 150 
##$TP07= 0
##$TPNAME0= <>
##$TPNAME1= <>
##$TPNAME2= <>
##$TPNAME3= <>
##$TPNAME4= <>
##$TPNAME5= <>
##$TPNAME6= <>
##$TPNAME7= <>
##$TPOAL= (0..7)
0.5 0.5 0.5 0.5 0.5 0.5 0.5 0.5 
##$TPOFFS= (0..7)
0 0 0 0 0 0 0 0 
##$TUNHIN= 0
##$TUNHOUT= 0
##$TUNXOUT= 0
##$USERA1= <user>
##$USERA2= <user>
##$USERA3= <user>
##$USERA4= <user>
##$USERA5= <user>
##$V9= 5
##$VALIST= <valist>
##$VCLIST= <CCCCCCCCCCCCCCC>
##$VD= 0
##$VDLIST= <DDDDDDDDDDDDDDD>
##$VPLIST= <PPPPPPPPPPPPPPP>
##$VTLIST= <TTTTTTTTTTTTTTT>
##$WBST= 1024
##$WBSW= 4
##$XGAIN= (0..3)
0 0 0 0 
##$XL= 0
##$YL= 0
##$YMAX_a= 154454290
##$YMIN_a= -37766629
##$ZGOPTNS= <>
##$ZL1= 120
##$ZL2= 120
##$ZL3= 120
##$ZL4= 120
##$ABSF1= 222.624
##$ABSF2= -17.3728
##$ABSG= 5
##$ABSL= 3
##$ALPHA= 0
##$AQORDER= 0
##$ASSFAC= 0
##$ASSFACI= 0
##$ASSFACX= 0
##$ASSWID= 0
##$AUNMP= <proc_1d>
##$AZFE= 0.1
##$AZFW= 0.5
##$BCFW= 0
##$BC_mod= 2
##$BYTORDP= 0
##$COROFFS= 0
##$CY= -3
##$DATMOD= 1
##$DC= 0
##$DFILT= <>
##$DTYPP= 0
##$F1P= 0
##$F2P= 0
##$FCOR= 0.5
##$FTSIZE= 32768
##$FT_mod= 6
##$GAMMA= 0
##$GB= 0
##$INTBC= 1
##$INTSCL= 4.134877e-10
##$ISEN= 128
##$LB= 2
##$LEV0= 0
##$LPBIN= 0
##$MAXI= 10000
##$MC2= 0
##$MEAN= 0
##$ME_mod= 0
##$MI= 0.1934396
##$NCOEF= 0
##$NC_proc= 2
##$NLEV= 6
##$NOISF1= 120.0001
##$NOISF2= 80.00006
##$NSP= 0
##$NTH_PI= 0
##$NZP= 0
##$OFFSET= 222.624
##$PC= 1.4
##$PHC0= -308.5452
##$PHC1= 25.61809
##$PH_mod= 1
##$PKNL= yes
##$PPARMOD= 0
##$PSCAL= 0
##$PSIGN= 0
##$REVERSE= no
##$SF= 50.3227315983092
##$SI= 32768
##$SIGF1= 140
##$SIGF2= 120
##$SINO= 11.81781
##$SIOLD= 32768
##$SREGLST= <13C.CDCl3>
##$SSB= 0
##$STSI= 32768
##$STSR= 0
##$SW_p= 12077.2946859903
##$SYMM= 0
##$S_DEV= 0
##$TDeff= 32768
##$TDoff= 0
##$TI= <>
##$TILT= no
##$TM1= 0
##$TM2= 0
##$TOPLEV= 0
##$USERP1= <user>
##$USERP2= <user>
##$USERP3= <user>
##$USERP4= <user>
##$USERP5= <user>
##$WDW= 1
##$XDIM= 32768
##$YMAX_p= 363894366
##$YMIN_p= -1712867
$$ End of Bruker specific parameters
$$ ---------------------------------
##NTUPLES= NMR SPECTRUM
##VAR_NAME=  FREQUENCY,     SPECTRUM/REAL,   SPECTRUM/IMAG
##SYMBOL=    X,             R,               I
##VAR_TYPE=  INDEPENDENT,   DEPENDENT,       DEPENDENT
##VAR_FORM=  AFFN,          ASDF,            ASDF
##VAR_DIM=   32768,         32768,           32768
##UNITS=     HZ,            ARBITRARY UNITS, ARBITRARY UNITS
##FACTOR=    0.368581032318806, 1,           1
##FIRST=     11203.0474430531, 0,            0
##LAST=      -874.247242937185, 0,           0
##MIN=       -874.247242937185, -1712867,    0
##MAX=       11203.0474430531, 363894366,    0
$$ Real data points
##PAGE= N=1
##DATA TABLE= (X++(R..R)), XYDATA
$$ [...]
$$ plain form
15959 -218787 -283163 -474945 -702868 -851833 -892846 -802792 -573171 -296283 -62837 87323
15949 87323 128642 104000 111223 171281 252682 338805 388048 342597 230827 167052 225453 313323
15937 313323 289659 163889 35279 -45549 -33882 95462 256529 332510 348207 409989 504034
15926 504034 547141 510268 409684 294187 233937 258436 363539 499322 576110 518854 402020
15915 402020 365832 420419 521217 626355 677118 661495 597173 470285 308675 192304
15905 192304 170138 211729 260906 265821 164814 -8105 -109901 -155736 -266565 -466676 -680719
15894 -680719 -794171 -724781 -486936 -192133 53661 212653 275044 226276 104339 -26998
15884 -26998 -163825 -298654 -385633 -392451 -340016 -280510 -236623 -200820 -159130 -106839 -5368
$$ packed form
15959b18787o4376j91782k27923j48965m1013R0054K29621K76888K33446J50160
15949H7323M1319k4642P223O0058Q1401Q6123M9243m5451j11770o3775N8401Q7870
15937C13323k3664j25770j28610q0828J1667J29344J61067P5981J5697O1782R4045
15926E04034M3107l6873j00584j15497o0250K4499J05103J35783P6788n7256j16834
15915D02020l6188N4587J00798J05138N0763j5623o4322j26888j61610j16371
15905A92304k2166M1591M9177M915j01007j72919j01796m5835j10829k00111k14043
15894f80719j13452O9390K37845K94803K45794J58992O2391m8768j21937j31337
15884b6998j36827j34829q6979o818N2435N9506M3887L5803M1690N2291J01471
$$ plain form
15873 -5368 120989 200391 236643 233236 146150 2493 -108599 -97652 72241 320059 514986
15862 514986 630961 640622 487195 249923 103727 43044 -73428 -210274 -242305 -140422
15852 -140422 -9113 39068 3953 -64736 -171854 -299474 -369694 -341109 -232030 -58359
15842 -58359 121973 233033 249260 216697 186598 179678 194400 201250 174366 99937 -50433
15831 -50433 -235714 -408670 -543706 -561368 -434549 -239698 -96402 -43355 -51252 -83215 -82863
15820 -82863 -1767 124123 222965 263364 225934 118336 -567 -79237 -157406 -265993 -320602
15809 -320602 -278783 -138622 109956 404792 673407 928643 1191705 1410833 1513705 1477539
15799 1477539 1331252 1102321 832315 604938 484689 469014 496795 509409 473144 348870
$$ packed form
15873e368J26357P9402L6252l407q7086j43657j11092J0947J69893K47818J94927
15862E14986J15975R661j53427k37272j46196o0683j16472j36846l2031J01883
15852a40422J31309M8181l5115o8689j07118j27620p0220K8585J09079J73671
15842e8359J80332J11060J6227l2563l0099o920J4722O850k6884p4429j50370
15831e0433j85281j72956j35036j7662J26819J94851J43296N3047p897l1963L52
15820h2863Q1096J25890R8842M0399l7430j07598j18903p8670p8169j08587n4609
15809c20602M1819J40161K48578K94836K68615K55236K63062K19128J02872l6166
15799A477539j46287k28931k70006k27377j20249j5675K7781J2614l6265j24274
$$ plain form
15789 348870 187670 42646 -107256 -234705 -236902 -130887 -53059 -65242 -83270 -28232 68572
15778 68572 169502 266344 307244 276273 222657 188014 177320 134240 29947 -71202 -96539
15767 -96539 -36985 30409 51339 -11172 -145900 -250014 -269830 -230038 -183828 -140486 -64524
15756 -64524 16267 40108 -1724 -55471 -96764 -128214 -116297 -51904 -4674 15376 101694 266284
15744 266284 431483 555929 644007 696571 659952 503227 319246 189382 101532 46430
15734 46430 17679 -34011 -131241 -246370 -331116 -392030 -468276 -585031 -753894 -977379 -1165722
15723 -1165722 -1138460 -862652 -480267 -91144 236446 449332 562409 604636 587530 502526
15713 502526 401910 334443 268775 193780 153259 188286 319033 428763 379318 232829 71764
$$ packed form
15789C48870j61200j45024j49902j27449k197J06015P7828j2183j8028N5038R6804
15778F8572J00930R6842M0900l0971n3616l4643j0694m3080j04293j01149k5337
15767i6539N9554O7394K0930o2511j34728j04114j9816L9792M6210M3342P5962
15756f4524Q0791K3841m1832n3747m1293l1450J1917O4393M7230K0050Q6318J64590
15744B66284J65199J24446Q8078N2564l6619j56725j83981j29864q7850n5102
15734D6430k8751n1690r7230j15129q4746o0914p6246j16755j68863k23485j88343
15723a165722K7262K75808L82385L89123L27590K12886J13077M2227j7106q5004
15713E02526j00616o7467o5668p4995m0521L5027J30747J09730m9445j46489j61065
$$ plain form
15702 71764 -89004 -188594 -176835 -115978 -137344 -262867 -369461 -351455 -233045 -118839 -57399
15691 -57399 18711 194183 475808 824086 1135133 1301885 1284986 1118185 867227 578021
15681 578021 278962 22466 -163448 -262141 -269896 -257160 -293302 -376926 -447990 -478045 -536463
15670 -536463 -650948 -708307 -643147 -483236 -292588 -164532 -151534 -157392 -70161 96646 296423
15659 296423 448244 495248 452084 319876 121875 -61152 -172341 -203023 -183955 -157737
15649 -157737 -150785 -138266 -27683 220992 525338 771084 870009 855878 800141 714655 592288
15638 592288 464558 357942 267908 189531 118618 40983 -40741 -71174 -2759 85763 154162
15627 154162 244624 337988 348695 242259 108226 45154 60565 92019 116653 158889 169027
$$ packed form
15702G1764j60768r9590J1759O0857k1366j25523j06594J8006J18410J14206O1440
15691e7399P6110J75472K81625L48278L11047J66752j6899j66801k50958k89206
15681E78021k99059k56496j85914r8693p755J2736l6142q3624p1064l0055n8418
15670e36463j14485n7359O5160J59911J90648J28056J2998n858Q7231J66807J99777
15659B96423J51821M7004m3164j32208j98001j83027j11189l0682J9068K6218
15649a57737O952J2519J10583K48675L04346K45746R8925j4131n5737q5486j22367
15638E92288j27730j06616r0034p8377p0913p7635q1724l0433O8415Q8522O8399
15627A54162R0462R3364J0707j06436j34033o3072J5411L1454K4634M2236J0138
$$ plain form
15616 169027 60246 -125968 -253746 -281541 -258479 -177423 -5871 214821 391853 487382
15606 487382 514879 460613 342565 237123 148624 12259 -179210 -360012 -434316 -363475
15596 -363475 -230926 -144458 -98936 -45477 14536 97549 250287 488464 774553 1023439
15586 1023439 1158805 1179649 1121664 959060 716463 506759 393275 357073 365187 390394
15576 390394 365832 297955 275925 309668 309535 206795 9115 -211549 -361899 -434291 -469361
15565 -469361 -495971 -549481 -639325 -706391 -644536 -401866 -27229 342057 575114 631707 561986
15554 561986 424121 258607 113334 20389 -40255 -110254 -176279 -196508 -187654 -233368 -333056
15543 -333056 -433881 -478573 -410097 -264649 -166844 -193135 -314206 -442872 -509623 -541795 -574115
$$ packed form
15616A69027j08781j86214j27778k7795K3062Q1056J71552K20692J77032R5529
15606D87382K7497n4266j18048j05442q8499j36365j91469j80802p4304P0841
15596c63475J32549Q6468M5522N3459O0013Q3013J52738K38177K86089K48886
15586A023439J35366K0844n7985j62604k42597k09704j13484l6202Q114K5207
15576C90394k4562o7877k2030L3743j33j02740j97680k20664j50350p2392l5070
15565d69361k6610n3510q9844o7066O1855K42670L74637L69286K33057N6593o9721
15554E61986j37865j65514j45273r2945o0644o9999o6025k0229Q854m5714r9688
15543c33056j00825m4692O8476J45448R7805k6291j21071j28666o6751l2172l2320
$$ plain form
15532 -574115 -547863 -420099 -228636 -32837 110972 210508 316206 443959 575389 653087
15522 653087 583469 374549 159576 33612 -41119 -150236 -256743 -296778 -268215 -217660
15512 -217660 -197789 -229716 -298324 -400737 -531796 -604103 -591990 -572641 -594048 -584837 -444319
15501 -444319 -197522 55341 229396 240355 70216 -264282 -666497 -928647 -920355 -731496
15491 -731496 -553141 -512437 -592020 -710326 -828478 -898944 -899694 -841221 -743914 -650595 -581608
15480 -581608 -482002 -296486 -93844 32063 65128 44202 -2479 -91428 -227282 -315684 -277282
15469 -277282 -168142 -45775 79823 132789 71342 2939 16038 53050 86271 133529 144055
15458 144055 120170 76832 -20792 -107517 -92926 17346 144587 245912 359040 489016
$$ packed form
15532e74115K6252J27764J91463J95799J43809R9536J05698J27753J31430P7698
15522F53087o9618k08920k14973j25964p4731j09117j06507m0035K8563N0555
15512b17660J9871l1927o8608j02413j31059p2307J2113J9349k1407R211J40518
15501d44319K46797K52863J74055J0959j70139l34498m02215k62150Q292J88859
15491g31496J78355M0704p9583j18306j18152p0466p50N8473R7307R3319O8987
15480e81608R9606J85516K02642J25907L3065k0926m6681q8949j35854q8402L8402
15469b77282J09140J22367J25598N2966o1447o8403J3099L7012L3221M7258J0526
15458A44055k3885m3338r7624q6725J4591J10272J27241J01325J13128J29976
$$ plain form
15448 489016 566499 571773 507198 387832 257829 160370 127166 168877 266968 374723 476781
15437 476781 587560 706520 797088 839652 843799 798279 705358 631109 595271 526627 392712
15426 392712 226671 71441 -61329 -171743 -213824 -137921 29015 193773 302248 347798
15416 347798 306229 185186 61519 -9254 -28186 -27134 -54636 -105268 -142814 -132960 -86506
15405 -86506 -13914 49017 20473 -115272 -265447 -314603 -263462 -178169 -129340 -128478 -131548 -137779
15393 -137779 -150076 -166060 -154824 -53272 65927 125300 119738 52562 -52077 -121390 -145795
15382 -145795 -153105 -144321 -128110 -90888 -4930 130639 255166 320054 343709 350256 344263 320541
15370 320541 249949 133551 97130 224884 403476 461145 387677 335533 435744 654682
$$ packed form
15448D89016P7483N274o4575j19366j30003r7459l3204M1711R8091J07755J02058
15437D76781J10779J18960R0568M2564M147m5520r2921p4249l5838o8644j33915
15426C92712j66041j55230j32770j10414m2081P5903J66936J64758J08475M5550
15416C47798m1569j21043j23667p0773j8932J052k7502n0632l7546R854M6454
15405h6506P2592O2931k8544j35745j50175m9156N1141Q5293M8829Q62l070o231
15393a37779j2297j5984J1236J01552J19199N9373n562o7176j04639o9313k4405
15382a45795p310Q784J6211L7222Q5958J35569J24527O4888K3655O547n993k3722
15370C20541p0592j16398l6421J27754J78592N7669p3468n2144J00211K18938
$$ plain form
15360 654682 822999 841555 811810 826152 836000 800193 716486 575117 377661 227586 209262
15349 209262 249510 253728 248280 286905 317662 274781 194505 82620 -55306 -117139 -68964
15338 -68964 -2904 29001 42109 52703 75339 125246 198302 216481 129452 -23403 -186929
15327 -186929 -334658 -431845 -462872 -431415 -306013 -106575 32475 84749 169786 308661
15317 308661 444485 564831 644914 633534 512711 333469 145845 -25399 -104183 -65554
15307 -65554 -28703 -60212 -127739 -155325 -28096 289364 706182 1060465 1225466 1203799 1069435
15296 1069435 861155 592062 310685 111808 83661 194487 308377 323049 258006 172525
15286 172525 63170 -104888 -311703 -513183 -670128 -763518 -828588 -852582 -790647 -681313
$$ packed form
15360F54682J68317J8556k9745J4342R848l5807q3707j41369j97456j50075j8324
15349B09262M0248M218n448L8625L0757m2881q0276j11885j37926o1833M8175
15338f8964O6060L1905J3108J0594K2636M9907P3056J8179q7029j52855j63526
15327a86929j47729r7187l1027L1457J25402J99438J39050N2274Q5037J38875
15317C08661J35824J20346Q0083j1380j20823j79242j87624j71244p8784L8629
15307f5554L6851l1509o7527k7586J27229L17460M16818L54283J65001k1667j34364
15296A069435k08280k69093k81377j98877k8147J10826J13890J4672o5043q5481
15286A72525j09355j68058k06815k01480j56945r3390o5070k3994O1935J09334
$$ plain form
15276 -681313 -526233 -337422 -195471 -151821 -175672 -180995 -164961 -172405 -197256 -226019 -282035
15265 -282035 -298908 -213337 -85067 -38408 -164877 -418461 -678539 -855273 -900500 -873757
15255 -873757 -891252 -988089 -1071320 -1001417 -789615 -561017 -364683 -183659 -50702 -34556
15245 -34556 -98879 -184325 -290901 -377995 -406689 -417384 -407535 -392653 -446698 -576854 -693197
15234 -693197 -700723 -619555 -501409 -345061 -174630 -59836 -32516 -66688 -137586 -190551 -187657
15223 -187657 -146140 -104420 -115541 -208934 -378098 -608034 -839177 -982131 -1005712 -970294 -903946
15212 -903946 -803615 -687647 -537346 -358406 -265733 -312459 -417569 -520408 -619257 -697913
15202 -697913 -713772 -640582 -548599 -533068 -617410 -756057 -845457 -809450 -652178 -454279 -336076
$$ packed form
15276f81313J55080J88811J41951M3650k3851n323J6034p444k4851k8763n6016
15265b82035j6873Q5571J28270M6659j26469k53584k60078j76734m5227K6743
15255h73757j7495r6837q3231O9903K11802K28598J96334J81024J32957J6146
15245c4556o4323q5446j06576q7094k8694j0695R849J4882n4045j30156j16343
15234f93197p526Q1168J18146J56348J70431J14794K7320l4172p0898n2965K894
15223a87657M1517M1720j1121r3393j69164k29936k31143j42954k3581L5418O6348
15212i03946J00331J15968J50301J78940R2673m6726j05110j02839r8849p8656
15202f97913j5859P3190R1983J5531q4342j38647q9400L6007J57272J97899J18203
$$ plain form
15191 -336076 -367916 -515445 -674820 -788082 -878213 -920412 -905614 -875862 -806543 -632602 -345827
15180 -345827 -4352 319801 576228 747663 843487 876956 820958 658695 405856 49548
15170 49548 -314801 -530419 -568667 -507699 -416688 -284880 -138056 -67927 -51292 19352 133418
15159 133418 188329 112877 -69632 -276346 -421772 -462727 -396119 -267738 -158064 -128966
15149 -128966 -191420 -268934 -343942 -430064 -555702 -717597 -844518 -929883 -984215 -1005077 -988451
15138 -988451 -927520 -857870 -829389 -853069 -882317 -828531 -686484 -535609 -398063 -299091 -298568
15127 -298568 -368102 -410514 -375783 -270152 -143726 -43478 30333 53115 15555 -25461 -56691
15116 -56691 -133331 -172654 -119042 -104055 -231031 -503077 -833413 -1098962 -1186514 -1085158 -925348
$$ packed form
15191c36076l1840j47529j59375j13262r0131m2199J4798K9752O9319J73941K86775
15180c45827L41475L24153K56427J71435R5824L3469n5998j62263k52839l56308
15170D9548l64349k15618l8248O0968R1011J31808J46824P0129J6635P0644J14066
15159A33418N4911p5452j82509k06714j45426m0955O6608J28381J09674K9098
15149a28966o2454p7514p5008q6122j25638j61895j26921q5365n4332k0862J6626
15138i88451O0931O9650K8481k3680k9248N3786J42047J50875J37546R8972N23
15127b98568o9534m2412L4731J05631J26426J00248P3811K2782l7560m1016l1230
15116e6691p6640l9323N3612J4987j26976k72046l30336k65549q7552J01356J59810
$$ plain form
15105 -925348 -814342 -727189 -641724 -585327 -568919 -549999 -486221 -421661 -444737 -547274 -618487
15094 -618487 -580986 -450204 -315179 -242286 -248011 -312430 -378197 -385706 -327927 -307265 -361451
15083 -361451 -377484 -261578 -51139 149372 264827 240608 80239 -158200 -381714 -482057
15073 -482057 -436477 -307853 -176710 -76022 3798 30532 -28253 -129061 -193744 -234222 -306382
15062 -306382 -359949 -380258 -440555 -555345 -679917 -780565 -861598 -917156 -897010 -768511 -569506
15051 -569506 -380485 -263412 -229911 -242313 -228775 -135748 -22312 59608 156551 260077 319844
15040 319844 349721 360952 366719 409871 465433 480881 464688 427943 397755 399823 391070 379447
15028 379447 402572 452648 477404 408519 263917 103670 -48543 -168805 -208285 -137743 -10867
$$ packed form
15105i25348J11006Q7153Q5465N6397J6408J8920O3778O4560k3076j02537p1213
15094f18487L7501J30782J35025P2893n725o4419o5767p509N7779K0662n4186
15083c61451j6033J15906K10439K00511J15455k4219j60369k38439k23514j00343
15073d82057M5580J28624J31143J00688P9820K6734n8785j00808o4683m0478p2160
15062c06382n3567k0309o0297j14790j24572j00648q1033n5558K0146J28499J99005
15051e69506J89021J17073L3501j2402J3538R3027J13436Q1920R6943J03526N9767
15040C19844K9877J1231N767M3152N5562J5448j6193l6745l0188K068q753j1623
15028C79447K3125N0076K4756o8885j44602j60247j52213j20262l9480P0542J26876
$$ plain form
15017 -10867 83076 92512 26983 -45148 -104219 -194122 -363167 -594728 -777225 -855622 -864942
15006 -864942 -842372 -852201 -906068 -899095 -785794 -609947 -445064 -397442 -500677 -649147 -711464
14995 -711464 -697072 -664188 -628453 -579612 -480453 -324366 -173032 -64849 30708 92948 82529
14984 82529 58960 121966 262976 371788 393433 361077 254456 65492 -103419 -151794 -114781
14973 -114781 -79499 -33307 72606 162751 185840 217191 294728 334135 263071 92961 -146367
14962 -146367 -410381 -645597 -860737 -1060225 -1200368 -1249893 -1158053 -962062 -788423 -685076
14952 -685076 -646110 -654169 -620907 -522381 -448778 -481738 -591573 -668977 -665739 -649461 -639343 -565136
14940 -565136 -442927 -369694 -407864 -522232 -639456 -740558 -842026 -923250 -952240 -955012 -977887
$$ packed form
15017a0867R3943R436o5529p2131n9071q9903j69045k31561j82497p8397r320
15006h64942K2570r829n3867O973J13301J75847J64883M7622j03235j48470o2317
14995g11464J4392L2884L5735M8841R9159J56087J51334J08183R5557O2240j0419
14984H2529k3569O3006J41010J08812K1645l2356j06621j88964j68911m8375L7013
14973a14781L5282M6192J05913R0145K3089L1351P7537L9407p1064j70110k39328
14962a46367k64014k35216k15140j99488j40143m9525R1840J95991J73639J03347
14952f85076L8966q059L3262R8526P3603l2960j09835p7404L238J6278J0118P4207
14940e65136J22209P3233l8170j14368j17224j01102j01468q1224k8990k772k2875
$$ plain form
14929 -977887 -1013275 -1016876 -950608 -799933 -619825 -488412 -432287 -424459 -449928 -506058 -566541
14918 -566541 -594866 -610295 -625701 -586054 -480029 -336030 -197667 -68698 47320 95014
14908 95014 143012 295875 517163 700224 803768 843869 831305 799448 816425 903751 1066858
14897 1066858 1264530 1382360 1349829 1174525 904517 584320 253743 -58796 -367792 -622675
14887 -622675 -732183 -734548 -715583 -701611 -693174 -687384 -631880 -528018 -461509 -486198 -577546 -689625
14875 -689625 -811741 -921944 -965862 -927732 -850299 -787768 -749888 -694132 -590142 -517314 -534630
14864 -534630 -604008 -719300 -881393 -1070076 -1254720 -1406912 -1482002 -1452643 -1398354 -1376710
14854 -1376710 -1376509 -1362437 -1308341 -1223365 -1146271 -1052533 -914356 -768676 -635227 -528452 -433798
$$ packed form
14929i77887l5388l601O6268J50675J80108J31413N6125P828k5469n6130o0483
14918e66541k8325j5429j5406L9647J06025J43999J38363J28969J16018M7694
14908I5014M7998J52863K21288J83061J03544M0101j2564l1857J6977Q7326J63107
14897A066858J97672J17830l2531j75304k70008l20197l30577l12539l08996k54883
14887f22675j09508k365J8965J3972Q437N790N5504J03862O6509k4689r1348j12079
14875f89625j22116j10203m3918L8130P7433O2531L7880N5756J03990P2828j7316
14864e34630o9378j15292j62093j88683j84644j52192p5090K9359N4289K1644
14854a376710K01J4072N4096Q4976P7094R3738J38177J45680J33449J06775R4654
$$ plain form
14843 -433798 -305944 -127356 55580 191273 282364 325350 328114 303859 233194 158529 142983
14832 142983 191162 256633 300519 315571 311060 263713 167027 18449 -181398 -361326 -466917
14821 -466917 -509415 -515678 -513029 -481554 -365599 -176010 -5434 58430 11692 -36170 1821
14810 1821 5595 -110524 -257877 -358977 -398427 -365762 -286043 -260528 -328588 -407106 -413888 -350204
14798 -350204 -268253 -191729 -88844 51370 179058 263465 274389 231506 162293 62252 -36937
14787 -36937 -78262 -19278 127208 339590 491867 481560 404701 365484 363275 375887 388432
14776 388432 327282 177508 28934 -73998 -153185 -162247 -53177 124662 246915 214987
14766 214987 100033 39661 51114 17687 -130102 -310067 -409348 -411984 -362633 -283048 -177318
$$ packed form
14843d33798J27854J78588J82936J35693R1091M2986K764k4255p0665p4665j5546
14832A42983M8179O5471M3886J5052m511m7347r6686j48578j99847j79928j05591
14821d66917m2498o263K649L1475J15955J89589J70576O3864m6738m7862L7991
14810A821L774j16119j47353j01100l9450L2665P9719K5515o8060p8518o782O3684
14798c50204Q1951P6524J02885J40214J27688Q4407J0924m2883o9213j00041r9189
14787c6937m1325N8984J46486K12382J52277j0307p6859l9217k209J2612J2545
14776C88432o1150j49774j48574j02932p9187r062J09070J77839J22253l1928
14766B14987j14954o0372J1453l3427j47789j79965r9281k636M9351P9585J05730
$$ plain form
14755 -177318 -31648 132531 219901 201705 169861 181946 209997 207219 164076 91617 -33722
14744 -33722 -220156 -419186 -555639 -548408 -431683 -369681 -398773 -423724 -398922 -331682 -215209
14733 -215209 -50930 122094 269981 405297 568317 788605 1000849 1136428 1208751 1247016
14723 1247016 1243433 1160102 939478 602282 279775 37335 -75600 -50899 13080 29653
14713 29653 -25526 -111114 -188227 -267852 -349801 -376448 -283140 -94050 72517 103255 16810
14702 16810 -89150 -189208 -286203 -403822 -536825 -640354 -689793 -705782 -727507 -754230 -714161
14691 -714161 -569477 -354308 -137261 20892 143635 245615 300481 321780 345080 354401
14681 354401 350330 405548 526643 618320 625756 584477 564274 641061 818341 1003130 1071765
$$ packed form
14755a77318J45670J64179Q7370j8196l1844J2085K8051k778m3143p2459j25339
14744c3722j86434j99030j36453P231J16725O2002k9092k4951K4802O7240J16473
14733b15209J64279J73024J47887J35316J63020K20288K12244J35579P2323L8265
14723A247016l583q3331k20624l37196l22507k42440j12935K4701O3979J6573
14713B9653n5179q5588p7113p9625q1949k6647R3308J89090J66567L0738q6445
14702A6810j05960j00058r6995j17619j33003j03529m9439j5989k1725k6723M0069
14691g14161J44684K15169K17047J58153J22743J01980N4866K1299K3300R321
14681C54401m071N5218J21095R1677P436m1279k0203P6787J77280J84789O8635
$$ plain form
14670 1071765 978666 818340 696461 626793 512643 294506 95635 33845 103133 202510
14660 202510 210351 146644 103439 141798 232732 272348 233331 162173 66039 -50037 -131029
14649 -131029 -175502 -226912 -270484 -290257 -301271 -294804 -239633 -130113 6762 109499 107463
14638 107463 -16758 -204053 -341852 -366427 -302640 -176551 -29420 98327 188934 172167
14628 172167 38946 -138326 -312847 -376545 -220348 107497 406818 528378 431752 171879
14618 171879 -128999 -389318 -509614 -478475 -420222 -375074 -309712 -234458 -159621 -45894 98357
14607 98357 210326 306667 416726 541675 705994 861903 926538 895003 832733 776588 689910
14596 689910 557617 375755 126178 -113672 -257671 -295291 -264213 -228809 -216796 -221929 -223853
$$ packed form
14670A071765r3099j60326j21879o9668j14150k18137j98871o1790O9288R9377
14660B02510P841o3707m3205L8359R0934L9616l9017p1158r6134j16076q0992
14649a31029m4473n1410m3572j9773j1014O467N5171J09520J36875J02737k036
14638A07463j24221j87295j37799k4575O3787J26089J47131J27747R0607j6767
14628A72167j33221j77272j74521o3698J56197L27845K99321J21560r6626k59873
14618A71879l00878k60319j20296L1139N8253M5148O5362P5254P4837J13727J44251
14607I8357J11969R6341J10059J24949J64319J55909O4635l1535o2270n6145q6678
14596F89910j32293j81862k49577k39850j43999l7620L1078L5404J2013n133j924
$$ plain form
14585 -223853 -175603 -104022 -64129 20848 213614 429654 573550 596370 497484 311115 149884
14574 149884 121310 143190 93711 -20405 -121078 -153865 -124782 -124790 -218352 -313030 -260958 -118158
14562 -118158 -48588 -81176 -95120 -17126 52193 8807 -101817 -194655 -280622 -370418 -440205
14551 -440205 -453012 -420463 -415911 -463844 -541357 -638387 -686873 -671482 -659674 -670445 -720435 -808241
14539 -808241 -899328 -943997 -925900 -869342 -805814 -786930 -785713 -710912 -562384 -406736 -267166
14528 -267166 -191733 -249881 -404980 -575927 -676135 -673038 -642569 -671481 -764329 -834825 -825105
14517 -825105 -753067 -648722 -523953 -359122 -140639 75240 219101 254498 218367 170131
14507 170131 129810 134047 154646 159427 139486 68963 -35198 -107242 -147946 -218904 -265828 -214818
$$ packed form
14585b23853M8250P1581L9893Q4977J92766K16040J43896K2820r8886j86369j61231
14574A49884k8574K1880m9479j14116j00673l2787K9083qr3562r4678N2072J42800
14562a18158O9570l2588j3944P7994O9319m3386j10624r2838q5967q9796o9787
14551d40205j2807L2549M552m7933p7513r7030m8486J5391J1808j0771m9990q7806
14539h08241r1087m4669J8097N6558O3528J8884J217P4801J48528J55648J39570
14528b67166P5433n8148j55099j70947j00208L097L0469k8912r2848p0496R720
14517h25105P2038J04345J24769J64831K18483K15879J43861L5397l6131m8236
14507A70131m0321M237K0599M781j9941p0523j04161p2044m0704p0958m6924N1010
$$ plain form
14495 -214818 -89091 34713 96360 80651 37837 62955 187753 333283 442448 586832
14485 586832 761109 831068 785194 703918 627360 525018 369200 247871 202274 179368 141292
14474 141292 81055 -6918 -107165 -163704 -177212 -170889 -153852 -181332 -261470 -368659 -489106
14463 -489106 -628214 -800051 -951530 -1025251 -1015016 -895245 -679966 -465446 -365910 -442183
14453 -442183 -644126 -837861 -925696 -947185 -984932 -951318 -745942 -482269 -284539 -191837
14443 -191837 -214309 -341063 -470372 -479668 -358633 -165958 37535 199928 293365 340874
14433 340874 353609 343469 339192 355294 379680 359813 213453 -57613 -386170 -732213 -967759
14422 -967759 -1003929 -952946 -941086 -974495 -982280 -907372 -751338 -596070 -532097 -575666 -649416
$$ packed form
14495b14818J25727J23804O1647j5709m2814K5118J24798J45530J09165J44384
14485E86832J74277O9959m5874q1276p6558j02342j55818j21329m5597k2906l8076
14474A41292o0237q7973j00247n6539j3508O323J7037k7480q0138j07189j20447
14463d89106j39108j71837j51479p3721J0235J19771K15279K14520R9536p6273
14453d42183k01943j93735q7835k1489l7747L3614K05376K63673J97730R2702
14443a91837k2472j26754j29309r296J21035J92675K03493J62393R3437M7509
14433C40874J2735j0140m277J6102K4386j9867j46360k71066l28557l46043k35546
14422i67759l6170N0983J1860l3409p785P4908J56034J55268O3973m3569p3750
$$ plain form
14411 -649416 -658033 -593031 -528030 -524720 -549719 -554770 -535410 -471254 -326453 -133105 20733
14400 20733 119094 151591 91533 -11952 -56730 17207 97088 62686 -49237 -180946 -286365
14389 -286365 -320995 -243407 -93447 21087 95197 158549 197774 197587 165375 125243 83254
14378 83254 65602 149287 366704 636568 841657 915989 886477 801239 654725 390817 29109
14367 29109 -296236 -475458 -490036 -403143 -302053 -187217 -8302 184801 337471 468435
14357 468435 563911 584677 512311 327627 48641 -266458 -543069 -727783 -769979 -645140
14347 -645140 -429478 -266733 -272649 -386992 -452936 -437440 -414654 -407560 -387817 -333840 -265381
14336 -265381 -209826 -198367 -250752 -281542 -198723 -24077 207584 460370 650151 733601 714605
$$ packed form
14411f49416q617O5002O5001L310k4999n051J9360O4156J44801J93348J53838
14400B0733R8361L2497o0058j03485m4778P3937P9881l4402j11923j31709j05419
14389b86365l4630P7588J49960J14534P4110O3352L9225j87l2212m0132m1989
14378H3254j7652Q3685K17417K69864K05089P4332k9512q5238j46514k63908l61708
14367B9109l25345j79222j4578Q6893J01090J14836J78915J93103J52670J30964
14357D68435R5476K0766p2366j84684k78986l15099k76611j84714m2196J24839
14347f45140K15662J62745n916j14343o5944J5496K2786P094J9743N3977O8459
14336b65381N5555J1459n2385l0790Q2819J74646K31661K52786J89781Q3450j8996
$$ plain form
14325 714605 594392 398906 171108 -63470 -235590 -275499 -247239 -228495 -212444 -147647
14315 -147647 -44112 59052 142872 128380 -7861 -164154 -274529 -335561 -338128 -270659 -123026
14304 -123026 43992 164748 252217 344206 418452 428420 362846 259523 148074 58531 25550
14293 25550 36293 33458 -34757 -132736 -142031 -63134 -35737 -94089 -160415 -242732 -401695 -579269
14281 -579269 -660905 -589079 -400293 -183994 -35029 10456 -11141 -30623 27516 192543 382455
14270 382455 458645 419687 366181 301407 182786 64799 14525 11505 4029 -9262 37083
14259 37083 139402 195017 169911 122522 59743 -42848 -157203 -271958 -354883 -410756 -471274
14248 -471274 -548855 -630822 -668714 -654945 -614423 -557591 -462054 -295455 -130821 -75944 -96969
$$ packed form
14325G14605j20213j95486k27798k34578j72120l9909K8260J8744J6051O4797
14315a47647J03535J03164Q3820j4492j36241j56293j10375o1032k567O7469J47633
14304a23026J67018J20756Q7469R1989P4246R968o5574j03323j11449q9543l2981
14293B5550J0743k835o8215r7979r295P8897K7397n8352o6326q2317j58963j77574
14281e79269q1636P1826J88786K16299J48965M5485k1597j9482N8139J65027J89912
14270C82455P6190l8958n3506o4774j18621j17987n0274l020p476j3291M6345
14259C7083J02319N5615k5106m7389o2779j02591j14355j14755q2925n5873o0518
14248d71274p7581q1967l7892J3769M0522N6832R5537J66599J64634N4877k1025
$$ plain form
14237 -96969 -120732 -138729 -172544 -236807 -281544 -229110 -91600 15212 -8207 -164995 -392651
14226 -392651 -620490 -766207 -790821 -772628 -734627 -618533 -450673 -329232 -284366 -273963
14216 -273963 -297063 -363177 -443234 -475108 -369425 -139025 97662 278611 389059 422596
14206 422596 398850 320588 174055 -14994 -241620 -484444 -666366 -736072 -717922 -662797
14196 -662797 -568155 -436861 -344249 -358000 -471266 -611879 -689042 -664084 -598853 -531713 -452203
14185 -452203 -352068 -219980 -55628 97916 156852 102457 -6418 -61611 -27978 37635
14175 37635 132427 296265 498621 655288 726147 698497 596190 487453 422060 378039 336500
14164 336500 301476 285553 296880 342977 403763 439129 433087 359275 254451 155119 34170
$$ packed form
14237i6969k3763j7997l3815o4263m4737N2434J37510J06812k3419j56788k27656
14226c92651k27839j45717k4614J8193L8001J16094J67860J21441M4866J0403
14216b73963k3100o6114q0057l1874J05683K30400K36687J80949J10448L3537
14206D22596k3746p8262j46533j89049k26626k42824j81922o9706J8150N5125
14196f62797R4642J31294R2612j3751j13266j40613p7163K4958O5231O7140P9510
14185d52203J00135J32088J64352J53544N8936n4395j08875n5193L3633O5613
14175C7635R4792J63838K02356J56667P0859k7650j02307j08737o5393m4021m1539
14164C36500l5024j5923J1327M6097O0786L5366o042p3812j04824r9332j20949
$$ plain form
14153 34170 -124553 -317614 -500022 -594085 -578603 -476657 -311319 -121429 73245 264510
14143 264510 395704 416985 316917 198806 192630 209807 138636 52337 29756 77322 133420
14132 133420 96881 -16683 -81063 -5265 173148 359864 502398 586045 658478 788896
14122 788896 939324 1031460 1026540 888554 690561 526028 447569 461446 483970 493931 472890
14111 472890 401890 346099 320606 310047 324034 340772 353408 372099 388412 389595 338942 235002
14099 235002 152462 130449 74844 -93500 -281207 -363772 -330637 -257851 -193267 -76059 100583
14088 100583 254237 334980 336391 291710 244144 206194 180021 184415 212589 179304 25054
14077 25054 -179801 -383241 -512918 -473351 -286483 -101465 -87441 -208393 -294249 -234509
$$ packed form
14153C4170j58723j93061j82408r4063J5482J01946J65338J89890J94674J91265
14143B64510J31194K1281j00068j18111o176J7177p1171q6299k2581M7566N6098
14132A33420l6539j13564o4380P5798J78413J86716J42534Q3647P2433J30418
14122G88896J50428R2136m920j37986j97993j64533p8459J3877K2524R961k1041
14111D72890p1000n5791k5493j0559J3987J6738J2636J8691J6313J183n0653j03940
14099B35002q2540k2013n5605j68344j87707q2565L3135P2786O4584J17208J76642
14088A00583J53654Q0743J411m4681m7566l7950k6173M394K8174l3285j54250
14077B5054k04855k03440j29677L9567J86868J85018J4024j20952q5856N9740
$$ plain form
14067 -234509 -83904 16515 11967 -7596 40077 110585 121841 20226 -156965 -310861 -401577
14056 -401577 -432119 -463795 -560978 -700186 -809239 -833039 -794829 -737742 -643818 -540651 -474193
14045 -474193 -416265 -347242 -299867 -275119 -245919 -158181 5439 170496 266854 266287 147679
14034 147679 -54904 -235376 -330872 -338730 -243043 -53047 148414 301718 428886 517158
14024 517158 535165 513656 486783 453063 386881 303568 186784 -12169 -227850 -389753 -434771
14013 -434771 -276274 17376 252206 356547 376863 319698 153301 -139882 -454351 -637367
14003 -637367 -654797 -607763 -622250 -700952 -733358 -673799 -572688 -450259 -312444 -142700 54716
13992 54716 207513 292555 328989 308764 188067 11121 -150079 -247831 -213457 -118712 -104135
$$ packed form
14067b34509J50605J00419m548j9563M7673P0508J1256j01615j77191j53896r0716
14056d01577l0542l1676r7183j39208j09053k3800L8210N7087R3924J03167O6458
14045d74193N7928O9023M7375K4748K9200Q7738J63620J65057R6358n67j18608
14034A47679k02583j80472r5496p858R5687J89996K01461J53304J27168Q8272
14024E17158J8007k1509k6873l3720o6182q3313j16784j98953k15681j61903m5018
14013d34771J58497K93650K34830J04341K0316n7165j66397k93183l14469j83016
14003f37367j7430M7034j4487p8702l2406N9559J01111J22429J37815J69744J97416
13992E4716J52797Q5042L6434k0225j20697j76946j61200r7752L4374R4745J4577
$$ plain form
13981 -104135 -175843 -240240 -239675 -214659 -239079 -322561 -407883 -468577 -501923 -530873 -523203 -421619
13969 -421619 -267089 -149806 -96924 -54015 -9644 -3358 -70078 -183943 -315962 -431296 -482852
13958 -482852 -528585 -630077 -716489 -697154 -561898 -364723 -226096 -231567 -367428 -576007
13948 -576007 -803532 -1002838 -1138542 -1181705 -1142642 -1119624 -1161931 -1197577 -1138321 -1011598 -904180
13937 -904180 -796025 -619040 -381641 -165809 -9111 90526 127848 161603 216351 255118
13927 255118 287460 342675 431707 514875 569102 628687 661511 621434 594359 663178 793994
13916 793994 888250 876851 799583 732163 661713 553078 422146 317511 264151 170988 -21694
13905 -21694 -186395 -203128 -51304 199563 413366 513721 503557 408570 289640 162613
$$ packed form
13981a04135p1708o4397N65K5016k4420q3482q5322o0694l3346k8950P670J01584
13969d21619J54530J17283N2882M2909M4371O286o6720j13865j32019j15334n1556
13958d82852m5733j01492q6412J9335J35256J97175J38627n471j35861k08579
13948e76007k27525j99306j35704m3163L9063K3018m2307l5646N9256J26723J07418
13937i04180J08155J76985K37399K15832J56698R9637L7322L3755N4748L8767
13927B55118L2342N5215Q9032Q3168N4227N9585L2824m0077k7075O8819J30816
13916G93994R4256j1399p7268o7420p0450j08635j30932j04635n3360r3163j92682
13905b1694j64701j6733J51824K50867K13803J00355j0164r4987j18930j27027
$$ plain form
13895 162613 -3235 -210319 -426601 -613390 -742278 -837632 -958447 -1066100 -1127961 -1203616
13885 -1203616 -1283679 -1301431 -1243872 -1143435 -1037093 -985207 -998183 -1024915 -1018208 -974526 -923949
13874 -923949 -849257 -719864 -553675 -391283 -274613 -212939 -170676 -152024 -187230 -228934 -242849
13863 -242849 -285209 -393550 -562286 -737386 -827880 -778041 -620588 -421936 -222787 -35331
13853 -35331 69225 45975 -20481 -75055 -134006 -205825 -249298 -246107 -243669 -244576 -182697 -35650
13841 -35650 112988 192123 200386 141680 67324 -18014 -178522 -419323 -645181 -779662 -829756
13830 -829756 -819735 -814263 -837848 -802488 -651153 -498311 -484613 -594184 -699538 -744517 -756224
13819 -756224 -768313 -753669 -651878 -468319 -224480 1080 69691 -28318 -184679 -328816
$$ packed form
13895A62613j65848k07084k16282j86789j28888r5354j20815j07653o1861p5655
13885a203616q0063j7752N7559J00437J06342N1886j2976k6732O707M3682N0577
13874i23949P4692J29393J66189J62392J16670O1674M2263J8652l5206m1704j3915
13863b42849m2360j08341j68736j75100r0494M9839J57453J98652J99149J87456
13853c5331J04556k3250o6456n4574n8951p1819m3473L191K438r07O1879J47047
13841c5650J48638P9135Q263n8706p4356q5338j60508k40801k25858j34481n0094
13830h29756J0021N472k3585L5360J51335J52842J3698j09571j05354m4979j1707
13819g56224j2089J4644J01791J83559K43839K25560O8611r8009j56361j44137
$$ plain form
13809 -328816 -413356 -455532 -536048 -661505 -771894 -831629 -821060 -718967 -543882 -347023
13799 -347023 -238910 -234394 -219713 -128862 -43816 -23082 -30495 -47441 -90643 -168230 -243329 -282445
13787 -282445 -283486 -258660 -242691 -249565 -279836 -369077 -504138 -641159 -794762 -963063 -1112777
13776 -1112777 -1201188 -1167249 -1043056 -952640 -906741 -821979 -696673 -576942 -503804 -504715 -526234
13765 -526234 -473761 -336490 -223336 -242764 -339521 -413016 -420913 -382038 -324491 -212778 -48982
13754 -48982 107616 216122 262217 223283 106728 -4295 -34375 902 24312 -66458 -281722
13743 -281722 -505255 -630361 -636000 -573396 -523750 -505518 -455683 -365689 -293366 -283893 -314106
13732 -314106 -300659 -279041 -362000 -516883 -641079 -724136 -783033 -762419 -610536 -359860 -98377
$$ packed form
13809c28816q4540m2176q0516j25457j10389n9735J0569J02093J75085J96859
13799c47023J08113M516J4681R0851Q5046K0734p413j6946m3202p7587p5099l9116
13787b82445j041K4826J5969o874l0271q9241j35061j37021j53603j68301j49714
13776a112777q8411L3939J24193R0416M5899Q4762J25306J19731P3138r11k1519
13765e26234N2473J37271J13154j9428r6757p3495p897L8875N7547J11713J63796
13754d8982J56598J08506M6095l8934j16555j11023l0080L5277K3410r0770k15264
13743b81722k23533j25106n639O2604M9646J8232M9835Q9994P2323R473l0213
13732c14106J3447K1618q2959j54883j24196q3057n8897K0614J51883K50676K61483
$$ plain form
13721 -98377 101067 183189 117980 -41151 -236370 -407485 -507440 -594865 -692073 -722208 -676632
13710 -676632 -627394 -547670 -382004 -207186 -98334 -46501 -46502 -78625 -103336 -101108 -67465 -61140
13698 -61140 -150904 -286369 -389224 -439250 -446844 -402540 -255968 -58079 83748 149056 150064
13687 150064 119749 90676 50342 -44188 -181015 -272750 -287154 -294128 -257344 -91290 67874
13676 67874 47512 -157396 -427186 -626426 -707247 -710294 -662706 -551513 -444754 -436760 -453888
13665 -453888 -388308 -252174 -75649 108227 233135 243712 169173 105213 111691 135816 98164
13654 98164 27284 -30336 -113150 -216021 -302187 -354756 -371354 -358091 -283410 -151278 -11543
13643 -11543 89719 122904 99628 79819 74319 59145 47979 53244 83321 138466 168215 146464
$$ packed form
13721i8377J99444Q2122o5209j59131j95219j71115r9955q7425r7208l0135M5576
13710f76632M9238P9724J65666J74818J08852N1833jl2123k4711K228L3643O325
13698f1140q9764j35465j02855n0026p594M4304J46572J97889J41827O5308J008
13687A50064l0315k9073m0334r4530j36827r1735j4404o974L6784J66054J59164
13676F7874k0362k04908k69790j99240q0821l047M7588J11193J06759P994j7128
13665d53888O5580J36134J76525J83876J24908J0577p4539o3960O478K4125l7652
13654I8164p0880n7620q2814j02871q6166n2569j6598J3263P4681J32132J39735
13643a1543J01262L3185k3276j9809n500j5174j1166N265L0077N5145K9749k1751
$$ plain form
13631 146464 131123 162726 224746 282866 300501 269734 205171 88749 -2463 30332 123979
13620 123979 165782 141855 145652 274382 502135 678243 716319 648947 515587 322592 152291
13609 152291 82521 69799 47835 -1947 -37406 -49404 -46855 -5669 44779 62373 57041 39552
13597 39552 -30262 -158931 -320390 -503718 -704759 -848127 -839038 -689868 -483213 -255800
13587 -255800 -39624 114752 214731 277276 327690 354807 335479 328262 314687 245741 181017
13576 181017 171474 194407 213659 236212 272665 328058 380725 422279 478404 521267 490849 402991
13564 402991 283165 117525 -77140 -227993 -290058 -297068 -304099 -295033 -190513 -9341 125442
13553 125442 144928 82577 -13428 -134364 -297495 -470084 -560993 -524775 -446564 -405837 -369395
$$ packed form
13631A46464j5341L1603O2020N8120J7635l0767o4563j16422r1212L2795R3647
13620A23979M1803k3927L797J28730K27753J76108L8076o7372j33360j92995j70301
13609A52291o9770j2722k1964m9782l5459j1998K549M1186N0448J7594n332j7489
13597C9552o9814j28669j61459j83328k01041j43368R089J49170K06655K27413
13587b55800K16176J54376R9979O2545N0414K7117j9328p217j3575o8946o4724
13576A81017r543K2933J9252K2553L6453N5393N2667M1554N6125M2863l0418q7858
13564D02991j19826j65640j94665j50853o2065p010p031R066J04520J81172J34783
13553A25442J9486o2351r6005j20936j63131j72589r0909L6218P8211M0727L6442
$$ plain form
13542 -369395 -288847 -173525 -91259 -69856 -93768 -133823 -131797 -104967 -136441 -233069 -356310
13531 -356310 -465713 -521057 -513887 -454681 -342553 -190873 -70536 -52244 -107584 -165684 -199615
13520 -199615 -238672 -302703 -339233 -340771 -340125 -319890 -291203 -279777 -339290 -455347 -550259 -598648
13508 -598648 -562999 -411294 -247319 -196387 -211791 -214027 -193093 -156624 -107100 -40203 4895
13497 4895 34210 75600 85596 23368 -86631 -146755 -124091 -80350 -60399 -62489 -49363 -1683
13485 -1683 70925 115800 118947 152110 247164 330727 348470 273746 152582 61757 13752 -60171
13473 -60171 -228596 -432906 -578654 -674552 -766299 -781846 -697062 -599137 -539005 -464991 -324981
13462 -324981 -166117 -71163 2474 108662 212910 330302 444853 467911 418969 378052
$$ packed form
13542c69395Q0548J15322Q2266K1403k3912m0055K026K6830l1474r6628j23241
13531c56310j09403n5344P170N9206J12128J51680J20337J8292n5340n8100l3931
13520a99615l9057o4031l6530j538O46K0235K8687J1426n9513j16057r4912m8389
13508e98648L5649J51705J63975N0932j5404k236K0934L6469M9524O6897M5098
13497D895K9315M1390R996o2228j09999o0124K2664M3741J9951k090J3126M7680
13485a683P2608M4875L147L3163R5054Q3563J7743p4724j21164r0825m8005p3923
13473f0171j68425k04310j45748r5898r1747j5547Q4784R7925O0132P4014J40010
13462c24981J58864R4954P3637J06188J04248J17392J14551K3058m8942m0917
$$ plain form
13452 378052 355087 332052 296270 247763 193753 195955 291108 435702 545310 564280 512910
13441 512910 416181 273424 119635 19889 -7352 -42737 -158765 -283533 -293697 -167088
13431 -167088 -7542 116952 218890 302636 343209 325278 260847 181297 109362 46167 -46026
13420 -46026 -194347 -336214 -416475 -457709 -477550 -473614 -445369 -412413 -410139 -448233 -502893 -543941
13408 -543941 -570723 -570904 -550236 -576806 -650297 -709515 -700887 -569633 -357097 -192675 -109200
13397 -109200 -14502 124663 293001 464418 559884 529342 415177 305852 269690 308832
13387 308832 358168 384559 408066 451572 507123 519632 484270 439542 405859 414042 462581 526301
13375 526301 567834 532454 426189 307980 222179 199769 215075 141612 -47608 -230909 -336321
$$ packed form
13452C78052k2965k3035l5782m8507n4010K202R5153J44594J09608J8970n1370
13441E12910r6729j42757j53789r9746k7241l5385j16028j24768j0164J26609
13431a67088J59546J24494J01938Q3746M0573j7931o4431p9550p1935o3195r2193
13420d6026j48321j41867q0261m1234j9841L936K8245L2956K274l8094n4660m1048
13408e43941k6782j81K0668k6570p3491n9218Q628J31254K12536J64422Q3475
13397a09200R4698J39165J68338J71417R5466l0542j14165j09325l6162L9142
13387C08832M9336K6391K3507M3506N5551J2509l5362m4728l3683Q183M8539O3720
13375E26301M1533l5380j06265j18209q5801k2410J5306p3463j89220j83301j05412
$$ plain form
13364 -336321 -348299 -241363 -55836 100699 218703 369082 548534 663280 638082 506101
13354 506101 353061 198191 10697 -152364 -218476 -275104 -415527 -597971 -731902 -769482
13344 -769482 -704527 -528514 -264698 4615 180890 256701 296713 279782 258287 365086
13334 365086 546916 656535 638402 554603 490501 505370 638882 871022 1181965 1564546
13324 1564546 2010603 2417277 2581500 2443771 2080771 1636131 1302887 1127649 1020450
13315 1020450 943360 902615 907537 904949 818514 657565 465825 307820 241981 259331 282829
13304 282829 228056 77506 -89073 -120616 28605 240390 391568 440471 471718 604180
13294 604180 838902 1025052 1053877 981008 919165 860424 753608 645211 618903 694138 792322
$$ packed form
13364c36321j1978J06936J85527J56535J18004J50379J79452J14746k5198j31981
13354E06101j53040j54870j87494j63061o6112n6628j40423j82444j33931l7580
13344g69482O4955J76013K63816K69313J76275P5811M0012j6931k1495J06799
13334C65086J81830J09619j8133q3799o4102J4869J33512K32140L10943L82581
13324A564546M46057M06674J64223j37729l63000m44640l33244j75238j07199
13315A020450p7090m0745M922k588q6435j60949j91740j58005o5839J7350K3498
13304B82829n4773j50550j66579l1543J49221K11785J51178M8903L1247J32462
13294F04180K34722J86150K8825p2869o1843n8741j06816j08397k6308P5235R8184
$$ plain form
13283 792322 835771 794381 626556 374192 166922 29705 -92283 -208108 -311227 -382590
13273 -382590 -390027 -333704 -228061 -113629 -56442 -79680 -122807 -89198 78746 368654 678670
13262 678670 880403 924875 867026 794450 766225 780368 780615 680573 501432 348012 238640
13251 238640 189120 284644 503886 735308 906639 1012249 1069024 1102920 1102383 1007949 835362
13240 835362 671671 541514 410129 294834 259342 343363 478649 579793 582628 462644
13230 462644 289305 121568 -31655 -131727 -178188 -197560 -151116 3749 243134 494941
13220 494941 695627 791519 751522 611379 463696 396516 425450 477075 469758 431290 413774
13209 413774 400398 359943 254874 118466 -15117 -142074 -249764 -376684 -510944 -566234
$$ packed form
13283G92322M3449m1390j67825k52364k07270j37217j21988j15825j03119p1363
13273c82590p437N6323J05643J14432N7187k3238m3127L3609J67944K89908L10016
13262F78670K01733M4472n7849p2576k8225J4143K47j00042j79141j53420j09372
13251B38640m9520R5524K19242K31422J71331J05610N6775L3896n37r4434j72587
13240H35362j63691j30157j31385j15295l5492Q4021J35286J01144K835j19984
13230D62644j73339j67737j53223j00072m6461j9372M6444J54865K39385K51807
13220D94941K00686R5892l9997j40143j47683o7180K8934N1625p317l8468j7516
13209D13774j3376m0455j05069j36408j33583j26957j07690j26920j34260n5290
$$ plain form
13199 -566234 -484612 -290880 -17193 277297 509236 681381 805376 826658 754671 655928
13189 655928 574976 547657 585580 648487 644371 556676 447097 381785 379485 413422 495554 655299
13177 655299 839004 965002 1039769 1039462 953869 822085 668030 559829 516480 525494 584442
13166 584442 623283 618445 675751 826698 971352 1031800 979465 827387 670425 561655 437106
13155 437106 284871 218643 306186 469922 609754 698734 736366 727577 699982 676632 653718
13144 653718 639974 626302 614899 634658 627933 562662 532346 602056 702752 763640 807411
13133 807411 875155 908418 874293 856731 835234 736191 630805 611350 658133 725654 791032
13122 791032 827561 809590 742038 714743 808897 962391 1086112 1211893 1416244 1689902
$$ packed form
13199e66234Q1622J93732K73687K94490K31939J72145J23995K1282p1987r8743
13189F55928q0952k7319L7923O2907m116q7695j09579o5312k300L3937Q2132J59745
13177F55299J83705J25998P4767l07q5593j31784j54055j08201m3349R014N8948
13166E84442L8841m838N7306J50947J44654O0448n2335j52078j56962j08770j24549
13155D37106j52235o6228Q7543J63736J39832Q8980L7632q789k7595k3350k2914
13144F53718j3744j3672j1403J9759o725o5271l0316O9710J00696O0888M3771
13133H07411O7744L3263l4125j7562k1497r9043j05386j9455M6783O7521O5378
13122G91032L6529j7971o7552k7295R4154J53494J23721J25781K04351K73658
$$ plain form
13112 1689902 1957819 2138614 2164993 2090941 1973393 1842194 1718962 1578164 1458307 1451311
13102 1451311 1540837 1620190 1659759 1712835 1799578 1871334 1894674 1916079 2030036 2244879 2439223
13091 2439223 2541632 2548480 2486909 2450734 2465385 2483154 2494931 2536893 2638649 2748488 2756819
13080 2756819 2611964 2421479 2306239 2256909 2221051 2202901 2189098 2130534 2043548 1973188 1946109
13069 1946109 1975357 2037078 2098223 2152351 2238064 2395063 2578484 2710659 2785168 2858525 2962785
13058 2962785 3095393 3234004 3300372 3247870 3143952 3100097 3167180 3295020 3448057 3599193
13048 3599193 3708948 3793740 3892123 3975825 3991276 3988821 3993939 3981028 3969284 4013288 4109403
13037 4109403 4188306 4220426 4246842 4317176 4403703 4455236 4458227 4453559 4500615 4632828 4868771
$$ packed form
13112A689902K67917J80795K6379p4052j17548j31199j23232j40798j19857o996
13102A451311Q9526P9353L9569N3076Q6743P1756K3340K1405J13957K14843J94344
13091B439223J02409O848o1571l6175J4651J7769J1777M1962J01756J09839Q331
13080B756819j44855j90485j15240m9330l5858j8150j3803n8564q6986p0360k7079
13069A946109K9248O1721O1145N4128Q5713J56999J83421J32175P4509P3357J04260
13058B962785J32608J38611O6368n2502j03918m3855O7083J27840J53037J51136
13048C599193J09755Q4792R8383Q3702J5451k455N118j2911j1744M4004R6115
13037D109403P8903L2120K6416P0334Q6527N1533K991m668M7056J32213K35943
$$ plain form
13026 4868771 5167272 5448941 5713200 5989894 6304471 6611247 6848364 7055003 7256055
13017 7256055 7494424 7784627 8055810 8295842 8496125 8694167 8997642 9448915 9987768
13008 9987768 10490208 10910472 11270237 11619751 12006533 12450181 12980326 13658472 14532884
12999 14532884 15635639 16950750 18412052 20001972 21732230 23603386 25640366 27913007
12991 27913007 30547880 33717348 37534420 42057913 47422137 53904080 61775850 71253488
12983 71253488 82664915 96446509 113171344 133737964 159130146 190101812 226903227
12976 226903227 268390645 310291699 343888254 358495613 348494186 318145957 277837841
12969 277837841 236793687 199897029 168637422 142887597 121896045 104761382 90725967
$$ packed form
13026D868771K98501K81669K64259K76694L14577L06776K37117K06639K01052
13017G256055K38369K90203K71183K40032K00283J98042L03475M51273N38853
13008I987768N02440M20264L59765L49514L86782M43648N30145O78146Q74412
12999A4532884J102755J315111J461302J589920J730258J871156K036980K272641
12991B7913007K634873L169468L817072M523493N364224O481943P871770R477638
12983G1253488J1411427J3781594J6724835K0566620K5392182L0971666L6801415
12976B26903227M1487418M1901054L3596555J4607359j0001427l0348229m0308116
12969B77837841m1044154l6896658l1259607k5749825k0991552j7134663j4035415
$$ plain form
12962 90725967 79209156 69730108 61827549 55116744 49363554 44422011 40217348 36669724
12954 36669724 33619542 30933991 28604630 26651805 24973170 23415824 21943345 20609368
12946 20609368 19455949 18457907 17572012 16778748 16097711 15550841 15092535 14718042 14466723
12937 14466723 14296104 14155829 14046652 13973985 13921304 13849636 13738871 13585870 13410992 13263269
12927 13263269 13182546 13242931 13494457 13908237 14396403 14917341 15520414 16273025 17192030 18275811
12917 18275811 19521866 20868224 22224286 23394809 24132544 24429087 24553302 24802145 25330015
12908 25330015 26204280 27478840 29144825 31198418 33733210 36857815 40732581 45583552
12900 45583552 51525448 58645815 67111364 77153731 89110225 103524268 121175237
$$ packed form
12962I0725967j1516811r479048p902559o710805n753190m941543m204663l547624
12954C6669724l050182k685551k329361j952825j678635j557346j472479j333977
12946B0609368j153419r98042q85895p93264o81037n46870m58306l74493k51319
12937A4466723j70619j40275j09177p2667n2681p1668j10765j53001j74878j47723
12927A3263269q0723O0385K51526M13780M88166N20938O03073P52611R19005J083781
12917A8275811J246055J346358J356062J170523P37735K96543J24215K48843N27870
12908B5330015Q74265J274560J665985K053593K534792L124605L874766M850971
12900D5583552N941896P120367Q465549J0042367J1956494J4414043J7650969
$$ plain form
12893 121175237 142910013 169668423 202414436 241326250 284479742 326130661 356110600
12886 356110600 363894366 346411341 310788812 268224466 227067459 191135766 161227944
12879 161227944 136832225 117063767 100986603 87762838 76723300 67476239 59758720
12872 59758720 53284485 47852910 43362914 39639967 36426399 33520887 30852630 28465739
12864 28465739 26378094 24568152 23058217 21838045 20793665 19855389 19030817 18329805
12856 18329805 17697522 17016833 16241715 15443372 14731408 14173636 13770467 13500863 13300467
12847 13300467 13070626 12814271 12625629 12570995 12641906 12742211 12818735 12892895 12968054 13022614
12837 13022614 13099927 13282430 13611136 14018721 14386148 14726303 15147769 15701126 16295220
$$ packed form
12893A21175237K1734776K6758410L2746013L8911814M3153492M1650919K9979939
12886C56110600P783766j7483025l5622529m2564346m1157007l5931693k9907822
12879A61227944k4395719j9768458j6077164j3223765j1039538r247061p717519
12872E9758720o474235n431575m489996l722947l213568k905512k668257k386891
12864B8465739k087645j809942j509935j220172j044380r38276q24572p01012
12856A8329805o32283o80689p75118p98343p11964n57772m03169k69604k00396
12847A3300467k29841k56355j88642n4634P0911J00305P6524P4160P5159N4560
12837A3022614P7313J82503L28706M07585L67427L40155M21466N53357N94094
$$ plain form
12828 16295220 16858763 17466759 18197823 19105613 20253307 21639121 23192870 24839036 26592437
12819 26592437 28611140 31070351 34051303 37634969 41901048 46982565 53088830 60426218
12811 60426218 69186464 79596596 92116280 107412172 126167876 149219702 177478564
12804 177478564 211554024 251068846 293188439 331045684 354297727 354370076 331275123
12797 331275123 293650635 251863803 212701443 178906832 150822687 127887386 109281110
12790 109281110 94110425 81580306 71138163 62444212 55199939 49085747 43859595
12783 43859595 39426952 35693954 32478830 29673249 27243192 25128680 23264284 21652500
12775 21652500 20279520 19074086 18010136 17059353 16144727 15156777 14086458 13066399
$$ packed form
12828A6295220N63543O07996P31064R07790J147694J385814J553749J646166J753401
12819B6592437K018703K459211K980952L583666M266079N081517O106265P337388
12811F0426218Q760246J0410132J2519684J5295892J8755704K3051826K8258862
12804A77478564L4075460L9514822M2119593L7857245K3252043P2349k3094953
12797C31275123l7624488m1786832l9162360l3794611k8084145k2935301j8606276
12790A09281110j5170685j2530119j0442143q693951p244273o114192n226152
12783D3859595m432643l732998l215124k805581k430057k114512j864396j611784
12775B1652500j372980j205434j063950r50783r14626r87950j070319j020059
$$ plain form
12767 13066399 12174174 11393967 10703223 10087648 9529407 8995150 8451686 7871224 7280738
12758 7280738 6766478 6372869 6026783 5675974 5359165 5081244 4818599 4567754 4392344
12749 4392344 4344228 4326302 4259842 4150048 3963800 3763521 3621634 3516057 3411278 3278440
12739 3278440 3109993 2926710 2793013 2730771 2704273 2681702 2622943 2525152 2421788 2302647
12729 2302647 2139844 2004775 2006770 2131574 2274272 2354957 2388551 2402590 2394176 2368465 2343912
12718 2343912 2328217 2327965 2318185 2282977 2243610 2192657 2152568 2147770 2151309 2122021 2050726 1954258
12706 1954258 1789771 1552282 1354315 1271701 1281810 1348407 1437054 1499987 1503857 1472870 1466626
12695 1466626 1503463 1545509 1554691 1571131 1649559 1751284 1785532 1734050 1650743 1568466 1450247
$$ packed form
12767A3066399q92225p80207o90744o15575n58241n34257n43464n80462n90486
12758G280738n14260l93609l46086l50809l16809k77921k62645k50845j75410
12749D392344m8116j7926o6460j09794j86248k00279j41887j05577j04779j32838
12739C278440j68447j83283j33697o2242k6498k2571n8759r7791j03364j19141
12729B302647j62803j35069J995J24804J42698Q0685L3594J4039q414k5711k4553
12718B343912j5695k52r780l5208l9367n0953m0089m798L539k9288p1295r6468
12706A954258j64487k37489j97967q2614J0109O6597Q8647O2933L870l0987o244
12695A466626L6837M2046R182J6440P8428J01725L4248n1482q3307q2277j18219
$$ plain form
12684 1450247 1245809 970933 661871 382298 225423 202986 256218 364278 569365 886495
12674 886495 1229459 1491311 1638233 1714443 1774166 1820977 1860660 1875830 1879384 1912189 1951430
12663 1951430 1940162 1835645 1616910 1337725 1115300 994194 963621 1036382 1174771 1282869
12653 1282869 1288609 1201914 1090239 1013383 996173 997891 991019 996643 1001627 953238 802416 606123
12641 606123 489742 479463 495933 526713 618236 776532 990249 1204565 1312622 1282184
12631 1282184 1133654 916672 743781 670060 649167 665259 744553 843098 855223 767764 679418
12620 679418 600961 502452 427383 401494 426536 516961 618753 684878 684033 582532 477240
12609 477240 490193 578563 643894 675609 699218 699624 676604 633739 544568 397520 234358
$$ packed form
12684A450247k04438k74876l09062k79573j56875k2437N3232J08060K05087L17130
12674H86495L42964K61852J46922P6210N9723M6811L9683J5170L554L2805L9241
12663A951430j1268j04517k18735k79185k22425j21106l0573P2761J38389J08098
12653A282869N740q6695j11675p6856j7210J718o872N624M984m8389j50822j96293
12641F06123j16381j0279J6470L0780R1523J58296K13717K14316J08057l0438
12631A282184j48530k16982j72891p3721k0893J6092P9294R8545J2125q7459q8346
12620F79418p8457r8509p5069k5889K5042R0425J01792O6125q45j01501j05292
12609D77240J2953Q8370O5331L1715K3609M06k3020m2865q9171j47048j63162
$$ plain form
12598 234358 136531 135245 171473 215682 315068 458794 559505 585264 582058 576440 531076 409033
12586 409033 285714 262251 356061 520979 690487 806604 877734 967469 1080235 1184346
12576 1184346 1268186 1299603 1256208 1170216 1094320 1059283 1079392 1129766 1158748 1151787 1146658 1161945
12564 1161945 1160759 1137544 1132491 1177388 1273422 1409489 1590515 1801647 2026782 2322612 2759990
12553 2759990 3327492 4017799 4903674 6095863 7665059 9458249 10974037 11420000 10475917
12544 10475917 8772077 7059490 5686498 4701607 4005573 3465207 2984429 2560857 2220656
12535 2220656 1972201 1815111 1712936 1565016 1336684 1067434 779076 533050 380611
12526 380611 307589 303726 369195 564174 856931 1134985 1363396 1469022 1397715 1259808
$$ packed form
12598B34358r7827j286L6228M4209R9386J43726J00711K5759l206n618m5364j22043
12586D09033j23319k3463R3810J64918J69508J16117P1130Q9735J12766J04111
12576A184346Q3840L1417m3395q5992p5896l5037K0109N0374K8982o961n129J5287
12564A161945j186k3215n053M4897R6034J36067J81026K11132K25135K95830M37378
12553B759990N67502O90307Q85875J192189J569196J793190J515788M45963r44083
12544A0475917j703840j712587j372992r84891o96034n40366m80778m23572l40201
12535B220656k48455j57090j02175j47920k28332k69250k88358k46026j52439
12526C80611p3022l863O5469J94979K92757K78054K28411J05626p1307j37907
$$ plain form
12516 1259808 1186319 1188694 1193584 1159740 1171532 1208088 1138760 985695 916250 1014998 1199501
12505 1199501 1349693 1445411 1543663 1675723 1801982 1827502 1707587 1507645 1306195 1108323
12495 1108323 940086 854398 855106 882134 882809 849396 854046 931900 1042906 1096939 1027092 884881
12483 884881 790977 819541 957744 1142887 1238617 1109854 830929 596077 528979 604466
12473 604466 710697 776395 866155 1066916 1406158 1837643 2236745 2563759 2902267 3261679
12463 3261679 3586898 3911868 4378230 5131132 6298385 7904204 9930565 12471365 15821979
12454 15821979 20277712 25860220 31898905 36063701 35433383 30545725 24542119 19317038
12446 19317038 15291413 12310866 10098283 8374526 6903408 5644135 4728238 4108361
$$ packed form
12516A259808p3489K375M890l3844J1792L6556o9328j53065o9445R8748J84503
12505A199501J50192R5718R8252J32060J26259K5520j19915j99942k01450j97872
12495A108323j68237q5688P08K7028O75l3413M650P7854J11006N4033o9847j42211
12483H84881r3904K8564J38203J85143R5730j28763k78925k34852o7098P5487
12473F04466J06231O5698Q9760K00761L39242M31485L99102L27014L38508L59412
12463C261679L25219L24970M66362P52902J167253J605819K026361K540800L350614
12454A5821979M455733N582508O038685M164796o30318m887658o003606n225081
12446A9317038m025625k980547k212583j723757j471118j259273r15897o19877
$$ plain form
12438 4108361 3674334 3396054 3266369 3240797 3242547 3220697 3172815 3087749 2970572 2816407
12428 2816407 2647469 2457028 2161757 1799734 1486123 1229924 1044288 995707 1041565 1064381
12418 1064381 1049950 1023463 984621 954954 958682 986489 977699 921871 878155 894362 981242 1110529
12406 1110529 1191231 1164601 1086412 1006292 893096 698849 532995 530633 695495 922868
12396 922868 1083169 1136988 1149967 1185203 1232287 1210075 1104860 992308 933578 896974 831899
12385 831899 721222 581021 418204 304080 301399 355884 405178 390511 297814 223002 263954
12374 263954 419532 613562 732178 747946 761133 808597 860803 906150 939162 915955 800990
12363 800990 634026 459653 268424 141229 175897 333496 494702 531736 427502 282888
$$ packed form
12438D108361m34027k78280j29685k5572J750k1850m7882q5066j17177j54165
12428B816407j68938j90441k95271l62023l13611k56199j85636m8581M5858K2816
12418A064381j4431k6487l8842k9667L728K7807q790n5828m3716J6207Q6880J29287
12406A110529Q0702k6630p8189q0120j13196j94247j65854k362J64862K27373
12396I22868J60301N3819J2979L5236M7084k2212j05215j12552n8730l6604o5075
12385H31899j10677j40201j62817j14124k681N4485M9294j4667r2697p4812M0952
12374B63954J55578J94030J18616J5768J3187M7464N2206M5347L3012k3207j14965
12363H00990j66964j74373j91229j27195L4668J57599J61206L7034j04234j44614
$$ plain form
12353 282888 149435 83467 149702 309657 451341 523605 544740 510522 444383 395145 365825
12342 365825 353619 394816 507187 666944 836312 942381 962101 979216 1020975 1035551 979068
12331 979068 878567 769194 661383 564663 444295 269712 67779 -132725 -293558 -397995
12321 -397995 -459846 -488111 -482821 -433984 -368805 -329901 -299481 -267786 -273119 -293971 -283644 -307631
12309 -307631 -410049 -464768 -379553 -200103 -29916 47987 6935 -129647 -318483 -498800
12299 -498800 -592483 -592354 -535631 -447668 -397725 -402035 -432131 -482309 -506199 -486236 -460484 -407840
12287 -407840 -265732 -54752 136934 249580 277683 294761 361955 508099 736280 997208
12277 997208 1211794 1313831 1237102 996945 760853 626698 516370 339626 117967 -83607
$$ packed form
12353B82888j33453o5968O6235J59955J41684P2264K1135l4218o6139m9238k9320
12342C65825j2206M1197J12371J59757J69368J06069J9720J7115M1759J4576n6483
12331I79068j00501j09373j07811r6720j20368j74583k01933k00504j60833j04437
12321c97995o1851k8265N290M8837O5179L8904L0420L1695n333k0852J0327k3987
12309c07631j02418n4719Q5215J79450J70187P7903m1052j36582j88836j80317
12299d98800r3683J29N6723Q7963M9943m310l0096n0178k3890J9963K5752N2644
12287d07840J42108K10980J91686J12646K8103J7078O7194J46144K28181K60928
12277I97208K14586J02037p6729k40157k36092j34155j10328j76744k21659k01574
$$ plain form
12267 -83607 -215894 -309236 -445125 -676731 -973422 -1248107 -1434199 -1479998 -1378324 -1207490
12257 -1207490 -1054332 -940881 -855115 -749863 -626356 -511463 -364672 -150104 43502 95076
12247 95076 18174 -70906 -111475 -84640 39875 159970 180495 139026 64443 -46380 -143659
12236 -143659 -185054 -153929 -84958 -71436 -107878 -96326 -9907 58935 37288 -16274 -31697
12225 -31697 7519 94925 180567 233638 255663 218380 123554 62224 66930 57496 -19306 -92458
12213 -92458 -77677 -13719 27250 31366 38364 109985 259096 356292 296559 157163 66498 56869
12201 56869 113186 211247 300755 348329 360216 383071 444296 466844 342421 115437 -65352
12190 -65352 -129288 -99537 -35386 46361 173655 320974 401121 380712 286983 196140 151834
$$ packed form
12267h3607j32287r3342j35889k31606k96691k74685j86092m5799J01674J70834
12257a207490J53158J13451Q5766J05252J23507J14893J46791K14568J93606N1574
12247I5076p6902q9080m0569K6835J24515J20095K0525m1469p4583j10823r7279
12236a43659m1395L1125O8971J3522l6442J1552Q6419O8842k1647n3562j5423
12225c1697L9216Q7406Q5642N3071K2025l7283r4826o1330M706r434p6802p3152
12213i2458J4781O3958M0969M116O998P1621J49111R7196n9733j39396r0665r629
12201E6869N6317R8061Q9508M7574J1887K2855O1225K2548j24423k26984j80789
12190f5352o3936K9751O4151Q1747J27294J47319Q0147k0409r3729r0843m4306
$$ plain form
12179 151834 125711 69985 -27939 -69956 18007 175812 313194 395640 464674 563208 660810
12168 660810 682090 627535 598648 594684 545833 462209 401149 393257 413097 465639 607891 794006
12156 794006 885613 782402 540030 285927 85801 -25699 -52625 -62149 -61942 -425 115237
12145 115237 243149 355784 445419 484142 456194 367229 259789 178244 143363 114807 43841
12134 43841 -44870 -148053 -254216 -264927 -141697 65477 292778 435543 489901 505554
12124 505554 461288 356190 289296 320175 358384 363065 339522 331025 376387 401074 301277 90008
12112 90008 -114193 -225477 -243244 -216718 -226553 -287503 -387500 -509662 -571569 -473516 -208286
12101 -208286 118102 418070 687666 904383 1018543 1048962 1016929 955679 879645 777821
$$ packed form
12179A51834k6123n5726r7924m2017Q7963J57805J37382Q2446O9034R8534R7602
12168F60810K1280n4555k8887l964m8851q3624o1060p892J9840N2542J42252J86115
12156G94006R1607j03211k42372k54103k00126j11500k6926r524K07O1517J15662
12145A15237J27912J12635Q9635L8723k7948q8965j07440q1545l4881k8556p0966
12134D3841q8711j03183j06163j0711J23230K07174K27301J42765N4358J5653
12124E05554m4266j05098o6894L0879L8209M681k3543q497M5362K4687r9797k11269
12112I0008k04201j11284j7767K6526r835o0950r9997j22162o1907R8053K65230
12101b08286L26388K99968K69596K16717J14160L0419l2033o1250p6034j01824
$$ plain form
12091 777821 684011 617443 548630 465515 393891 346862 301113 226423 168397 195580 298920
12080 298920 375610 353403 254817 138497 92820 125004 169006 205760 281723 416109 529274
12069 529274 539366 456355 382919 368437 383419 418354 468854 493063 468883 439684 461606
12058 461606 572949 751279 923509 1020455 1002997 885526 674402 425195 281937 300767
12048 300767 393715 444957 392465 209606 -90098 -417160 -640676 -706806 -700901 -722171 -782235
12037 -782235 -832777 -795753 -678361 -552177 -438083 -352477 -322085 -352764 -351686 -240814 -111541
12026 -111541 -23876 88545 207064 237269 189944 111193 53013 29863 -5147 -79536 -180084
12015 -180084 -271492 -314631 -329947 -309274 -160750 114279 362578 471458 454354 383329 366321
$$ packed form
12091G77821r3810o6568o8813q3115p1624m7029m5749p4690n8026K7183J03340
12080B98920P6690k2207r8586j16320m5677L2184M4002L6754P5963J34386J13165
12069E29274J0092q3011p3436j4482J4982L4935N0500K4209k4180k9199K1922
12058D61606J11343J78330J72230R6946j7458j17471k11124k49207j43258J8830
12048C00767R2948N1242n2492j82859k99704l27062k23516o6130N905k1270o0064
12037g82235n0542L7024J17392J26184J14094Q5606L0392l0679J078J10872J29273
12026a11541Q7665J12421J18519L0205m7325p8751n8180k3150l5010p4389j00548
12015a80084r1408m3139j5316K0673J48524K75029K48299J08880j7104p1025j7008
$$ plain form
12004 366321 388459 353457 267478 188073 106073 -29106 -172389 -240926 -219830 -139923 -37112
11993 -37112 123517 351683 609126 840725 969808 995722 969041 931569 887933 816315 662652
11982 662652 403418 95866 -162118 -311242 -375940 -408805 -440057 -482465 -560723 -636856 -632559
11971 -632559 -551700 -433534 -309008 -175238 -19310 126523 234141 301024 346328 389011
11961 389011 436431 422921 302064 156607 87757 88836 109315 165457 292277 446003 580469
11950 580469 684304 722314 658852 516443 342468 139671 -62139 -146896 -77251 14814
11940 14814 16700 9528 135537 354219 520823 537715 425269 299978 236197 230640 225645
11929 225645 149269 9039 -113685 -181162 -204096 -159049 -58400 34221 55034 31567 4565
$$ packed form
12004C66321K2138l5002q5979p9405q2000j35179j43283o8537K1096P9907J02811
11993c7112J60629K28166K57443K31599J29083K5914k6681l7472m3636p1618j53663
11982F62652k59234l07552k57984j49124o4698l2865l1252m2408p8258p6133M297
11971f32559Q0859J18166J24526J33770J55928J45833J07618O6883M5304M2683
11961C89011M7420j3510j20857j45457o8850J079K0479N6142J26820J53726J34466
11950E80469J03835L8010o3462j42409j73975k02797k01810q4757O9645R2065
11940A4814J886p172J26009K18682J66604J6892j12446j25291o3781n557m995
11929B25645p6376j40230j22724o7477k2934M5047J00649R2621K0813k3467k7002
$$ plain form
11918 4565 -74070 -174274 -196496 -151940 -97862 -17083 117706 288669 441168 580691 719672
11907 719672 786641 683706 438206 171839 -20295 -112397 -173456 -250021 -343182 -461128
11897 -461128 -558772 -549156 -450756 -357140 -309325 -293145 -312485 -352625 -366770 -339506 -222931
11886 -222931 -3405 204063 248806 104118 -46335 -63327 26544 130678 182753 124552
11876 124552 -29073 -170097 -260097 -317313 -329512 -319004 -325467 -290253 -207139 -173217 -172714 -99259
11864 -99259 56826 182700 201134 171202 186146 254345 319118 346235 327553 274187 182382
11853 182382 30758 -132756 -255873 -324360 -352869 -423026 -588244 -774537 -909940 -968441
11843 -968441 -932742 -823314 -685266 -511242 -295057 -101078 67841 210574 206176 -4533
$$ packed form
11918D565p8635j00204k2222M4556N4078Q0779J34789J70963J52499J39523J38981
11907G19672O6969j02935k45500k66367j92134r2102o1059p6565r3161j17946
11897d61128r7644R616R8400R3616M7815J6180j9340m0140j4145K7264J16575
11886b22931K19526K07468M4743j44688j50453j6992Q9871J04134N2075n8201
11876A24552j53625j41024r0000n7216j2199J0508o463L5214Q3114L3922N03P3455
11864i9259J56085J25874J8434k9932J4944O8199O4773K7117j8682n3366r1805
11853A82382j51624j63514j23117o8487k8509p0157j65218j86293j35403n8501
11843i68441L5699J09428J38048J74024K16185J93979J68919J42733m398k10709
$$ plain form
11833 -4533 -310738 -535014 -618735 -636347 -643334 -596737 -484345 -346225 -185878 -34741 66664
11822 66664 160877 259864 274571 177018 24465 -180014 -394489 -475791 -377511 -218412 -134946
11811 -134946 -167524 -269140 -316368 -198912 18026 211244 375253 497219 536471 509838
11801 509838 470962 424286 352001 271899 193864 117128 43269 -41443 -151879 -296401 -426398
11790 -426398 -467440 -424678 -337972 -234714 -123832 12430 144960 230394 267565 244582 194577
11779 194577 178526 214690 346154 536182 705559 863200 1052235 1271706 1428968 1415940
11769 1415940 1147292 674862 256590 45721 -50777 -141697 -190142 -120113 48478 296015
11759 296015 525918 589946 554032 578613 646381 609630 403140 167286 91382 171232 279885
$$ packed form
11833d533l06205k24276q3721j7612o987M6597J12392J38120J60347J51137J01405
11822F6664R4213R8987J4707r7553j52553k04479k14475q1302R8280J59099Q3466
11811a34946l2578j01616m7228J17456K16938J93218J64009J21966L9252k6633
11801E09838l8876m6676p2285q0102p8035p6736p3859q4712j10436j44522j29997
11790d26398m1042M2762Q6706J03258J10882J36262J32530Q5434L7171k2983n0005
11779A94577j6051L6164J31464J90028J69377J57641J89035K19471J57262j3028
11769A415940k68648m72430m18272k10869r6498r0920m8445P0029J68591K47537
11759B96015K29903O4028l5914K4581O7768l6751k06490k35854p5904P9850J08653
$$ plain form
11748 279885 329676 330133 316964 333028 427060 655609 1026393 1481554 1864984 2022213 1953970
11737 1953970 1735166 1462301 1243094 1124760 1022236 858615 675030 519281 389468
11728 389468 269107 153928 76792 86831 122177 87378 22853 -15184 -69132 -145701 -223825
11717 -223825 -307653 -341565 -245167 -48886 166010 329010 353737 262769 153753 64352 774
11706 774 -16563 -19893 -45700 -58946 -48169 -73205 -167471 -266571 -322933 -324770 -281095 -244766
11694 -244766 -183086 -59988 64878 134353 152860 193710 317082 456424 498283 469820 435714
11683 435714 387804 342682 305185 210526 73101 72490 334035 726949 1057777 1288534 1426751
11672 1426751 1405698 1229757 1023676 847395 673535 463378 253207 84149 -87513 -241983
$$ packed form
11748B79885M9791M57j3169J6064R4032K28549L70784M55161L83430J57229o8243
11737A953970k18804k72865k19207j18334j02524j63621j83585j55749j29813
11728C89468j20361j15179p7136J0039L5346l4799o4525l8037n3948p6569p8124
11717b23825q3828l3912R6398J96281K14896J63000K4727r0968j09016q9401o3578
11706G74j7337l330k5807j3246J0777k5036r4266r9100n6362j837M3675L6329
11694b44766O1680J23098J24866O9475J8507M0850J23372J39342M1859k8463l4106
11683D35714m7910m5122l7497r4659j37425o11K61545L92914L30828K30757J38217
11672A426751k1053j75941k06081j76281j73860k10157k10171j69058j71662j54470
$$ plain form
11662 -241983 -252530 -92003 129189 298489 365393 330048 230041 131448 72109 18201 -91981
11651 -91981 -219247 -275274 -237634 -145110 -67704 -98723 -215907 -335914 -467815 -604732 -717132
11640 -717132 -759767 -655805 -433064 -200871 -35458 65453 106997 50240 -93026 -202033
11630 -202033 -203154 -141564 -118540 -168706 -237945 -281173 -335628 -448242 -554871 -557148 -465944
11619 -465944 -371835 -277400 -163648 -82528 -75241 -66373 27549 150374 194021 137431 4825
11608 4825 -142573 -272255 -425795 -596023 -708858 -698547 -587172 -460367 -361958 -239874
11598 -239874 -37581 186118 352025 439666 451951 412155 379104 329619 205402 7905
11588 7905 -228317 -397425 -442614 -400685 -292308 -145484 -8826 50006 47048 96702 214866
$$ packed form
11662b41983j0547J60527K21192J69300O6904l5345j00007r8593n9339n3908j10182
11651i1981j27266n6027L7640R2524P7406l1019j17184j20007j31901j36917j12400
11640g17132m2635J03962K22741K32193J65413J00911M1544n6757j43266j09007
11630b02033j121O1590K3024n0166o9239m3228n4455j12614j06629k277R1204
11619d65944R4109R4435J13752Q1120P287Q868R3922J22825M3647n6590j32606
11608D825j47398j29682j53540j70228j12835J0311J11375J26805R8409J22084
11598b39874K02293K23699J65907Q7641J2285l9796l3051m9485j24217j97497
11588G905k36222j69108m5189M1929J08377J46824J36658N8832k958M9654J18164
$$ plain form
11577 214866 318265 358107 408120 538637 682950 754932 728279 602169 357066 73201
11567 73201 -130364 -263037 -388620 -490654 -513756 -494080 -500081 -554730 -599848 -585740 -544050
11556 -544050 -486035 -426411 -390924 -340824 -226943 -96458 17490 98372 137301 181877 271023
11545 271023 435324 607152 684389 681331 644886 602501 576812 551101 470161 335354 192221
11534 192221 57587 -62982 -161233 -235767 -244702 -174176 -77663 14072 93852 176561 273063
11523 273063 367190 455888 534541 587591 618313 629933 595228 463774 248717 32629 -90424
11512 -90424 -65374 37066 99425 97203 66178 18871 -59547 -169040 -266987 -339680 -392113
11501 -392113 -385146 -340234 -324519 -321822 -254065 -124320 44146 219881 302982 271909 202887
$$ packed form
11577B14866J03399L9842N0013J30517J44313P1982k6653j26110k45103k83865
11567G3201k03565j32673j25583j02034k3102J9676o001n4649m5118J4108M1690
11556e44050N8015N9624L5487N0100J13881J30485J13948Q0882L8929M4576Q9146
11545B71023J64301J71828P7237l058l6445m2385k5689k5711q0940j34807j43133
11534A92221j34634j20569r8251p4534q935P0526R6513R1735P9780Q2709R6502
11523B73063R4127Q8698P8653N3050L0722J1620l4705j31454k15057k16088j23053
11512i0424K5050J02440O2359k222l1025m7307p8418j09493r7947p2693n2433
11501c92113O967M4912J5715K697O7757J29745J68466J75735Q3101l1073o9022
$$ plain form
11490 202887 106058 -17060 -167789 -316397 -365159 -262961 -78426 107260 261540 339271
11480 339271 325519 284829 279998 261520 150519 -24895 -133171 -93176 47971 207536 320123
11469 320123 382671 421420 422197 367258 237019 60644 -80027 -123821 -124030 -149155 -149083 -25164
11457 -25164 216797 438439 514194 428555 265605 106345 15189 27539 142485 321630
11447 321630 433007 323484 43494 -228665 -421385 -509101 -522235 -515287 -471263 -389167 -269734
11436 -269734 -132878 -66005 -113699 -243594 -379723 -459479 -468665 -368226 -145469 113035
11426 113035 326082 457537 522219 560495 546326 480330 470700 559593 670308 709147 643232
11415 643232 540220 432599 323465 252840 249103 278999 268249 211437 170386 162662 126320
$$ packed form
11490B02887r6829j23118j50729j48608m8762J02198J84535J85686J54280P7731
11480C39271j3752m0690m831j8478j11001j75414j08276L9995J41147J59565J12587
11469C20123O2548L8749P77n4939j30239j76375j40671m3794k09k5125P2J23919
11457b5164K41961K21642P5755q5639j62950j59260r1156J2350J14946J79145
11447C21630J11377j09523k79990k72159j92720q7716j3134O948M4024Q2096J19433
11436b69734J36856O6873m7694j29895j36129p9756r186J00439K22757K58504
11426A13035K13047J31455O4682L8276j4169o5996r630Q8893J10715L8839o5915
11415F43232j03012j07621j09134p0625l737K9896j0750n6812m1051p724l6342
$$ plain form
11404 126320 26234 -40999 -35875 -46672 -102089 -182588 -288192 -358752 -296461 -133069 -27829
11393 -27829 -39975 -99111 -168172 -230754 -256218 -248602 -222938 -185535 -144974 -91248 -5286 74846
11381 74846 84655 25338 -76524 -143304 -105920 -4598 46182 57688 121956 280616 523666
11370 523666 782881 926951 883681 710784 516745 336528 172060 61516 44395 107432
11360 107432 160842 152887 135458 168218 207454 233094 271789 332228 433870 530662 506442
11349 506442 357179 202831 104719 37872 -41321 -160831 -294340 -390921 -439921 -390096 -233552
11338 -233552 -61451 90841 236650 315445 269048 142958 8909 -92461 -149792 -161240
11328 -161240 -174302 -213173 -220090 -158901 -100709 -107728 -206140 -396975 -566215 -606276 -536399
$$ packed form
11404A26320j00086o7233N124j0797n5417q0499j05604p0560O2291J63392J05240
11393b7829j2146n9136o9061o2582k5464P616K5664L7403M0561N3726Q5962Q0132
11381G4846R809n9317j01862o6780L7384J01322N0780J1506O4268J58660K43050
11370E23666K59215J44070m3270j72897j94039j80217j64468j10544j7121O3037
11360A07432N3410p955j7429L2760L9236K5640L8695O0439J01642R6792k4220
11349E06442j49263j54348r8112o6847p9193j19510j33509r6581m9000M9825J56544
11338b33552J72101J52292J45809P8795m6397j26090j34049j01370n7331j1448
11328a61240j3062l8871o917O1189N8192p019r8412j90835j69240m0061O9877
$$ plain form
11317 -536399 -473499 -524099 -663699 -808680 -939191 -1063743 -1157736 -1178937 -1105288 -983947
11307 -983947 -831991 -627507 -414431 -256897 -157980 -68718 67544 284466 519312 600492
11297 600492 480178 286986 122007 35780 98855 338175 635809 872687 998647 1001025
11287 1001025 883097 628183 293777 -15612 -224872 -311179 -359040 -441547 -549743 -670242
11277 -670242 -747310 -713342 -560147 -313554 -49151 125108 160643 98518 25189 10296 48755
11266 48755 81397 63068 -1458 -51280 -21621 101647 234498 309456 328996 305790 263700
11255 263700 208087 173096 215100 277164 249464 174164 142672 160165 221069 305820 334417
11244 334417 276711 191288 107239 18505 -31343 -5826 34117 56100 89903 142423 182098
$$ packed form
11317e36399O2900n0600j39600j44981j30511j24552r3993k1201P3649J21341
11307i83947J51956K04484K13076J57534R8917Q9262J36262K16922K34846Q1180
11297F00492j20314j93192j64979q6227O3075K39320K97634K36878J25960K378
11287A001025j17928k54914l34406l09389k09260q6307m7861q2507j08196j20499
11277f70242p7068L3968J53195K46593K64403J74259L5535o2125p3329j4893L8459
11266D8755L2642j8329o4526m9822K9659J23268J32851P4958J9540k3206m2090
11255B63700n5613l4991M2004O2064k7700p5300l1492J7493O0904Q4751K8597
11244C34417n7706q5423q4049q8734m9848K5517L9943K1983L3803N2520L9675
$$ plain form
11233 182098 213801 235219 211675 108825 -88689 -345933 -598714 -770380 -875125 -948704
11223 -948704 -940812 -810192 -644849 -567595 -619234 -717587 -752549 -702580 -627494 -577243 -537197
11212 -537197 -479565 -438154 -488752 -592908 -638868 -604176 -533869 -471503 -436869 -398396 -340224
11201 -340224 -301204 -281055 -205133 -26729 203851 368191 429267 435243 375377 192410 -77539
11190 -77539 -327373 -500741 -614731 -728728 -844062 -909934 -917613 -895368 -906529 -911091 -813157
11179 -813157 -630315 -455443 -361672 -358217 -430506 -555357 -670839 -774894 -923131 -1093784
11169 -1093784 -1186345 -1173985 -1139829 -1111263 -1070550 -1020612 -960143 -902638 -864361 -816645 -699175
11158 -699175 -487062 -240113 -41388 78207 128807 136130 149601 176940 174630 101998 -30930
$$ packed form
11233A82098L1703K1418k3544j02850j97514k57244k52781j71666j04745p3579
11223i48704P892J30620J65343P7254n1639r8353l4962M9969P5086N0251M0046
11212e37197N7632M1411n0598j04156m5960L4692P0307O2366L4634L8473N8172
11201c40224L9020K0149P5922J78404K30580J64340O1076N976n9866j82967k69949
11190g7539k49834j73368j13990j13997j15334o5872p679K2245j1161m562R7934
11179h13157J82842J74872R3771L455p2289j24851j15482j04055j48237j70653
11169a093784r2561J2360L4156K8566M0713M9938O0469N7505L8277M7716J17470
11158f99175K12113K46949J98725J19595N0600P323J3471K7339k310p2632j32928
$$ plain form
11147 -30930 -126240 -106022 -15772 80643 180132 286795 352755 332680 215989 45535 -144408
11136 -144408 -353618 -523490 -552318 -415881 -211459 -11055 215865 437065 544681 485402
11126 485402 305747 41451 -286915 -585921 -743808 -744832 -702914 -689587 -668027 -606108 -528608
11115 -528608 -442777 -379273 -411712 -498302 -571998 -642004 -724471 -738547 -632811 -501809 -451414
11104 -451414 -461693 -433807 -349586 -280027 -263865 -207604 -22973 236879 435736 510012 520671
11093 520671 493580 395532 303219 326214 415262 478397 513940 552412 598863 630571 594419
11082 594419 470505 292098 59541 -200302 -462229 -682150 -771151 -716448 -611424 -478721
11072 -478721 -285396 -60406 120881 212274 219918 192094 175388 164256 180845 291530 508491
$$ packed form
11147c0930r5310K0218R0250R6415R9489J06663O5960k0075j16691j70454j89943
11136a44408k09210j69872k8828J36437K04422K00404K26920K21200J07616n9279
11126D85402j79655k64296l28366k99006j57887j024M1918J3327K1560O1919P7500
11115e28608Q5831O3504l2439q6590p3696p0006q2467j4076J05736J31002N0395
11104d51414j0279K7886Q4221O9559J6162N6261J84631K59852J98857P4276J0659
11093E20671k7091r8048r2313K2995Q9048O3135L5543L8472M6451L1708l6152
11082E94419j23914j78407k32557k59843k61927k19921q9001N4703J05024J32703
11072d78721J93325K24990J81287R1393P644k7824j6706j1132J6589J10685K16961
$$ plain form
11061 508491 734288 869207 885152 776966 583517 378329 227172 130770 6412 -137709
11051 -137709 -203857 -174941 -151586 -229513 -391172 -535747 -571707 -504478 -395312 -289262 -190236
11040 -190236 -69198 64483 185526 304058 463901 620355 674989 638961 601315 586977
11030 586977 530348 407837 263325 123878 54574 143254 317140 414116 315186 56151
11020 56151 -165891 -221821 -161843 -113235 -167362 -338218 -534941 -630714 -598773 -501643 -418608
11009 -418608 -372530 -231598 62839 356958 515767 536008 472031 374515 286209 270816 370283
10998 370283 549621 677295 662058 539351 356709 182397 3883 -233393 -422244 -439149
10988 -439149 -279232 -19288 198616 290304 301068 279312 196981 38567 -142300 -304409
$$ packed form
11061E08491K25797J34919J5945j08186j93449k05188j51157r6402j24358j44121
11051a37709o6148K8916K3355p7927j61659j44575l5960O7229J09166J06050R9026
11040a90236J21038J33681J21043J18532J59843J56454N4634l6028l7646j4338
11030E86977n6629j22511j44512j39447o9304Q8680J73886R6976r8930k59035
11020E6151k22042n5930N9978M8608n4127j70856j96723r5773L1941R7130Q3035
11009d18608M6078J40932K94437K94119J58809K0241o3977r7516q8306j5393R9467
10998C70283J79338J27674j5237j22707j82642j74312j78514k37276j88851j6905
10988d39149J59917K59944K17904R1688J0764k1756q2331j58414j80867j62109
$$ plain form
10978 -304409 -417683 -383729 -161550 116247 273737 263476 178769 125497 147499 246350 369089
10967 369089 405320 357410 328569 332145 319669 204377 -61257 -373868 -571240 -574746 -461087
10956 -461087 -368794 -325376 -289509 -262559 -263112 -286107 -270791 -167046 -6570 143139 224142
10945 224142 221304 175685 98155 -6912 -81415 -66974 57243 268646 477049 624123 662443
10934 662443 540419 307087 62020 -159437 -403367 -662332 -878922 -1059873 -1182193 -1145815
10924 -1145815 -942517 -674705 -443517 -308788 -277543 -277419 -259484 -234685 -217448 -206197 -176237
10913 -176237 -124914 -34129 104725 266069 440673 591372 696818 759579 759313 714670 662091
10902 662091 571782 415122 193084 -53326 -253589 -357776 -370515 -353408 -373061 -401626
$$ packed form
10978c04409j13274L3954K22179K77797J57490j0261q4707n3272K2002R8851J22739
10967C69089L6231m7910k8841L576j2476j15292k65634l12611j97372l506J13659
10956d61087R2293M3418L5867K6950n53k2995J5316J03745J60476J49709Q1003
10945B24142k838m5619p7530j05067p4503J4441J24217K11403K08403J47074L8320
10934F62443j22024k33332k45067k21457k43930k58965k16590j80951j22320L6378
10924a145815K03298K67812K31188J34729L1245J24J7935K4799J7237J1251K9960
10913a76237N1323R0785J38854J61344J74604J50699J05446O2761k66m4643n2579
10902F62091r0309j56660k22038k46410k00263j04187j2739J7107j9653k8565
$$ plain form
10892 -401626 -366115 -319858 -367691 -439309 -372599 -164415 16318 127050 257292 397179
10882 397179 509833 567613 585646 635624 687002 657544 528973 317436 85555 -87079
10872 -87079 -188907 -227561 -178446 -71689 24337 55181 -15128 -154506 -330927 -510511 -619870
10861 -619870 -669536 -698911 -697535 -683247 -699985 -718675 -688511 -685239 -781863 -906849 -985055 -996207
10849 -996207 -949462 -867534 -777369 -713924 -699282 -717784 -786487 -905182 -1035045 -1131357 -1156651
10838 -1156651 -1108340 -1032914 -994521 -967913 -896451 -799566 -709998 -652399 -607329 -551979 -556040
10827 -556040 -615961 -647744 -613891 -549967 -526359 -580840 -710794 -884790 -1024761 -1079816 -1053193
10816 -1053193 -985490 -863299 -683617 -519974 -469778 -526797 -567444 -511169 -369180 -244355
$$ packed form
10892d01626L5511M6257m7833p1618O6710K08184J80733J10732J30242J39887
10882C97179J12654N7780J8033M9978N1378k9458j28571k11537k31881j72634
10872h7079j01828l8654M9115J06757R6026L0844p0309j39378j76421j79584j09359
10861f19870m9666k9375J376J4288j6738j8690L0164L272r6624j24986p8206j1152
10849i96207M6745Q1928R0165O3445J4642j8502o8703j18695j29863r6312k5294
10838a156651M8311P5426L8393K6608P1462R6885Q9568N7599M5070N5350m061
10827e56040n9921l1783L3853O3924K3608n4481j29954j73996j39971n5055K6623
10816a053193O7703J22191J79682J63643N0196n7019m0647N6275J41989J24825
$$ plain form
10806 -244355 -219753 -287865 -376397 -438500 -483076 -502507 -454682 -369406 -299336 -217081 -129274
10795 -129274 -72958 -29632 32916 128059 234261 295393 296162 285316 291842 311718 304565 216864
10783 216864 68564 -56320 -102536 -103272 -110265 -106989 -37099 79452 157321 151432 96584 52505
10771 52505 -16679 -92455 -128334 -152936 -156640 -116518 -41671 36644 73252 47849 -2998 -8319
10759 -8319 45908 104716 121965 83944 22576 -13656 -3374 26547 57665 96254 120694 109173
10747 109173 74240 55796 42233 -13375 -78047 -94095 -43586 60171 175746 219420 196227
10736 196227 185484 207617 250622 291856 382805 555893 731424 825393 808981 714215 596582
10725 596582 480390 357157 245452 125746 -5793 -97289 -217758 -406993 -613806 -814237
$$ packed form
10806b44355K4602o8112q8532o2103m4576j9431M7825Q5276P0070Q2255Q7807
10795a29274N6316M3326O2548R5143J06202O1132P69j0846O526J9876p153q7701
10783B16864j48300j24884m6216p36o993L276O9890J16551P7869n889n4848m4079
10771E2505o9184p5776l5879k4602l704M0122P4847P8315L6608k5403n0847n321
10759h319N4227N8808J7249l8021o1368l6232J0282K9921L1118L8589K4440j1521
10747A09173l4933j8444j3563n5608o4672j6048N0509J03757J15575M3674k3193
10736A96227j0743K2133M3005M1234R0949J73088J75531R3969j6412r4766j17633
10725E96582j16192j23233j11705j19706j31539r1496j20469j89235k06813k00431
$$ plain form
10715 -814237 -900460 -777479 -526669 -232628 111370 438346 629131 639812 534200 414418
10705 414418 365133 389865 434804 493634 516718 418006 242955 119133 73592 29464 -45539
10694 -45539 -136490 -233086 -288064 -279210 -256087 -292815 -392126 -499264 -585510 -661571 -716044 -689332
10682 -689332 -563942 -417619 -289023 -153978 -28645 86049 257941 469828 616956 667796
10672 667796 647406 564093 448045 319993 170083 8612 -111204 -127324 -25504 157532
10662 157532 364638 517557 541609 408571 171846 -67990 -280713 -470535 -627015 -729728
10652 -729728 -720044 -532710 -262239 -116669 -150201 -252721 -324018 -319193 -189901 38630 285089
10641 285089 475201 543375 486785 340411 157824 -37309 -243808 -445708 -563803 -548694
$$ packed form
10715h14237q6223J22981K50810K94041L43998L26976J90785J0681j05612j19782
10705D14418m9285K4732M4939N8830K3084r8712j75051j23822m5541m4128p5003
10694d5539r0951r6596n4978Q854K3123l6728r9311j07138q6246p6061n4473K6712
10682f89332J25390J46323J28596J35045J25333J14694J71892K11887J47128N0840
10672F67796k0390q3313j16048j28052j49910j61471j19816j6120J01820J83036
10662A57532K07106J52919K4052j33038k36725k39836k12723j89822j56480j02713
10652g29728R684J87334K70471J45570l3532j02520p1297M825J29292K28531K46459
10641B85089J90112O8174n6590j46374j82587j95133k06499k01900j18095J5109
$$ plain form
10631 -548694 -498157 -514377 -538313 -490349 -408445 -349538 -323569 -327216 -307430 -193265 -1626
10620 -1626 184739 338481 548636 818970 1017014 1087171 1111154 1149776 1170720 1173647 1186539
10609 1186539 1183746 1120040 1034759 989285 986687 999531 1007506 972196 840642 630008 393754
10598 393754 145031 -47139 -103461 -86290 -104119 -151825 -141701 -59170 6914 -10547 -68897
10587 -68897 -101049 -93141 -94868 -135698 -174363 -153027 -69341 56349 183283 266412 280452 287566
10575 287566 354791 434423 479175 493314 467904 407896 322236 227744 123777 -28755 -203982
10564 -203982 -330024 -400523 -503275 -645443 -734858 -716409 -573685 -357490 -208137 -218155
10554 -218155 -312182 -366158 -341676 -287572 -278066 -335615 -457869 -568788 -629340 -673156 -691610
$$ packed form
10631e48694N0537j6220k3936M7964Q1904N8907K5969l647J9786J14165J91639
10620a626J86365J53742K10155K70334J98044P0157K3983L8622K0944K927J2892
10609A186539k793o3706q5281m5474k598J2844P975l5310j31554k10634k36254
10598C93754k48723j92170n6322J7171j7829m7706J0124Q2531O6084j7461n8350
10587f8897l2152P908j727m0830l8665K1336Q3686J25690J26934Q3129J4040P114
10575B87566O7225P9632M4752J4139k5410o0008q5660r4492j03967j52532j75227
10564b03982j26042p0499j02752j42168q9415J8449J42724K16195J49353j0018
10554b18155r4027n3976K4482N4104R506n7549j22254j10919o0552m3816j8454
$$ plain form
10543 -691610 -691217 -687904 -618971 -462162 -281435 -168215 -172500 -266081 -428262 -641581 -827563
10532 -827563 -928786 -949670 -870752 -703160 -476375 -199138 112045 348958 424509 411125
10522 411125 363231 272953 174890 87468 -30552 -180901 -300650 -377669 -474355 -591707 -679935
10511 -679935 -763208 -881395 -982924 -984244 -892292 -772661 -671124 -632413 -606188 -484531 -274409
10500 -274409 -100176 -30127 8893 72676 176161 331111 478913 538996 526404 511611 506949
10489 506949 497893 526175 576683 564174 458471 290597 87958 -92504 -144764 -62751 69548
10478 69548 187616 228819 192619 136231 99253 101422 165284 275383 342480 291985 158259
10467 158259 160 -147254 -274397 -384522 -444407 -401853 -254152 -91495 -21317 -40385
$$ packed form
10543f91610L93L313O8933J56809J80727J13220m285r3581j62181k13319j85982
10532h27563j01223k0884P8918J67592K26785K77237L11183K36913P5551j3384
10522D11125m7894r0278r8063q7422j18020j50349j19749p7019r6686j17352q8228
10511f79935q3273j18187j01529j320R1952J19631J01537L8711K6225J21657K10122
10500b74409J74233P0049L9020O3783J03485J54950J47802O0083j2592j4793m662
10489E06949r056K8282N0508j2509j05703j67874k02639j80462n2260Q2013J32299
10478F9548J18068M1203l6200n6388l6978K169O3862J10099O7097n0495j33726
10467A58259j58099j47414j27143j10125n9885M2554J47701J62657P0178j9068
$$ plain form
10457 -40385 -44476 -39002 -137680 -352194 -568508 -678555 -673724 -624172 -590657 -570677 -538329 -488948
10445 -488948 -429805 -373581 -321301 -303669 -339171 -373351 -370289 -351603 -362983 -436715 -518481 -555846
10433 -555846 -547603 -503991 -478585 -517351 -592622 -656923 -675712 -666687 -682299 -730676 -772713 -764231
10421 -764231 -669996 -490243 -271488 -86128 26021 49746 35351 59831 123862 214177 315153
10410 315153 443537 632361 900256 1175367 1330963 1285019 1050480 744654 470857 262545
10400 262545 126497 57129 18179 1229 32291 63818 60030 19772 -48960 -108406 -131722
10389 -131722 -84255 67274 280049 442776 483594 448930 392116 287238 147275 40757
10379 40757 -17119 -47140 -82338 -163623 -248636 -238461 -100408 122610 324754 422354 422707
$$ packed form
10457d0385m091N474r8678k14514k16314j10047M831M9552L3515J9980L2348M9381
10445d88948N9143N6224N2280J7632l5502l4180L062J8686j1380p3732q1766l7365
10433e55846Q243M3612K5406l8766p5271o4301j8789R025j5612m8377m2037Q482
10421g64231R4235J79753K18755J85360J12149K3725j4395K4480O4031R0315J00976
10410C15153J28384J88824K67895K75111J55596m5944k34539l05826k73797k08312
10400B62545j36048o9368l8950j6950L1062L1527l788m0258o8732n9446k3316
10389a31722M7467J51529K12775J62727M0818l4664n6814j04878j39963j06518
10379D0757n7876l0021l5198q1285q5013J0175J38053K23018K02144R7600L53
$$ plain form
10368 422707 385413 401338 507709 636209 698743 677854 586722 424069 200444 -53244
10358 -53244 -271536 -378342 -366764 -260502 -112471 -21889 -69624 -227921 -433648 -632212
10348 -632212 -730889 -727006 -671840 -528240 -259358 24921 193431 216538 97962 -140146
10338 -140146 -440908 -691485 -808518 -834748 -782064 -605292 -347982 -152307 -109466 -148884
10328 -148884 -169324 -164215 -186523 -235521 -277785 -289790 -269991 -217842 -180390 -206704 -251336 -268768
10316 -268768 -287052 -367163 -557303 -771061 -874418 -836988 -742320 -684773 -647955 -554478 -440709
10305 -440709 -428108 -509411 -576872 -547188 -443622 -363677 -374549 -456598 -560826 -682879 -814558
10294 -814558 -904173 -911969 -841062 -767151 -745574 -741652 -678126 -536762 -327585 -69043 154927
$$ packed form
10368D22707l7294J5925J06371J28500O2534k0889r1132j62653k23625k53688
10358e3244k18292j06806J1578J06262J48031R0582m7735j58297k05727j98564
10348f32212r8677L883N5166J43600K68882K84279J68510K3107j18576k38108
10338a40146l00762k50577j17033k6230N2684J76772K57310J95675M2841l9418
10328a48884k0440N109k2308m8998m2264j2005J9799N2149L7452k6314m4632j7432
10316b68768j8284q0111j90140k13758j03357L7430R4668N7547L6818R3477J13769
10305d40709J2601q1303o7461K9684J03566P9945j0872q2049j04228j22053j31679
10294h14558q9615p796P0907P3911K1577L922O3526J41364K09177K58542K23970
$$ plain form
10283 154927 279950 336866 392852 460053 513565 548347 569868 598092 627825 678491 725823
10272 725823 661341 456498 193711 -17335 -162480 -263088 -332880 -398242 -488656 -583962
10262 -583962 -589625 -482349 -346916 -195561 -16990 127111 159363 67136 -49117 -108150
10252 -108150 -155714 -260378 -373360 -425796 -424839 -388588 -258365 -20163 235463 385461 407971
10241 407971 389894 349187 263734 183813 147216 77003 -45799 -147145 -181919 -150409 -84345
10230 -84345 -85747 -224653 -410500 -529806 -596643 -646654 -657444 -615020 -543869 -484818 -446781
10219 -446781 -436378 -419879 -336257 -232085 -181257 -216119 -341226 -513746 -621795 -627957 -564312
10208 -564312 -474848 -437762 -466245 -465836 -353319 -151906 41073 169898 227414 219005 145263
$$ packed form
10283A54927J25023N6916N5986O7201N3512L4782K1521K8224K9733N0666M7332
10272G25823o4482k04843k62787k11046j45145j00608o9792o5362r0414r5306
10262e83962n663J07276J35433J51355J78571J44101L2252r2227j16253n9033
10252a08150m7564j04664j12982n2436R57L6251J30223K38202K55626J49998K2510
10241D07971j8077m0707q5453p9921l6597p0213j22802j01346l4774L1510O6064
10230h4345j402j38906j85847j19306o6837n0011j0790M2424P1151N9051L8037
10219d46781J0403J6499Q3622J04172N0828l4862j25107j72520j08049o162O3645
10208e64312Q9464L7086k8483M09J12517K01413J92979J28825N7516q409p3742
$$ plain form
10197 145263 63580 74915 208407 366885 464108 478526 441615 416277 405309 409147 396120
10186 396120 286835 39423 -268430 -492602 -572034 -555521 -502444 -420193 -281228 -122186
10176 -122186 -16009 84714 197908 241882 242569 276313 326205 333637 285013 213315 160306
10165 160306 138652 134399 88708 -9707 -88314 -136994 -211425 -332516 -434185 -462458 -434603
10154 -434603 -384232 -321552 -200027 -49697 54999 113407 175211 264536 369145 424971 380468
10143 380468 256737 103770 -39228 -134300 -188298 -212073 -171539 -70994 67392 209512
10133 209512 306301 391131 520540 656578 750222 794508 768313 668532 554650 503073 482145
10122 482145 416060 342633 289518 238101 211111 213724 220833 229957 216636 179413 112775 -4854
$$ packed form
10197A45263q1683J1335J33492J58478R7223J4418l6911k5338j0968L838j3027
10186C96120j09285k47412l07853k24172p9432J6513N3077Q2251J38965J59042
10176a22186J06177J00723J13194M3974O87L3744M9892P432m8624p1698n3009
10165A60306k1654m253m5691r8415p8607m8680p4431j21091j01669k8273K7855
10154d34603N0371O2680J21525J50330J04696N8408O1804Q9325J04609N5826m4503
10143C80468j23731j52967j42998r5072n3998k3775M0534J00545J38386J42120
10133B09512R6789Q4830J29409J36038R3644M4286k6195r9781j13882n1577k0928
10122D82145o6085p3427n3115n1417k6990K613P109R124j3321l7223o6638j17629
$$ plain form
10110 -4854 -128353 -243392 -404083 -576492 -680524 -695691 -674021 -672084 -717592 -763895 -731188
10099 -731188 -642540 -585831 -622087 -722033 -815024 -871544 -934562 -998443 -1022331 -998167 -951000
10088 -951000 -913689 -856065 -740330 -593474 -449062 -332843 -217330 -73325 62677 145042
10078 145042 177645 204247 249545 309301 358854 312744 130882 -109867 -286001 -338645 -342287
10067 -342287 -388143 -458514 -513773 -524829 -547214 -654258 -715040 -610933 -448663 -349769 -309890
10056 -309890 -315863 -339732 -319749 -249590 -131140 26994 164959 263888 337170 410701 497569
10045 497569 544885 455369 246246 117110 190117 343993 394096 270524 55173 -155461
10035 -155461 -350561 -538101 -684992 -768796 -752685 -624899 -433062 -226884 -51958 75700
$$ packed form
10110d854j23499j15039j60691j72409j04032j5167K1670J937m5508m6303L2707
10099g31188Q8648N6709l6256r9946r2991n6520o3018o3881k3888K4164M7167
10088i51000L7311N7624J15735J46856J44412J16219J15513J44005J36002Q2365
10078A45042L2603K6602M5298N9756M9553m6110j81862k40749j76134n2644l642
10067c42287m5856p0371n5259j1056k2385j07044o0782J04107J62270R8894L9879
10056c09890n973k3869J9983P0159J18450J58134J37965R8929P3282P3531Q6868
10045D97569M7316q9516k09123j29136P3007J53876N0103j23572k15351k10634
10035a55461j95100j87540j46891q3804J6111J27786J91837K06178J74926J27658
$$ plain form
10025 75700 160355 221482 286465 361312 431953 482349 518880 540568 521848 494970 516042 563529
10013 563529 555804 483788 425615 416255 403687 330691 199461 61823 11658 107186 258481
10002 258481 378329 536405 802148 1136724 1434048 1572492 1509525 1281233 1007094 794262
9992 794262 659764 592827 597154 604574 535926 432413 353173 324009 384379 518312 591954
9981 591954 536768 411328 279263 150257 3709 -160234 -321901 -421666 -351471 -121400
9971 -121400 151143 348871 425956 420218 375537 332050 335750 373952 334351 159727 -76586
9960 -76586 -275399 -423423 -588207 -790763 -959657 -1028821 -964261 -784991 -606820 -542668
9950 -542668 -611772 -772677 -943301 -1058385 -1107248 -1093703 -1028290 -910588 -756768 -581295
$$ packed form
10025G5700Q4655O1127O4983P4847P0641N0396L6531K1688j8720k6878K1072M7487
10013E63529p725p2016n8173r360j2568p2996j31230j37638n0165R5528J51295
10002B58481J19848J58076K65743L34576K97324J38444o2967k28292k74139k12832
9992G94262j34498o6937M327P420o8648j03513p9240k9164O0370J33933P3642
9981E91954n5186j25440j32065j29006j46548j63943j61667r9765P0195K30071
9971a21400K72543J97728P7085n738m4681m3487L700L8202l9601j74624k36313
9960g6586j98813j48024j64784k02556j68894o9164O4560J79270J78171O4152
9950e42668o9104j60905j70624j15084m8863J3545O5413J17702J53820J75473
$$ plain form
9940 -581295 -416999 -311774 -232654 -97554 112866 340195 492411 542597 518609 422309
9930 422309 286816 229222 315701 466582 525270 423801 240031 88868 4895 -44357 -99726
9919 -99726 -212783 -332635 -362794 -346081 -342189 -341577 -290583 -150148 266 80371 98686 67161
9907 67161 -18290 -142719 -281859 -427737 -547642 -597173 -642293 -769835 -940730 -1008701 -873893
9896 -873893 -617078 -390090 -260018 -196251 -115380 34044 188467 251852 208517 104770
9886 104770 7172 -62880 -125350 -209863 -349935 -517799 -663932 -727471 -726686 -739655 -736498 -674754
9874 -674754 -575083 -468908 -395963 -385571 -417701 -475879 -530113 -524949 -440285 -336183 -344524 -524717
9862 -524717 -726826 -768213 -640041 -421082 -192033 -46853 1093 -10906 -34328 -51381 -122427
$$ packed form
9940e81295J64296J05225P9120J35100K10420K27329J52216N0186k3988r6300
9930D22309j35493n7594Q6479J50881N8688j01469j83770j51163q3973m9252n5369
9919i9726j13057j19852l0159J6713L892O12N0994J40435J50414Q0105J8315l1525
9907F7161q5451j24429j39140j45878j19905m9531m5120j27542j70895o7971J34808
9896h73893K56815K26988J30072O3767Q0871J49424J54423O3385m3335j03747
9886A04770r7598p0052o2470q4513j40072j67864j46133o3539P85j2969L157O1744
9874f74754R9671J06175P2945J0392l2130n8178n4234N164Q4664J04102q341j80193
9862e24717k02109m1387J28172K18959K29049J45180M7946j1999k3422j7053p1046
$$ plain form
9851 -122427 -285930 -478186 -554272 -431443 -199820 -6848 100103 120736 57292 -38650
9841 -38650 -59849 -8720 5258 -22748 -18580 -6893 -60757 -139337 -140120 -53907 36563 87007
9829 87007 143803 249796 384624 512109 587041 563921 426745 209657 26837 -88299
9819 -88299 -155097 -183225 -188475 -163219 -104091 -20001 74215 157017 217782 266156 317248 405643
$$ packed form
9851a22427j63503j92256p6086J22829K31623J92972J06951K0633o3444r5942
9841c8650k1199N1129J3978k8006M168J1687n3864p8580p83Q6213R0470N0444
9829H7007N6796J05993J34828J27485P4932k3120j37176k17088j82820j15136
9819h8299o6798k8128n250K5256N9128Q4090R4216Q2802O0765M8374N1092Q8395
$$ [...]
##END NTUPLES=NMR SPECTRUM
##END=
