##TITLE=C13_Ad=0(bat2-aceton)-f12f5
 CDCl3, 22200 sc

 26.1.2023
##JCAMPDX= 6.0         $$ Bruker NMR JCAMP-DX V2.0
##DATA TYPE= NMR SPECTRUM
##DATA CLASS= NTUPLES
##ORIGIN= UXNMR, Bruker Analytische Messtechnik GmbH
##OWNER= root
$$ XWIN-NMR		Version 3.5
$$ Fri Jan 27 13:43:11 2023 Russian Standard Time (UT+4h)  she@DPX200
##.OBSERVE FREQUENCY= 50.327896
##.OBSERVE NUCLEUS= ^13C
##.ACQUISITION MODE= SIMULTANEOUS
##.ACQUISITION SCHEME= undefined
##.AVERAGES= 22208
##.DIGITISER RES= 17
##SPECTROMETER/DATA SYSTEM= spect
##.PULSE SEQUENCE= zgpg30
##.SOLVENT NAME= CDCl3
##.SHIFT REFERENCE= (INTERNAL, CDCl3, 0, 222.653)
##AUDIT TRAIL= $$ (NUMBER, WHEN, WHO, WHERE, WHAT)
$$ ##TITLE= Audit trail, XWIN-NMR		Version 3.5
$$ ##JCAMPDX= 5.01
$$ ##ORIGIN= Bruker BioSpin GmbH
$$ ##OWNER= she
$$ F:/spectra/data/she/nmr/c13/1/pdata/1/auditp.txt
$$ ##AUDIT TRAIL=  $$ (NUMBER, WHEN, WHO, WHERE, WHAT)
(   1,<2023-01-27 13:41:27.78 +0400>,<she>,<DPX200>,
      <created by zg, POWCHK disabled, PULCHK disabled
       terminated by command 'halt'
       configuration hash MD5:
       00 E9 B6 7A A2 85 ED C7 34 08 36 98 17 FE 4E 26
       data hash MD5: 32K
       F9 BA 09 CD CA CA 71 DE 5A E6 FE 6B 8A 90 C4 0B>)
(   2,<2023-01-27 13:41:30.70 +0400>,<she>,<DPX200>,
      <Start of raw data processing
       efp BC_mod = 2 LB = 2 FT_mod = 6 PKNL = 1 PHC0 = -315.7511 PHC1 = 31.18446 SI = 32K 
       data hash MD5: 32K
       04 0F 1B 1F 8F EC E2 05 87 5E 1A BC 8C 86 AC D0>)
(   3,<2023-01-27 13:41:34.04 +0400>,<she>,<DPX200>,
      <abs ABSG = 5 
       data hash MD5: 32K
       C4 7E 4A A5 93 9A C7 C7 4D 14 90 30 1A 47 A8 02>)
(   4,<2023-01-27 13:41:56.57 +0400>,<she>,<DPX200>,
      <pk PHC0 = 9.013865 PHC1 = -13.2 
       data hash MD5: 32K
       36 73 48 8C 0C 7D 32 DD D9 F6 34 EC 0B 0C 5D CC>)
(   5,<2023-01-27 13:42:00.00 +0400>,<she>,<DPX200>,
      <abs ABSG = 5 
       data hash MD5: 32K
       81 0E CC D5 43 90 B8 6B 93 85 15 16 AB 8A B8 52>)
(   6,<2023-01-27 13:42:25.85 +0400>,<she>,<DPX200>,
      <pk PHC0 = 3.99803 PHC1 = -5.599998 
       data hash MD5: 32K
       E3 6C 8A B1 D1 A3 0C 54 79 BA 30 F8 C7 5D 98 79>)
(   7,<2023-01-27 13:42:28.95 +0400>,<she>,<DPX200>,
      <abs ABSG = 5 
       data hash MD5: 32K
       FF 4C 54 62 85 3E 6A 01 85 85 A8 98 38 7E 3F 38>)
$$ ##END=
$$ 
$$ hash MD5
$$ D0 C2 21 D1 12 28 36 ED A2 FB 71 DA 47 90 93 64
##$RELAX= 
##$RELAX= 
##$RELAX= 
##$RELAX= 
##$RELAX= 
##$RELAX= 
##$RELAX= 
##$RELAX= 
$$ Bruker specific parameters
$$ --------------------------
##$DU= <F:/spectra>
##$EXPNO= 1
##$NAME= <c13>
##$PROCNO= 1
##$TYPE= <nmr>
##$USER= <she>
##$AMP= (0..31)
100 100 100 100 100 100 100 100 100 100 100 100 100 100 100 100 100 100 
100 100 100 100 100 100 100 100 100 100 100 100 100 100 
##$AQSEQ= 0
##$AQ_mod= 1
##$AUNM= <au_zg>
##$AUTOPOS= <>
##$BF1= 50.322709
##$BF2= 200.13
##$BF3= 50.322709
##$BF4= 500.13
##$BF5= 500.13
##$BF6= 500.13
##$BF7= 500.13
##$BF8= 500.13
##$BYTORDA= 1
##$CFDGTYP= 0
##$CFRGTYP= 5
$$ [...]
##$SUBNAM4= <"">
##$SUBNAM5= <"">
##$SUBNAM6= <"">
##$SUBNAM7= <"">
##$SUBNAM8= <"">
##$SUBNAM9= <"">
##$SW= 239.972175391363
##$SWIBOX= (0..15)
0 1 3 0 0 0 0 0 0 0 0 0 0 0 0 0 
##$SW_h= 12077.2946859903
##$TD= 32768
##$TD0= 1
##$TE= 0
##$TE2= 300
##$TE3= 300
##$TEG= 300
##$TL= (0..7)
120 120 120 120 120 120 120 120 
##$TP= (0..7)
150 150 150 150 150 150 150 150 
##$TP07= 0
##$TPNAME0= <>
##$TPNAME1= <>
##$TPNAME2= <>
##$TPNAME3= <>
##$TPNAME4= <>
##$TPNAME5= <>
##$TPNAME6= <>
##$TPNAME7= <>
##$TPOAL= (0..7)
0.5 0.5 0.5 0.5 0.5 0.5 0.5 0.5 
##$TPOFFS= (0..7)
0 0 0 0 0 0 0 0 
##$TUNHIN= 0
##$TUNHOUT= 0
##$TUNXOUT= 0
##$USERA1= <user>
##$USERA2= <user>
##$USERA3= <user>
##$USERA4= <user>
##$USERA5= <user>
##$V9= 5
##$VALIST= <valist>
##$VCLIST= <CCCCCCCCCCCCCCC>
##$VD= 0
##$VDLIST= <DDDDDDDDDDDDDDD>
##$VPLIST= <PPPPPPPPPPPPPPP>
##$VTLIST= <TTTTTTTTTTTTTTT>
##$WBST= 1024
##$WBSW= 4
##$XGAIN= (0..3)
0 0 0 0 
##$XL= 0
##$YL= 0
##$YMAX_a= 149758750
##$YMIN_a= -36115259
##$ZGOPTNS= <>
##$ZL1= 120
##$ZL2= 120
##$ZL3= 120
##$ZL4= 120
##$ABSF1= 222.6533
##$ABSF2= -17.34351
##$ABSG= 5
##$ABSL= 3
##$ALPHA= 0
##$AQORDER= 0
##$ASSFAC= 0
##$ASSFACI= 0
##$ASSFACX= 0
##$ASSWID= 0
##$AUNMP= <proc_1d>
##$AZFE= 0.1
##$AZFW= 0.5
##$BCFW= 0
##$BC_mod= 2
##$BYTORDP= 0
##$COROFFS= 0
##$CY= -3
##$DATMOD= 1
##$DC= 0
##$DFILT= <>
##$DTYPP= 0
##$F1P= 0
##$F2P= 0
##$FCOR= 0.5
##$FTSIZE= 32768
##$FT_mod= 6
##$GAMMA= 0
##$GB= 0
##$INTBC= 1
##$INTSCL= 4.134877e-10
##$ISEN= 128
##$LB= 2
##$LEV0= 0
##$LPBIN= 0
##$MAXI= 10000
##$MC2= 0
##$MEAN= 0
##$ME_mod= 0
##$MI= 0.1934396
##$NCOEF= 0
##$NC_proc= 2
##$NLEV= 6
##$NOISF1= 120.0001
##$NOISF2= 80.00006
##$NSP= 0
##$NTH_PI= 0
##$NZP= 0
##$OFFSET= 222.6533
##$PC= 1.4
##$PHC0= -302.7392
##$PHC1= 12.38446
##$PH_mod= 1
##$PKNL= yes
##$PPARMOD= 0
##$PSCAL= 0
##$PSIGN= 0
##$REVERSE= no
##$SF= 50.322730123286
##$SI= 32768
##$SIGF1= 140
##$SIGF2= 120
##$SINO= 11.81781
##$SIOLD= 32768
##$SREGLST= <13C.CDCl3>
##$SSB= 0
##$STSI= 32768
##$STSR= 0
##$SW_p= 12077.2946859903
##$SYMM= 0
##$S_DEV= 0
##$TDeff= 32768
##$TDoff= 0
##$TI= <>
##$TILT= no
##$TM1= 0
##$TM2= 0
##$TOPLEV= 0
##$USERP1= <user>
##$USERP2= <user>
##$USERP3= <user>
##$USERP4= <user>
##$USERP5= <user>
##$WDW= 1
##$XDIM= 32768
##$YMAX_p= 380747954
##$YMIN_p= -1812213
$$ End of Bruker specific parameters
$$ ---------------------------------
##NTUPLES= NMR SPECTRUM
##VAR_NAME=  FREQUENCY,     SPECTRUM/REAL,   SPECTRUM/IMAG
##SYMBOL=    X,             R,               I
##VAR_TYPE=  INDEPENDENT,   DEPENDENT,       DEPENDENT
##VAR_FORM=  AFFN,          ASDF,            ASDF
##VAR_DIM=   32768,         32768,           32768
##UNITS=     HZ,            ARBITRARY UNITS, ARBITRARY UNITS
##FACTOR=    0.368581032318806, 1,           1
##FIRST=     11204.5221812756, 0,            0
##LAST=      -872.772504714734, 0,           0
##MIN=       -872.772504714734, -1812213,    0
##MAX=       11204.5221812756, 380747954,    0
$$ Real data points
##PAGE= N=1
##DATA TABLE= (X++(R..R)), XYDATA
$$ [...]
18370 466474 419556 335887 233750 124005 69796 109176 208710 264005 278980 350739 466187
18359 466187 520047 466794 381599 382334 500369 619603 653911 651792 624649 512533 322876
18348 322876 142076 48919 20755 -28045 -150018 -260026 -268838 -253718 -296330 -421202 -563310
18337 -563310 -584332 -452816 -249112 -35042 187111 373993 441684 394134 330620 282044
18327 282044 192523 101901 92284 141573 176203 160978 113925 54806 -5423 -46192 -1489 181510
18315 181510 448921 712781 926563 1055378 1064579 936387 707513 481800 316851 227543
18305 227543 258844 403055 572467 641562 576708 472782 368594 194949 -37883 -255153
18295 -255153 -392829 -375391 -178354 136617 430214 588266 570796 404276 143098 -202046
18285 -202046 -578489 -864994 -1028730 -1106300 -1071813 -931007 -768273 -639783 -518990 -362190
18275 -362190 -207009 -126083 -123035 -140760 -158562 -203523 -255854 -250985 -171768 -46603 50275
18264 50275 97670 153641 248892 351234 431011 480997 517184 520228 462684 359237 249657
18253 249657 179932 154741 112627 5225 -114631 -107394 55474 220851 251960 151099 -54420
18242 -54420 -316351 -503131 -552731 -514537 -497955 -559899 -637990 -719084 -860394 -1038226 -1207486
18231 -1207486 -1365654 -1435444 -1364999 -1207864 -1040535 -955099 -952799 -951443 -904455 -793003 -648381
18220 -648381 -552438 -550631 -596856 -683449 -843546 -1016042 -1072384 -930076 -673130 -446006 -286654
18209 -286654 -159209 -30256 99645 188161 244182 309634 366066 336032 183990 -35847
18199 -35847 -275795 -431034 -453889 -443078 -475464 -537997 -588614 -649057 -747804 -855394 -898651
18188 -898651 -831687 -670717 -473151 -300839 -185642 -128725 -70552 54571 171426 154205
18178 154205 -12499 -259981 -496705 -619450 -571507 -405131 -260662 -227807 -239933 -231729
18168 -231729 -238806 -289868 -347797 -399906 -410363 -289483 -54173 142455 190275 100705 -60851
18157 -60851 -196666 -218309 -124064 -18176 6435 -32925 -53565 -5818 126663 329892 509304
18146 509304 617598 672620 642734 528822 431925 405618 371202 257299 80890 -88817
18136 -88817 -205203 -244460 -178083 -27238 124772 251292 342925 322148 238192 224800 284648
18125 284648 382241 465777 467825 343678 105644 -170926 -385683 -452577 -395048 -345058 -388150
18114 -388150 -476525 -499935 -438426 -393884 -440545 -553323 -640595 -673804 -636178 -486241 -291217
18103 -291217 -139512 -56178 -30030 -61463 -137940 -202494 -236179 -193438 -48346 143519 327125
18092 327125 427061 386363 267915 154929 54092 -54603 -189995 -308668 -354537 -344496
18082 -344496 -323276 -342979 -418428 -502013 -542360 -581522 -700624 -875275 -1010859 -1044498 -975262
18071 -975262 -814002 -606313 -424091 -296238 -176664 -747 205290 362460 413283 336088
18061 336088 161814 -54415 -261817 -408669 -456868 -383228 -240021 -140974 -102777 -101705 -137708
18050 -137708 -126650 -46241 -11132 -48432 -84720 -89067 -81140 -33968 60154 172594 275070
18039 275070 351112 377072 321850 198298 46549 -94614 -241238 -365899 -415116 -386124
18029 -386124 -287308 -169445 -57221 51147 179223 330163 419062 410327 399077 446519 486069
18018 486069 467827 467935 502910 475191 418694 439060 520904 552005 480596 366375 304466 299751
18006 299751 246437 84524 -93527 -207808 -285575 -311345 -258641 -202342 -147108 -62306 24873
17995 24873 118479 227507 309845 367170 422531 459435 454407 442610 478236 513809 495011 431560
17983 431560 347878 333047 460410 603520 620742 532476 390167 233884 105282 24445
17973 24445 -34148 -78658 -81213 -58691 -47272 -82122 -147565 -178290 -154343 -115270 -111267 -155873
17961 -155873 -195444 -178506 -76860 89953 266476 468673 692460 823851 786700 598789
17951 598789 358515 172388 43964 -42837 -42343 45559 109807 67353 -65301 -198684 -268115
17940 -268115 -296933 -259920 -105329 117915 288132 327809 233506 21671 -229959 -410600
17930 -410600 -502030 -500073 -396564 -254831 -201584 -238049 -252258 -191820 -103910 -26574 54012
17919 54012 144915 235626 328151 404292 414483 340381 198649 19732 -163469 -355240 -554689
17908 -554689 -687780 -694826 -588072 -432378 -300745 -207984 -146789 -131182 -156670 -192052 -232681
17897 -232681 -268392 -257541 -178768 -89739 -59029 -88460 -176110 -299514 -393902 -438358 -490019
17886 -490019 -558561 -635536 -671402 -546082 -219420 201546 541536 693094 673798 530485
17876 530485 296759 19896 -223205 -352374 -338664 -248690 -166549 -116336 -104597 -166530 -328256
17865 -328256 -508135 -609782 -651916 -668149 -651952 -620321 -599392 -581531 -510368 -324607 -70463
17854 -70463 142661 277420 409446 558587 643199 666211 673368 695941 697459 629148 520899
17843 520899 441593 414038 422794 458798 459830 393564 352532 391674 465551 518539 516260 447613
17831 447613 293699 102665 9840 47851 90798 98474 107553 113756 91700 24781 -70717 -161965
17819 -161965 -214123 -222908 -232223 -269303 -326182 -377734 -406339 -388268 -317459 -274521 -299440 -316808
17807 -316808 -282279 -212648 -195925 -260983 -374033 -500634 -578019 -553824 -437920 -303114 -202981
17796 -202981 -126245 -26807 81693 120691 75842 25439 37352 86294 87755 57997 76956
17785 76956 113135 127163 143808 146475 75005 -39686 -122927 -153682 -83502 22115 69269
17774 69269 91239 98993 97570 94980 68489 45189 20985 -17508 -2298 72585 109305 24342
17762 24342 -136882 -214779 -148514 -8931 135674 233625 262701 239768 160275 22179 -133560
17751 -133560 -243422 -279022 -260548 -189759 -74353 35939 102374 109071 60538 -5549 -74041
17740 -74041 -150403 -240929 -355383 -422318 -384812 -307518 -245729 -209284 -194759 -172678 -138518
17729 -138518 -86080 55980 321899 600840 799901 953458 1103053 1235852 1317341 1339917
17719 1339917 1303935 1167023 965063 829734 825976 900759 960669 984362 1034210 1132952 1189659
17708 1189659 1096250 913246 793235 762794 731285 622146 475815 392125 362773 297716
17698 297716 205387 108993 -51426 -244643 -374380 -361219 -249303 -165409 -145382 -144380 -116920
17687 -116920 -73416 -14328 72736 174099 253542 273302 219718 116023 22403 -42667 -117881
17676 -117881 -244271 -387862 -463937 -484677 -518474 -573293 -644192 -717563 -766801 -753234 -682862
17665 -682862 -535506 -296834 -61655 75373 125845 162479 245310 366972 415467 313621
17655 313621 170812 104353 130045 180300 162997 102638 66469 39521 -39284 -179872 -352666
17644 -352666 -463076 -446547 -349369 -226623 -82741 33847 62996 43462 -10647 -135269
17634 -135269 -323720 -563452 -800825 -952952 -1010605 -1007577 -929046 -812368 -745120 -734806 -732752
17623 -732752 -727020 -724926 -692117 -617622 -567343 -616323 -748766 -858374 -896631 -886554 -841501
17612 -841501 -770242 -727799 -770037 -868679 -966484 -1024728 -1004234 -940988 -903839 -898983 -883229 -853619
17600 -853619 -844543 -856845 -872896 -907944 -947846 -928658 -836778 -697629 -562761 -514778 -538061
17589 -538061 -493097 -346760 -226726 -227617 -320598 -422122 -492139 -580577 -714023 -809855 -827194
17578 -827194 -801838 -739922 -600280 -371016 -96076 154824 314655 306842 127144 -94595
17568 -94595 -238174 -301420 -301251 -218407 -106464 19011 193454 400584 574901 615298 529539
17557 529539 392744 184643 -80264 -269594 -264516 -96795 134279 362138 549122 639200
17547 639200 562901 386937 237840 112004 -46495 -219911 -381328 -495536 -484389 -340229
17537 -340229 -172268 -60709 47098 185306 306366 393597 494385 618707 682113 606850
17527 606850 430733 266482 184629 167990 143006 87436 15366 -57093 -155644 -310101 -484353
17516 -484353 -668336 -833719 -881310 -836637 -792446 -753026 -712181 -677803 -640487 -630182 -649430
17505 -649430 -614567 -471425 -260036 -42214 118355 168286 95240 -72096 -227596 -318929
17495 -318929 -396717 -470204 -481419 -453557 -456964 -491193 -508276 -504927 -468699 -397952 -357528 -332061
17483 -332061 -233920 -96260 -31298 -19319 -4796 15021 85069 251838 426231 495193 475058
17472 475058 438238 432321 432465 391648 303766 218533 193868 235862 334780 434182 468587 445039
17460 445039 401353 329525 230818 157347 125735 150449 223498 237722 152597 62432 704
17449 704 -50717 -95643 -136138 -121976 -61933 -40019 -76697 -120626 -136402 -106158 -19523 100459
17437 100459 221536 340008 436671 447031 372649 315358 327277 360749 392036 421715 400632
17426 400632 250181 -21172 -276467 -437158 -498718 -389744 -85388 230158 364813 346688
17416 346688 300323 255100 145162 -20534 -112368 -81092 8693 66737 45567 55044 153294
17405 153294 252789 314733 387067 489248 589018 638637 632470 618911 633060 661385 637396
17394 637396 558662 491126 429241 360690 269259 156318 42364 -75960 -177649 -265784 -340894
17383 -340894 -359193 -308794 -201632 -41863 149744 322400 442161 509353 509531 439578 334402
17372 334402 266530 245752 203088 102842 -34647 -137962 -148139 -80496 54089 273964
17362 273964 490189 565126 525696 520380 596749 629715 542149 410434 311576 230551 100423
17351 100423 -94422 -291000 -405072 -417959 -312096 -98223 139035 324439 427775 443481
17341 443481 381561 263515 55628 -230444 -503447 -711593 -885402 -1041095 -1132820 -1108112
17331 -1108112 -962864 -740632 -469274 -171437 95143 272482 316456 262529 194729 124829
17321 124829 50918 10728 54115 192303 385532 557707 647849 675399 699645 718702 707964
17310 707964 607973 399220 135225 -142556 -375066 -508383 -575001 -606161 -630054 -674381
17300 -674381 -737925 -826268 -898504 -919492 -955195 -1042261 -1130957 -1172837 -1153257 -1107154 -1086094
17289 -1086094 -1088697 -1059429 -943378 -755881 -588657 -496714 -456831 -435557 -435532 -454348 -453480 -418430
17277 -418430 -395884 -395310 -412932 -476030 -543991 -561536 -523275 -445337 -340569 -238252 -201841
17266 -201841 -261990 -367266 -431414 -427722 -380816 -297438 -168712 -18901 81865 86577 16155
17255 16155 -79586 -170931 -313680 -511515 -656725 -715682 -797565 -962565 -1118638 -1135506 -1006653
17244 -1006653 -839863 -721867 -698206 -745262 -796376 -837370 -822154 -696661 -523396 -401237
17234 -401237 -352861 -336822 -285789 -192598 -89560 -33123 -56501 -108300 -97075 6630 86457
17223 86457 67657 4531 -45907 -93474 -170466 -272897 -407175 -557392 -702684 -818211 -829683
17212 -829683 -728957 -583305 -455875 -375815 -330605 -250950 -133598 -80858 -126248 -272136
17202 -272136 -515505 -804131 -1082723 -1293839 -1359575 -1301844 -1219049 -1181637 -1197016 -1208425 -1173854
17191 -1173854 -1121063 -1112654 -1145327 -1183091 -1176188 -1084148 -959039 -837640 -677779 -462536 -236893
17180 -236893 -59239 56127 111089 116932 139662 209381 245708 208169 135081 46196 -21408
17169 -21408 -77579 -150259 -218059 -254045 -248208 -173336 -48301 40630 55218 -10712 -101367 -115707
17157 -115707 -52844 -63024 -177104 -245916 -251996 -240943 -208768 -196353 -226416 -250918 -207432
17146 -207432 -40791 216036 420170 465017 345285 92118 -230166 -548577 -814549 -1005899
17136 -1005899 -1137304 -1234001 -1334564 -1423352 -1388751 -1207747 -1023945 -891262 -760502 -685327
17126 -685327 -718079 -734065 -667031 -589609 -544230 -529789 -535642 -513916 -425025 -307897 -246245
17115 -246245 -236368 -251143 -279383 -309775 -418808 -594353 -718239 -736651 -715648 -755732 -844491
17104 -844491 -901415 -870963 -771637 -664643 -601202 -560829 -552100 -641306 -828779 -1056202 -1219914
17093 -1219914 -1228962 -1071810 -804623 -574277 -513634 -578741 -647722 -640103 -560886 -471203 -386887
17082 -386887 -279222 -129538 26465 113387 122178 147331 259644 381550 410151 366075 307006
17071 307006 241866 115467 -54625 -182091 -254061 -256368 -150760 343 41031 -73529
17061 -73529 -281813 -472219 -595340 -674419 -678755 -653701 -694690 -760817 -706005 -504673 -224294
17050 -224294 43979 220219 282083 264331 201688 132162 90105 94891 144954 177067 156217
17039 156217 85665 -9428 -79395 -73273 -19447 5394 -40506 -131291 -189155 -172970 -109761 -74552
17027 -74552 -139542 -286360 -437305 -521890 -505716 -377601 -181853 -14884 39966 -39530 -215119
17016 -215119 -446455 -684861 -895533 -1045987 -1068605 -1011705 -990790 -981232 -921413 -855923 -843614
17005 -843614 -861092 -817737 -701784 -580346 -488779 -417913 -345422 -299742 -315375 -336313 -315770
16994 -315770 -255233 -153083 -20910 129296 277650 362440 335702 248823 152006 530
16984 530 -240750 -504261 -673340 -724885 -692230 -615113 -563293 -564245 -584227 -575847 -512873 -381112
16972 -381112 -204194 -90016 -58273 -12561 77611 188761 280282 296846 211901 115792 116109
16961 116109 196026 220372 76610 -175815 -388124 -478308 -453179 -391891 -353141 -318038 -243533
16950 -243533 -129780 -36507 -35296 -120054 -241224 -362456 -450771 -453933 -367864 -273204 -218762
16939 -218762 -201414 -201856 -225440 -280476 -324078 -331294 -299037 -237369 -178610 -159539 -185935 -222904
16927 -222904 -238110 -258360 -291122 -318986 -353275 -371037 -370482 -367197 -375429 -391357 -389025 -327497
16915 -327497 -179595 7012 159752 201857 119381 24548 -15858 -51418 -172881 -368855
16905 -368855 -550896 -636147 -573445 -413733 -298123 -301021 -404374 -571928 -705495 -695586 -534578
16894 -534578 -332245 -187035 -79815 -6392 12832 13015 9852 -40757 -135829 -219973 -286885
16883 -286885 -318904 -323150 -352639 -384307 -344940 -241362 -161233 -157806 -195323 -241639 -281481 -267610
16871 -267610 -157533 14628 222958 471295 717974 903968 965086 867363 618862 293790
16861 293790 16676 -110777 -120859 -68466 112189 427161 731744 902755 924038 870956
16851 870956 798036 681422 506616 315329 156783 65424 76087 172902 320382 477835
16841 477835 640385 789731 810725 654969 392302 113377 -150030 -421676 -685568 -917079
16831 -917079 -1087332 -1067696 -790929 -372293 -8956 171753 178070 98111 53994 110012 231028
16820 231028 336526 415223 533047 675167 776303 837442 871348 861456 739334 529178
16810 529178 352827 213835 100228 46823 39801 29004 3318 -41917 -109056 -204153 -294331
16799 -294331 -312188 -264924 -245302 -346580 -522918 -672225 -732211 -738922 -731723 -659878 -535774
16788 -535774 -458169 -510866 -670002 -839048 -957325 -1037304 -1071779 -1022674 -906320 -737397
16778 -737397 -538491 -366955 -257238 -217520 -232001 -258945 -262627 -220285 -125614 -684 125545
16767 125545 208228 214927 184184 154554 146874 148690 158242 150383 147135 180165 203688 222182 281681
16754 281681 402058 553216 655097 649902 536240 307162 41156 -168911 -357576 -516319
16744 -516319 -531355 -334061 -50817 142711 238957 301051 346374 353610 285508 117934 -109197
16733 -109197 -316030 -432938 -468996 -436363 -314997 -123778 42960 112516 82607 -6514
16723 -6514 -92808 -208199 -383017 -580416 -760352 -903103 -1009998 -1084464 -1126755 -1153253 -1179076
16712 -1179076 -1214952 -1216086 -1126839 -976156 -831483 -664402 -435101 -197988 16169 213084
16702 213084 369369 492199 583656 642789 696094 787374 866330 787607 528581 244379 72083
16691 72083 6136 16419 87983 186749 263074 276563 242548 239022 275183 255224 127498 -44503
16679 -44503 -195868 -322614 -482420 -678275 -808188 -832908 -845460 -908696 -1007880 -1058372 -1038965
16668 -1038965 -1006050 -932458 -784335 -607292 -445686 -289018 -194110 -203118 -208524 -102459 97594
16657 97594 276753 356656 361746 363713 422849 512242 583562 651450 724130 753159 689445 557312
16645 557312 435572 371913 371797 368812 305566 186814 54565 -78623 -250302 -438738 -575509
16634 -575509 -660535 -719968 -694514 -526135 -226519 97928 342472 476230 499553 447907
16624 447907 330075 163937 5808 -138039 -230237 -217315 -115460 -7024 -21097 -178515
16614 -178515 -362263 -449570 -401182 -271852 -194721 -228339 -292707 -346916 -352507 -285567 -228893
16603 -228893 -270466 -385808 -453648 -391706 -220376 5983 194122 273052 275289 255504 244037
16592 244037 251480 225759 162693 138568 162451 226376 314026 391961 529956 730384 806780
16581 806780 688954 468411 229182 -18907 -283410 -532412 -716613 -760880 -680203 -583449
16571 -583449 -505216 -425864 -374051 -416121 -515642 -520173 -377355 -214577 -126922 -48531 88390
16560 88390 216474 240456 160433 15512 -150859 -276864 -345990 -427549 -567114 -701240
16550 -701240 -761146 -782961 -818778 -858391 -879715 -892638 -907138 -905465 -868657 -797558 -744737 -710350
16538 -710350 -639438 -523727 -362533 -161406 34856 178912 276958 355937 369816 230626
16528 230626 -3910 -218509 -416262 -598731 -752212 -854427 -861780 -780708 -641791 -491623
16518 -491623 -377683 -331470 -338392 -338720 -268704 -113229 79820 244217 281681 174861 15056
16507 15056 -165703 -399351 -622166 -789111 -969721 -1167120 -1304647 -1343986 -1306542 -1230046
16497 -1230046 -1180653 -1205132 -1314122 -1475056 -1589606 -1623684 -1600673 -1556437 -1530285 -1485697 -1402520
16486 -1402520 -1312469 -1219737 -1119242 -1055119 -1026829 -964896 -859008 -768681 -716948 -672159 -633263
16475 -633263 -621940 -633793 -637982 -623237 -585546 -485045 -285047 -53825 113110 186820 171154
16464 171154 104196 57425 69759 79360 16092 -70808 -51508 108442 283548 345338 298391
16453 298391 208547 136627 141983 184919 142348 -17270 -211071 -363995 -451678 -463298 -414411
16442 -414411 -387533 -443586 -526424 -518449 -388265 -237124 -112447 -5282 60663 45629 -9238
16431 -9238 11677 114740 214498 284601 327896 340123 326674 341045 408586 466905 425021 270197
16419 270197 65037 -125335 -251207 -280537 -199665 -3458 247567 426064 476132 438425
16409 438425 355120 249172 150297 68850 8183 17851 129501 236422 256213 247529 213123
16398 213123 104558 -52007 -185069 -246586 -276451 -328659 -405174 -439007 -391702 -324919 -348664
16387 -348664 -474977 -668946 -953906 -1207085 -1258860 -1182291 -1103632 -1000977 -854227 -694408
16377 -694408 -551425 -467410 -474934 -527779 -604451 -727090 -809461 -777835 -707126 -645803 -586771
16366 -586771 -569927 -615169 -657461 -643876 -569477 -492941 -484138 -488370 -408971 -280197 -189824 -183272
16354 -183272 -276175 -451823 -651867 -843480 -988644 -1004699 -921569 -823035 -747801 -716018 -710817
16343 -710817 -717850 -770673 -865825 -952748 -1026273 -1062095 -998249 -880411 -798916 -732182 -678847
16332 -678847 -660646 -669019 -718935 -807320 -909126 -1000084 -1049384 -1044687 -1005285 -959121 -878378 -716335
16320 -716335 -521380 -354104 -238219 -157238 -72434 46803 151110 127482 -51491 -291987
16310 -291987 -497317 -617482 -657488 -661933 -630170 -477182 -168864 230861 584725 762662
16300 762662 730943 571005 395055 259735 167457 113980 35649 -118886 -251704 -297531
16290 -297531 -286493 -214786 -71962 75000 112616 10962 -125790 -161770 -90221 -27809 -34704
16279 -34704 -124655 -269776 -390074 -443064 -471895 -516634 -513411 -389283 -178740 5156 66041
16268 66041 66358 127434 243122 359469 435210 460369 406192 238964 48950 -17771 84802
16257 84802 295739 513783 601428 498013 315963 171567 86167 17325 -30288 -16664 43214
16246 43214 129030 219497 277073 308979 352056 385713 340852 223533 128256 83568 48771
16235 48771 -22729 -162009 -335410 -494254 -584925 -601671 -610595 -621243 -577634 -478806 -365630
16224 -365630 -274226 -218587 -208206 -259852 -348345 -444448 -525597 -536273 -446579 -301276 -196801
16213 -196801 -223829 -342752 -460021 -481041 -390412 -348610 -476206 -707719 -927826 -1047265
16203 -1047265 -1014632 -878149 -766048 -725615 -658323 -517747 -376961 -316972 -355045 -475916
16193 -475916 -630547 -715571 -688984 -683184 -789315 -909303 -911782 -718376 -376662 -50515 128872
16182 128872 150275 78674 -4471 -29260 -14585 -29612 -34675 32024 136173 272168 432821
16171 432821 558840 614451 595755 544449 506860 493804 470018 398779 335414 334890 310313 178444
16159 178444 18625 -33366 54096 195979 265762 198736 40182 -85359 -119060 -98414 -15823
16148 -15823 118621 238779 322367 349131 290733 207213 126192 36720 -23458 -33705 -66687
16137 -66687 -182345 -358637 -521320 -578583 -527506 -465473 -450231 -442834 -382644 -231584 -26841
16126 -26841 121589 150860 135502 140685 162615 180625 216476 255948 235936 228773 278060 326124
16114 326124 333317 304821 294159 271667 182235 52413 -61309 -148156 -223541 -315127 -419697
16103 -419697 -471735 -433602 -321933 -166414 3188 114079 109043 8681 -151865 -331292
16093 -331292 -453675 -391939 -113471 202217 385010 388376 271336 128769 41208 63066
16083 63066 152380 196428 139090 -2020 -117324 -171770 -272139 -403677 -442076 -399892 -385662
16072 -385662 -407164 -378299 -291032 -242494 -252029 -295437 -361391 -411793 -442578 -476482 -488312 -510770
16060 -510770 -544704 -514624 -400643 -289916 -264828 -302154 -338906 -327438 -313662 -363562 -468951
16049 -468951 -599390 -739864 -871677 -974085 -1006215 -968904 -902136 -875039 -903408 -917004 -838849
16038 -838849 -686481 -580279 -538002 -515141 -518336 -506578 -408798 -243948 -110947 -58683 -14865
16027 -14865 86481 195117 176605 36525 -77024 -86208 -31825 88565 296565 491205
16017 491205 551722 498271 421383 378117 338249 231653 68071 -98282 -226576 -256940 -173563
16006 -173563 -35523 100141 234428 380785 550728 718570 789785 704977 526762 296741
15996 296741 14880 -244846 -409181 -510075 -613283 -707698 -766093 -771611 -740560 -664264 -527081
15985 -527081 -339524 -164420 -87627 -97593 -63256 81834 253626 345680 377078 433486 502576
15974 502576 489963 331191 111241 -17811 -31246 -5386 -6082 -39546 -57136 -68205 -121662
15963 -121662 -208468 -298609 -376113 -398781 -355763 -299842 -303734 -390551 -507547 -571494 -572965 -589363
15951 -589363 -636940 -616006 -544697 -546609 -623145 -666736 -590320 -411966 -237591 -117401 -42606
15940 -42606 -22324 -16212 -16001 -41509 -43393 25183 113517 117295 40312 -1514 35160 141716
15928 141716 286357 395673 408414 318863 195815 122627 145287 175629 105703 -26128 -150019
15917 -150019 -247369 -303175 -318001 -342147 -386453 -441958 -514109 -563408 -503026 -296516 -16125
15906 -16125 241824 427448 510815 502002 467764 412784 309366 226856 191533 144224 70715
15895 70715 -22731 -85191 -87353 -84136 -101683 -56065 96914 280367 406054 462374 518827
15884 518827 629925 765709 854033 823047 649827 369671 72043 -149152 -279199 -344296
15874 -344296 -371600 -401704 -413658 -356122 -270956 -242422 -246106 -192708 -103911 -90910 -175454 -285109
15862 -285109 -404989 -498016 -474429 -345511 -174809 -11478 77881 120402 146089 94438 -63294
15851 -63294 -213035 -236412 -170601 -99903 -23373 153624 454542 723849 836143 812520 687783
15840 687783 496065 303768 206625 177530 73904 -120795 -279430 -308017 -231668 -140623
15830 -140623 -110009 -97638 -25098 104067 178780 88114 -111483 -274188 -336175 -406249 -578352
15819 -578352 -795883 -947639 -932738 -742478 -447052 -142556 52085 111094 88884 24739
15809 24739 -63943 -162568 -272503 -403786 -519004 -565950 -567383 -588060 -613693 -595120 -522625
15798 -522625 -466454 -503501 -640470 -809882 -919613 -933160 -888738 -848696 -840988 -841163 -815168
15787 -815168 -750742 -717865 -776805 -899314 -1002543 -1025833 -952424 -780731 -588318 -492905 -536397
15776 -536397 -662906 -778546 -779249 -695533 -626187 -584755 -549553 -536082 -505223 -408885 -312019
15765 -312019 -293292 -387594 -600638 -851265 -1048324 -1196407 -1310122 -1350021 -1275998 -1145229
15755 -1145229 -1009186 -882886 -777888 -705255 -678979 -725615 -862925 -1069559 -1223409 -1248932
15745 -1248932 -1239160 -1299144 -1379086 -1352539 -1186310 -1000895 -919857 -909402 -896561 -866289 -832954
15734 -832954 -810405 -803305 -798156 -776119 -757239 -704158 -582325 -425811 -256567 -118023 -67047
15723 -67047 -86555 -117041 -127774 -115647 -61814 56503 243907 461439 621461 657524 555931
15712 555931 372635 200402 95327 38973 10220 16813 24236 -70267 -258541 -393888 -400086
15701 -400086 -328410 -216680 -66949 84574 161796 93546 -79813 -248705 -375873 -464989
15691 -464989 -497551 -458399 -391857 -360870 -363394 -373082 -392089 -418321 -403801 -348191 -273494 -169209
15679 -169209 -7390 205739 414019 532984 486257 298385 96993 -15536 -48050 -43175
15669 -43175 -14086 46256 106771 57451 -119850 -281207 -300084 -196617 -92105 -72977 -159523
15658 -159523 -318866 -466259 -581927 -689231 -716563 -613777 -423314 -228953 -49287 142788
15648 142788 296353 319750 222404 96531 -27798 -124299 -138085 -56343 58948 120391 123514
15637 123514 72886 -17870 -102021 -199574 -344655 -499269 -605834 -630075 -604395 -620391 -710722
15626 -710722 -797765 -827770 -798941 -764774 -763927 -734622 -632337 -514186 -428375 -353244 -343843 -429372
15614 -429372 -531203 -587192 -624381 -700192 -792337 -810609 -727747 -650190 -642253 -652631 -664607
15603 -664607 -724771 -832094 -898710 -896697 -875856 -847947 -797262 -780920 -860430 -984669 -1093633
15592 -1093633 -1145332 -1099339 -960858 -725846 -452521 -267700 -232852 -304768 -392838 -424800
15582 -424800 -378839 -279965 -162226 -48735 57915 160033 205422 110478 -68226 -177914
15572 -177914 -183218 -150814 -139385 -130367 -69440 3598 25194 -1461 -76841 -171618 -224240 -265730
15560 -265730 -358697 -471661 -503076 -401088 -247394 -143955 -89749 -53656 6142 119871
15550 119871 241874 306488 297920 243135 149501 23034 -112458 -223819 -228727 -154854 -95677
15539 -95677 -90220 -86697 13107 136074 144393 25697 -132740 -206019 -137650 40383 256512
15528 256512 458005 642728 820925 953845 988562 897079 683313 438832 232136 62280
15518 62280 -31375 -6078 143987 349989 506736 593281 695221 826000 942866 1010173
15508 1010173 985343 901425 902350 1033015 1176095 1220437 1190573 1247554 1442623 1667767 1886145
15497 1886145 2169842 2573421 3062157 3520482 3813028 3896120 3800448 3621415 3424257 3140456
15487 3140456 2697667 2153824 1658559 1275829 972102 718037 505853 372120 301161 255601
15477 255601 223354 180233 129405 103995 85488 32744 -49750 -165921 -304261 -386095 -300295
15466 -300295 -41201 239785 420203 497786 484474 363384 130324 -135174 -309634 -355100
15456 -355100 -357299 -386155 -438399 -451742 -384862 -298928 -203665 -70638 19418 -30421 -191573
15445 -191573 -399416 -604652 -718010 -708479 -636165 -576810 -522365 -484510 -494120 -466240 -355798
15434 -355798 -251587 -173249 -89689 -47238 -100255 -230315 -362273 -429869 -403548 -323263 -236724
15423 -236724 -141185 -67636 -65917 -104152 -88573 -9080 93608 232400 371829 435951 450867
15412 450867 487830 506371 415929 251209 162304 210140 292881 333399 358573 377984 331680
15401 331680 167224 -100514 -363592 -494683 -476719 -386191 -314025 -296716 -270718 -191564 -79797
15390 -79797 32992 106290 72978 -66455 -228217 -342943 -436225 -563717 -699870 -782638
15380 -782638 -790474 -691494 -527418 -400838 -320070 -261975 -238414 -244932 -284344 -362634 -465008
15369 -465008 -587092 -741559 -865614 -864880 -770095 -690687 -678547 -688778 -660564 -589303 -456523
15358 -456523 -240562 -21885 120237 206619 284286 341832 310695 153981 -80269 -334741
15348 -334741 -611825 -880885 -1061629 -1180358 -1317657 -1448300 -1499654 -1447310 -1318339 -1155146
15338 -1155146 -1007168 -883714 -818405 -852534 -938802 -990534 -981152 -913894 -771987 -572517 -376462
15327 -376462 -230918 -145871 -133924 -216108 -333990 -364160 -278115 -147332 -25008 45741 2192
15316 2192 -136536 -229031 -190321 -105079 -96375 -213103 -428136 -630141 -706416 -670679 -628574
15305 -628574 -670448 -767265 -830406 -863880 -883780 -848004 -796774 -828745 -917109 -961085 -923286
15294 -923286 -825058 -735576 -707605 -704537 -664753 -573891 -438020 -293738 -197482 -169577 -171304
15283 -171304 -118733 47423 250027 367223 370588 316092 274386 283144 295090 264681 232748
15272 232748 193761 49896 -169740 -318830 -331778 -236913 -169340 -234396 -368215 -503977
15262 -503977 -634181 -698872 -656852 -566396 -486045 -423337 -332002 -166882 9688 116014 162806
15251 162806 168154 124377 52296 -47395 -143305 -172164 -154723 -180836 -298351 -471138 -615724
15240 -615724 -663960 -621695 -546081 -545773 -695611 -943487 -1136508 -1228969 -1297639 -1328829 -1288900
15229 -1288900 -1208458 -1119519 -1003881 -838573 -640279 -519414 -520580 -519942 -446563 -354394 -281872
15218 -281872 -233954 -253962 -334830 -402204 -441816 -445915 -409260 -337461 -221850 -94188 39595
15207 39595 208304 401890 532309 534498 427030 284567 178552 126551 91368 35182 -28110
15196 -28110 -100524 -147654 -117310 -32917 65480 182483 314434 467215 693332 958641 1174487
15185 1174487 1313984 1395489 1433987 1460564 1474265 1422171 1259574 957894 588929 258244
15175 258244 -8139 -237196 -421110 -506876 -520740 -518592 -513005 -472753 -314102 -12637 283980
15164 283980 435965 460817 444895 411144 340370 253725 194827 180329 246396 422469 646464
15153 646464 792269 840631 816252 684679 450884 178888 -34631 -90448 3867 178915
15143 178915 399847 621400 739035 675517 532515 450869 394396 264925 89405 -75903
15133 -75903 -228137 -347683 -413693 -418804 -365987 -296530 -213766 -93702 39431 135792 167413
15122 167413 111135 -30492 -201355 -319680 -346098 -329278 -335527 -380239 -453307 -511556 -485459
15111 -485459 -362260 -163385 128013 484832 772016 925119 995527 1049992 1079183 992397
15101 992397 809504 657197 568445 508329 462450 413130 374006 381346 427586 474434 469517
15090 469517 372938 235019 135257 120500 229421 427120 595859 630245 533889 416242
15080 416242 384331 474500 631203 805324 948807 991528 920614 776139 590968 414111
15070 414111 287884 236263 236875 225146 206434 209740 257379 366615 474785 485597 370550
15059 370550 199226 86682 29148 -49806 -125921 -112990 29610 241764 411878 497643
15049 497643 486045 371702 201645 17127 -176601 -291435 -227053 -17592 218392 359768
15039 359768 342773 210792 92610 85305 153458 194908 201251 234966 290026 293657 255919 222429
15027 222429 186511 127092 51767 -17080 -66167 -134904 -231795 -272132 -236573 -188897 -150844
15016 -150844 -92581 -45971 -76468 -129834 -101948 11660 122465 193444 253455 304021 272977
15005 272977 111919 -78998 -213426 -334953 -466380 -573933 -628088 -643633 -625927 -555086
14995 -555086 -413373 -208987 52998 303043 416777 378385 262829 157895 116584 162163
14985 162163 219024 187888 48040 -146074 -281794 -277048 -177991 -108204 -146143 -240096 -268608
14974 -268608 -203471 -117232 -76061 -120057 -281028 -525380 -727178 -849525 -913200 -895440 -817557
14963 -817557 -717368 -605623 -458873 -316997 -290555 -374550 -428297 -307602 -34712 250052
14953 250052 388803 362384 288022 249998 259620 247665 157055 -37178 -268658 -458089 -571336
14942 -571336 -553406 -425950 -269012 -193932 -244682 -341829 -392808 -339787 -195788 -33730 92974
14931 92974 188191 280306 379486 404156 337359 251001 199819 203241 270543 405661 559138
14920 559138 688441 781209 803077 748807 673585 616473 562324 461705 273956 41770 -151586
14909 -151586 -313323 -434602 -484111 -486685 -480685 -453823 -398382 -281551 -62365 194204 428300
14898 428300 614108 715685 755740 809722 915614 1053971 1247802 1512375 1758790 1865613
14888 1865613 1769937 1521483 1259160 1129804 1184983 1370316 1623220 1874302 2085109 2245461
14878 2245461 2303226 2264294 2231904 2260472 2294786 2325131 2324472 2177485 1881116 1544563 1247515
14867 1247515 990833 737663 480603 267052 127391 47583 -59793 -210346 -283882 -197600
14857 -197600 60032 412765 688735 791422 748269 615881 493143 431780 359624 186329
14847 186329 -67453 -271896 -352123 -326384 -184663 41802 251612 418472 594109 755110
14837 755110 826348 793547 712242 619708 565377 590358 634378 641042 638165 663046 710927 721488
14825 721488 674287 633129 618969 611570 600788 604513 681222 820199 893982 832381 746234 746204
14813 746204 761162 678629 522890 353119 185989 68853 23418 -16433 -30726 38616 162820
14802 162820 269331 271180 155838 8291 -76414 -105033 -137957 -177360 -193315 -185702 -162609
14791 -162609 -142974 -156733 -172797 -119014 -15092 13941 -90713 -266165 -465573 -679207
14781 -679207 -865278 -953611 -901018 -776301 -644466 -520934 -429273 -384756 -341411 -254922 -139742
14770 -139742 -16697 68148 99043 115863 149487 219632 286487 314364 343258 383964 413193
14759 413193 433934 438429 349116 93948 -229173 -467668 -591791 -637495 -631779 -565716 -398019
14748 -398019 -138002 110905 248619 280954 280199 289666 324713 394814 481463 542379 514676
14737 514676 376914 228413 164774 135646 88524 70851 110011 188339 292841 358788 318790
14726 318790 242624 256271 337914 351022 277282 183537 114435 70203 41324 33043 36739 30439
14714 30439 39081 98218 169441 211241 228600 223779 188572 124852 55876 -34857 -161381 -262159
14702 -262159 -267461 -190525 -127605 -127606 -143328 -154288 -184555 -236928 -273880 -292560 -334343 -388529
14690 -388529 -426024 -476456 -595136 -727744 -752955 -689472 -631565 -638596 -703562 -783048 -872045
14679 -872045 -945024 -970436 -964231 -888025 -690793 -432591 -193856 -30754 19863 -38260 -126138
14668 -126138 -120306 -31596 24973 3968 -88182 -240048 -395799 -474552 -433945 -308161 -188281
14657 -188281 -129089 -127347 -165850 -244338 -323565 -398068 -466575 -501003 -537973 -595759 -663288 -762205
14645 -762205 -897279 -989205 -975036 -878259 -720199 -539711 -409955 -329366 -282807 -290486 -354802
14634 -354802 -380970 -290906 -158750 -133045 -275879 -468952 -574394 -557510 -497615 -490381 -532899
14623 -532899 -588108 -629768 -674664 -715291 -701861 -638071 -574404 -537787 -504527 -460348 -419993
14612 -419993 -399930 -391284 -391267 -409786 -422409 -373447 -269671 -180948 -140933 -109170 -54113 40434
14600 40434 215240 453523 670783 768797 701137 547871 427626 357832 335007 378740 429054
14589 429054 410066 330801 221659 46193 -183738 -327821 -313402 -200038 -44521 106867
14579 106867 225945 286021 266516 197470 132129 72618 10266 -18994 1827 63120 134889
14568 134889 152946 85725 -4242 -34106 15486 115996 209963 257503 254816 219125 173028
14557 173028 187846 284503 387356 431723 409485 324569 182547 20835 -143614 -273815
14547 -273815 -331273 -357244 -399473 -454183 -475497 -447957 -418369 -401188 -429879 -499479 -564797
14536 -564797 -626540 -703581 -788709 -813117 -732386 -580801 -410784 -273981 -216403 -218922 -191916
14525 -191916 -78249 73260 159679 139498 33537 -85573 -132834 -52430 142479 366707
14515 366707 554740 656984 558845 240750 -92025 -266253 -307077 -257015 -132410 31806
14505 31806 196165 325243 418405 456485 424700 351477 301128 324113 406659 517208 588927
14494 588927 509698 235575 -123280 -386440 -472497 -479993 -517512 -580018 -636805 -684502 -717638
14483 -717638 -729445 -728782 -724412 -694905 -603289 -498121 -479484 -526471 -521305 -443732 -323100 -171857
14471 -171857 -39869 44199 105998 152460 136578 53352 -50493 -167696 -298673 -428293
14461 -428293 -567681 -700286 -796442 -851728 -869554 -865174 -855308 -868471 -890431 -850672 -793982
14450 -793982 -788144 -794634 -754035 -644530 -455584 -237241 -116117 -143784 -226517 -254441 -274323
14439 -274323 -360952 -468919 -544742 -594795 -584457 -465293 -285778 -109901 42260 157033
14429 157033 238434 321063 387481 346820 190223 12984 -119956 -226325 -315288 -370769 -413149
14418 -413149 -496137 -586772 -608903 -571378 -544602 -577873 -680362 -815322 -874095 -795055 -621735
14407 -621735 -423921 -230327 -70731 12061 11181 -49401 -124038 -182009 -245032 -312068 -351289
14396 -351289 -350682 -329644 -325152 -336015 -274807 -90627 142072 288194 264322 97722 -170437
14385 -170437 -482942 -732038 -853307 -886474 -839294 -689608 -450682 -206867 -77035 -60187
14375 -60187 -82060 -101605 -56452 78925 224717 266404 164932 20335 -123754 -300354
14365 -300354 -450911 -515016 -452951 -272907 -86198 22432 57391 90397 176159 260692 254657
14354 254657 126531 -51759 -165576 -249736 -448471 -754815 -1018132 -1154651 -1194390 -1192015
14344 -1192015 -1200283 -1223613 -1219141 -1195848 -1144858 -1042812 -914854 -788962 -700986 -656345 -603251
14333 -603251 -522061 -447090 -409822 -368900 -266784 -97190 95849 221412 220106 118116 -74132
14322 -74132 -297437 -437183 -472819 -429862 -349267 -304752 -322774 -347561 -340302 -300673 -233491
14311 -233491 -136821 -42882 -38849 -117971 -199917 -275865 -344699 -405424 -436181 -395450 -355369 -431604
14299 -431604 -529241 -476072 -241653 26867 166696 156285 39727 -119298 -287317 -446309
14289 -446309 -533801 -527880 -461740 -372113 -334675 -373165 -387120 -337953 -353280 -481829 -538002
14278 -538002 -437602 -323248 -275223 -207063 -73116 31625 81637 133538 219881 306863 335472
14267 335472 296209 188207 22572 -155994 -274741 -358063 -443925 -439524 -320287 -183184
14257 -183184 -134250 -191161 -256454 -270347 -256894 -238717 -238583 -266132 -277745 -229625 -133483 -39200
14245 -39200 37722 80903 21628 -157731 -342445 -416320 -351887 -192771 9238 145552 148290
14234 148290 123290 170099 262352 344573 399255 402955 359759 311965 271590 187976 53081
14223 53081 -94728 -205821 -239583 -267662 -391371 -585264 -759774 -839568 -788337 -658476
14213 -658476 -521038 -398654 -277323 -170053 -144087 -222177 -350485 -463049 -523757 -493242
14203 -493242 -402809 -338389 -305976 -251017 -162331 -121121 -216173 -399921 -534654 -587475 -676451
14192 -676451 -850561 -1009277 -1072285 -1047482 -973534 -888388 -798133 -668264 -505112 -389071
14182 -389071 -388378 -465431 -517182 -489284 -401760 -270991 -135246 -47960 -60251 -227536 -493213
14171 -493213 -722009 -901381 -1070143 -1195695 -1238283 -1214449 -1177781 -1159553 -1157703 -1128629 -1015335
14160 -1015335 -819366 -579282 -342562 -177233 -110901 -81290 -55376 -79147 -110639 -115542 -162478
14149 -162478 -296972 -435525 -518912 -615328 -727046 -799004 -824300 -817228 -807992 -826814 -850828
14138 -850828 -821047 -776973 -754207 -704445 -596423 -481225 -384572 -262836 -130252 -31907 36352
14127 36352 94333 117492 89603 22595 -46570 -59166 -62106 -124156 -250978 -416361 -551516
14116 -551516 -571151 -477764 -397696 -431145 -564266 -698791 -758035 -727188 -638943 -552985 -511159
14105 -511159 -511330 -493409 -408433 -284879 -190283 -100531 -5709 -259 -102252 -227725 -284849
14094 -284849 -243451 -137062 18253 166406 254442 305929 333582 393953 529275 692667
14084 692667 827135 840033 719015 577550 478566 355642 178798 35186 -25091 -41619
14074 -41619 -50856 -30999 44823 137903 168679 112552 -1023 -147340 -318075 -510995 -694517
14063 -694517 -794048 -771064 -644875 -480015 -372290 -388790 -518477 -683541 -789834 -804327
14053 -804327 -734816 -630705 -513869 -360777 -172217 34172 199969 285171 283595 233074
14043 233074 183321 144359 105238 28296 -66631 -128732 -145667 -87520 19884 98347 130081
14032 130081 148897 166692 185640 230154 304854 382367 422172 433175 438211 412170 301990
14021 301990 114049 -94707 -206393 -178246 -92222 -75543 -193171 -394331 -570872 -654676
14011 -654676 -691274 -724650 -713973 -635251 -566841 -583216 -673371 -774327 -859322 -937031 -983683
14000 -983683 -951071 -880133 -834223 -798471 -782368 -821610 -868254 -887837 -885848 -866794 -816601 -731162
13988 -731162 -625040 -475573 -338000 -300588 -311995 -280409 -168359 22803 225330 372682
13978 372682 445099 422969 311390 159474 31765 -27540 -46141 -62942 -84534 -126844 -160997
13967 -160997 -166873 -209980 -312724 -428725 -530894 -600383 -618446 -584493 -548425 -558176 -541226
13956 -541226 -433890 -259312 -64785 94682 160405 134794 71058 34017 42886 17739 -74935
13945 -74935 -169311 -244399 -295255 -319614 -315894 -311710 -325856 -323295 -279794 -246641 -259390 -276410
13933 -276410 -307424 -388945 -478968 -473308 -342306 -139263 34423 134930 203317 298273 395849
13922 395849 412774 345548 250669 211280 293509 450649 578682 638889 616857 526633 441092
13911 441092 391232 324919 201398 49527 -83716 -218756 -323786 -296506 -102022 164329
13901 164329 394891 568564 653512 593863 428639 246901 155631 218045 356931 453096
13891 453096 462003 412382 352159 342269 384431 377797 297484 195909 75792 -36778 -98967
13880 -98967 -129968 -155126 -196450 -268767 -358800 -445630 -492379 -490390 -414263 -276693 -130066
13869 -130066 18624 132527 188950 240074 320765 345967 211172 -12574 -197034 -274248
13859 -274248 -250640 -174211 -71129 46229 103999 96516 144667 330735 565582 698452 686954
13848 686954 544426 323698 103009 -56959 -124815 -100240 -21315 22746 30985 73816 167415
13837 167415 261630 263630 140641 -71932 -313463 -502772 -598512 -583102 -474694 -389373 -426968
13826 -426968 -542942 -661223 -756431 -737989 -516945 -160710 193866 445313 577219 634998
13816 634998 600654 439222 263333 194080 161338 23319 -227304 -491807 -690816 -804274
13806 -804274 -878245 -950439 -984650 -981795 -982762 -997205 -947812 -788408 -556239 -348824 -238647
13795 -238647 -187085 -139431 -114738 -116267 -136628 -185132 -244862 -309470 -366134 -380174 -300207 -137054
13783 -137054 31132 191670 309123 301306 215051 140739 158760 272398 368209 337802 178092
13772 178092 -30214 -200576 -300659 -358119 -400078 -438466 -490038 -559611 -630169 -686151 -688899
13761 -688899 -611989 -485756 -383928 -337585 -263665 -147673 -110065 -196122 -291675 -290816 -204869
13750 -204869 -69430 79408 178568 216951 225130 199808 171627 171526 144543 88035 34951 53180
13738 53180 167779 275898 292279 276068 284410 333494 447130 560302 561036 453806 310427
13727 310427 171149 52399 -47240 -160897 -345759 -566844 -730641 -849287 -975115 -1096779
13717 -1096779 -1162791 -1181903 -1179848 -1134045 -1047307 -974571 -952827 -944633 -887758 -776695 -636549
13706 -636549 -466333 -298108 -208814 -158438 -58419 1414 -76610 -207748 -327433 -451959
13696 -451959 -583622 -734474 -890840 -1021747 -1051786 -951138 -821374 -749517 -720939 -697482
13686 -697482 -698580 -761419 -845593 -868371 -811889 -748125 -775237 -951950 -1257113 -1536054 -1669182
13675 -1669182 -1680512 -1614598 -1473937 -1235362 -896695 -569869 -431519 -502306 -675157 -859578
13665 -859578 -1016122 -1105575 -1112555 -1085056 -1044133 -967102 -823204 -604238 -339233 -96056 56040
13654 56040 127997 137928 72259 7522 37996 111858 148345 163663 235794 380831 485654
13643 485654 431405 236294 20966 -118472 -177709 -238849 -297415 -313956 -319423 -342983 -395691
13632 -395691 -502958 -643805 -787360 -921470 -1017941 -1062952 -1045521 -978147 -924816 -877164 -764558
13621 -764558 -652330 -614902 -607129 -595366 -569773 -545638 -543641 -494931 -369135 -230103 -101052
13610 -101052 29501 118750 111145 17936 -64460 -78189 -43153 7565 54726 61386 3889 -88984
13598 -88984 -199858 -334021 -494014 -684105 -892188 -1045574 -1036464 -846029 -593960 -452006
13588 -452006 -477832 -591159 -714500 -788068 -789341 -796487 -844940 -839513 -712723 -529023 -396386
13577 -396386 -347692 -309265 -239370 -132030 2777 105522 172649 223008 244450 245602 235020
13566 235020 118697 -147412 -419032 -614616 -742537 -813334 -866356 -902987 -920433 -928183 -903441
13555 -903441 -846296 -813719 -810008 -797362 -772654 -704856 -528734 -311929 -171297 -83941 -19259
13544 -19259 -6929 -40549 -70916 -121307 -201191 -236113 -167581 -46943 31546 90588 153031
13533 153031 202598 278631 379947 430363 376602 235130 49547 -161456 -409385 -691756
13523 -691756 -927409 -1062275 -1120040 -1113040 -1013107 -840495 -677340 -573063 -521956 -496694 -516528
13512 -516528 -631824 -803548 -920310 -889037 -688946 -417442 -202792 -109265 -86264 -74927
13502 -74927 -129768 -242025 -302639 -260123 -111268 94168 253649 306630 271870 233091 260965
13491 260965 343924 406738 436317 483682 538743 566755 543493 463403 340948 219941 148347
13480 148347 101555 382 -125118 -192966 -204516 -225141 -301925 -412425 -515961 -599027 -613945
13469 -613945 -531493 -347957 -122367 38615 59594 -99742 -364252 -587034 -690148 -666911
13459 -666911 -559811 -455796 -414604 -468309 -618364 -761580 -787398 -725955 -640660 -543688 -438445
13448 -438445 -363020 -340829 -323290 -281803 -245057 -184143 -67849 68112 172868 188281 109263
13437 109263 31747 33080 102921 204813 315277 381806 360014 241795 28858 -211811 -369692
13426 -369692 -409262 -397812 -374207 -315854 -233376 -153868 -48856 74393 142572 136968 104757
13415 104757 80702 40775 18816 141665 417782 723972 954889 1029034 921539 702031
13405 702031 464876 217922 -22643 -153945 -145011 -82402 -32502 -34332 -55632 -18941 73085
13394 73085 177162 295974 405211 432085 379791 319382 290843 307298 341085 351735 366333
13383 366333 449870 636259 877720 1073543 1164648 1138386 1000563 790390 545537 339511
13373 339511 244513 258457 359447 492733 571160 550425 445951 309216 175836 64165
13363 64165 -34410 -133743 -193471 -200984 -194214 -199564 -242899 -296499 -313831 -321704 -351752 -369516
13351 -369516 -327650 -227474 -97803 30992 123221 156866 169669 231838 349076 445995 467506
13340 467506 445158 454529 534056 603440 571992 470582 405709 437440 506597 518340 432273
13329 432273 290558 232943 328004 466151 567074 634943 659698 640297 634946 676468 749102
13318 749102 795606 774038 715006 639208 500626 234520 -112883 -365691 -434430 -377378 -286618
13307 -286618 -205632 -159524 -180316 -273124 -346538 -295419 -154715 -8181 91299 151233 210625
13296 210625 233188 214728 230139 303234 393392 504279 650919 750834 748139 638771 469034
13285 469034 274960 76262 -84037 -181317 -194939 -106992 52814 219548 328559 310144
13275 310144 151437 -9318 -23770 69540 135772 106052 11889 -88570 -110763 -41614 32146
13264 32146 120536 279609 489699 690136 779814 726067 645786 637340 646997 550148 292841
13253 292841 -45922 -344404 -525499 -532116 -339239 -50493 192533 340567 412641 448525
13243 448525 478404 507028 555042 639432 688117 644576 532259 414938 387155 471942 581750
13232 581750 675321 797740 972021 1148178 1233729 1199359 1078726 952112 928362 954233
13222 954233 886731 728822 599124 599039 731003 902032 1019668 1032651 940834 781129 617215
13211 617215 498920 441155 451262 482254 491079 505179 551138 583394 543922 478812 449225
13200 449225 437273 401792 387760 479600 633980 762268 844901 903217 904464 823734 723517
13189 723517 674830 697413 784443 900274 1019346 1090614 1057696 945835 803280 674663
13179 674663 636818 721793 861141 983756 1066042 1109169 1116437 1089218 1045648 1010848 991255
13168 991255 1004723 1091804 1244374 1390428 1487820 1541445 1546464 1523328 1554355 1686231 1899809
13157 1899809 2116380 2215462 2154489 2006133 1874580 1818803 1788097 1730772 1708850 1807437 2006207
13146 2006207 2197041 2305816 2340512 2342840 2322849 2255743 2129964 1952043 1757553 1610090
13136 1610090 1526765 1465202 1418670 1417420 1449691 1412114 1270816 1080793 867016 692425 641375
13125 641375 736180 913429 1079852 1186063 1228169 1235634 1221801 1205590 1226021 1326428 1471573
13114 1471573 1578672 1603839 1591071 1646493 1754166 1829501 1902927 2022344 2167731 2279917
13104 2279917 2296370 2217429 2116941 2041971 1979503 1904309 1837470 1824440 1873109 1930556 1934111
13093 1934111 1853441 1777511 1770886 1780681 1767091 1724748 1728441 1856882 2086106 2269758 2298138
13082 2298138 2225810 2155185 2126971 2138841 2176104 2230149 2324889 2452191 2550797 2605284 2644493
13071 2644493 2684617 2691480 2642857 2560485 2464209 2404999 2463448 2640987 2867478 3073702 3208217
13060 3208217 3261473 3265655 3248319 3259457 3368386 3636017 4029650 4351019 4486339 4522429
13050 4522429 4507906 4398775 4259372 4192703 4179008 4217079 4306063 4397260 4456194 4469761 4486819
13039 4486819 4553570 4660030 4791543 4957071 5131498 5272556 5433598 5636121 5821677 5952955
13029 5952955 6031871 6121738 6260352 6356177 6342128 6289014 6302172 6391753 6514314 6665271 6846458
13018 6846458 7018990 7179654 7396070 7714822 8102922 8461817 8747482 9035919 9392862
13009 9392862 9812193 10294315 10863296 11501599 12213929 12961617 13654474 14337204 15099197
13000 15099197 15982407 16983964 18085500 19311958 20705654 22295206 24108946 26128136
12992 26128136 28382891 31035806 34183405 37900074 42338508 47624022 53929735 61627655
12984 61627655 71142920 82904291 97524498 115877778 138997596 167911678 203426044
12977 203426044 245525710 291850374 335813999 367073702 376443101 362046802 330189762
12970 330189762 290426641 250437539 214345575 183518937 157848110 136588666 118849458
12963 118849458 103928527 91378857 80852467 71912094 64203237 57533773 51730657
12956 51730657 46646719 42223974 38449976 35262302 32572170 30290752 28288669 26438339
12948 26438339 24685381 23069497 21671406 20479494 19443800 18561669 17898365 17474029
12940 17474029 17171237 16842138 16397968 15845078 15261423 14732240 14319116 14054697 13977695
12931 13977695 14066427 14230277 14398309 14559799 14780207 15143948 15677343 16374878 17193315
12922 17193315 18064075 18998446 20031941 21195552 22601310 24323799 26207695 27889274
12914 27889274 29004135 29408176 29338809 29168688 29086028 29195496 29613413 30425034 31680211
12905 31680211 33461504 35838130 38792054 42341735 46649227 51914048 58365569 66360674
12897 66360674 76355282 88860782 104495152 124109588 148756989 179568995 217431506
12890 217431506 261989735 309720327 352342136 378663694 380747954 359428532 323013313
12883 323013313 281275337 241100225 205753619 175988155 151351184 131029726 114192514
12876 114192514 100086329 88142134 77998797 69349943 61887980 55405658 49795638
12869 49795638 45004727 40975526 37539296 34500379 31763562 29306898 27114869 25168531
12861 25168531 23462946 22005842 20768867 19693518 18751976 17960629 17295752 16665627 16041966
12852 16041966 15478263 15058336 14814636 14652217 14466174 14233669 13974266 13714128 13494329
12843 13494329 13364103 13308771 13301146 13395030 13632924 13930851 14165773 14314490 14422421 14534137
12833 14534137 14687693 14912103 15192990 15491833 15825134 16273444 16899995 17688146 18596746
12824 18596746 19647678 20903783 22395538 24139856 26096994 28214181 30637122 33565832
12816 33565832 37034354 41027806 45676605 51280908 58248673 66956866 77767845 91220790
12808 91220790 108075774 129261286 155853323 188869485 228681194 273962591 319970128
12801 319970128 357613441 376439925 371077943 344865849 306752188 265566477 226958912
12794 226958912 193402590 165282426 141982073 122657719 106581304 93142919 81824434
12787 81824434 72227848 64068386 57054509 50906434 45475596 40699951 36533294 32970089
12779 32970089 29958805 27379966 25108389 23099881 21390137 19905282 18550116 17290341
12771 17290341 16072864 14915281 13893708 12991886 12145635 11354841 10674928 10150087 9741238
12762 9741238 9386695 9040459 8649202 8234961 7836207 7411054 6947613 6502143 6124402
12753 6124402 5792446 5479897 5196335 4926889 4665295 4415094 4168218 3918105 3620899
12744 3620899 3293785 3059514 2953349 2886577 2846561 2845062 2823056 2746269 2622395 2494771
12734 2494771 2379487 2306018 2294232 2285671 2256308 2273571 2329341 2360704 2364455 2353138 2363168
12723 2363168 2386823 2353898 2232864 2122075 2104686 2071330 1910568 1652833 1442671 1397431
12713 1397431 1497752 1680135 1872599 1970012 1914991 1735086 1512622 1288928 1052904 798431
12703 798431 594990 563346 670255 804120 898397 902786 836615 769888 798472 927455 1046776
12692 1046776 1099604 1085296 1020898 921025 841210 810111 786601 732694 682142 696622 802308
12681 802308 987304 1226826 1482091 1635456 1594365 1416193 1243125 1179728 1201043 1208001
12671 1208001 1135709 952865 702788 486002 377429 371415 420565 500346 602023 682909
12661 682909 672960 568730 419785 305773 230448 167607 148337 127283 49052 -27429 -41205
12650 -41205 -1090 88269 242233 404154 480472 476481 437028 366691 277433 197880 145158
12639 145158 174903 293997 379874 341241 232496 105476 -9514 -61059 -89983 -132822 -117026
12628 -117026 8285 137288 186043 199868 229852 289595 371809 462866 535498 551882 520560
12617 520560 507614 512310 491214 463491 435449 374003 238596 63336 -69951 -133329 -118862
12606 -118862 -60657 15416 100086 191612 314171 457214 564543 644502 767994 946779
12596 946779 1088253 1093456 1008474 953044 943531 928913 908532 889908 859260 774886 622183
12585 622183 458539 323068 227798 242305 394087 553201 584964 487844 337264 226558
12575 226558 218349 271264 328208 426165 547974 632642 666539 655470 659679 733815 860436
12564 860436 990804 1141561 1375465 1752192 2253464 2784008 3257678 3711669 4248499 5015045
12554 5015045 6238511 8160833 10931248 14472384 18358554 21451748 22182023 20271106
12546 20271106 16989130 13642096 10813819 8562588 6812876 5512290 4611541 4013822
12538 4013822 3574133 3192980 2915460 2808489 2832225 2866922 2824291 2700323 2483516 2162000
12528 2162000 1792463 1432528 1059697 639610 250806 30726 44221 213560 449005 745278
12518 745278 1080983 1335760 1419959 1341935 1178940 1059697 1040806 1037883 980076 868824 769939
12507 769939 787763 926921 1092373 1169502 1138199 1074766 1012683 954621 870465 709261 466323
12496 466323 179848 -77062 -213557 -163324 61832 381242 643273 733999 704090 621200
12486 621200 525427 434082 348524 271598 219018 243677 338387 416634 469162 532381 626281
12475 626281 728165 759366 708482 624953 543602 481686 442380 400781 326320 192461 25315
12464 25315 -70717 29905 313926 550506 557729 385826 206085 105602 43155 -4343 -9282
12453 -9282 1708 -18250 -34210 -5856 -1478 -90804 -243187 -338370 -308530 -160221 23301
12442 23301 120609 126748 94932 34451 -56238 -154388 -224640 -219050 -147064 -76055 -38327 -35772
12430 -35772 -42231 -18668 43375 145451 246665 274630 229655 186547 217229 310821 381480
12419 381480 404574 389406 338842 284995 257954 292853 392525 468603 444058 341017 253035
12408 253035 267334 358831 432643 449266 446715 479041 542307 612332 685505 734901 746132 713908
12396 713908 627845 532087 477752 405323 273044 163019 112750 77685 35400 13164 44150
12385 44150 112279 122259 44250 -53226 -98763 -111624 -167543 -274150 -356252 -359568 -323974 -307371
12373 -307371 -309042 -259871 -104355 132866 391265 585808 706281 783197 849387 963070
12363 963070 1107357 1202248 1217270 1173729 1097311 999730 906713 842807 797955 724942 570861
12352 570861 366855 176495 10762 -76138 -11848 122384 181541 146177 70691 -39816
12342 -39816 -178433 -259336 -202965 -18813 149670 225328 217841 151702 105511 109309 164011
12331 164011 214492 196183 147358 151391 174779 133638 72361 56406 50217 30674 12216 -265
12319 -265 -23051 -65568 -165359 -333750 -500733 -670187 -909461 -1147113 -1222193 -1079019 -761901
12308 -761901 -342228 51741 274936 309157 263782 260285 331883 449596 579959 694821
12298 694821 753918 749997 682652 530967 313129 98759 -60690 -115686 -15108 179158
12288 179158 348354 397285 316267 143684 -36607 -119149 -82444 53039 211791 304421
12278 304421 360910 430886 509670 543143 472959 325347 198549 188932 269338 325953 336992
12267 336992 331070 347123 396209 444815 496183 538975 504712 352055 128107 -53419 -83982
12256 -83982 2002 55578 54096 100484 196862 200834 64215 -72142 -107178 -30571 119797
12245 119797 280086 453015 687968 937384 1117497 1229573 1294711 1282534 1225655 1147502
12235 1147502 1015699 865962 775538 776549 852392 950779 1018033 1080860 1164917 1216009 1228951
12224 1228951 1221136 1160150 1017248 827198 701563 694049 783243 880629 865836 710303 469752
12213 469752 259535 149878 72386 -42657 -149166 -168247 -127324 -21218 205150 462879
12203 462879 608139 634055 592463 503279 411940 355513 327935 337661 368465 358463 258160
12192 258160 103782 -39196 -152621 -203806 -176629 -107274 -44046 -13110 -2390 -3978 23802
12181 23802 117306 227819 318905 411637 482421 468413 403924 395845 478564 566070 550516 444033
12169 444033 343495 285411 257217 256522 247554 224093 256957 411373 629814 813356 926406
12158 926406 965645 909685 762828 557527 360838 225565 146481 160840 296378 459211
12148 459211 584071 734800 855943 794708 574300 347233 202908 192116 316020 462594
12138 462594 549742 605279 656437 659600 588387 484953 406778 407627 495633 592182 585914 441027
12126 441027 238005 67534 -21803 -33064 -10827 24124 82922 120428 52704 -74666 -120970
12115 -120970 -49459 94043 299653 476839 538262 510540 468216 440041 382417 301655 275238
12104 275238 343279 422854 442145 442273 436206 415028 393343 383275 407739 485891 595986 697255
12092 697255 753199 772542 780722 800895 835919 878562 915646 916293 849923 711196 629606 754297
12080 754297 1011185 1197361 1254618 1259743 1229849 1124750 941684 746918 642729 698666
12070 698666 878488 1069642 1192054 1210363 1149977 1022456 817228 607328 476020 435236
12060 435236 451548 500895 567944 672494 825138 928715 945495 949178 965912 973739 907755
12049 907755 710162 435256 153178 -119387 -338527 -389481 -249803 -81540 16185 48271
12039 48271 26895 9230 77422 216377 326397 390451 401400 317731 178255 50443 -54840
12028 -54840 -166607 -309160 -503033 -727877 -882423 -895239 -849407 -831433 -811647 -744985 -611680
12017 -611680 -433417 -284946 -226545 -251686 -320253 -385754 -391295 -340728 -285383 -255115 -256064 -266941
12005 -266941 -259641 -192818 -111463 -104888 -160444 -234547 -289301 -345023 -450726 -603376 -718656
11994 -718656 -704998 -593028 -471017 -401873 -398816 -444441 -484288 -452765 -396289 -388551 -417552
11983 -417552 -457680 -465716 -408342 -288325 -138839 -12519 65066 84329 49680 982 10
11972 10 64922 104442 93798 100895 161959 282432 419435 512277 554609 585130 607159 561465
11960 561465 434933 237586 -7440 -207899 -289983 -246271 -122015 4073 114764 239906
11950 239906 302345 212319 34193 -93625 -89243 -7409 71831 156140 210518 164563 17221
11939 17221 -159289 -319301 -432076 -459656 -429206 -386931 -339385 -281199 -232065 -205727 -206981
11928 -206981 -286883 -468748 -616370 -633735 -598753 -547088 -411835 -169905 25773 66908
11918 66908 12327 -25913 6611 55205 110737 200512 319781 435175 549127 661543 733377
11907 733377 730791 664261 588169 543536 569481 613982 590503 484974 347336 240401 173456
11896 173456 92665 -37184 -168855 -218763 -158862 -54111 -6078 -45513 -104077 -101549 8505
11885 8505 212501 496435 834989 1199872 1525701 1735858 1822493 1804925 1706734 1626617 1666820
11874 1666820 1783901 1896140 1980471 1986662 1850572 1609964 1383836 1249808 1195229 1190948
11864 1190948 1207660 1216038 1167593 1037277 850811 680082 572804 537437 551523 548192 463120
11853 463120 295609 162276 139739 180473 247223 339862 413842 460219 524677 628740 757182
11842 757182 876099 960365 949410 842399 753568 730235 725831 778381 924534 1163534 1455400
11831 1455400 1681069 1744819 1675634 1585257 1549061 1544452 1513221 1503511 1551539 1576986 1527116
11820 1527116 1412832 1244602 1083540 970848 868292 786688 770985 839576 929322 930779
11810 930779 816852 653254 569046 644761 857798 1072658 1162351 1184098 1271125 1468469
11800 1468469 1734170 1959567 2113407 2253470 2396585 2520631 2607804 2674352 2670827 2487591
11790 2487591 2142381 1777768 1506729 1367896 1271177 1116823 926290 797552 825839 1015374
11780 1015374 1252280 1400609 1384041 1260795 1203197 1259163 1347036 1367995 1218333 816420
11770 816420 219135 -369481 -832134 -1093883 -1083072 -900051 -726003 -682640 -766652 -906018
11760 -906018 -952304 -814856 -584575 -358934 -210789 -158806 -145680 -121526 -80998 -33139 30757
11749 30757 45340 -43039 -178440 -299163 -363836 -351516 -289323 -241903 -231341 -231707 -212054 -153492
11737 -153492 -106242 -98704 -88417 -98352 -144645 -149859 -90750 -37911 -76462 -247722 -488250 -704483
11725 -704483 -850125 -870515 -766883 -601570 -443219 -352191 -316282 -282956 -243827 -259165 -393647
11714 -393647 -570148 -655826 -621658 -470225 -229490 19023 226426 456652 765472 1027547
11704 1027547 1100886 1050335 1010859 1039319 1129771 1262876 1382433 1440079 1435804 1334860 1158749
11693 1158749 1015029 957406 950022 920103 849867 724297 521296 303155 166879 117814
11683 117814 96607 52552 -45529 -185162 -324463 -428414 -477698 -517757 -551162 -516516 -424982
11672 -424982 -363143 -354691 -352470 -297598 -248183 -305565 -393916 -411425 -401283 -470282 -600881 -609730
11660 -609730 -405054 -129037 94207 279519 436686 475261 395732 333813 317250 257453
11650 257453 100420 -123604 -318183 -394520 -324474 -156311 10052 147271 276742 402847
11640 402847 505175 544446 509455 392171 198293 -25574 -183406 -193649 -115210 -85287
11630 -85287 -164486 -279134 -363039 -421315 -474511 -496130 -404006 -219760 -53320 12940 -40038
11619 -40038 -176739 -338367 -506662 -639430 -670551 -626752 -569905 -487524 -364446 -255332
11609 -255332 -234014 -307651 -425265 -516386 -582483 -714553 -921675 -1110725 -1216918 -1198319
11599 -1198319 -1077310 -929392 -847924 -885563 -1019556 -1199275 -1305354 -1248249 -1092843 -964540
11589 -964540 -934370 -971447 -970250 -858602 -659231 -433803 -260065 -167508 -149136 -204269 -353777
11578 -353777 -556590 -727937 -846503 -934857 -961464 -952383 -931687 -804448 -614547 -522933 -566969
11567 -566969 -686741 -795166 -798403 -700982 -589030 -521992 -486940 -455223 -423420 -382895 -328459
11556 -328459 -273708 -233767 -232481 -287011 -401045 -570317 -709444 -696742 -521809 -312929 -181319
11545 -181319 -122814 -67400 33777 155344 253164 294158 285127 227618 128254 36618 -17628
11534 -17628 -78247 -176107 -279879 -358444 -463551 -606691 -684315 -634522 -490156 -338197 -243830
11523 -243830 -226208 -251589 -250226 -211140 -149638 -45053 71585 128891 122727 104958 100189 91958
11511 91958 65188 45209 56325 117609 199624 221469 178008 102148 -1386 -94101 -133174
11500 -133174 -135678 -109961 -59439 -23761 -19650 -27906 -36783 -33319 -19079 47631 201710 375074
11488 375074 536983 680797 736064 655106 430575 72109 -233393 -319533 -257143 -136260
11478 -136260 19370 160080 244629 223408 92776 -14759 -5238 45392 3525 -92771 -158043
11467 -158043 -157518 -139983 -199350 -330069 -476514 -559088 -565871 -602501 -653064 -644549 -598383 -569610
11455 -569610 -567717 -553464 -540848 -520692 -455263 -359077 -225478 -70686 82199 274808 520617
11444 520617 680323 633518 405811 126580 -109435 -304965 -432150 -463729 -471403 -505048
11434 -505048 -539279 -546475 -572080 -664826 -773749 -838218 -841566 -792186 -743930 -695589 -610245 -521515
11422 -521515 -440844 -365001 -335874 -346831 -364907 -412190 -495070 -538263 -450101 -259135 -89443
11411 -89443 19002 81208 84896 29568 -94249 -256150 -354571 -367542 -404019 -506646 -595732
11400 -595732 -582151 -485693 -438503 -488154 -549959 -547438 -414043 -140994 168820 388091 473652
11389 473652 477931 457161 397080 321406 331559 461287 609690 690561 718964 707309 621377
11378 621377 404054 91156 -186747 -331175 -364126 -346257 -296275 -207139 -109613 -51190 -37178
11367 -37178 -56813 -101578 -167311 -242693 -282382 -300551 -346517 -386691 -381292 -324726 -192205 -31608
11355 -31608 49929 30918 -33993 -86419 -100997 -65497 5709 66810 42152 -79455 -246572
11344 -246572 -413708 -533435 -545418 -420576 -167814 132220 350463 414635 387466 339194
11334 339194 252763 104211 -32340 -105313 -135194 -121870 -126891 -183927 -239257 -283948 -337343
11323 -337343 -351501 -292690 -198857 -110399 -13826 77255 133780 193387 277649 414054 580039
11312 580039 658032 654969 688129 733915 671599 537701 462855 524667 663602 723708 646829
11301 646829 506762 408360 341807 241132 126776 74648 110887 190764 215504 150332 50476
11290 50476 -54519 -127555 -136732 -134602 -176325 -248198 -298326 -290555 -252856 -215657 -199056 -232931
11278 -232931 -314017 -361034 -353253 -365882 -377474 -342450 -329574 -410562 -552558 -694052 -767984
11267 -767984 -711073 -579769 -461007 -318432 -108937 99824 241814 298019 261771 181778
11257 181778 113501 22196 -89039 -129803 -118761 -116892 -135964 -203175 -325382 -438083 -466119
11246 -466119 -406638 -331070 -301981 -343481 -409900 -426109 -444795 -558432 -702393 -756850 -714027
11235 -714027 -612101 -459155 -287409 -134239 -21829 36483 29702 -26385 -107697 -203432 -271863
11224 -271863 -270846 -200292 -143757 -171875 -281929 -435428 -579063 -678553 -677263 -567274 -409767
11213 -409767 -262273 -180799 -194108 -296774 -446775 -545582 -535399 -411444 -246433 -102193
11203 -102193 48930 259063 513135 731911 853887 900998 915662 968153 1127806 1354771
11193 1354771 1500482 1475381 1300832 1005600 693712 462564 285969 145417 51800 -39762
11183 -39762 -141217 -259203 -390547 -492110 -553158 -573039 -496805 -298590 -78010 82039
11173 82039 191097 284085 412534 561861 644892 665328 700252 777306 868495 924432 881223
11162 881223 795684 839661 1038666 1219267 1220269 1078721 966692 995368 1121182 1190174 1096785
11151 1096785 849642 548177 320910 223791 222437 222283 169060 77680 21864 57226 140578
11140 140578 174213 143274 111649 72977 -16721 -137156 -265996 -347729 -330473 -271221 -255724
11129 -255724 -277173 -288286 -264334 -198677 -132569 -131454 -193382 -288786 -364708 -417328 -456062 -491782
11117 -491782 -569138 -686664 -784667 -806151 -739351 -635988 -485781 -291427 -122010 31717
11107 31717 213201 400488 525487 521725 407337 270123 146348 57636 46042 73919 32817
11096 32817 -73449 -149556 -170669 -140963 -54712 53629 117998 125604 120821 78626 -73551
11085 -73551 -304210 -468007 -515957 -509058 -524474 -569767 -534760 -351220 -120091 12287 41375
11074 41375 72630 152229 242858 319952 388777 398750 312479 215707 203633 258590 302985 261295
11062 261295 127576 -26697 -126728 -137035 -117451 -151383 -224972 -259255 -248111 -243803 -289233
11051 -289233 -384913 -478278 -534470 -571301 -652670 -783627 -837816 -726510 -523431 -361710 -295182
11040 -295182 -293585 -302588 -296771 -289817 -298031 -328578 -362600 -372958 -382147 -434488 -510855 -534895 -479094
11027 -479094 -355772 -217425 -148619 -194432 -309294 -411532 -452108 -415851 -341198 -267884 -195670
11016 -195670 -134557 -138317 -223524 -355117 -528990 -732756 -877032 -902671 -850816 -794543 -763050
11005 -763050 -733653 -623179 -399510 -125314 146807 381296 523375 583364 604543 590543
10995 590543 486608 277868 97655 35379 5097 -71441 -167733 -239150 -282352 -310917 -335647
10984 -335647 -364144 -355301 -277064 -169686 -58870 65767 218090 386110 473025 447945 377732
10973 377732 285537 191730 144188 153923 187086 213136 193769 123818 64369 55464 131076 281043
10961 281043 406313 438565 399937 324228 187797 -14410 -203520 -275806 -232197 -140637 -71427
10950 -71427 -89337 -199654 -349730 -484653 -590997 -678627 -743329 -741324 -655284 -539405 -419726
10939 -419726 -322148 -315033 -392138 -507735 -618124 -690484 -726765 -739794 -697292 -546713 -328107
10928 -328107 -107120 39048 67990 -13903 -190824 -412592 -626226 -775939 -804077 -730642
10918 -730642 -587612 -428634 -316378 -226167 -52075 179585 302745 277101 170376 81142
10908 81142 79998 125723 160732 229534 298781 295733 228214 106698 10578 -18774 -15186 51059
10896 51059 163950 277078 363189 429536 522106 657591 797357 908908 976390 946897 801510
10885 801510 568744 300248 61156 -110160 -136518 20654 291075 560870 781961 946057
10875 946057 969593 846525 724814 674947 690619 781821 888237 915738 835517 722341 677173
10864 677173 737942 846122 923336 955067 1008045 1159681 1370469 1523823 1524727 1365119 1102351
10853 1102351 830149 650006 549329 480597 404821 281682 99027 -69350 -116039 -32177
10843 -32177 76376 162735 214696 181318 82687 1884 -12394 16840 14088 -68403 -169270
10832 -169270 -152275 51912 341373 551922 582501 431477 155125 -140275 -377851 -511456
10822 -511456 -524414 -487334 -440078 -352269 -230507 -129958 -50425 4761 9291 -44658 -158043
10811 -158043 -294026 -416193 -494389 -499283 -421090 -306883 -224547 -153849 -40798 112536 244524
10800 244524 278015 230054 161106 83387 24379 -30891 -149626 -312784 -451362 -493620 -391685
10789 -391685 -201312 -13882 121361 180571 137830 -28678 -268133 -515266 -747669 -915923
10779 -915923 -993966 -979915 -848666 -665356 -519622 -416591 -346451 -333633 -372559 -394030 -363873
10768 -363873 -315878 -280431 -309003 -426209 -529772 -505839 -409792 -376727 -431495 -480470 -466726
10757 -466726 -461996 -496858 -491378 -422438 -352840 -285955 -200458 -114775 -12091 100330 145066
10746 145066 59762 -107306 -226398 -261018 -293462 -387708 -544073 -714696 -843107 -938796
10736 -938796 -1009724 -1031798 -992686 -895901 -809827 -793338 -872658 -998745 -1060592 -1046513 -1036150
10725 -1036150 -1087526 -1170468 -1170684 -1033309 -812269 -557482 -334366 -209705 -121304 27363
10715 27363 216307 345459 344402 232193 70387 -100245 -278009 -472458 -598890 -529624
10705 -529624 -320623 -196278 -230038 -301811 -357515 -459651 -619555 -761780 -793044 -686799
10695 -686799 -493808 -291526 -143557 -58488 35279 134180 137510 71373 18893 -1746 -15834
10684 -15834 -16611 23530 88611 189930 375672 581963 693929 658950 535210 403238 309488
10673 309488 283825 282332 269903 254217 227573 158782 77310 50797 119551 250285 331451
10662 331451 314031 287738 358277 524480 707737 863179 1037997 1214024 1252755 1134521
10652 1134521 953663 809706 714479 612388 508081 464434 519304 639603 790762 915040
10642 915040 882770 684227 462908 293136 184232 144794 174142 236541 293862 347807 421325
10631 421325 509105 577519 621901 573378 406112 202407 21194 -100989 -100551 104635 520241
10620 520241 1040398 1511572 1782151 1803979 1646682 1367412 1037218 776789 650908 603684
10610 603684 580760 520944 361645 135380 -88404 -286673 -467709 -577396 -523072 -334468
10600 -334468 -142105 -41828 -22919 -19701 -19069 -42985 -58714 -50573 -101151 -224495 -348532
10589 -348532 -438247 -463072 -443422 -444969 -435541 -376413 -267013 -95118 46085 35523 -100120
10578 -100120 -241414 -324167 -337887 -303673 -222057 -80265 107785 301997 394337 317866 148365
10567 148365 4645 -34015 915 59933 140870 180074 146938 120211 160381 216681 238935
10556 238935 258060 293249 336346 386528 425288 459340 487297 467374 395767 317349 307064
10545 307064 429700 578923 535119 256620 -120419 -458374 -663741 -718300 -705060 -690089
10535 -690089 -684682 -681701 -668819 -620032 -537467 -507013 -598880 -765847 -946721 -1093576 -1148560
10524 -1148560 -1093960 -980569 -919177 -970537 -1064727 -1104057 -1076620 -1017303 -924469 -776346 -622986
10513 -622986 -525138 -430409 -271299 -62366 125901 212848 210821 197115 186636 152457 57508
10502 57508 -65333 -71955 63443 178709 201630 198420 189368 130531 4566 -167008 -352642
10491 -352642 -544305 -710836 -812658 -864050 -826958 -670140 -436306 -187418 -9836 93397
10481 93397 206492 307172 355833 367617 317404 227501 181142 164722 156353 205644 279743
10470 279743 307755 280261 234481 242039 295080 301176 233454 109350 -48349 -165999 -190660
10459 -190660 -182435 -188036 -168885 -140021 -174146 -272604 -366581 -376144 -266025 -117513 -62587 -141294
10447 -141294 -308701 -523842 -727155 -833063 -837610 -802462 -808952 -866718 -931549 -961183 -951428
10436 -951428 -901226 -814911 -731363 -666746 -607646 -584873 -603695 -621535 -591201 -505894 -435114
10425 -435114 -451229 -526360 -584797 -588608 -566323 -598664 -672096 -721908 -751796 -748505 -702319 -639602
10413 -639602 -604678 -644383 -724881 -740615 -642739 -494851 -377874 -326863 -340751 -373826 -353352
10402 -353352 -282882 -248577 -288650 -344352 -394285 -490736 -628642 -693871 -647559 -544954 -455984
10391 -455984 -424470 -500230 -653761 -796286 -899989 -967422 -965697 -855267 -689354 -529338
10381 -529338 -374776 -244395 -155946 -124289 -111494 -40347 114813 290342 397855 389466 293289
10370 293289 141253 -80685 -326730 -503633 -567167 -523553 -436702 -360568 -268356 -161817
10360 -161817 -95454 -94738 -95337 -58850 1100 116401 278497 380016 357859 269750 133938
10349 133938 -78731 -327667 -500943 -540411 -481689 -382809 -254630 -100304 35831 101364
10339 101364 100196 72587 74600 150758 301105 434619 474687 455170 422300 419022 473191 539315
10327 539315 518950 367101 143591 -75990 -253197 -316260 -254611 -153334 -32898 118106
10317 118106 293094 489491 671201 763344 701510 537341 407113 375000 401728 454866
10307 454866 493719 497359 501354 464341 327174 132857 -32088 -93915 -56979 -15130 -20212
10296 -20212 -44728 -88694 -154875 -205870 -196500 -115065 50677 269414 424629 437405 351513
10285 351513 223032 68331 -64450 -118824 -70694 53037 164108 223988 284982 386156
10275 386156 503128 609065 685271 695408 602295 419920 235867 75748 -86623 -260528
10265 -260528 -412263 -491289 -475698 -387273 -277743 -239970 -331719 -523809 -730957 -880933
10255 -880933 -928760 -854427 -671156 -444764 -218548 -10752 158432 309492 439459 513902
10245 513902 518795 491197 473040 529136 691040 770837 638929 411454 216717 99297 71760
10234 71760 144585 297866 456245 515805 482474 419672 384280 430535 538694 627037 635820
10223 635820 559928 432369 279069 119820 -19473 -153711 -308017 -468692 -630119 -787469
10213 -787469 -912658 -1009553 -1115073 -1262364 -1410659 -1434271 -1334691 -1202557 -1057134 -880322
10203 -880322 -701783 -541165 -381817 -219207 -75383 22770 35373 -64632 -221095 -358995
10193 -358995 -467025 -544098 -566407 -562346 -555034 -508385 -426871 -336156 -201881 -16892 158521
10182 158521 244220 199207 98559 52728 61029 55584 -4386 -119427 -239483 -278373 -209383
10171 -209383 -84917 70542 251551 438224 565504 567111 490984 458313 529824 623720 651471
10160 651471 583950 403430 157455 -46954 -183328 -299776 -377205 -372330 -281676 -161189
10150 -161189 -65648 -18908 -60276 -165413 -235889 -248709 -231645 -240552 -325904 -412579 -391444
10139 -391444 -284051 -158074 -21370 112542 194547 247175 301704 318046 298627 256758 156271
10128 156271 42012 28217 86288 60851 -115558 -357436 -528910 -590576 -550646 -436904
10118 -436904 -328163 -297550 -354155 -435165 -467012 -428201 -339675 -189899 -32042 47335 46641
10107 46641 31427 47661 113172 171755 167804 149565 161755 220925 268536 235087 133335 -11168
10095 -11168 -183575 -359444 -503840 -532080 -422554 -263474 -117515 28940 167878 252338
10085 252338 262483 221162 168107 110986 44374 -15188 -52923 -88506 -121726 -188507 -305756
10074 -305756 -385586 -367203 -260026 -99569 41267 71192 12144 -60521 -114266 -153955 -234286
10063 -234286 -329663 -320937 -185143 -19389 86116 119800 130020 179708 267972 322085 361907
10052 361907 442079 477894 425747 397194 474483 616587 757972 893399 1021850 1091507 1077493
10041 1077493 995228 917020 931017 1014239 1076577 1104629 1140423 1212290 1318474 1423952 1530128
10030 1530128 1619906 1700890 1804922 1899727 1861386 1612216 1240834 889689 654521 538126
10020 538126 478035 456590 503377 614984 701202 650372 499507 396723 352947 277693 157292
10009 157292 74375 77297 96838 95522 102067 132217 177188 214175 278245 436428 675260 947684
9997 947684 1230275 1502552 1776424 2071101 2302832 2349442 2212389 2020804 1873806 1778135
9987 1778135 1682084 1639408 1736171 1889677 1967312 1924692 1808143 1659238 1486261 1358237
9977 1358237 1341299 1398668 1457846 1438389 1285126 997972 639185 322500 141223 86608
9967 86608 97271 151132 239452 339164 416505 458752 460723 413232 367585 370246 418923 506337
9955 506337 586172 628838 645919 626592 607778 594187 507391 358572 217811 81836 -103843
9944 -103843 -319168 -544692 -765088 -886017 -818398 -617372 -437536 -314179 -181283 -38743
9934 -38743 -4717 -107673 -245941 -369256 -439655 -409531 -312768 -206750 -107106 -33940 -31609
9923 -31609 -72804 -84612 -50079 30266 110749 141245 158045 161801 102361 8957 -84199 -222755
9911 -222755 -438251 -686360 -886045 -992335 -1022742 -955619 -723572 -341699 83822 391440
9901 391440 472402 357893 205517 135485 124289 128855 154017 194909 220162 228601 251919 325651
9889 325651 437655 562787 672523 730922 768295 802356 830222 842121 789157 612767 333598
9878 333598 49494 -178583 -332925 -419652 -431608 -363306 -229743 -57123 103095 210621
9868 210621 276629 329043 354553 359846 403125 473035 503201 513697 539593 590702 653110 705181
9856 705181 733993 698207 593126 515810 510997 514505 517765 536008 526245 486443 398324 227666
9844 227666 63977 -6891 23492 190725 466881 730147 855000 854352 830249 774401 643559
9833 643559 494884 442699 531502 741379 1036530 1338919 1551926 1584588 1430033 1175102
9823 1175102 847626 489593 218189 94209 82122 197587 450909 740461 972263 1085583
9813 1085583 1123653 1163549 1153939 1028227 817223 607871 433627 287886 161592 57829
9803 57829 11907 78733 258102 452302 545424 500398 390465 296522 252618 261426 328153
9792 328153 467966 676143 844218 869848 799483 708968 643654 636727 724732 889463 1062062
9781 1062062 1205374 1271976 1185844 965601 695290 477415 358039 244952 97764 10046
9771 10046 44759 127546 118765 -31609 -268729 -440770 -418572 -225898 1862 117707 84724
9760 84724 14916 -29894 -62466 -26009 96345 209985 313468 453145 611365 749951 821275
9749 821275 840361 811871 731734 602959 443710 321583 249257 202469 143225 37907 -75911
9738 -75911 -137343 -169787 -247762 -371140 -496258 -587699 -621161 -559859 -437515 -381872 -438931
9727 -438931 -539700 -609979 -595065 -482784 -285677 -43963 155814 229378 191439 171676 225939
9716 225939 261562 190013 119801 199152 377546 516397 574947 586592 574253 558560 553900
9705 553900 508759 438085 451950 534060 583332 585271 617993 713288 751336 661010 470222 203727
9693 203727 -38634 -181288 -202729 -72739 165071 401158 529671 496806 343419 178781
9683 178781 79666 58120 106242 185305 209055 129396 30584 64865 221598 330465 363458
9672 363458 439223 609867 828772 1060532 1245561 1329154 1330891 1232309 1012035 718976 426912
9661 426912 205156 78057 33856 16262 -41336 -139561 -184173 -137458 -64894 -26960 -9127
9650 -9127 41493 122623 199561 232866 194790 73862 -105207 -254548 -261943 -86988 172039
9639 172039 422795 623422 727527 745262 726709 713387 700077 656521 544366 391474 266663
9628 266663 157711 50674 1362 41530 108109 121438 83372 62572 94869 140922 190080
9617 190080 266807 359802 420213 455406 502921 549713 526868 437644 381973 380690 365561 283881
9605 283881 157281 52484 1018 -2480 6704 -19710 -76976 -160130 -247405 -285549 -287899 -319072
9593 -319072 -423159 -552309 -580576 -490266 -357235 -199028 -14926 162277 308320 393463
9583 393463 428000 484173 583053 723033 931893 1102850 1094571 941887 768898 611641 472908
9572 472908 366165 252153 106398 -46510 -142281 -191793 -239411 -228673 -120721 10290
9562 10290 121012 212208 276411 288939 202604 21048 -208418 -389102 -411038 -260584 -23771
9551 -23771 210052 344497 344965 276909 238390 303804 412573 426348 316498 147423 -15470
9540 -15470 -182562 -361031 -496122 -575691 -596162 -560581 -477619 -387119 -318363 -203003 -38685
9529 -38685 36732 -22343 -134822 -227423 -223768 -96297 36076 59535 40906 69513 136802
9518 136802 214232 306048 398440 403083 248464 -11204 -157061 -74334 97461 192357 226142
9507 226142 305407 432954 540667 585006 530004 439601 429237 504422 609726 745802 897351
9496 897351 995780 973641 821752 603694 394067 230491 187615 294265 497863 682232
9486 682232 714088 593501 434896 319571 280102 328788 395461 387050 302891 206054 138080
9475 138080 162382 317745 560126 764090 831214 771122 680023 630897 620399 648449 757023
9464 757023 950632 1142290 1252859 1295949 1339237 1388215 1395170 1372222 1351058 1343555 1314076
9453 1314076 1212791 1011566 765547 608915 567129 560097 539437 493943 417906 272631 56459
9442 56459 -153744 -357766 -592140 -798777 -908554 -918691 -862322 -776354 -721237 -697911 -663484
9431 -663484 -600329 -529737 -433900 -258966 -33008 190080 361965 428558 408514 362002 334980
9420 334980 309113 261240 195152 142838 106340 38948 -76394 -220383 -332526 -357088 -276659
9409 -276659 -148928 -31286 53584 71979 26815 -30323 -39988 -48357 -101322 -134432 -120005 -83091
9397 -83091 -46924 30295 149963 244112 287486 320981 376752 409648 325777 166099 78460
9386 78460 58047 24932 -57259 -186618 -318106 -441916 -531187 -516997 -444484 -441375 -523461
9375 -523461 -610025 -622811 -576822 -536742 -514367 -493397 -482417 -448969 -351080 -208319 -68530
9364 -68530 10714 12654 -47289 -119672 -116551 6664 224287 473282 673655 749795 708744
9353 708744 631968 556215 488751 416684 315834 176067 14293 -131925 -178844 -94454 55040
9342 55040 156620 107951 -74404 -253520 -353185 -341725 -205035 29901 294917 492251
9332 492251 534520 459353 388727 363839 372523 415919 525664 759221 1099777 1417951 1581279
9321 1581279 1583066 1521698 1466655 1415323 1347978 1225902 1015247 781550 608716 501834 453981
9310 453981 514777 608706 611188 558036 550805 595958 631515 588502 455812 315564 249177 265893
9298 265893 317277 351682 352349 341425 322042 318875 373167 441731 485437 547805 635861 673447
9286 673447 650740 666276 750484 808943 786712 705614 608273 513557 439543 414006 427122 427563
9274 427563 379091 297826 260741 312066 405662 533103 702928 828201 837693 779519 724461
9263 724461 667812 610306 598084 633134 661577 689236 750649 852606 997901 1198121 1467311
9252 1467311 1733479 1880849 1912425 1906037 1888833 1842088 1775877 1751015 1790545 1850321 1898335
9241 1898335 1890410 1793112 1661738 1623206 1705118 1834346 1960166 2020739 1977976 1907420 1873945
9230 1873945 1809638 1701916 1622751 1597487 1601478 1573389 1488976 1389385 1283651 1201780 1202478 1272125
9218 1272125 1292399 1232767 1183633 1197525 1216832 1185248 1084515 912716 689372 449069 242882
9207 242882 108214 86922 142642 168971 115344 4153 -62841 2574 179264 357820 450730
9196 450730 450607 423766 465664 589188 709118 771956 819744 845943 802485 734900 713637 728578
9184 728578 728258 736159 831116 968262 999246 841226 530362 206067 6571 -68908 -71127
9173 -71127 42515 282097 553779 805122 1019530 1189741 1275056 1264645 1186444 1067282
9163 1067282 904086 734537 586062 420495 234701 43797 -45481 45443 198567 264553
9153 264553 236462 163720 72761 -185 -35256 -53419 -79333 -83279 -71999 -42841 43224 123407
9141 123407 77872 -70255 -157313 -124063 -68624 -67709 -89175 -52565 79739 270107 417465
9130 417465 447706 418826 401036 419056 487565 634165 810702 900190 817015 518647 60063
9119 60063 -352233 -523712 -476691 -357871 -245853 -90451 117616 289961 331085 255116
9109 255116 154088 87556 74832 102642 150696 213870 253889 279865 318267 317508 278022 273286
9097 273286 292635 282688 282845 320752 356689 376360 427616 501350 535719 479889 345713 206017
9085 206017 98592 89306 180760 254617 240012 166690 96006 40897 -20073 -114332 -188037 -129166
9073 -129166 96983 375494 559777 609923 563192 494691 468959 468479 430600 338452 289137
9062 289137 364371 480004 551932 660557 815434 918676 953157 863645 661383 502278
9052 502278 419681 368258 364165 396879 395559 349533 320163 343121 383776 382794 339588 336888 420516
9039 420516 535249 588729 488481 263962 58803 -81952 -232510 -391936 -416505 -252864
9029 -252864 -10148 181352 236965 205467 208059 274092 377315 508621 648704 761203 799399
9018 799399 737382 619425 495789 339179 131590 -44591 -134482 -171641 -181547 -143196 -17074
9007 -17074 169927 276644 238401 151905 155182 322447 531699 589429 457268 243786 68910
8996 68910 13466 80692 204665 287688 292501 216079 85633 -3668 -20764 -6474 24995 55066
8984 55066 18037 -44797 2890 167008 345594 484838 567136 632812 713481 788557 829220
8973 829220 833928 814345 774882 741741 710687 663842 623402 638500 706935 792611 888576 1028728
8961 1028728 1166954 1207221 1183018 1155854 1130832 1157234 1268455 1384816 1465736 1551149 1631373
8950 1631373 1683801 1691368 1617223 1442100 1168649 883511 721412 686393 656939 577056 473038
8939 473038 394093 361031 352355 366070 439379 593403 785540 971369 1150490 1278784 1290735
8928 1290735 1207629 1039199 781777 510559 287357 113570 -23681 -168560 -339984 -459759
8918 -459759 -437019 -287073 -91455 77912 194283 244809 235766 206191 184664 154716 136555
8907 136555 175376 255143 333680 390158 447970 541072 657825 738199 746962 709999 635724 547843
8895 547843 552954 693342 845085 838197 684675 552252 548717 594861 572942 464113 288799
8884 288799 103151 4270 26148 138873 344540 580420 760240 875610 945931 944053 867098
8873 867098 742295 549673 397111 439793 635395 817739 916684 977524 986369 882088 708244
8862 708244 551404 428166 338525 283280 252533 254380 306668 399975 537803 698859 858866
8851 858866 1011317 1114178 1154637 1126915 1034043 877160 649256 387450 158479 -17021
8841 -17021 -133114 -180241 -219215 -262507 -233489 -113434 53139 198382 262484 272051 279879
8830 279879 287527 283181 286842 333201 420768 531324 646446 706325 685728 627052 577772 572434
8818 572434 597756 614203 655202 798161 992476 1176995 1354508 1506411 1620263 1687052
8808 1687052 1713330 1734640 1767699 1751461 1593015 1315164 1074943 991179 1016473 1035252 1013779
8797 1013779 1048887 1183765 1282601 1249246 1149702 1068440 978317 834939 682064 597766 578269
8786 578269 593265 665327 823235 1058336 1333756 1549801 1593461 1478943 1334109 1259797
8776 1259797 1224690 1165858 1136743 1191552 1259383 1279988 1258721 1222249 1184090 1194254 1297133
8765 1297133 1471716 1674525 1889437 2098724 2286501 2506524 2770388 2993082 3098039 3102109
8755 3102109 3022929 2877237 2715024 2597060 2587033 2684242 2798026 2840705 2778592 2653830
8745 2653830 2510638 2382607 2367173 2469262 2579673 2649221 2672092 2655216 2648902 2701068 2805235
8734 2805235 2950037 3158946 3430694 3741636 4087346 4457150 4844603 5255835 5683293 6127236
8724 6127236 6596314 7051241 7417834 7688795 7894168 8068234 8208592 8280405 8262044 8221173
8714 8221173 8221189 8237432 8256534 8265417 8224225 8068403 7806412 7582964 7536263 7630127 7764095
8703 7764095 7888213 7893537 7629562 7149564 6717833 6463581 6335461 6327781 6412897 6532119
8693 6532119 6733063 7051013 7377467 7548847 7534315 7440753 7308809 7112134 6873158 6582021
8683 6582021 6185877 5703941 5201797 4793831 4579331 4527514 4473411 4332482 4189078 4075343
8673 4075343 3962144 3864021 3829475 3843114 3799882 3620666 3349330 3087969 2879238 2740904
8663 2740904 2707818 2809051 2969056 3004805 2879555 2713216 2528578 2341735 2237261 2221200
8653 2221200 2260412 2326247 2350885 2334312 2319775 2307336 2284689 2232679 2115805 1950784 1781273
8642 1781273 1641859 1548515 1516378 1548822 1582747 1592342 1600065 1625283 1658247 1711858 1774147 1821234
8630 1821234 1867699 1900403 1899065 1849515 1715558 1478522 1218849 1031575 915306 812855
8620 812855 750579 760252 783012 834661 990800 1237254 1461135 1617439 1741405 1857169 1966380
8609 1966380 2049284 2083437 2055347 2019029 2003872 1957466 1873715 1721476 1436887 1076350 757232
8598 757232 551015 462195 442790 472295 563552 721873 893563 961492 928810 908338 960850
8587 960850 1105365 1282728 1388958 1356704 1188894 937868 674149 468025 332767 280305
8577 280305 316800 420011 533745 588383 564444 483770 408303 427930 545583 686888 810594
8566 810594 901862 975189 1084348 1277103 1491592 1678172 1910763 2224654 2523233 2674298
8556 2674298 2620627 2408382 2101958 1771709 1510070 1365312 1301305 1281869 1271239 1270698 1302960
8545 1302960 1348388 1380657 1388521 1408224 1490418 1627926 1713728 1648264 1440090 1214557 1071891
8534 1071891 1043562 1143023 1342407 1595174 1894324 2240482 2655741 3200996 3910655 4732421
8524 4732421 5575067 6274156 6541846 6247327 5590024 4892160 4335375 3963107 3777083 3716102
8514 3716102 3675098 3605946 3510025 3383002 3259406 3156456 3016801 2869953 2801073 2840939
8504 2840939 2995376 3275663 3662514 4042007 4234110 4168124 3939232 3657178 3406989 3270236
8494 3270236 3265310 3291835 3248620 3144558 3064408 3030762 2988842 2965043 2988420 2988842 2943704 2904035
8482 2904035 2845344 2772027 2746634 2756147 2738774 2729937 2790984 2901530 3018405 3114216 3166009
8471 3166009 3182599 3192619 3240190 3364492 3571941 3842140 4079350 4189843 4204203 4282568
8461 4282568 4499759 4740626 4903673 4981286 5029976 5075931 5090383 5061243 4978351 4818790 4594118
8450 4594118 4351700 4166617 4118971 4165936 4114837 3845138 3483548 3241548 3156197 3112713
8440 3112713 3049502 2984743 2974610 3012354 3016084 2940958 2831368 2780586 2788022 2830002 2895614 2918260
8428 2918260 2839887 2683830 2509089 2384647 2359400 2424960 2544765 2599641 2479438 2214779
8418 2214779 1896544 1627688 1476791 1448303 1497326 1519780 1452028 1360655 1344304 1415702 1517732
8407 1517732 1585472 1562056 1432566 1299652 1289579 1422479 1581259 1700130 1866371 2110976
8397 2110976 2290579 2267552 2054030 1740496 1428821 1240668 1193066 1217816 1298321 1437998
8387 1437998 1617539 1795003 1912639 1988342 2048483 2117389 2211440 2291803 2335857 2383359 2461004
8376 2461004 2470462 2351305 2201843 2133320 2164641 2270220 2438602 2625022 2734692 2713163
8366 2713163 2578790 2377277 2146646 1872634 1538560 1209683 1021987 1017769 1147264 1343552
8356 1343552 1542601 1630213 1516624 1301233 1150160 1158656 1258906 1329349 1358008 1375680 1400403
8345 1400403 1429358 1475046 1551159 1608681 1575868 1491477 1430551 1388952 1347453 1285045 1205064
8334 1205064 1166167 1215877 1337796 1469052 1632097 1859593 2071225 2196089 2215878 2155272
8324 2155272 2058636 1960540 1888560 1837812 1784962 1690121 1559696 1461116 1453403 1559705 1740171
8313 1740171 1915308 2065129 2198582 2316947 2424244 2508072 2523650 2453298 2304533 2130881
8303 2130881 1992276 1875231 1715441 1478571 1271648 1209491 1312219 1542153 1846001 2169730
8293 2169730 2452754 2645518 2759650 2835099 2940971 3170451 3570061 4111258 4767338 5473285
8283 5473285 6079845 6413520 6342842 5889539 5216429 4536279 4034857 3787589 3703156 3589260
8273 3589260 3392642 3154291 2906827 2724436 2634666 2622414 2717152 2870250 2974011 3030088
8263 3030088 3055234 3040972 3006286 2959651 2933006 2974277 3012954 2968423 2844029 2683112 2572876
8252 2572876 2517300 2438641 2348814 2273031 2157921 2030058 1955647 1915817 1844900 1734224 1682995
8241 1682995 1754604 1829646 1769188 1603316 1430142 1285991 1183094 1155671 1244440 1440057
8231 1440057 1675579 1899496 2123441 2420744 2837337 3269571 3585416 3754501 3808400 3806047
8221 3806047 3819349 3878956 3954868 4035374 4147037 4264771 4306478 4273614 4245684 4191084 4035981
8210 4035981 3753658 3406507 3090863 2873713 2779536 2706598 2587340 2456984 2363785 2303448
8200 2303448 2222483 2145264 2124051 2160715 2210765 2236683 2259997 2309406 2357325 2373681 2399327
8189 2399327 2527255 2782296 3144465 3565775 3928687 4147818 4248940 4295823 4272407 4121447
8179 4121447 3824824 3461574 3140533 2864024 2617135 2430708 2333586 2353201 2499653 2735202
8169 2735202 2998049 3243065 3466200 3665735 3768774 3711313 3536682 3370357 3287174 3287746
8159 3287746 3406153 3686566 4070976 4459224 4763133 4960247 5108220 5205908 5177537 5028964
8149 5028964 4860112 4714498 4527525 4269751 4023114 3895308 3929365 4046750 4125825 4139456
8139 4139456 4128929 4151550 4247023 4366170 4425865 4423654 4447356 4534120 4649847 4727802 4726016
8128 4726016 4692198 4639274 4541866 4446796 4436203 4537493 4683232 4789343 4837417 4834118 4789302
8117 4789302 4709884 4641293 4634006 4676675 4720673 4707397 4638180 4634717 4794812 5062699 5344358
8106 5344358 5582450 5809922 6132322 6593856 7139989 7587746 7708326 7409938 6844051 6225567
8096 6225567 5676126 5260032 4992002 4834773 4757364 4778475 4893752 4988203 4982894 4932767 4956209
8085 4956209 5076052 5153127 5044858 4737467 4378261 4150989 4051428 3979990 3914757 3862359
8075 3862359 3862548 3919302 3964233 3938362 3857981 3782165 3774436 3854982 3984216 4124752 4242973
8064 4242973 4311661 4339526 4339390 4286725 4117484 3788387 3395498 3119534 2997983 2971038 2991419
8053 2991419 3038863 3092538 3120299 3113280 3033632 2853805 2612544 2385647 2317882 2433619 2569652
8042 2569652 2608030 2586442 2573330 2614112 2706548 2803357 2891167 2938618 2934905 2906546 2843424 2803878
8030 2803878 2888602 3042539 3172355 3225288 3176022 3065325 3007477 3093194 3295113 3491501
8020 3491501 3564637 3522229 3448301 3386853 3348701 3324871 3278871 3190181 3059400 2922315 2883038
8009 2883038 3005654 3232590 3452990 3620787 3757498 3883242 4017894 4168156 4292920 4334026
7999 4334026 4301016 4235629 4139663 4013185 3879939 3736268 3596193 3500375 3446703 3424712 3440797
7988 3440797 3521136 3697318 3964470 4268180 4543247 4744460 4784219 4610990 4332544 4122827
7978 4122827 4037142 4031718 4088570 4195927 4288835 4264394 4134422 4005328 3892645 3814588 3842878
7967 3842878 3959178 4059775 4047492 3922276 3757568 3650847 3658378 3718725 3816345 3989651
7957 3989651 4171899 4299464 4381074 4409363 4399637 4398905 4408420 4345619 4172807 3976691 3867742
7946 3867742 3886553 4039747 4325029 4662912 4982609 5315768 5681849 6022026 6300039 6472377
7936 6472377 6436726 6102808 5545192 4981046 4501095 4066359 3698030 3453985 3306373 3173123
7926 3173123 3035642 2885419 2693413 2504463 2431845 2547288 2829099 3158147 3382726 3483658
7916 3483658 3568641 3705121 3903976 4204353 4655580 5144722 5474158 5634882 5718153 5709901
7906 5709901 5544062 5257397 4960037 4685751 4428486 4232208 4162606 4249426 4461000 4722889
7896 4722889 4926639 5020561 5017372 4941069 4833679 4721423 4566429 4334191 4048381 3726214
7886 3726214 3408877 3151086 2967639 2813301 2638566 2444834 2270410 2103011 1921553 1783833
7876 1783833 1717826 1680779 1697854 1770309 1875545 2040265 2239308 2412820 2558424 2714262
7866 2714262 2893623 3039850 3092595 3119468 3213790 3367251 3562681 3790647 3936376 3908710
7856 3908710 3768508 3635665 3547876 3469992 3436787 3505213 3636500 3769093 3881490 3956568
7846 3956568 3978433 3966389 3954322 3934889 3922865 3930872 3900747 3765205 3526172 3273430 3069617
7835 3069617 2925156 2818300 2706416 2619043 2628373 2760463 2954761 3139394 3301765 3446071
7825 3446071 3577820 3691760 3767062 3845361 3981246 4139924 4297687 4494721 4665982 4674585
7815 4674585 4502016 4232548 4003123 3858186 3720701 3557503 3412886 3344545 3349163 3344900
7805 3344900 3258635 3122471 2973566 2829981 2781932 2847145 2971761 3083461 3114066 3034433
7795 3034433 2869656 2695219 2578070 2560449 2662610 2848957 3015104 3148787 3321939 3540942
7785 3540942 3830592 4225115 4639677 4952635 5127457 5165289 5086280 5008600 5031559 5103206
7775 5103206 5141058 5106118 4969223 4788354 4657052 4604172 4583357 4497395 4316850 4125489
7765 4125489 3966729 3800738 3621626 3407780 3136393 2853494 2663432 2595054 2568714 2544046
7755 2544046 2553084 2655856 2875630 3136748 3295588 3343674 3391918 3500536 3709707 4020733
7745 4020733 4379063 4729466 5034177 5298839 5570423 5837427 5997664 6016769 5945991 5829363
7735 5829363 5691192 5587508 5561192 5569919 5608726 5671795 5672996 5559587 5329112 5062100 4855873
7724 4855873 4710552 4659674 4689610 4719834 4761956 4863915 4988492 5060305 5073660 5040509 4921994
7713 4921994 4741631 4630222 4698057 4881916 5083068 5308958 5562296 5801507 6035206 6299410
7703 6299410 6587465 6832948 7025048 7257517 7584932 7976479 8345143 8643257 8907876 9172336
7693 9172336 9467552 9854913 10329103 10778781 11140202 11388171 11482314 11397409 11149577 10789317
7683 10789317 10356432 9898891 9473090 9100565 8817827 8689412 8632740 8546965 8451771 8373544
7673 8373544 8288945 8192853 8063831 7855512 7544245 7183792 6866318 6649218 6561938 6593987
7663 6593987 6696795 6817464 6889861 6857515 6707777 6523817 6393105 6359641 6458115 6695952
$$ [...]
##END NTUPLES=NMR SPECTRUM
##END=
