##TITLE=C13_Ad=0(bat2-aceton)-f14
 CDCl3, 22500 sc

 17.1.2023
##JCAMPDX= 6.0         $$ Bruker NMR JCAMP-DX V2.0
##DATA TYPE= NMR SPECTRUM
##DATA CLASS= NTUPLES
##ORIGIN= UXNMR, Bruker Analytische Messtechnik GmbH
##OWNER= root
$$ XWIN-NMR		Version 3.5
$$ Wed Jan 18 13:49:10 2023 Russian Standard Time (UT+4h)  she@DPX200
##.OBSERVE FREQUENCY= 50.327896
##.OBSERVE NUCLEUS= ^13C
##.ACQUISITION MODE= SIMULTANEOUS
##.ACQUISITION SCHEME= undefined
##.AVERAGES= 22501
##.DIGITISER RES= 17
##SPECTROMETER/DATA SYSTEM= spect
##.PULSE SEQUENCE= zgpg30
##.SOLVENT NAME= CDCl3
##.SHIFT REFERENCE= (INTERNAL, CDCl3, 0, 222.653)
##AUDIT TRAIL= $$ (NUMBER, WHEN, WHO, WHERE, WHAT)
$$ ##TITLE= Audit trail, XWIN-NMR		Version 3.5
$$ ##JCAMPDX= 5.01
$$ ##ORIGIN= Bruker BioSpin GmbH
$$ ##OWNER= she
$$ F:/spectra/data/she/nmr/c13/1/pdata/1/auditp.txt
$$ ##AUDIT TRAIL=  $$ (NUMBER, WHEN, WHO, WHERE, WHAT)
(   1,<2023-01-18 13:47:32.76 +0400>,<she>,<DPX200>,
      <created by zg, POWCHK disabled, PULCHK disabled
       terminated by command 'halt'
       configuration hash MD5:
       00 E9 B6 7A A2 85 ED C7 34 08 36 98 17 FE 4E 26
       data hash MD5: 32K
       EE D4 A8 5B 67 71 54 2C B5 8C 00 2A 35 22 F8 BD>)
(   2,<2023-01-18 13:47:35.17 +0400>,<she>,<DPX200>,
      <Start of raw data processing
       efp BC_mod = 2 LB = 2 FT_mod = 6 PKNL = 1 PHC0 = -306.1249 PHC1 = 22.24132 SI = 32K 
       data hash MD5: 32K
       67 5D 04 B0 9C 65 26 E5 B1 4B 0D 71 7D 21 87 0B>)
(   3,<2023-01-18 13:47:39.79 +0400>,<she>,<DPX200>,
      <abs ABSG = 5 
       data hash MD5: 32K
       65 18 A2 3C 67 D4 82 65 1B B2 71 A5 B1 C4 C3 26>)
(   4,<2023-01-18 13:48:20.23 +0400>,<she>,<DPX200>,
      <pk PHC0 = 2.358571 PHC1 = -3.599966 
       data hash MD5: 32K
       7E 9F 36 EB C0 BF E6 1F B7 B9 BD 74 C4 45 62 AC>)
(   5,<2023-01-18 13:48:22.92 +0400>,<she>,<DPX200>,
      <abs ABSG = 5 
       data hash MD5: 32K
       7C 55 00 78 4E 53 A5 98 72 87 AD F0 6B 82 0A DB>)
$$ ##END=
$$ 
$$ hash MD5
$$ 49 7D 48 F1 25 20 E1 81 DC FF D6 FB EF 3B 68 B1
##$RELAX= 
##$RELAX= 
##$RELAX= 
##$RELAX= 
##$RELAX= 
##$RELAX= 
##$RELAX= 
##$RELAX= 
$$ Bruker specific parameters
$$ --------------------------
##$DU= <F:/spectra>
##$EXPNO= 1
##$NAME= <c13>
##$PROCNO= 1
##$TYPE= <nmr>
##$USER= <she>
##$AMP= (0..31)
100 100 100 100 100 100 100 100 100 100 100 100 100 100 100 100 100 100 
100 100 100 100 100 100 100 100 100 100 100 100 100 100 
##$AQSEQ= 0
##$AQ_mod= 1
##$AUNM= <au_zg>
##$AUTOPOS= <>
##$BF1= 50.322709
##$BF2= 200.13
##$BF3= 50.322709
##$BF4= 500.13
##$BF5= 500.13
##$BF6= 500.13
##$BF7= 500.13
##$BF8= 500.13
##$BYTORDA= 1
##$CFDGTYP= 0
##$CFRGTYP= 5
##$CHEMSTR= <none>
##$CNST= (0..31)
1 1 145 1 1 1 1 1 1 1 1 1 1 1 1 1 1 1 1 1 1 1 1 1 1 1 1 1 1 1 1 1 
##$CPDPRG= <waltz16>
##$CPDPRG1= <>
##$CPDPRG2= <waltz16>
##$CPDPRG3= <>
##$CPDPRG4= <mlev>
##$CPDPRG5= <mlev>
##$CPDPRG6= <mlev>
##$CPDPRG7= <mlev>
##$CPDPRG8= <mlev>
##$CPDPRGB= <>
##$CPDPRGT= <>
##$D= (0..31)
$$ [...]
##$SUBNAM4= <"">
##$SUBNAM5= <"">
##$SUBNAM6= <"">
##$SUBNAM7= <"">
##$SUBNAM8= <"">
##$SUBNAM9= <"">
##$SW= 239.972175391363
##$SWIBOX= (0..15)
0 1 3 0 0 0 0 0 0 0 0 0 0 0 0 0 
##$SW_h= 12077.2946859903
##$TD= 32768
##$TD0= 1
##$TE= 0
##$TE2= 300
##$TE3= 300
##$TEG= 300
##$TL= (0..7)
120 120 120 120 120 120 120 120 
##$TP= (0..7)
150 150 150 150 150 150 150 150 
##$TP07= 0
##$TPNAME0= <>
##$TPNAME1= <>
##$TPNAME2= <>
##$TPNAME3= <>
##$TPNAME4= <>
##$TPNAME5= <>
##$TPNAME6= <>
##$TPNAME7= <>
##$TPOAL= (0..7)
0.5 0.5 0.5 0.5 0.5 0.5 0.5 0.5 
##$TPOFFS= (0..7)
0 0 0 0 0 0 0 0 
##$TUNHIN= 0
##$TUNHOUT= 0
##$TUNXOUT= 0
##$USERA1= <user>
##$USERA2= <user>
##$USERA3= <user>
##$USERA4= <user>
##$USERA5= <user>
##$V9= 5
##$VALIST= <valist>
##$VCLIST= <CCCCCCCCCCCCCCC>
##$VD= 0
##$VDLIST= <DDDDDDDDDDDDDDD>
##$VPLIST= <PPPPPPPPPPPPPPP>
##$VTLIST= <TTTTTTTTTTTTTTT>
##$WBST= 1024
##$WBSW= 4
##$XGAIN= (0..3)
0 0 0 0 
##$XL= 0
##$YL= 0
##$YMAX_a= 144742230
##$YMIN_a= -34508503
##$ZGOPTNS= <>
##$ZL1= 120
##$ZL2= 120
##$ZL3= 120
##$ZL4= 120
##$ABSF1= 222.6533
##$ABSF2= -17.34351
##$ABSG= 5
##$ABSL= 3
##$ALPHA= 0
##$AQORDER= 0
##$ASSFAC= 0
##$ASSFACI= 0
##$ASSFACX= 0
##$ASSWID= 0
##$AUNMP= <proc_1d>
##$AZFE= 0.1
##$AZFW= 0.5
##$BCFW= 0
##$BC_mod= 2
##$BYTORDP= 0
##$COROFFS= 0
##$CY= -3
##$DATMOD= 1
##$DC= 0
##$DFILT= <>
##$DTYPP= 0
##$F1P= 0
##$F2P= 0
##$FCOR= 0.5
##$FTSIZE= 32768
##$FT_mod= 6
##$GAMMA= 0
##$GB= 0
##$INTBC= 1
##$INTSCL= 4.134877e-10
##$ISEN= 128
##$LB= 2
##$LEV0= 0
##$LPBIN= 0
##$MAXI= 10000
##$MC2= 0
##$MEAN= 0
##$ME_mod= 0
##$MI= 0.1934396
##$NCOEF= 0
##$NC_proc= 2
##$NLEV= 6
##$NOISF1= 120.0001
##$NOISF2= 80.00006
##$NSP= 0
##$NTH_PI= 0
##$NZP= 0
##$OFFSET= 222.6533
##$PC= 1.4
##$PHC0= -303.7663
##$PHC1= 18.64135
##$PH_mod= 1
##$PKNL= yes
##$PPARMOD= 0
##$PSCAL= 0
##$PSIGN= 0
##$REVERSE= no
##$SF= 50.322730123286
##$SI= 32768
##$SIGF1= 140
##$SIGF2= 120
##$SINO= 11.81781
##$SIOLD= 32768
##$SREGLST= <13C.CDCl3>
##$SSB= 0
##$STSI= 32768
##$STSR= 0
##$SW_p= 12077.2946859903
##$SYMM= 0
##$S_DEV= 0
##$TDeff= 32768
##$TDoff= 0
##$TI= <>
##$TILT= no
##$TM1= 0
##$TM2= 0
##$TOPLEV= 0
##$USERP1= <user>
##$USERP2= <user>
##$USERP3= <user>
##$USERP4= <user>
##$USERP5= <user>
##$WDW= 1
##$XDIM= 32768
##$YMAX_p= 384060723
##$YMIN_p= -16127118
$$ End of Bruker specific parameters
$$ ---------------------------------
##NTUPLES= NMR SPECTRUM
##VAR_NAME=  FREQUENCY,     SPECTRUM/REAL,   SPECTRUM/IMAG
##SYMBOL=    X,             R,               I
##VAR_TYPE=  INDEPENDENT,   DEPENDENT,       DEPENDENT
##VAR_FORM=  AFFN,          ASDF,            ASDF
##VAR_DIM=   32768,         32768,           32768
##UNITS=     HZ,            ARBITRARY UNITS, ARBITRARY UNITS
##FACTOR=    0.368581032318806, 1,           1
##FIRST=     11204.5221812756, 0,            0
##LAST=      -872.772504714734, 0,           0
##MIN=       -872.772504714734, -16127118,   0
##MAX=       11204.5221812756, 384060723,    0
$$ Real data points
##PAGE= N=1
##DATA TABLE= (X++(R..R)), XYDATA
$$ [...]
16078f46403O7717J72936J93476Q3099m137J000O41j6860o7096j56338k30269
16067f02234k33099j66068k3012J23398J64555J55769J49006J26598Q8285M4978
16057a71824J5046K7442M3887N2378R0947J71693K31327J98930N7693j09092k12762
16046C95665k72154k35318q7874N3089Q1615L3990J5545O5748J01249J03812R5694
16035C51061M6187k7354n4254k4113m899k2178m3299p4082j43753j93868j71746
16024c62298j20191m0274L7547Q4726R4378N4436J6302M4534J08336R2749Q295
16013A8540p5632j06606l6383P3802R0531L0684k4993o4318p7244r3066j10421
16002c75106p1457L5054J42669J67539R1847R602N872N0676R5888J16280J05007
$$ y = [-646403, -578686, -405750, -212274, -129175, -133312, -132312, -131671, -148531, -215627, -371965, -602234, -835333, -1001401, -1024413, -901015, -736460, -580691, -431685, -305087, -216802, -171824, -156778, -129336, -85449, -33071, 57876, 229569, 460896, 659826, 717519, 608427, 395665, 123511, -111807, -199681, -146592, -64977, -30987, -15442, 50306, 151555, 255367, 351061, 397248, 369894, 315640, 291527, 286628, 264450, 221151, 147069, 3316, -190552, -362298, -482489, -522763, -485216, -400490, -306112, -251676, -235374, -190840, -82504, 10245, 18540, -57092, -163698, -200081, -126279, -35748, -5064, -30057, -94375, -171619, -264685, -375106, -446563, -411509, -268840, -101301, -9454, 148, 6020, 56696, 152584, 268864, 373871]
15991C73871J13589J50457J68866J15492m7863k30148k71876j97457q9649o551
15981G8731K7937K3893j8918o5005m5679O1492J36782J09569M3025J2770k4943
15970C39654o4350q7092j49678j98884j34280k4694K2510N3182J30019J87249
15960G3636J84454J84434J59779R1634L241r6985j41815j04770r8044j21133q1665
15949E2766n1248r0439j04839p2368j5174O0653J08326J17958J30802J35133R4944
15938C66514J8465n6842j18871j82404k33940k51657k03280r1295N5501J92334
15928e05475K37120J53243O4642N4741J01084J40170J32421Q6735R7390J20183
15918F82254N1182l1628n0764m0365j5059P1118J30667J05466K1040r3669j44566
$$ y = [373871, 487460, 637917, 806783, 922275, 874412, 644264, 372388, 174931, 85282, 78731, 106668, 130561, 111643, 46638, 959, 62451, 199233, 308802, 351827, 364597, 339654, 275304, 188212, 38534, -160350, -294630, -319324, -296814, -243632, -113613, 73636, 258090, 442524, 602303, 693937, 697178, 600193, 458378, 353608, 255564, 134431, 52766, 1518, -88921, -193760, -266128, -281302, -220649, -112323, 5635, 136437, 271570, 366514, 384979, 328137, 209266, 26862, -207078, -458735, -662015, -753310, -697809, -505475, -268355, -115112, -50470, 4271, 105355, 245525, 377946, 464681, 562071, 682254, 733436, 701808, 651044, 610679, 595620, 666738, 797405, 902871, 923911, 830242, 685676]
15907F85676j19161j06930j28631j39422j27741q2765l3923j6773K1572R7657
15897D9559J25797R3340K8833M656L3332O3808N7591J1068k4662j0314k3332j03536
15885C06140j58150j18762n7226p2943j11886p4010O7077J78812J53929N4026
15875A67007n4726j19429j13459o8405k0629L7773Q3935P8876L3868j867K9012
15864E1956J38387K25139J84187O2413r577l0035o1100p9130q9943j04984r9876
15853A87437p6976q1207r5456j26749k00273k61325j82855j7501J10215J52136
15843e92554J22508J39626K06072J87645Q0057K5712K060o1776j05357r4014m3515
15832a33536L5692J25900J37185K2314j24725j73497j25373n8281L1529J18313
$$ y = [685676, 566515, 459585, 330954, 191532, 63791, -18974, -52897, -69670, -48098, 49559, 175356, 268696, 297529, 302185, 335517, 399325, 456916, 467984, 443322, 433008, 409676, 306140, 147990, 29228, -27998, -100941, -212827, -286837, -219760, -40948, 112981, 167007, 112281, -7148, -120607, -189012, -209641, -171868, -87933, -9057, 24811, 22944, 51956, 190343, 415482, 599669, 662082, 652505, 622470, 561370, 482240, 392297, 287313, 187437, 110461, 29254, -66202, -192951, -393224, -654549, -837404, -854905, -744690, -592554, -470046, -330420, -124348, 63297, 143354, 169066, 171126, 109350, 3993, -90021, -133536, -97844, 28056, 165241, 187555, 62830, -110667, -236040, -294321, -262792, -144479]
15822a44479J86852K22954J51728R826p5595q7406q6297r5957r6058k5799J13742
15811G3511J80182J15593J6010n7860j27238j55550j19454o168R5311P4908r808
15800G9437m4939P896L6581o6132j94698k46528k39299j72877q3266l9884K8171
15789i35538J26026J61704R5993q8482k55730k55840j14448O5379J87299K01384
15779h12253J32850K7396k7660K3058J04992J65311J80154J20061j2733j32903
15769b31727j36498l7838O9987J37642J64612J47954P3319L872q535j3870m3743
15758A25175j05485j89155k17004j56160n4129P6161J96046K39447K08281J61885
15748B85062Q8997k9736j13599q5083k7035l7444r8681j28457r4508j4494R5820
$$ y = [-144479, 42373, 265327, 417055, 426881, 351286, 263880, 177583, 81626, -14432, -40231, 73511, 253693, 369286, 385296, 327436, 200198, 44648, -74806, -80974, 14337, 89245, 79437, 34498, 42394, 78975, 12843, -181855, -428383, -667682, -840559, -923825, -963709, -935538, -809512, -647808, -551815, -640297, -896027, -1151867, -1266315, -1200936, -1013637, -812253, -679403, -652007, -679667, -656609, -551617, -386306, -206152, -86091, -98824, -231727, -368225, -406063, -336076, -198434, -33822, 114132, 187451, 191323, 182788, 168918, 125175, 19690, -169465, -386469, -542629, -596758, -520597, -324551, -85104, 123177, 285062, 374059, 344323, 230724, 145641, 118606, 81162, -17519, -145976, -240484, -254978, -159158]
15737a59158J70282J08373o1351k05055k57244k20490j39734o8871k065Q4171
15727g51142J51259J45657J13593J20376J58869J52983L7370r5621j06423k5676
15717i8755P2009J53296J86013J95882J94065Q4230q7759j62360j04498o7345
15707C64778q0683p4815r6727j09475n9388j2258l6369l4914N8599J10730J7774
15696D7252j15786j65562j43381j35277j45696j02151k6139M7202J28243J98973
15686d12322J66487L1386j419J31789K53257K61062J39220n4894j78773j76901
15676A58892p5741L4559N7019J8072J824L8113P5958M2777m2943j42907k59857
15665i4234k97052j97468l4167Q4281J35876J50619J79972K21482J69767k5748
$$ y = [-159158, 11124, 119497, 58146, -146909, -404153, -624643, -764377, -833248, -835313, -751142, -599883, -454226, -340633, -220257, -61388, 91595, 128965, 33344, -73079, -98755, -26746, 126550, 312563, 508445, 702510, 786740, 698981, 536621, 432123, 364778, 284095, 209280, 112553, 3078, -56310, -68568, -104937, -139851, -81252, 29478, 47252, -68534, -234096, -377477, -512754, -658450, -760601, -786740, -739538, -611295, -412322, -245835, -214449, -215868, -84079, 169178, 430240, 569460, 514566, 335793, 158892, 83151, 117710, 174729, 192801, 194625, 232738, 308696, 351473, 308530, 165623, -94234, -391286, -588754, -622921, -538640, -402764, -252145, -72173, 149309, 319076, 293328]
15655B93328k49552l15098j74838k4811k4295n1175r258M8338R0408J22878R9939
15644a94136L7032K3894M9227M7390M5796R0635J32468J02316N5955O0702J01317
15633E52596J39025J42014R3955L2302j8982p7200j13189j29759j13737m9954
15623D57071k2986k6091j1981l9811j27523k18269k19015j20103l0756l5062q9318
15612d83844q9450k0597P9073J65927K11271J82653Q1476J93j9392p5653j83350
15601a51693k09276j29570o1378L973P5588Q9621M2487m1937j36879k05330j67980
15590h92374j22715j36906j20200m3900R402J28l434O6810J91925K74060K61729
15579e15475J61224J9716q7283j15958m8228P4881J47465R8649K5401k7789p2737
$$ y = [293328, 43776, -271322, -446160, -470971, -495266, -546441, -555699, -507361, -416953, -294075, -194136, -157104, -133210, -83983, -36593, 9203, 99838, 232306, 334622, 390577, 451279, 552596, 691621, 833635, 927590, 959892, 940910, 863710, 750521, 620762, 507025, 457071, 434085, 407994, 396013, 356202, 228679, 10410, -208605, -328708, -359464, -394526, -483844, -573294, -593891, -514818, -348891, -137620, 45033, 126509, 126702, 107310, 31657, -151693, -360969, -490539, -551917, -547944, -472356, -382735, -340248, -382185, -519064, -724394, -892374, -1015089, -1151995, -1272195, -1316095, -1306693, -1306565, -1309999, -1243189, -1051264, -777204, -515475, -354251, -334535, -421818, -537776, -586004, -511123, -363658, -265009, -239608, -267397, -340134]
15568c40134p3090m8361l994O6098J68333K39814J55967m2832j82102j97297j46341
15557d03939j16945j10222q7127m0464M5916J09260N0980m3714o6867n8997m1520
15546g63639K791O1014Q0274P8050R2235P9961L2620m999M327O0287R3626N4175
15534a29278k8859q3206j24486r6167N0674J74513J60191Q1987L6473M6590J08984
15523A97416J54712J41131Q8584P565m0289n1256n7195j9167K2425L4498K8940
15512E07364j4822m5862k0474R013J4901k197j9745l2830l7240n9538m1759P2550
15500C29361J61937J05331n8478j86963j86230q0901L3443R8532O0257j1911P582
15489B71960L5705j2504q2918o1844M9682J20399J10679R2016Q8424N2905N193
$$ y = [-340134, -413224, -461585, -465579, -399481, -231148, 8666, 164633, 121801, -60301, -257598, -403939, -520884, -631106, -718233, -758697, -712781, -603521, -552541, -596255, -663122, -722119, -763639, -760848, -699834, -619560, -541510, -449275, -369314, -336694, -341693, -337366, -277079, -183453, -129278, -158137, -241343, -365829, -461996, -411322, -236809, -76618, 5369, 41842, 88432, 197416, 352128, 493259, 581843, 589408, 549119, 497863, 440668, 421501, 443926, 478424, 507364, 492542, 446680, 426206, 435219, 450120, 447923, 428178, 395348, 358108, 298570, 256811, 329361, 491298, 596629, 538151, 351188, 164958, 84057, 117500, 216032, 276289, 264378, 271960, 307665, 295161, 212243, 150399, 200081, 320480, 431159, 523175, 611599, 664504, 669697]
15478F69697l5453m7381P175k2840j42070j78164j70692j49839n9186N4843P9797
15467E887J6510N394K5654j7525j11173j62656n8891J28000K06449J46059O8638
15456B52346K0984p6888k17786k70739j49549J1227O5719P0020P1131O0139O1098
15445a02298Q8267O8590m3733j31542j51983j40477j26351j44274j67973j20498
15435i72272L328J45210K41609K97359L23955K38178K2827k00013l11390k74427
15425d85636k59058l18111k74797r1987P5655J18746J40092J97138K27326K49794
15415d20838K53691J63280J4505m8602j6442k2394q7961j07539o665Q8437L5786
15404a54742m8260k0887P1424J38878J43372J11481O1769P577o0525j44139j37147
$$ y = [669697, 634244, 586863, 594038, 571198, 429128, 250964, 80272, -69567, -128753, -73910, 5887, 22397, 27791, 53445, 35920, -75253, -237909, -296800, -168800, 37649, 183708, 252346, 273330, 196442, -21344, -292083, -441632, -430405, -364686, -294666, -223535, -163396, -102298, -14031, 54559, 10826, -120716, -272699, -413176, -539527, -683801, -851774, -972272, -968944, -823734, -582125, -284766, 39189, 277367, 300194, 100181, -211209, -485636, -744694, -1062805, -1337602, -1429589, -1353934, -1235188, -1095096, -897958, -670632, -420838, -167147, -3867, 10638, -37964, -54406, -76800, -164761, -272300, -278965, -190528, -154742, -203002, -223889, -152465, -13587, 129785, 241266, 303035, 310612, 250087, 105948, -31199]
15393c1199k1444R5143J44821N5596j26114j98613r6034j2315p2359j43541r8817
15382e04876N2436K15392K40561J59944J12651O0862p968n2754k5033M1976P7831
15371C71022J14137J50929J20194J5807q0427j25275j65125k25234k68376k50392
15361c42740j68162q3300k9881M9418J48486J61916Q0322l385p352L0424J8426
15350a45828k2247J774Q3999J26827R5716K1717k8617l3095q9385k10036k51432
15339d50607j55943k9066P8529J67200J58019R4160N2470N0834Q9384J28990J13018
15328B96988O0316O4239J14723J39305J17449Q8551K3540n3105q3759r2226j30177
15317E45844r0929J5384N0584O311m9894m6339m4536r2992j47254j41285r2159
$$ y = [-31199, -52643, 42500, 187321, 242917, 116803, -81810, -177844, -190159, -262518, -406059, -504876, -452440, -237048, 3513, 163457, 276108, 336970, 329002, 276248, 251215, 293191, 371022, 485159, 636088, 756282, 772089, 691662, 566387, 401262, 176028, -92348, -342740, -510902, -594202, -624083, -574665, -426179, -264263, -183941, -187326, -194678, -164254, -145828, -168075, -166301, -82302, 44525, 140241, 161958, 133341, 100246, 10861, -199175, -450607, -606550, -635616, -557087, -389887, -231868, -137708, -85238, -34404, 54980, 183970, 296988, 357304, 421543, 536266, 675571, 793020, 881571, 905111, 852006, 768247, 676021, 545844, 454915, 470299, 520883, 527194, 477300, 430961, 386425, 293433, 146179, 4894, -87265]
15306h7265q6519j35265j14614L274J21932J69912J57805J16988P2316m828o3218
15295A50518k2211N0526Q8934Q0330L3858j3221l1976j8961M8840J54382K14438
15284G35457J58362M609j37016k10307k14660j73303j74022j28362K2425J35637
15274A8820J66321J70041J21460K2412q3232j37623j73222j99501k25902k09595
15264e30021j28945r2276r8622o9242K6870J16100J73500K07448J59155N3690
15254a82343o5057j20636j30547j62090j54143r2339k7290J2641J3454l7728q8591
15243a034669o7324J2025P7968J08526R4261O5742P5848R5978N8556j5104o8579
15232e96772o2320L164O3760R9727J72317J97055J01347m072l3028j4703k7827
$$ y = [-87265, -173784, -309049, -423663, -420389, -298457, -128545, 29260, 146248, 218564, 213736, 150518, 128307, 178833, 267767, 348097, 381955, 368734, 336758, 317797, 366637, 521019, 735457, 893819, 898428, 761412, 551105, 336445, 163142, -10880, -139242, -116817, 18820, 185141, 355182, 476642, 499054, 415822, 278199, 104977, -94524, -320426, -530021, -658966, -751242, -849864, -919106, -892236, -776136, -602636, -395188, -236033, -182343, -247400, -368036, -498583, -660673, -814816, -907155, -934445, -921804, -908350, -946078, -1034669, -1101993, -1089968, -1012000, -903474, -809213, -743471, -667623, -571645, -513089, -528193, -596772, -659092, -655928, -592168, -492441, -320124, -123069, -21722, -25794, -58822, -73525, -101352]
15221a01352n4845k027R6977R9340l9043j90433k33376j72758p3660m774J6643
15210f59308L9603J17323J76433J24347R654p0034m0502L3445O2134N3994J013
15199a51898l9004n823O9557R6851Q5908R5848M4157k8404Q530O7191j7234j87520
15187C8159k81676k11611m8704L2911L634l6503m0535k6478J5512L4356J6595
15176e04340K9079P4043R2588N2796J7622N447q737J4219O8947Q3636K2013m2751
15164i5438m7070K859J12194J97402J95575J50711J31797J13843M9867p3960k21314
15153E16466k89859k53039k01137j73278q3757K0292L3635L3279N2911K9874k1072
15142c35685j372Q1196J33823J77988K53161L35230L40304K07297k961j44488
$$ y = [-101352, -156197, -158224, -61247, 38093, -950, -191383, -424759, -597517, -671177, -675951, -659308, -619705, -502382, -325949, -201602, -191948, -261982, -302484, -269039, -206905, -152911, -151898, -190902, -196725, -127168, -30317, 55591, 151439, 195596, 167192, 175722, 242913, 225679, 38159, -243517, -455128, -503832, -470921, -467287, -503790, -544325, -570803, -555291, -520935, -504340, -475261, -401218, -308630, -255834, -238212, -232765, -241502, -227283, -158336, -74700, -52687, -95438, -142508, -139649, -27455, 169947, 365522, 516233, 648030, 761873, 811740, 737780, 516466, 226607, -26432, -227569, -400847, -484604, -464312, -430677, -397398, -344487, -314613, -335685, -337057, -255861, -122038, 55950, 309111, 644341, 984645, 1191942, 1188981, 1044493]
15132A044493j73014j87158j60093o9418K0002L0914r7436k25276k30046j19049
15122a66081L9714J51263K25881K60749J96928O5338n7749o6356J1415M7818J2094
15111G21014m8478q1335r2120j50828j72378p5908P840N3671R2581R2543Q3327
15100D29929R4262R3214J6460j34600k70653k95813k09354q7460J1618N1634N2814
15089b47949M5483M1011L9660M4266O2927M6479K63r697M786K8307L6441k1888
15077G0089q1683q8421o2250l9664m5458L371J02370J16559O8879J8281m4682
15066A7391r8596j00893k7459M9911N6326P1372J49845K43196K62175K05114J55279
15055I83661P5520l6708o8747J314P1941K7900q9748j31119j12123j73201k74704
$$ y = [1044493, 871479, 684321, 524228, 454810, 474812, 505726, 408290, 183014, -47032, -166081, -126367, 24896, 250777, 511526, 708454, 773792, 716043, 649687, 661102, 708920, 721014, 672536, 591201, 499081, 348253, 175875, 99967, 107807, 161478, 254059, 346602, 429929, 524191, 617405, 633865, 499265, 228612, -67201, -276555, -364015, -352397, -300763, -247949, -202466, -161455, -121795, -77529, -14602, 31877, 32140, 22443, 27229, 55536, 91977, 70089, -11594, -100015, -162265, -201929, -247387, -244016, -141646, -25087, 43792, 62073, 17391, -81205, -182098, -209557, -159646, -103320, -31948, 117897, 361093, 623268, 828382, 983661, 1059181, 1022473, 953726, 955040, 1026981, 1054881, 965133, 834014, 721891, 548690, 273986]
15044B73986k64627j30957O0983K12026K48065K17777J40654n33p7576p1328m9803
15033E58667q125J2628O730l541k3523m1946j9357M4933N3675l2154j10026j04987
15021C32974l8411M9818J32902J94704J97046J09071M923l1491n0341j40592k23356
15010E37247k25123k00380j71040j44202q9458L32J18945K27565J95856J13835
15000C63577J23112L7340k06767l56687l10064j68793m2339J2547J3188L156j1864
14989e43594k3571n14M9310J06151J35685J36943J10924P5692M3570k4743p3473
14978g620n0775R926Q4132J05074J2883j13644k47985l07578j95828o0474K3897
14967g47992J04140J41733J48755J64274J96487J78019R4303Q4789J34161J26489
$$ y = [273986, 9359, -121598, -60615, 151411, 399476, 617253, 757907, 757374, 679798, 608470, 558667, 550542, 563170, 569900, 566359, 542836, 500890, 481533, 526466, 580141, 547987, 437961, 332974, 294563, 344381, 477283, 671987, 869033, 978104, 983027, 951536, 901195, 760603, 537247, 312124, 111744, -59296, -203498, -292956, -292624, -173679, 53886, 249742, 363577, 486689, 524029, 317262, -39425, -349489, -518282, -560621, -548074, -534886, -531730, -543594, -567165, -567679, -518369, -412218, -276533, -139590, -28666, 47026, 90596, 65853, -7620, -58395, -48469, 35663, 140737, 153620, 39976, -208009, -515587, -711415, -771889, -747992, -643852, -502119, -353364, -189090, 7397, 185416, 279719, 364508, 498669, 625158]
14957F25158P3663J5456j226k6339r2973j24354j18575j07853p4800k7121k7663
14946A13373l2170J5484O8241J06416J37991J37545J18388J03697P8456K6055
14936H73476k6509l6472J0668M3987L1312j2595n4841p0225m0994L6804Q8400
14925H43011P5348O287r6793j80656k10492j92088j07771J5778R6949J07633Q5795
14914D43001L1814o9824j24148j14268j01729j01513r6758n1404K0263N1037O013
14903a07516p4069q8466K1429J35762J13767K7563k3201r0278j73496j60534n8100
14892d77139Q848L857k504j4918r1646j79420j80937o9171N8029J09454R8557
14881g36990P1542N1473l25m0822l4661p812J4639J8757O098l280j8833n3387
$$ y = [625158, 698821, 714277, 713051, 686712, 593739, 469385, 350810, 242957, 168157, 141036, 113373, 81203, 96687, 164928, 271344, 409335, 546880, 665268, 768965, 847421, 873476, 846967, 810495, 821163, 865150, 896462, 883867, 829026, 758801, 717807, 754611, 843011, 918359, 924646, 827853, 647197, 436705, 244617, 136846, 152624, 249573, 357206, 443001, 474815, 404991, 280843, 166575, 64846, -36667, -133425, -184829, -164566, -113529, -107516, -181585, -270051, -248622, -112860, 907, 28470, 5269, -85009, -258505, -419039, -477139, -468291, -464434, -466938, -481856, -573502, -752922, -933859, -1003030, -945001, -835547, -736990, -665448, -613975, -614300, -655122, -689783, -697595, -682956, -664199, -658101, -661381, -680214, -733601]
14869g33601j9405R3399J92073K28544J62022K5441o5698q9211j17195j99837
14859e23468k53168j78743k1007J01885J23881J06438J35499J49353R7556L2601
14849b29173j121K630Q704J7026K3665K8050N3858P6093O6229J6891n5596o9134
14837f1878k5994n6748j43689j80097j87408j69665p8029J4296K8812K3113N3565
14826g83722R9815J30431J23825J26090J15046M3266j7580p993K0396j4213j03089
14815b67728j18543j13589j26746m6434O3904J02962Q0359L5313J058N52J2865
14804c76027Q416k1886m4159k5270N4803J09755R2543M9982K8035N9086Q4008
14793A9286O6843L5957K3158J3347m6998j29787j33184n0747K7559P6030O4543
$$ y = [-733601, -753006, -659607, -467534, -238990, -76968, -51527, -117225, -206436, -323631, -523468, -776636, -955379, -976386, -874501, -750620, -644182, -508683, -359330, -261774, -229173, -230294, -227664, -218960, -201934, -178269, -150219, -96361, -20268, 45961, 62852, 7256, -61878, -87872, -144620, -288309, -468406, -655814, -825479, -903508, -889212, -860400, -837287, -783722, -683907, -553476, -429651, -303561, -188515, -145249, -162829, -170822, -150426, -164639, -267728, -386271, -499860, -626606, -673040, -609136, -506174, -425815, -390502, -389444, -388892, -376027, -367611, -389497, -433656, -458926, -404123, -294368, -201825, -151843, -123808, -64722, 19286, 86129, 122086, 145244, 158591, 111593, -18194, -151378, -202125, -174566, -98536, -33993]
14782c3993R727k1750N204P3976J56760J84941J42404R2408N5993L2077j687k5381
14770F70679l5665o3798r1614j14164j82235k44292k16455r4997L6815J54202
14760a81524K31384K19915J05521l8136q7304n3965R48L0091K648n3806j13375
14749F2397j22326r3390j18440j11148J348J55990K41101K26980J64058J28390
14739E34960J19742Q1100P587n8595p3895q0080j18392j22883r2505j06392j07685
14728a7038p1120l2155o439l212L3889Q9780R2841K7020o2155j46982j89805j82893
14716d68269r4684Q7326K14152J79855Q6027L0052k1980n6693n9884j20690j93583
14705d18371j84628q0009O7395J29272O4320p1068j78000j66505p1817k1250J4230
$$ y = [-33993, -24266, -46016, -40812, 33164, 189924, 374865, 517269, 609677, 665670, 697747, 696060, 670679, 635014, 571216, 479602, 365438, 183203, -61089, -277544, -372541, -335726, -181524, 49860, 269775, 375296, 337160, 249856, 195891, 196839, 226930, 229578, 175772, 62397, -59929, -153319, -271759, -382907, -381559, -225569, 15532, 242512, 406570, 534960, 654702, 735802, 743389, 684794, 610899, 530819, 412427, 289544, 197039, 90647, -17038, -88158, -120313, -126752, -129964, -96075, -6295, 86546, 113566, 51411, -95571, -285376, -468269, -562953, -475627, -261475, -81620, 4407, 34459, 12479, -44214, -104098, -224788, -418371, -602999, -683008, -615613, -486341, -422021, -493089, -671089, -837594, -909411, -930661, -916431]
14694i16431J05880K23310L24462L29659J53328j06967k55673k28393j25454o9887
14684e66166r9590k00149k46535j58601l4253O3875J60308K33200K43463K35326
14674c69122K21175J79278J37414J44778J06932n0894j72623j55082j09280j11675
14664a79099q9083R277J06123J65252J82266J47958Q8910L3719l1989n5255L894
14653C81973Q1359J10207Q3694O1479R7094Q3848k5252j05423j27592j33387j50409
14642C57591j13890J0877R3631Q7287L9866j6570n5700q0336p2930n0323p6501
14631A23002j47623j84956j54199q8511l8058j3424K6602L2787j7461n2901p6346
14620e91088q0893m5030o517J36J2515O8246J52299J82640J04676J3298J3283
$$ y = [-916431, -810551, -587241, -262779, 66880, 220208, 113241, -142432, -370825, -496279, -566166, -665756, -865905, -1112440, -1271041, -1305294, -1241419, -1081111, -847911, -604448, -369122, -147947, 31331, 168745, 313523, 420455, 369561, 196938, 41856, -67424, -179099, -268182, -258905, -152782, 12470, 194736, 342694, 431604, 465323, 433334, 378079, 381973, 463332, 573539, 657233, 718712, 815806, 899654, 874402, 768979, 641387, 508000, 357591, 243701, 254578, 348209, 435496, 475362, 458792, 403092, 322756, 249826, 199503, 123002, -24621, -209577, -363776, -452287, -490345, -503769, -477167, -444380, -461841, -514742, -591088, -671981, -717011, -723528, -723392, -710877, -642631, -490332, -307692, -203016, -189718, -176435]
14609a76435J01761J87342K08613J84642J36102O8546m5185j55599j83498r4158
14599B32131M0685P8922M2381M1226N6103L5881P455K0703M0127l7209j45892
14588D12513j51059o5608J2888q431q4241p6305Q638P9647R7511P0849Q814r7464
14576B07752j31959m9768O5221J41566J10910n472q9538j10389j34954r1164J3158
14565g4637L1644m6994j09074j38664j30435p2332p0126j17951j21383o3909J2313
14554i01548P0059J12216R3582j9666j52776j97926j58082n0353N7841P0024J8979
14543a057650J0368P8423J78625K48587K85578K82962J98689P6368J3050L9061
14533C54061J21409J65157J03794q482j21099k14597k61916k37737j45227J7266
$$ y = [-176435, -74674, 112668, 321281, 505923, 642025, 710571, 665386, 509787, 326289, 232131, 272816, 351738, 394119, 435345, 491448, 527329, 534784, 555487, 595614, 558405, 412513, 261454, 195846, 208734, 200303, 116062, 39757, 48395, 128042, 225553, 296402, 305216, 207752, 75793, 26025, 91246, 232812, 343722, 338250, 248712, 138323, 3369, -87795, -74637, -42993, -89987, -199061, -337725, -468160, -540492, -610618, -728569, -849952, -913861, -901548, -831489, -719273, -625691, -645357, -798133, -996059, -1154141, -1204494, -1146653, -1076629, -1057650, -1047282, -968859, -790234, -541647, -256069, 26893, 225582, 301950, 315000, 354061, 475470, 640627, 744421, 735939, 614840, 400243, 138327, -99410, -244637, -227371]
14523b27371J43802J99888K06755J65699M5786j24077k21160k20606j90643j50525
14513c72452j07580o6705k7879j0923m6729j69628k41239j43516l650P1057J32511
14502i86733J90345J59895L6089m4773o5505n3083l3300o6036j26882j28718n2713
14491a171414N3971J36269J36007P1848N6112J34882K60257L06400K08904L5069
14481B28305j13690j72934j48206j10274j13937j21318r1072j5137O4552P1178
14471e22533n927q3243j23212q6755j9233j0640k8282m2586j5539O2454J01838
14460g73658R8808J19574J28476K9705j03114j30717p3851j5314J0253M0795J24372
14449e44671J85033J75411J56723J61849J94926K20144J93803J23165N7444l4810
$$ y = [-227371, -83569, 116319, 323074, 488773, 534559, 410482, 189322, -31284, -221927, -372452, -480032, -546737, -574616, -585539, -632268, -801896, -1043135, -1186651, -1190301, -1119244, -986733, -796388, -636493, -600404, -645177, -710682, -763765, -797065, -863101, -989983, -1118701, -1171414, -1117443, -981174, -845167, -773319, -717207, -582325, -322068, -15668, 193236, 228305, 114615, -58319, -206525, -316799, -430736, -552054, -643126, -658263, -593711, -522533, -528460, -611703, -734915, -821670, -840903, -851543, -879825, -922411, -937950, -875496, -773658, -674850, -555276, -426800, -397095, -500209, -630926, -704777, -720091, -709838, -669043, -544671, -359638, -184227, -27504, 134345, 329271, 549415, 743218, 866383, 923827, 889017]
14439H89017j58148j81331j22370q8639n5410k4998m1432p4569q4460q1695q8623
14428a12658q5532p5186p9977n2788L3543R6967J01181M8624j4834n5446o8214
14417b64320l2162J2266L3410P3719J00284N4388l0461p7243m5016r352l4687
14406b19174m6826k3253k6260l9733l9492q769L3887K5615k3324r1797j59208
14395f18334j34834l6884L1504O4432J24535J92534K23409J73652P0308K4290
14385A14612M4817O1489M5150o358m6528l228K0164o4237j38814j55374j69553
14374b97860j15414P669J06020J11032P342j05543j13419k8980P2244J46298J58732
14363e1879J03364M0162k6869r2520j03388p4988o0510m6106m7366p6178j23984
$$ y = [889017, 730869, 549538, 427168, 338529, 283119, 258121, 216689, 142120, 57660, -24035, -112658, -198190, -273376, -353353, -406141, -372598, -275631, -174450, -125826, -140660, -196106, -264320, -296482, -284216, -250806, -177087, -76803, -22415, -52876, -130119, -175135, -184487, -219174, -266000, -289253, -315513, -355246, -394738, -403507, -369620, -344005, -367329, -459126, -618334, -753168, -790052, -758548, -694116, -569581, -377047, -153638, 20014, 90322, 114612, 159429, 220918, 266068, 259710, 213182, 209954, 230118, 165881, 27067, -128307, -297860, -413274, -405605, -299585, -188553, -181211, -286754, -400173, -429153, -356909, -210611, -51879, 51485, 91647, 64778, -27742, -131130, -206118, -266628, -312734, -360100, -436278, -560262]
14352e60262j09391l8315k2304k1998L626k7547o0226l1266L4393J10506J04663
14341f18121O7487O2635M7398J0744M074J0299L3130Q8202R8214O347j52260k78632
14329f20483k84229j86794l6405J19727K25107K10714J08467k5515j08235o6230
14319f63876P304K8707K7531M0839J06357K19442K35085R2666o1217j01581r7660
14308a66403j51031j66891r8200o8415j11274j61681j59412j24337j34421j33881
14298a475946q0641o563O6726J33398J70745J47659J11894N9213O29l1431j384
14287i05701O8970P8156K3989o467L643P898k4841m8452k0472L8456R7808J41481
14275e45532J32329P7586O6234J09856J24017L1662r1574j35092j32187j04438
$$ y = [-560262, -669653, -707968, -730272, -752270, -748644, -776191, -836417, -867683, -833290, -722784, -618121, -550634, -487999, -440601, -429857, -425783, -415484, -382354, -294152, -195938, -189591, -341851, -620483, -904712, -1091506, -1127911, -1008184, -783077, -572363, -463896, -489411, -597646, -663876, -656572, -627865, -600334, -559495, -453138, -233696, 1389, 94055, 32838, -68743, -166403, -317434, -484325, -582525, -650940, -762214, -923895, -1083307, -1207644, -1342065, -1475946, -1556587, -1563150, -1496424, -1363026, -1192281, -1044622, -932728, -873515, -872886, -904317, -905701, -836731, -758575, -734586, -741053, -737410, -729512, -754353, -802805, -823277, -784821, -687013, -545532, -413203, -335617, -269383, -159527, -35510, -3848, -95422, -230514, -362701, -467139]
14265d67139k3734P1805J64568K16701J44906l8123j66761j20365N350R0622Q7099
14254c5071l751k8667K2373N7606M7840M2095N7396L9174j7171o1034m2175O787
14242H5402K9678K3478k603j6445K2930O1808L6890m144j2301j3386j691n34l2211
14229A76871n1421k9200K5595M3401n0552j76021j88058r7454M2995J04487Q2646
14218a16711R1908J15850N2125o1691p4019J3375P1209M6252J1076k2971q8550
14207C7853j44874j43575j25180r2448p6485j05345j21184r2825o9969o2182p268
14196a003482R9894J55578J37954J35210J38019J13016J19862Q6923o6581k10459
14186b94066k27596j31710j4850L7003M1908N1451Q602o3117m5859j339J2734
$$ y = [-467139, -490873, -419068, -254500, -37799, 107107, 68984, -97777, -218142, -212792, -122170, -35071, -38822, -67489, -45116, 12490, 60330, 102425, 159821, 198995, 181824, 120790, 78615, 85402, 115080, 138558, 135955, 119510, 142440, 204248, 241138, 236994, 224693, 211307, 209616, 209082, 176871, 125450, 96250, 121845, 165246, 114694, -61327, -249385, -346839, -303844, -199357, -116711, -24803, 91047, 143172, 81481, 7462, 20837, 92046, 138298, 149374, 126403, 37853, -107021, -250596, -375776, -468224, -544709, -650054, -771238, -864063, -934032, -996214, -1003482, -903588, -748010, -610056, -474846, -336827, -223811, -103949, -17026, -83607, -294066, -521662, -653372, -668222, -631219, -589311, -537860, -529258, -592375, -638234, -639573, -626839]
14175f26839J7431q427K497N0521M4237J3051J9271M6593K9459L2525J16093J77868
14163h5720J94694K51144K93027K15163P0243p2153j99077k56101k21570j58198
14153C1452j04196n3292K7717P3315Q0062Q5284O6666N8761P7259P1245K0351
14142D34624k7313m1570m8954n7933l0799q386J0777N1236N7987N5631Q8603R7415
14130E81318O1809L8064L2440O693n1363p5220m4416n2612j05322r6986l4707
14119B59698j1404q0212j49811j12786k5394K7640O695p3575j74726j89771o8002
14108e91648R0333J81550J61766O9319j9032p7857n7552M7497J15958Q9325j11
14097I548q8860j49538j73066j26660p5427p5746q9447j07691q6526K4754J08122
$$ y = [-626839, -609408, -617835, -615338, -564817, -520580, -507529, -488258, -441665, -412206, -379681, -263588, -85720, 108974, 360118, 653145, 868308, 938551, 866398, 667321, 411220, 189650, 31452, -72744, -126036, -98319, -25004, 55058, 140342, 207008, 265769, 343028, 414273, 434624, 407311, 365741, 316787, 258854, 228055, 219669, 230446, 281682, 339669, 395300, 483903, 581318, 643127, 681191, 713631, 720324, 668961, 593741, 549325, 496713, 391391, 294405, 259698, 248294, 168082, 18271, -94515, -119909, -92269, -85574, -159149, -333875, -523646, -591648, -501315, -319765, -157999, -88680, -107712, -185569, -243121, -195624, -79666, 9659, 9548, -79312, -228850, -401916, -528576, -604003, -679749, -769196, -876887, -963413, -938659, -830537]
14086h30537J11503Q9287O4156N7118M6684J5431j9009n2292n1866o638R295k6514
14074e93382m2872j4971M259k7426o8494r6280q4818o9914q7994j17315r6942
14063a296149p174J07904J85966K13270K24172K14138J48313P7730j678q4643
14053b18151j04848q0421k6838K4006R8459J61770J41770Q9881M9919m972j15572
14042A5003k10753k25734j43680m683P2872L2954r5889j57222j1740J75084K01930
14031c51858J07331N0439M7142M5425M0185K5542Q260l9214q0677q4034p8306
14020c09765o2073p5180j29991j31541m5939N9958J49944J90399J48656P5144
14010a30388K464p9860j39957j31549k8653J13006K25238L17295L30109K79999
$$ y = [-830537, -719034, -629747, -565591, -508473, -461789, -446358, -465367, -517659, -569525, -576163, -566868, -593382, -636254, -651225, -646966, -674392, -742886, -839166, -923984, -993898, -1081892, -1199207, -1296149, -1303323, -1195419, -1009453, -796183, -572011, -357873, -209560, -131830, -133508, -218151, -322999, -403420, -430258, -406252, -307793, -146023, -4253, 85628, 135547, 130575, 15003, -195750, -421484, -565164, -569847, -496975, -464021, -559910, -717132, -728872, -553788, -351858, -244527, -194088, -146946, -101521, -61336, -35794, -27534, -66748, -147425, -231459, -309765, -371838, -447018, -577009, -708550, -754489, -694531, -544587, -354188, -205532, -130388, -127924, -207784, -347741, -479290, -507943, -394937, -169699, 147596, 477705, 757704]
14000G57704J93526P1318q5026k18484k49345j73535j06670j05630r5648m4646
13990e6436k8661q1644r6017m7368q982l781J3423N0982O9739Q1161O7585J0328
13978b9671l3072l8084n7504p4722o6885o9941q3392l6595O3048J57492J87224
13967h2102J50685J07450P7977R6883J14873P5672R433j1463N5831J02230L7931
13956G35400j04446k30009k57814j75589j24532j49536j54553j24760n2920j8083
13946f56842o664P7254J81587K10195J54712M4273q9489j86270j77348l8467J60185
13935c26874K41175J70301M3128q2348j57533j66179j16832r908J18764J21956
13925a64350J7942l1797M4067J25848J05562J5471r9263j43096n4335L4025o555
$$ y = [757704, 951230, 1022548, 937522, 719038, 469693, 296158, 189488, 83858, -11790, -56436, -85097, -166741, -262758, -310126, -319108, -322889, -309466, -258484, -188745, -107584, -39999, -29671, -62743, -100827, -158331, -233053, -299938, -369879, -453271, -489866, -426818, -269326, -82102, 68583, 176033, 254010, 350893, 465766, 541438, 550871, 539408, 595239, 697469, 735400, 630954, 400945, 143131, -32458, -156990, -306526, -461079, -585839, -638759, -656842, -663506, -586252, -404665, -194470, -39758, 4515, -84974, -271244, -448592, -487059, -326874, -85699, 84602, 127730, 45382, -112151, -278330, -395162, -405070, -286306, -164350, -146408, -178205, -134138, -8290, 97272, 112743, 13480, -129616, -183951, -149926, -156481]
13914a56481q1641q4661l6078R811L2073N8758P5584K8365j00728k05126j76558
13903f36682p3313J7590J22021K36548K48981J06544m2137o7877o8005j09634
13893b65964j20423r6124q9712r6662m3201K8938N6231J7906j6554p645m4432
13882f77642q1167k2388P8824J39267J41395J14307P0909l3367j65531k51474
13872f86867k37838j27330K8188J41395J62485J23474R0072M9558J5660K8950
13862d12253L3488r82q384L7302P2705N9697m411q8593j21345q7247l6230j0984
13850e67237M6305R6069P1720L4287K4778N1066P7358J2420j22598j82187j12268
13839e70287n598N0523L3292n1741j28820j36231j26370j39338j16476K417N9794
$$ y = [-156481, -238122, -322783, -358861, -349050, -316977, -258219, -182635, -154270, -254998, -460124, -636682, -709995, -692405, -570384, -333836, -84855, 21689, -20448, -88325, -156330, -265964, -386387, -482511, -572223, -668885, -712086, -683148, -626917, -609011, -625565, -633210, -677642, -758809, -781197, -702373, -563106, -421711, -307404, -236495, -269862, -435393, -686867, -924705, -1052035, -1023847, -882452, -719967, -596493, -506421, -456863, -441203, -412253, -378765, -379747, -388131, -350829, -278124, -218427, -222838, -311431, -432776, -520023, -556253, -567237, -520932, -424863, -353143, -318856, -294078, -243012, -165654, -153234, -275832, -458019, -570287, -575885, -525362, -492070, -543811, -672631, -808862, -935232, -1074570, -1191046, -1188629, -1128835]
13828a128835k4393j03439r9809n2584K3642J46796K71604L15830K03617j1967
13818d59538j00762L0658J32859L9733q6626o2319O5310J23214M7625n3783n6208
13807c79837n872J3355L0373N3440k6224j28734o0712J16774K03106J57135O5503
13796C8307k1122q1469o0227J208J2454k1021m4809o1880j00019j31783j10821
13785e81182k4352L0636K5232L7305P3698J51342K18351J73721Q4213J7563Q453
13774B14980N8083J04542R1776N5918P113q2971j56784j69164j43139o6813N9992
13763b6467J87670K75246K39284P5079q0004j31391q9159m6695l8907l7034n2338
13752B75284q1340q8650q6984j00467p4150k0332n3431j21023r6541j5374M7425
$$ y = [-1128835, -1153228, -1256667, -1356476, -1409060, -1385418, -1238622, -967018, -651188, -447571, -459538, -560300, -529642, -396783, -357050, -443676, -505995, -440685, -317471, -269846, -323629, -379837, -385709, -372354, -341981, -288541, -314765, -443499, -504211, -387437, -184331, -27196, 38307, 17185, -64284, -124511, -123303, -110849, -131870, -176679, -238559, -338578, -470361, -581182, -605534, -574898, -549666, -512361, -438663, -287321, -68970, 104751, 188964, 206527, 214980, 273063, 377605, 469381, 525299, 532412, 449441, 292657, 123493, -19646, -86459, -26467, 161203, 436449, 675733, 750812, 670808, 539417, 450258, 403563, 364656, 327622, 275284, 193944, 105294, 18310, -82157, -156307, -176639, -230070, -351093, -447634, -463008, -415583]
13741d15583N8034L5751N0367J03043J01174L4806K0074R0165Q7300m7889j89126
13730g1884k04476j02929l5307n3343l8361P0928J31649R2665Q0419J54172K35652
13719B59185K18406Q3646k7939q4926j04261r4563r7774j08667j40963j50586
13709b48442q6171J4234P8319P5069M9900N0969K4258k9975q7011r8660k6184
13698b83694M0813O7463R3021J01220M7698J1778M6495N0961L9573P4011J07747
13687C97086J11302J16148P2046n8511j44891j63856j40875o7360l8205n6417
13677B6467o4281o9208j04826j18166n2540r607n6929j33002j59306j30363j16535
13666i88296r5680j8109J13312K43880K74940K16165J51948J17316P9811M0626
$$ y = [-415583, -357549, -321798, -271431, -168388, -67214, -32408, -12334, 77831, 165131, 117242, -71884, -276360, -379289, -414596, -467939, -506300, -435372, -303723, -211058, -130639, 23533, 259185, 477591, 561237, 533298, 448372, 344111, 249548, 151774, 43107, -97856, -248442, -334613, -320379, -242060, -166991, -117091, -66122, -41864, -71839, -158850, -257510, -283694, -242881, -175418, -82397, 18823, 66521, 78299, 124794, 175755, 215328, 289339, 397086, 508388, 624536, 696582, 638071, 493180, 329324, 188449, 121089, 82884, 26467, -37814, -107022, -211848, -330014, -382554, -392161, -449090, -582092, -741398, -871761, -988296, -1083976, -1102085, -988773, -744893, -469953, -253788, -101840, 15476, 95287, 135913]
13656A35913J2665k4782l3520L0908J13379J11430M3583L323J7672O6454R5696
13645E72721M2128n0885j04024p9015k0428p925l3620j1207M3644Q7395J12845
13634E51629R3898K3722l8650j13900k34261l18480k80013j65360m6775O7619
13624d60571J25695J24179J19928O2455n9200j27110q3256n6770j12033j41493
13614f08176m1708J11790J55964J04933K6431l7506r9134j23461l4363R4498J33361
13603c17371R3773M2116k2844p4630m8206O5089J51555J27553N2508L905N1680
13592A25128J36842J48783R0308M6997J1953m0718m9917m7646r4178j23778j23926
13581G9848j46253j82110j96785j66897j33264j12687p4837k9132L5899Q7917
$$ y = [135913, 148578, 123796, 90276, 121184, 234563, 345993, 389576, 392899, 410571, 477025, 572721, 614849, 563964, 459940, 380925, 360497, 352572, 318952, 307745, 351389, 438784, 551629, 645527, 669249, 630599, 516699, 282438, -36042, -316055, -481415, -528190, -460571, -334876, -210697, -90769, -28314, -87514, -214624, -297880, -354650, -466683, -608176, -649884, -538094, -382130, -277197, -250766, -288272, -387406, -510867, -545230, -450732, -317371, -223598, -181482, -204326, -278956, -327162, -262073, -110518, 17035, 69543, 73448, 125128, 261970, 410753, 501061, 548058, 560011, 519293, 469376, 421730, 327552, 203774, 79848, -66405, -248515, -445300, -612197, -745461, -858148, -932985, -962117, -926218, -838301]
13571h38301R0278P0734N0662K0912J7091N8914J10683O9363m3838j01387r0030
13560e84919p978J21844K00330K02519J86444J46916O1328j7392p2820r3252o4401
13549G8619k9318M824M8079N9185o697r5750j25166n7549Q1798J53222P6822n0043
13537A38026j20352j60790j77786j50493p6674k2086k1657j8930J8816M8232J1181
13526e32513j3548J9166L7762N1173P1759N7425o216n5516l1613K0095N5140N6191
13514b70695J9922m0212r6742j52574j95434j48194p3708m7799j7004L0519J01718
13503h90203J64472J30795K2087k2614l22J1110K2942L6324J1309j5916M409O2312
13491d63295J23879J80482K05262J32750k5344j37762j85661j48063j01956j11933
$$ y = [-838301, -748023, -677289, -626627, -605715, -588624, -529710, -419027, -349664, -393502, -494889, -584919, -592897, -471053, -270723, -68204, 118240, 265156, 326484, 309092, 236272, 143020, 78619, 49301, 54125, 102204, 161389, 154692, 58942, -66224, -123773, -41975, 111247, 188069, 138026, 17674, -143116, -320902, -471395, -548069, -570155, -591812, -610742, -591926, -543694, -532513, -546061, -526895, -489133, -437960, -366201, -308776, -314992, -370508, -402121, -382026, -326886, -270695, -250773, -290985, -387727, -540301, -735735, -883929, -957637, -1005436, -1022440, -991921, -890203, -725731, -594936, -572849, -595463, -595785, -584675, -561733, -525409, -514100, -530016, -525607, -463295, -339416, -158934, 46328, 179078, 153734, 15972, -169689, -317752, -419708, -531641]
13481e31641m3788R4043J72039J55640J26931J46235J30624N3910n1065j58936
13471I3992k08871j95072j36650p9301l2642L3057J15310J70260J78974J48506
13461H7563J17617R3917N2280r791q7287j50252j30368q0218p6913l1369M6382
13450a68439O1102O0632P5970Q6807O5608M006p1773j27455j14703m4383M1110
13439a31518L9060o8985j11149k7075M2079P5280J19338R2618J3821k7694O828
13428B2603J03242J86462J67700R8894Q2888J10390Q6772O829j5593K5491J9649
13417H95327j05470k34856k27511j42211n1088L1650M6509j2522j11734j79272
13407i1178j78039j45875p1971M505K2320L8619R9177J69869K29417K03876N3755
$$ y = [-531641, -575429, -481386, -309347, -153707, -26776, 119459, 250083, 303993, 252928, 93992, -114879, -309951, -446601, -525902, -558544, -525487, -410177, -239917, -60943, 87563, 205180, 299097, 351377, 341586, 254299, 104047, -26321, -106539, -183452, -214821, -168439, -107337, -46705, 29265, 116072, 181680, 185686, 113913, -13542, -128245, -172628, -131518, -92458, -161443, -272592, -299667, -257588, -182308, -62970, 29648, 43469, 15775, 22603, 125845, 312307, 480007, 578901, 661789, 772179, 858951, 865780, 850187, 875678, 895327, 789857, 555001, 327490, 185279, 134191, 165841, 212350, 199828, 88094, -91178, -269217, -415092, -487063, -482558, -460238, -421619, -322442, -152573, 76844, 280720, 334475]
13396C34475j15081j85046j37476n2855R28M9277J20956J41686O5735L7545R2377
13385C52521J07993M3291k3241m9184l4714M5963J44891J51286M5779n3520p2419
13374F58646r5361j37326j04323l3613k135P917R732J7088L7778Q834n9722j16349
13362A91166j43129j11701R006J68831K32421J83300J44676J05542J5892r3290
13352G02714j53990j79883j92807j96867j48963N011J40769J52018P2039j8723
13342A81318m7908l2868k7428l4946m6073k5144K8346M8288K9114K9772Q0759
13331A83230J22955P1735j6550j6672Q4214J60219J22466J7494n3687q1970j15935
13320D77499j37788p7863L0571P1571K9631l8584j15845j39056o0809L4537J22284
$$ y = [334475, 219394, 34348, -103128, -155983, -155055, -105778, 15178, 156864, 222599, 260144, 352521, 460514, 503805, 480564, 431380, 396666, 442629, 587520, 738806, 784585, 731065, 658646, 563285, 425959, 321636, 288023, 285888, 293805, 303537, 320625, 358403, 367237, 307515, 191166, 48037, -63664, -54658, 114173, 346594, 529894, 674570, 780112, 796004, 702714, 548724, 368841, 176034, -20833, -169796, -164785, -24016, 128002, 200041, 181318, 133410, 100542, 73114, 38168, -7905, -33049, -4703, 43585, 72699, 102471, 183230, 306185, 377920, 361370, 344698, 428912, 589131, 711597, 729091, 675404, 593434, 477499, 339711, 261848, 292419, 363990, 393621, 355037, 239192, 100136, 39327, 73864, 196148]
13309A96148J81699J75873Q9063k9009j02552j26685q0086N8164J85267J82917
13299G30799R9919J9306m1067q5960j05481j17609j27198q6526K7556J02201P5762
13288D91702k5331j02705n1977O9522J49714J35730N7841m7441j02716o7934J9892
13277E26297J15003J75610J43642K68j36441j24301k3076L6068P7082R3140K4781
13266I08073p3687j18599j44025j50661r2699n0282o4633n8161l9497n4766m7317
13255A3746P761M1630K7941J6801J6433K8129K5769L8467O5458O2212N1050K4977
13243D20374L852M943J5506L2224L7817O980J6301R1407R4214M336j11969j65343
13231D50642j28722j08627r9472k3582J01666J86750J28380j0092j43011k01503
$$ y = [196148, 377847, 553720, 642783, 613774, 511222, 384537, 304451, 362615, 547882, 730799, 830718, 850024, 808957, 722997, 617516, 499907, 372709, 286183, 313739, 415940, 491702, 466371, 363666, 311689, 381211, 530925, 666655, 724496, 677055, 574339, 506405, 526297, 641300, 816910, 960552, 960820, 824379, 700078, 677002, 713070, 790152, 883292, 908073, 834386, 715787, 571762, 421101, 328402, 278120, 213487, 155326, 115829, 61063, 13746, 21507, 63137, 91078, 107879, 124312, 152441, 178210, 216677, 282135, 344347, 395397, 420374, 424226, 429169, 444675, 476899, 514716, 521696, 537997, 629404, 723618, 727954, 615985, 450642, 321920, 213293, 113821, 90239, 191905, 378655, 507035, 496943, 353932, 152429]
13221A52429j06958O5349J49618N8617r4498j57459j36985p5831J6486J37128
13211G896K22595J69745O1581N0172J18399J60494J48032J05820J6006m5968j0784
13200A003988N5881Q4146P0878Q5838J19085R6082J0026m3440l4490O818M9998
13189A504810L4772n8753j55544j79743j36261m2619O0157Q1795K8726J1134L4293
13178A182767K4753l3946p6938n3380m1295o3109p8803q6674m1420L4774N5029
13167H21758M0636N8419J02278P9561L187l8032o3121j38384k16421k03935p3261
13156C72685Q3893J87135K04460J34021N7311M0235P3789J03112P2983Q561p5307
13145A262878j53019j66682o8191J07527J80316R7677p4041j91697j73763j12821
$$ y = [152429, 45471, 110820, 260438, 319055, 224557, 67098, -69887, -145718, -129232, 7896, 230491, 400236, 461817, 511989, 630388, 790882, 938914, 1044734, 1060740, 1014772, 1003988, 1059869, 1144015, 1214893, 1300731, 1419816, 1515898, 1525924, 1482484, 1447994, 1454812, 1504810, 1539582, 1480829, 1325285, 1145542, 1009281, 966662, 1026819, 1108614, 1137340, 1148474, 1182767, 1207520, 1173574, 1096636, 1043256, 1001961, 938852, 860049, 773375, 731955, 766729, 821758, 862394, 920813, 1023091, 1102652, 1105839, 1067807, 1004686, 866302, 649881, 445946, 372685, 456578, 643713, 848173, 982194, 1039505, 1079740, 1153529, 1256641, 1329624, 1338185, 1262878, 1109859, 943177, 874986, 982513, 1162829, 1260506, 1186465, 994768, 821005, 708184]
13135G08184q3145m4857M5723J33401J64862J48826Q4892k565q3059j17512j35754
13124H18996j57638r4467L5393J07881J37273J64819J70501J47886R3776M3313
13114A467733L5455K3515m8991j37431j79298j34102n6180l1638O831J01410J75769
13103A223073K05629J81624J10136M6476N2771Q8259M8259p0718j59033j49101
13093A577375j45413j72279j30175j5204P9420R3961Q2816L9388l7772m9382M050
13082A326785R5364K15144K72718K13408Q9344k2273m9806o589m143k9656L0992
13071B131288P9423M9012K1252N5219J36717K17303K43453J83088L5352r4379
13061C057728r8703j6766M3583P2091Q4510P3773N7544P1166J32799J68669J30273
$$ y = [708184, 625039, 580182, 625905, 759306, 924168, 1072994, 1157886, 1155321, 1072262, 954750, 818996, 661358, 566891, 602284, 710165, 847438, 1012257, 1182758, 1330644, 1424420, 1467733, 1503188, 1526703, 1477712, 1340281, 1160983, 1026881, 970701, 939063, 945894, 1047304, 1223073, 1428702, 1610326, 1720462, 1766938, 1819709, 1907968, 1956227, 1885509, 1726476, 1577375, 1431962, 1259683, 1129508, 1114304, 1193724, 1287685, 1370501, 1409889, 1372117, 1322735, 1326785, 1422149, 1637293, 1910011, 2123419, 2212763, 2190490, 2140684, 2134095, 2129952, 2100296, 2131288, 2210711, 2259723, 2280975, 2336194, 2472911, 2690214, 2933667, 3116755, 3152107, 3057728, 2959025, 2942259, 2985842, 3057933, 3142443, 3216216, 3273760, 3344926, 3477725, 3646394, 3776667]
13050C776667J03812J03380P1357M7244M6059M1221L9855M6156L6294L2087J8086
13039D362218j0774o299m15j6604J4808J15685K00251K12907K11796J98061J40277
13028E421911J14539J48831K31388L04331L04782K63460K08272K01629K47726
13019G446869K84958L21997L82981L90417K94960J79974J49441K32270L45566
13010A0029433L92400L29635K40182K50276L39558M36982N34573O35459P42172
13001A3930670Q38549R36992J068483J219040J346115J479331J649147J874996
12993B4343323K170565K506009K921431L437248M046285M782938N697740O823403
12985E6728942Q225200R947876J2034439J4538431J7592614K1391431K6119043
$$ y = [3776667, 3880479, 3983859, 4055216, 4102460, 4148519, 4189740, 4229595, 4275751, 4312045, 4344132, 4362218, 4351444, 4345145, 4344730, 4328126, 4342934, 4458619, 4658870, 4871777, 5083573, 5281634, 5421911, 5536450, 5685281, 5916669, 6221000, 6525782, 6789242, 6997514, 7199143, 7446869, 7731827, 8053824, 8436805, 8827222, 9122182, 9302156, 9451597, 9683867, 10029433, 10421833, 10751468, 10991650, 11241926, 11581484, 12018466, 12553039, 13188498, 13930670, 14769219, 15706211, 16774694, 17993734, 19339849, 20819180, 22468327, 24343323, 26513888, 29019897, 31941328, 35378576, 39424861, 44207799, 49905539, 56728942, 64954142, 74902018, 86936457, 101474888, 119067502, 140458933, 166577976]
12978A66577976L1814259L7948186M3092213M4209683L6615808J7411288q874132
12971C68795281l1522500m3160713m4469492m0045293l3753013k7579112k2256072
12964A26009086j7937277j4522024j1865801r841298q306077p079907o025640
12957E0431062n056418m169457l405675k833988k476784k236178j998074j783307
12949B6471181j660190j571731j425076j195265r85361q73251p90988p00471o02995
12940A6665853n11664m49369m27743m18043l24191j68024n9145n6367p7050n341
12930A4168916Q6387J29429J71544K81127M36681N12916N25767N75136O66857
12921A7554760Q09141J022679J291738J567072J783533J861871J692714J181803
$$ y = [166577976, 198392235, 236340421, 279432634, 323642317, 360258125, 377669413, 368795281, 337272781, 294112068, 249642576, 209597283, 175844270, 148265158, 126009086, 108071809, 93549785, 81683984, 71842686, 63536609, 56456702, 50431062, 45374644, 41205187, 37799512, 34965524, 32488740, 30252562, 28254488, 26471181, 24810991, 23239260, 21814184, 20618919, 19633558, 18760307, 17969319, 17268848, 16665853, 16154189, 15704820, 15277077, 14859034, 14534843, 14366819, 14307674, 14251307, 14174257, 14168916, 14255303, 14384732, 14556276, 14837403, 15274084, 15787000, 16312767, 16887903, 17554760, 18363901, 19386580, 20678318, 22245390, 24028923, 25890794, 27583508, 28765311]
12913B8765311M98135K5372o7448P4439L36519P04622J113596J512806J993973
12904C4957325K596492L265090M026484M870555N791073O951106Q445509J0235695
12896H1139329J2381720J5050813J8402934K2586493K7745907L3883468M0308288
12889B51498952M5028168M4241445L3074323J0217835j7096161l7474598m5661132
12882B83828832m4361209l8606811l1936411k5931261k1008274j7119473j4075537
12875I0789856j1661122r718832q125626o743902n578950m682607l945624l348652
12867C6984541k948324k682810k429664k120174j789005j542725j426068j345237
12859B0700534j200809j000835q57428q10397p40654n88674m83525m25622l32848
$$ y = [28765311, 29263446, 29288818, 29221370, 29295809, 29632328, 30336950, 31450546, 32963352, 34957325, 37553817, 40818907, 44845391, 49715946, 55507019, 62458125, 70903634, 81139329, 93521049, 108571862, 126974796, 149561289, 177307196, 211190664, 251498952, 296527120, 340768565, 373842888, 384060723, 366964562, 329489964, 283828832, 239467623, 200860812, 168924401, 142993140, 121984866, 104865393, 90789856, 79128734, 69409902, 61284276, 54540374, 48961424, 44278817, 40333193, 36984541, 34036217, 31353407, 28923743, 26803569, 25014564, 23471839, 22045771, 20700534, 19499725, 18498890, 17641462, 16831065, 16090411, 15501737, 15018212, 14592590, 14259742]
12850A4259742k76672l03378l44037l08915k21884j62474j42705j26363p8671
12841A2294643J3544J23772K27958K78540K75277K84179L14807L71763M71883
12832A4656366N34758N18539N16553N67148O79122Q45375R93209J111713J246945
12823B1669728J419854J639043J829779J932335K088585K422613K932588L574348
12815C9508873M296115N126083O188280P572737R261750J1214780J3483967J6254610
12807A12907195J9747881K4122622K9428324L5412974M1135863M4295388M0708827
12800C47759074K6188846J784670k3610484m0149182m5228021m2544905l6688136
12793A87511862l0372712k4646739j9862338j6077728j3066193j0613769q699688
$$ y = [14259742, 13983070, 13679692, 13335655, 13026740, 12804856, 12642382, 12499677, 12373314, 12294643, 12308187, 12431959, 12659917, 12938457, 13213734, 13497913, 13812720, 14184483, 14656366, 15191124, 15709663, 16226216, 16793364, 17472486, 18317861, 19311070, 20422783, 21669728, 23089582, 24728625, 26558404, 28490739, 30579324, 33001937, 35934525, 39508873, 43804988, 48931071, 55119351, 62692088, 71953838, 83168618, 96652585, 112907195, 132655076, 156777698, 186206022, 221618996, 262754859, 307050247, 347759074, 373947920, 375732590, 352122106, 311972924, 266744903, 224199998, 187511862, 157139150, 132492411, 112630073, 96552345, 83486152, 72872383, 64172695]
12786F4172695p242324o175484n411743m791982m165158l523011l001925k620956
12778B7240112k299349j976475j704304j544640j468476j412491j316522j176043
12770A4341812j000759q26304p41327p16223o79885o26409n39909m48379l69730
12761H392887k65054j67235j71301k43001k80001k72765k76963l04005k99479
12752F113083k37888j54815q3956q6204j86973l23453m20930m19689l12338j03141
12742C783696J09352J86373J50200R0100J4608q3339j51370j62770j69263j66044
12732C601543j17128o6035n1011q5301j41296k06345k60349k28561j29870k5457
12722B290190L8428J3438r7331j97973k14153j98876j70514p1994K7572K6859
$$ y = [64172695, 56930371, 50754887, 45343144, 40551162, 36386004, 32862993, 29861068, 27240112, 24940763, 22964288, 21259984, 19715344, 18246868, 16834377, 15517855, 14341812, 13341053, 12514749, 11773422, 11057199, 10377314, 9750905, 9210996, 8762617, 8392887, 8127833, 7960598, 7789297, 7546296, 7266295, 6993530, 6716567, 6412562, 6113083, 5875195, 5720380, 5636424, 5550220, 5363247, 5039794, 4618864, 4199175, 3886837, 3783696, 3893048, 4079421, 4229621, 4319721, 4334329, 4250990, 4099620, 3936850, 3767587, 3601543, 3484415, 3418380, 3367369, 3282068, 3140772, 2934427, 2674078, 2445517, 2315647, 2290190, 2328618, 2342056, 2244725, 2046752, 1832599, 1633723, 1463209, 1391215, 1418787, 1445646]
12712A445646J2421O6782J24634O7491r0399k10002k18664k03640j54862k9664
12702H09743Q2116J22119J22093J17122R8195L0669k4274j8378K4907M8760l26
12691A412746j04479j89995k04144j62133r7243l8326k9153j3568L9229L2402
12681F45336j8783p2675j10618p4605J0226K2842m1020q2688n3961M9467J52940
12670D26461J64511J37008J73912J85380Q1409m9948j55279j91423j39381m4581
12660E88069L3259J8723l8678o7043r3924j47488j51517q1731j9778O8971J57727
12649B66590J43357L5711n6470l6189M7790O6804K4491O639J6292m017j6039J484
12637D96443l1682r0197p2984J7351J01083R8136L5436m4642r5188m8082L9882
$$ y = [1445646, 1458067, 1524849, 1649483, 1716974, 1626575, 1416573, 1197909, 994269, 839407, 809743, 891859, 1013978, 1136071, 1253193, 1351388, 1382057, 1357783, 1339405, 1364312, 1413072, 1412746, 1308267, 1118272, 914128, 751995, 654752, 616426, 587273, 573705, 612934, 645336, 626553, 553878, 443260, 368655, 378881, 401723, 360703, 278015, 224054, 273521, 426461, 590972, 727980, 901892, 1087272, 1168681, 1118733, 963454, 772031, 632650, 588069, 621328, 640051, 601373, 534330, 440406, 292918, 141401, 59670, 39892, 108863, 266590, 409947, 445658, 389188, 352999, 400789, 467593, 492084, 498723, 515015, 510998, 494959, 496443, 464761, 374564, 301580, 318931, 420014, 518150, 553586, 508944, 413756, 365674, 405556]
12626D05556R9459J57896K23613K37502J46050k2829j72216k10630j50623l9293
12616F74485L8590j2571q5137o7337n0684j05294j56047j34519m7085K754m3238
12605A3917j12693j57080j41090l0474P8555J18379J30181J16059J08363R6732
12595B20849R3612J12464J05371M3384m0718p7808l0367L3459J9408k0110l24
12584D59220M3800L9210K7698P9918J62738J54713P0941j7133p9274o0708O389
12573H87512R40n2636p6009j34912k26702k28274r3700P5991J59697J47111R1145
12562E50163L0745k2721n8847n5750O275J02307J56607J01255j4595q0485j04147
12551F10807j07610j22384j60998j45858m1663M4082j1473j17613j36675p1042
$$ y = [405556, 505015, 662911, 886524, 1124026, 1270076, 1247247, 1075031, 864401, 713778, 674485, 713075, 700504, 615367, 548030, 497346, 392052, 236005, 101486, 54401, 57155, 13917, -98776, -255856, -396946, -427420, -348865, -230486, -100305, 15754, 124117, 220849, 314461, 426925, 532296, 575680, 534962, 457154, 426787, 460246, 479654, 459544, 459220, 503020, 542230, 569928, 649846, 812584, 967297, 1038238, 1021105, 941831, 881123, 887512, 888452, 835816, 759807, 624895, 398193, 169919, 76219, 152210, 311907, 459018, 550163, 580908, 558187, 499340, 443590, 449865, 552172, 708779, 810034, 795439, 714954, 610807, 503197, 380813, 219815, 73957, 32294, 76376, 64903, -52710, -189385, -260427]
12541b60427O540O1108J16793J54351J50623R4243J5278r457R759p720l8701k6493
12529B65897j6879k2495r994p684M492L2285j4717r5140r2154m6427j1335l2259
12517d6410j42496j94031q3921N5528Q2322L3150M5280J07176J15071P1587k8269
12506A4987j53067k35367k48578j91454o7284O0687J25129J55816J60059J29530
12496b49542P2283J2763l1387n5865m8010K8294J64975K72307K81429J55567j6558
12485E86256j06514p1981Q897J3299l1149n8222o3941r2381j35961j29006o2552
12474a43255N0771J32870J14035J7888j18177k07414j63052m9603K1121O8797
12464b76019J51566J98696J30787L5557J3267L6185L5834J2409k2198m8426m1591
$$ y = [-260427, -253887, -192779, -75986, 78365, 228988, 323231, 338509, 329052, 338811, 331091, 292390, 265897, 249018, 226523, 216529, 208845, 213337, 245622, 230905, 135765, 43611, -2816, -14151, -46410, -188906, -382937, -466858, -411330, -329008, -295858, -250578, -143402, -28331, 43256, 14987, -138080, -373447, -622025, -813479, -880763, -820076, -694947, -539131, -379072, -249542, -177259, -164496, -195883, -251748, -299758, -271464, -106489, 165818, 447247, 602814, 586256, 479742, 407761, 416658, 429957, 398808, 340586, 276645, 184264, 48303, -80703, -143255, -92484, 40386, 154421, 172309, 54132, -153282, -316334, -365937, -344816, -276019, -124453, 74243, 205030, 240587, 253854, 290039, 325873, 338282, 316084, 267658, 226067]
12453B26067j0502J781n6479j62706k07550j37660n1707j5188J8098R427l9723
12442d26142n1388J2229Q9260Q3296j6339j03092p8156J3677J06480J30754P1277
12431a68144K8552K4852K6030J0636j376M6240Q5345O8947J4143o0302o2844Q358
12419B0437L1747m413n4280j10139j25615p0126m0368r5150j16540m0988K7360
12408e78075M1128P5438J41412K02617K12835J91139J59509J04495P5343R7662
12398G23503J30115Q8748n3637j61718j61162j66189j83180j54734j13838q3084
12388a35176n2538n7890o1511j7718M8727J12187J33300J02331O4564Q2865J38366
12377C57507J72090J51559P7423m3350j47543j46135p2712j8943j8814q6751j30691
$$ y = [226067, 215565, 217346, 160867, -1839, -209389, -347049, -398756, -413944, -395846, -386419, -426142, -477530, -465301, -376041, -292745, -309084, -412176, -490332, -476655, -370175, -239421, -168144, -139592, -114740, -88710, -78074, -79450, -33210, 52135, 121082, 135225, 74923, 12079, 20437, 52184, 47771, -6509, -116648, -242263, -312389, -352757, -447907, -564447, -605435, -578075, -536947, -461509, -320097, -117480, 95355, 286494, 446003, 550498, 625841, 723503, 853618, 942366, 888729, 727011, 565849, 399660, 216480, 61746, -52092, -135176, -187714, -245604, -307115, -324833, -276106, -163919, -30619, 71712, 136276, 219141, 357507, 529597, 681156, 758579, 715229, 567686, 421551, 348839, 329896, 311082, 224331, 93640]
12366I3640o4110l2300r1147r1275k6632K9723O4583Q9911O7705k5678j28380
12355a13960j85862j64431q6892K12R7955J44837J14845P7854K7363k6916m1315
12344a56310j6058O5201J63840K06653J72903P0011n1967j46557j53303l3269
12334A21144M3417j6623n7007j8018K5130P5877J05741Q5440N7933m913j45262
12323B72859k56809k03074q9848n1110l0343M8686J18418J57130K10084K59335
12313D35328K32624J19674M4270N9674N9814l8352k08772l14818k68100j19629
12303A713q180k4656j36930k52170k81631k43369j50349j8600J13280K48904L44080
12292d07908K77142J01927n2158j36325j08894j041R5866J44541J49246J14853
$$ y = [93640, 29530, -2770, -93917, -185192, -211824, -182101, -117518, -27607, 40098, 14420, -113960, -299822, -464253, -551145, -550933, -452978, -308141, -193296, -115442, -88079, -114995, -156310, -172368, -107167, 56673, 263326, 436229, 506240, 454273, 307716, 154413, 121144, 164561, 147938, 90931, 72913, 98043, 173920, 279661, 365101, 423034, 418121, 272859, 16050, -187024, -276872, -327982, -358325, -309639, -191221, -34091, 175993, 435328, 667952, 787626, 831896, 891570, 951384, 913032, 704260, 389442, 121342, 1713, -6467, -31123, -168053, -420223, -701854, -945223, -1095572, -1114172, -1000892, -751988, -407908, -130766, -28839, -80997, -217322, -326216, -327257, -231391, -86850, 62396, 177249]
12282A77249M8006O21O154k151m7918j04016j01261l6403K4352M8367L5100p285
12270D0815j6249K3941L0205j4879k1328J865L3797L0533m2594n0987L5991R9963
12258A51073J22766J10792R2366Q3301P2935P3096J3058j20825j70535p8520M0728
12247C90235Q0011J3076l2499l3957o2258m3121K1080K9489j1787k2264n934j2419
12235C09652p7231j56757j34925J1399J92072K49686J82066J31367O2180q3484
12225F86025j62401j00446L2575J33865J25931M8676q394q7712j96820k32411
12215B38888j80348o4962j5137n3379n3660K1566P6964R0787J14034J04720O2138
12204C41611M5637M2759J9262l2550q7261r9085q6850l3515L5191O4753Q8680
$$ y = [177249, 225255, 225876, 232030, 229879, 181961, 77945, -23316, -59719, -35367, 13000, 48100, 40815, 24566, 48507, 78712, 63833, 42505, 44370, 78167, 108700, 66106, 15119, 51110, 151073, 273839, 384631, 476997, 560298, 633233, 706329, 719387, 598562, 428027, 349507, 390235, 470246, 483322, 450823, 416866, 354608, 311487, 332567, 362056, 350269, 328005, 322071, 309652, 232421, 75664, -59261, -47862, 144210, 393896, 575962, 707329, 769509, 686025, 523624, 423178, 455753, 589618, 715549, 764225, 755831, 668119, 471299, 238888, 58540, -6422, -21559, -74938, -128598, -107032, -30068, 60719, 174753, 279473, 341611, 387248, 430007, 449269, 416719, 329458, 230373, 143523, 110008, 145199, 209952, 298632]
12193B98632J24432J07438L1403o6849j66233k23839k40466k52436k22115r6629
12183g06662M2216J56305K47018K25067P1799m0887L5786J43508J35471Q1148
12173C90769M8043K511m1572K04N3579j2876j25429j96334k14595j52721k1991
12162b70412Q4739Q6500N1463J5861k9394j4534J6711J1491M1689O8883J8692
12151H1689o9084j16344o4251Q8059K06157K16976J59784L7302o8119o8824P102
12140D10447J07453J88088J50686K8686n0466m9077j1155k2427p5188o6404q720
12129F01923K2858n833l2885K6987J30363J80168R7840j14722k62610k43844j58121
12118B42124n8787L2555M5261Q186r077J3859M1193N2891Q2788M2011o4593j23257
$$ y = [298632, 423064, 530502, 561905, 495056, 328823, 104984, -135482, -387918, -610033, -706662, -664446, -508141, -261123, -36056, 35743, -5144, 30642, 174150, 309621, 390769, 438812, 441323, 399751, 399955, 453534, 440658, 315229, 118895, -95700, -248421, -270412, -185673, -99173, -47710, -31849, -61243, -75777, -59066, -47575, -5886, 62997, 81689, 12605, -103739, -167990, -79931, 126226, 343202, 502986, 540288, 472169, 403345, 410447, 517900, 705988, 856674, 885360, 834894, 785817, 774662, 752235, 677047, 610643, 601923, 624781, 618948, 586063, 613050, 743413, 923581, 1021421, 906699, 644089, 400245, 242124, 183337, 215892, 261153, 269339, 260262, 274121, 315314, 368205, 450993, 493004, 428411, 305154]
12106C05154j15857p9340l9512j8925L326L8147P7570R9620M4884o2422r5487
12095A57158k7104J4938m4970j58660k38261j95229l5567J40706K20974K16071
12085E0056J79420J03682K2137j4345k3677J005J3340m0808m7965M5668J46021
12074D34534J91931J34637M2081l472j8643m4911j31360k82432l73044l15443
12064c66122j82795n6811M0262J00030P3058m0707j56962j24925L6479J13047
12054e65446O5162M351l0097j0007L2486O9177P4451K3470r193Q040M090l8317
12042c71833r0029r5967J2502J49731J70808J60063K03004K02545J34590N4690
12032E30104j7482o2996p6603q8534q5168k1811O3013Q9193Q2370R2071J03688
$$ y = [305154, 189297, 109957, 70445, 51520, 54846, 92993, 170563, 270183, 315067, 252645, 157158, 130054, 144992, 100022, -58638, -296899, -492128, -527695, -386989, -166015, 50056, 229476, 333158, 355295, 340950, 317273, 318278, 331618, 290810, 242845, 288513, 434534, 626465, 761102, 803183, 799711, 781068, 736157, 604797, 322365, -50679, -366122, -548917, -605728, -565466, -465436, -392378, -433085, -590047, -714972, -678493, -565446, -500284, -495933, -526030, -536037, -503551, -434374, -359923, -336453, -345646, -337606, -333516, -371833, -461862, -557829, -545327, -395596, -224788, -64725, 138279, 340824, 475414, 530104, 512622, 449626, 373023, 284489, 199321, 177510, 240523, 329716, 412086, 504157, 607845]
12021F07845J16885J26259J02338K6864q6705j44354j30601j15440j40243j59909
12011B02939r3403p008L6019M1909k8003j08587j15448q2373m0354p929J9382
12000a82856N9752Q7179J33906J90651K00902J73904J26371J46j73134k58507
11990C58314k09165o0390N0486Q3975J29979J29048O3197m056n9135j34517k11525
11979A36211j98164j01265j3467L1244Q2767J16604Q5666j044p2500o7563K992
11968A481O1089N9043r775j06782j88771j66736j5584J15943J22461O4302N7986
11957e343J27112J89851J64966R6723P2814O9449L4427j2162q4227j43189j46828
11946C63593j19827q4770p2791o1987k4508R203L4016N8718O0256N9162N2046
$$ y = [607845, 724730, 850989, 953327, 980191, 893486, 749132, 618531, 503091, 362848, 202939, 109536, 102528, 138547, 180456, 152453, 43866, -71582, -153955, -194309, -202238, -182856, -123104, -35925, 97981, 288632, 489534, 663438, 789809, 789955, 616821, 358314, 149149, 88759, 139245, 223220, 353199, 482247, 545444, 541388, 482253, 347736, 136211, -61953, -163218, -176685, -145441, -62674, 53930, 139596, 138552, 66052, -1511, 1481, 62570, 121613, 111838, 5056, -183715, -350451, -366035, -250092, -127631, -63329, -5343, 121769, 311620, 476586, 573309, 646123, 715572, 749999, 737837, 653610, 510421, 363593, 243766, 158996, 86205, 24218, -290, 8913, 42929, 101647, 161903, 221065, 273111]
11935B73111k8058j46335j67112q1350L703N567n7524q3407l3195O9679J98572
11924d6349K58771J88026Q0983M0412J4079l5618j08633k03116k10906j45802
11914a68153j06697o4627k6523J3617P6661Q8403K3980P491Q0978J04592J3996
11903D3718n7079o7877n5046n972M8381P0812L4213m7914n0950k2273o1246q6893
11891b58126l8556K7996K7732n7504j64503k02164j68085j26196j09883j30027
11881a199316j06791J5734J70824K85333L26202L06493K15855P9354j655J2366
11871A04399J15675K07669J56165L3507n1329o9368n1334m2660J0055P3852J01693
11860E88324J31756J79770J92089J01411n6266j88282k76888k50333p9504L2244
$$ y = [273111, 245053, 98718, -68394, -149744, -146041, -140474, -197998, -281405, -314600, -244921, -46349, 212422, 400448, 481431, 521843, 535922, 500304, 391671, 188555, -22351, -168153, -274850, -339477, -366000, -352383, -275722, -187319, -163339, -155848, -74870, 29722, 43718, -13361, -81238, -136284, -142256, -93875, -23063, 11150, -36764, -87714, -109987, -171233, -258126, -296682, -268686, -240954, -298458, -462961, -665125, -833210, -959406, -1069289, -1199316, -1306107, -1290373, -1119549, -834216, -508014, -201521, 14334, 93688, 92033, 104399, 220074, 427743, 583908, 617415, 566086, 496718, 445384, 402724, 412779, 486631, 588324, 720080, 899850, 1091939, 1193350, 1137084, 948802, 671914, 421581, 342077, 374321]
11850C74321R198m4877j08718j48310r7271j5416l59q2523j27442p1467k0697
11839c33561j8550l5612k8929O450N8776J25536J80610J59613J06542P5960M6666
11828C43501j9183j08388j29974m7433N1253O1169ok0478K55l532j0608O624O0903
11815A84103J34474J90172J95743J61613J17370M1194o1669j49484j95029j79005
11805D39482j26071r1794q5040l1579Q5953J52609P9475k0730K4999J36434J33125
11794F96863J8167j04333j30554m8728J6327N7381J35400J83923J51863O9179
11784A045488n0072j89703k47914j58520n21P8285L4713l1034q1187j15933j37877
11773A45725j39430j12290k8940O7262Q7211O5537L1258K0243Q9637K19429K68863
$$ y = [374321, 383519, 338642, 229924, 81614, -15657, -31073, -31432, -113955, -241397, -312864, -333561, -352111, -387723, -416652, -410202, -351426, -225890, -45280, 114333, 220875, 296835, 343501, 324318, 215930, 85956, 38523, 89776, 150945, 150939, 130461, 130716, 127184, 116576, 123200, 184103, 318577, 508749, 704492, 866105, 983475, 1024669, 963000, 813516, 618487, 439482, 313411, 221617, 136577, 104998, 190951, 343560, 423035, 402305, 427304, 563738, 696863, 715030, 610697, 480143, 431415, 447742, 505123, 640523, 824446, 976309, 1045488, 995416, 805713, 557799, 399279, 398758, 477043, 511756, 480722, 399535, 283602, 145725, 6295, -105995, -134935, -67673, 19538, 85075, 116333, 136576, 226213, 445642, 714505]
11762G14505J35179n2703j14433p3795q6621j81718k76713l01818k01904k6500
11752d66521L7184l8368p7580p0820r1533m6626R4700K33917L39244L47339K81886
11741E42822J99987J13861J6587n7705p7706k6925J0743J0512K560l2679j27248
11730E74809k37023k55510j81426j19916o4804o236L5336M0652K0778R853j136
11719a84623p771l151m1071o5377M976R1813J43458J88282K17184K20485J55721
11708G19926R2320J03397J66081K37823L33382M20706M57124M38992L45693K42690
11698C558134K96491N19456P64699R97147J303916J657913K126748K787547L707643
11689A7719694M895299O222148P078257N747165O12975n216701p371455o540265
$$ y = [714505, 849684, 796981, 682548, 608753, 522132, 340414, 63701, -238117, -440021, -466521, -429337, -467705, -545285, -616105, -707638, -754264, -659564, -425647, -86403, 260936, 542822, 742809, 856670, 873257, 815552, 737846, 710921, 721664, 732176, 734736, 702057, 574809, 337786, 82276, -99150, -219066, -283870, -290106, -254770, -214118, -193340, -183487, -184623, -192394, -195545, -236616, -301993, -297017, -205204, -61746, 126536, 343720, 564205, 719926, 812246, 915643, 1081724, 1319547, 1652929, 2073635, 2530759, 2969751, 3315444, 3558134, 3854625, 4374081, 5138780, 6135927, 7439843, 9097756, 11224504, 14012051, 17719694, 22614993, 28837141, 35915398, 41662563, 42275538, 37058837, 29687382, 23147117]
11681B3147117m994070l772442k882285k183919j669187j283036r78206p82482
11673D601490o52865n19138l76066k85095k62475k52204k68623k96370k32883
11664A455771q1444M3903J6091o5833k8814M0406O891r7041k34936k87378j72684
11653E94932j9152M6571K8749n0051j50223j47835n0197J2493M2298O9338P9119
11642D56042P2044O0231O3188Q8259P0231m9355j74299j78182n5402J11180J92915
11631F56852J24095L4461J6044K8493J0047m1669q6719p3106j6075j3392p1072
11620E67959j12978j22227j01318o4755n718M4580K1265j093J5028N3805M5249
11609C39797n4741j32598p2366M9958P1592l2287j05836r9880o0650q783J9613
$$ y = [23147117, 18153047, 14380605, 11498320, 9314401, 7645214, 6362178, 5383972, 4601490, 3948625, 3429487, 3053421, 2768326, 2505851, 2253647, 1985024, 1688654, 1455771, 1374327, 1418230, 1434321, 1368488, 1339674, 1380080, 1386971, 1289930, 1054994, 767616, 594932, 575780, 622351, 651100, 601049, 450826, 302991, 252794, 265287, 307585, 376923, 456042, 528086, 588317, 651505, 739764, 809995, 760640, 586341, 408159, 352757, 463937, 656852, 780947, 815408, 831452, 859945, 869992, 828323, 741604, 668498, 652423, 639031, 567959, 454981, 332754, 231436, 166681, 160963, 205543, 226808, 225715, 240743, 294548, 339797, 285056, 152458, 80092, 130050, 201642, 169355, 63519, -36361, -97011, -105794, -86181]
11598h6181K994m7822o6387K5605J52991J96838J39062J2638j21876k10739k34421
11587b37298j63012l0652M1433M8484Q3846J40408J73127J69317R5117k1424p8364
11576B20982m5381M5847R0804K8891k9228K285P6996J62669K45122K14986N0789
11565A064762j27784j40804l0414k044m0335l5339k0235o3119j22483j31128j23488
11554B27589j54858j50442j24129j28890n4674Q5571J78796J89807J65811J03573
11544C38154l562m6665K5263J01619N6595j7784m5843o3565r4837j17265q9560
11533D2550K6875J94945K87743K35164R8917m7071r7503o1953k5206K4871J07777
11522G87109J74383J29983L8763J6150J1845n6016j55031j75162j17352q8342
$$ y = [-86181, -83187, -131009, -197396, -171791, -18800, 178038, 317100, 329738, 207862, -2877, -237298, -400310, -430962, -389529, -341045, -257199, -116791, 56336, 225653, 320770, 299346, 220982, 175601, 221448, 312252, 341143, 311915, 314200, 391196, 553865, 798987, 1013973, 1064762, 936978, 796174, 765760, 763716, 723381, 688042, 667807, 604688, 482205, 351077, 227589, 72731, -77711, -201840, -330730, -385404, -299833, -121037, 68770, 234581, 338154, 334592, 287927, 313190, 414809, 471404, 453620, 407777, 344212, 249375, 132110, 42550, 69425, 264370, 552113, 787277, 886194, 839123, 741620, 679667, 654461, 679332, 787109, 961492, 1091475, 1130238, 1146388, 1158233, 1102217, 947186, 772024, 654672, 566330]
11512E66330o5205l270M3748L6363J0648K939J8601K2141J6123l2047j33170k16088
11500B67113k29629j53366n2764k4747p1665j14906q9260j9988k3428r4608j08782
11489g16030j7511J21998K33697L09828K87010J42127n5650k02818k33597j59355
11479b90301o9947l2121o035K7046L2899M6912R8570J15258R7094J18304J38240
11468B75919Q5732K3710j5304q5623j59357j91680j85590j02302L0070N4469n2764
11457c22720p9090N8016J84801K19404J92907J76413K11162J87636Q6191K0485
11447I35205K2938k2836k03901l18131k32519j04821n0347J0175J28996K10787
11437C75546J61272L8768q8558j70730j35832o1427j3502L0200N6396K0527l1468
$$ y = [566330, 501125, 497855, 541603, 577966, 588614, 591553, 610154, 632295, 648418, 616371, 483201, 267113, 37484, -115882, -168646, -193393, -265058, -379964, -469224, -489212, -512640, -607248, -716030, -733541, -611543, -377846, -68018, 218992, 361119, 305469, 102651, -130946, -290301, -360248, -392369, -398404, -371358, -338459, -291547, -192977, -77719, 19375, 137679, 275919, 361651, 385361, 370057, 284434, 125077, -66603, -252193, -354495, -324425, -269956, -322720, -401810, -343794, -158993, 60411, 253318, 429731, 640893, 828529, 914720, 935205, 958143, 935307, 731406, 413275, 180756, 75935, 25588, 35763, 164759, 375546, 536818, 575586, 487028, 316298, 180466, 119039, 105537, 135737, 192133, 212660, 181192]
11426A81192n2174p2656j28533j27730l2880O2253J06178P1663l9990j09385m9683
11415a91745K3052M9300O9256R9421J39114J30675L4883j7291L0315N7594K0364
11404D44938q6245k52072l77680l05647m2255J26009P6441L6580O5635M1211k5279
11393b98364K885L7927j4468l5259j433p395p6805j24717r4723m1196R642P5618
11381e68288R2197M8304K3889K5761K8726O0705R9638J09695J03670R2468O6913
11370A83678N1253L7944J9932M89J072L1260l08p1967j11048j19867p5699M5234
11358h027J61628J98189J50166L9572n0074j06669j20561j25635j24555j04631
11348i0597j21099j13677n5072n6544j32703j71195p6626O0450J27700J64222
$$ y = [181192, 129018, 56362, -72171, -199901, -232781, -170528, -64350, 7313, -32677, -142062, -191745, -168693, -119393, -50137, 49284, 188398, 319073, 353956, 336665, 366980, 424574, 444938, 358693, 106621, -271059, -576706, -618961, -492952, -416511, -379931, -314296, -273085, -298364, -295479, -257552, -272020, -307279, -308712, -316107, -392912, -517629, -612352, -653548, -643906, -568288, -476091, -427787, -403898, -378137, -349411, -288706, -189068, -79373, 24297, 116765, 183678, 234931, 272875, 292807, 293296, 294368, 325628, 325320, 253353, 142305, 22438, -53261, -8027, 153601, 351790, 501956, 541528, 491454, 384785, 264224, 138589, 14034, -90597, -211696, -325373, -380445, -436989, -569692, -740887, -817513, -757063, -629363, -465141]
11338d65141J94509K23543K50152J70134J0341n8449m0488l9219r3048j09578
11328D2756p381J34561J43495P128j01901r3409o4774j08870j26208q5412j8682
11317b78697O1944R6050N1037n9965j06392K6758J80393J97602J11509j0071q6272
11306A83896p8050k0118K4369K1423M361P799J6468j3567n3498q8823j11851l6560
11294a44151J41420K32771J44274Q396p4684j16320j20813j06406p9756J8367
11284i6902Q0923L8434J8791N7756P8580N2237p985n8395j381J52064K25950J42705
11272F82777L6332l3761r6538j02341l7925M9860M1573q0650k13335k95730k71592
11261c21330j26346K8892O3379O380p5726j01527J0401J27602J30547J11172J19787
$$ y = [-465141, -270632, -47089, 203063, 373197, 383538, 325089, 284601, 245382, 152334, 42756, 35375, 169936, 313431, 320559, 218658, 125249, 60475, -48395, -174603, -260015, -278697, -216753, -120703, -69666, -129631, -236023, -209265, -28872, 168730, 280239, 270168, 183896, 105846, 85728, 110097, 131520, 135881, 143680, 160148, 146581, 93083, 4260, -107591, -144151, -2731, 230040, 374314, 382710, 308026, 191706, 70893, -35513, -115269, -96902, -15979, 22455, 41246, 99002, 177582, 229819, 221834, 163439, 162058, 314122, 540072, 682777, 719109, 685348, 588810, 486469, 448544, 498404, 539977, 459327, 245992, -49738, -321330, -447676, -418784, -355405, -349025, -424751, -526278, -515877, -388275, -257728, -146556, -26769]
11250b6769J11140M4289n2129j16176r5188k8599k0000k4137L7388Q1076P4279
11239a4826O9707N9607M3354O0327O7593L194p1593p0714l1023k0745q808L1000
11227A17073M198j05141j47437n0067J22213K62449K62823J27942k3730r6184
11217D74139q7346n2844p1686j48036j71102j11534m5494k6411m8858o8085j5660
11206c72917R1374J47968J23246N1246l1490p7985q3396k7187P4794J46693J27988
11195A70334K6095n8966o2366r8076j87389k01305j25583n8612p4647j40244j05602
11184i16361j536M9408N4939O2683L2647J411N5288R1793Q4959Q9996J02443R6520
11172a95810N9386k1465j12363r9847j4178M6040O0402J0334r219M2945L3507
$$ y = [-26769, 84371, 128660, 76531, -39645, -134833, -163432, -183432, -207569, -170181, -89105, -14826, 54881, 114488, 157842, 218169, 285762, 288956, 217363, 146649, 115626, 94881, 86073, 117073, 121271, 16130, -131307, -181374, -59161, 203288, 466111, 594053, 570323, 474139, 386793, 333949, 262263, 114227, -56875, -168409, -213903, -240314, -289172, -357257, -372917, -281543, -133575, -10329, 40917, 9427, -68558, -151954, -179141, -104347, 42346, 170334, 196429, 137463, 75097, -22979, -210368, -411673, -537256, -595868, -670515, -810759, -916361, -917897, -868489, -813550, -750867, -718220, -716809, -661521, -569728, -484769, -394773, -292330, -195810, -136424, -157889, -270252, -370099, -384277, -338237, -277835, -267501, -276720, -233775, -200268]
11161b00268n478O2036J74018J48385L4914m8024q9796r5848p3451k7665J8963
11150a02214L2114j2556p0530p8323l6509N039r386n3465j0459P2546J07801O0681
11138i5261p7038k40550l08498k40426j15368q523Q0138J65862K67749L05467
11128b66448J82550J6471m4480l3167k9489j3574L3317R7032J18394L4486p2486
11117B2606r1835n0180m5172m5216K821k1457j14755j39692q6176K012R9825J72334
11105b94885J48261P6077J8698o6980j40515j35377l7683N5618L7254l3165m3863
11094d16560j6988K1241P5827J03681L2664p6787j23751p0951r613l8496r3117
11083f12850j10083o9761J796O9740J33987J88258K35495K85603K54136R3414
$$ y = [-200268, -205746, -143710, 30308, 178693, 213607, 165583, 75787, -20061, -93512, -121177, -102214, -70100, -82656, -153186, -231509, -268018, -262979, -272365, -325830, -336289, -263743, -155942, -95261, -172299, -412849, -721347, -961773, -1077141, -1085664, -1005526, -839664, -571915, -266448, -83898, -67427, -111907, -145074, -174563, -188137, -154820, -57788, 60606, 95092, 22606, -69229, -119409, -164581, -209797, -206976, -228433, -343188, -482880, -569056, -567044, -467219, -294885, -146624, -70547, -51849, -118829, -259344, -394721, -432404, -376786, -339532, -372697, -416560, -433548, -412307, -336480, -232799, -200135, -276922, -400673, -471624, -481237, -519733, -612850, -722933, -792694, -790898, -721158, -587171, -398913, -163418, 122185, 376321, 469735]
11073D69735q1061j35052p6549o215K6573P5256J38031J15616l3316j86374k52625
11062E4019k52693k27937j94429j48632r7689n7558o82O7509P6659M8963P0450
11051f62020J60863K17366J84537Q5436m7972j37990j24597q3468n5986k8429
11041d92260j358P7768J62853J53504J15911J21279Q8398r624r2219j73667k13307
11030b62722j22323J695R4194J70039K29222K07873J27844Q7976R9784O0598m3821
11019F50359j10626j37388j37367r5338J929J08921J37562P9303O868r1467j79342
11008B33414j37937n4657n7155q5786p5642n3619l0025j2979k7748n2639n3965
10997d08738L0641J77740K29954J30373p6400k69211k71594q1057J15716J95576
$$ y = [469735, 388674, 253622, 177073, 170858, 197431, 272687, 410718, 526334, 493018, 306644, 54019, -198674, -426611, -621040, -769672, -867361, -924919, -925601, -858092, -781433, -732470, -662020, -501157, -283791, -99254, -13818, -61790, -199780, -324377, -407845, -463831, -492260, -493618, -415850, -252997, -99493, 16418, 137697, 226095, 216471, 124252, -49415, -262722, -385045, -383350, -289156, -119117, 110105, 317978, 445822, 533798, 633582, 694180, 650359, 539733, 402345, 264978, 169640, 171569, 280490, 418052, 497355, 504223, 412756, 233414, 95477, 40820, -16335, -102121, -177763, -231382, -261407, -274386, -302134, -354773, -408738, -378097, -200357, 29597, 159970, 83570, -185641, -457235, -538292, -422576, -227000]
10987b27000J75440J01949O831r140J39156K97670K71315R9785p5892j55792j24940
10976D99382j11002j84292k23536j26879k4879k9414p9404q6582J4328J89092
10966a63186K98383K53586J04445m6297j29347j34124p6189K770M2465J2189m2203
10955A22492m0073L8069J01085M7372n9016j19533j10925o1536j5610K6446M9055
10944b2174l0832j67532j95932j13433l621J14274J68509J54605J62407J94470
10934B60741J88163J61108J04718K232p4391q7341j7584J7688O26L9245P5436
10923F70641L2763m3782r4517j47377j87416j53964r6211l1364M7329N9649J1686
10912F7437l6937o3144p5395q1180n3893k634L8001M4667J0780m3729r8734j07762
$$ y = [-227000, -51560, 50389, 57220, 48080, 187236, 484906, 756221, 856006, 780114, 624322, 499382, 388380, 204088, -19448, -146327, -171206, -200620, -280024, -366606, -352278, -163186, 135197, 388783, 493228, 446931, 317584, 183460, 107271, 110041, 152506, 164695, 122492, 82419, 120488, 221573, 268945, 209929, 90396, -20529, -82065, -97675, -71229, -22174, -53006, -220538, -416470, -529903, -533524, -419250, -250741, -96136, 66271, 260741, 448904, 610012, 714730, 716962, 642571, 555230, 537646, 555334, 555960, 595205, 670641, 703404, 659622, 565105, 417728, 230312, 76348, -19863, -51227, -3898, 55751, 67437, 30500, -32644, -108039, -189219, -243112, -245746, -207745, -163078, -152298, -196027, -294761, -402523]
10900d02523n0264j6416l4907k0720K6935J02066J91491K07944J03613n1300j29561
10889g3642j02788r9K9081o6782j02950J2039J36956J64171Q4719n987j4661k882
10877E7175m2752r9934j24287r3990j712P8716J16991J48478J49895O0285p8734
10866A70131j45791j35036j39832j64509j24083m2068k493k3781k8124L6446P2491
10855e26649N4624M8397O4634N1740L0797M1968L1674J2675J2330M5155L7179
10844i5476q6113j62537j23070k383J44115J85425N7788j55807j99247l3762J35469
10833c35598K00064J81853J34886J07345R7852M6360l9249n5283m8595q1074o4075
10822A44486m5340q3532j06731q9794n1837L980P6266J40224J75218J96149J87239
$$ y = [-402523, -452787, -469203, -504110, -524830, -497895, -395829, -204338, 3606, 107219, 55919, -73642, -176430, -176529, -147448, -214230, -317180, -305141, -168185, -4014, 80705, 74718, 60057, 57175, 14423, -85511, -209798, -303788, -305500, -226784, -109793, 38685, 188580, 248865, 170131, 24340, -110696, -250528, -415037, -539120, -581188, -583681, -607462, -635586, -599140, -526649, -472025, -423628, -358994, -307254, -276457, -234489, -202815, -190140, -177810, -132655, -95476, -181589, -344126, -467196, -469579, -325464, -140039, -82251, -238058, -437305, -471067, -335598, -135534, 46319, 181205, 288550, 386402, 432762, 393513, 338230, 289635, 208561, 144486, 99146, 15614, -91117, -180911, -232748, -228768, -152502, -12278, 162940, 359089, 546328]
10811E46328Q8388k2778n6733m6247m6917q8244j30551j11709J554J53190K21079
10800E07360J50205r387j40341k02166k37727j61250k6874L0349J7419j8697m4596
10789a35705k3170M9192J31976J87714J53277J6578j52814k63176k39078j26047
10779d01253j0959K5465o4883j76305j66117q7018n4668q4567j19267j23317n4837
10768a317726J03722K59383K94042K12125J17861P4344R4376J04487M0643m5459
10758f2202q9364l8538M0859m678j46271k18590j69207n0768O9839J15717O8795
10747d84408J88r9852j62397j09586j9609j1696j9652N8015J61425J97606J95791
10736b94175K02336J83891J17100M0323l301j3619j3035j4318j1092j0514J4818
$$ y = [546328, 634716, 611938, 555205, 508958, 462041, 373797, 243246, 131537, 133091, 286281, 507360, 657565, 648178, 507837, 305671, 67944, -93306, -120180, -89831, -72412, -91109, -135705, -158875, -109683, 22293, 210007, 363284, 379862, 227048, -36128, -275206, -401253, -412212, -386747, -451630, -627935, -794052, -881070, -935738, -1020305, -1139572, -1262889, -1317726, -1214004, -954621, -660579, -448454, -330593, -256249, -161873, -57386, -16743, -62202, -151566, -190104, -149245, -153923, -300194, -518784, -687991, -738759, -668920, -553203, -484408, -484220, -584072, -746469, -856055, -875664, -887360, -907012, -848997, -687572, -489966, -294175, -91839, 92052, 209152, 249475, 246174, 232555, 219520, 205202, 194110, 183596, 198414]
10725A98414M0994L3199k5620j19326j99037k11195j19328N9090K36756L08704
10715B02651J92388O234o9741p0792p0502n2637m1537m7418o2277o8597n8385
10704a40613k4515K5866Q0635R7523N8731J9350J0685k3256o4057k3346J2779
10693B9782n3709j46893j76515j00212Q4578K44492K81491J91688O64j39642j66183
10682D9541j45708r8578m7947J5526J08948J47815Q1688o464k1776r475j1101
10671F2469l9660p3029q2170m8029K1227P3944N8929K7039M8829P1610J5139q6407
10659D9891j44786j27877m1666Q8302J84309J79920P3269p9880j87160j99603
10649b05281r5233L9205J04144R7128N8770P6913J73625K35352J87642Q8637K1214
$$ y = [198414, 239408, 272607, 246987, 127661, -71376, -282571, -401899, -342809, -106053, 202651, 395039, 401273, 331532, 260740, 190238, 137601, 96064, 48646, -13631, -82228, -140613, -165128, -139262, -58627, 38896, 97627, 116977, 127662, 104406, 40349, 17003, 29782, -23927, -170820, -347335, -447547, -362969, -118477, 163014, 354702, 355366, 215724, 49541, -96167, -194745, -242692, -227166, -118218, 29597, 111285, 104821, 83045, 73570, 62469, 22809, -50220, -132390, -180419, -159192, -85248, -26319, 720, 49549, 121159, 136298, 49891, -94895, -222772, -264438, -176136, 8173, 188093, 261362, 181482, -5678, -205281, -300514, -261309, -157165, -60037, -1267, 75646, 249271, 484623, 672265, 760902, 782116]
10638G82116o2369k05108l12298l35247k85800j75217r7261q0203m7946P6974
10628g42359K20198K52583J89945J20517M2843n687M5021J05267N7034r0882k07276
10617a2796k21156j58715r3248r3100j41689j36047l9182O5936J16614P7324m337
10606f40396m1551m8157l6608K5372J31488K00210J81218J44084J08963Q5581
10596A10204O9352M3335N6877R0510R9511Q4069L1615l7949r2885j41381j63423
10585A49835j46707j06859j2002P3639R6884R4669O2629j2117q7192j22475r6620
10574a06316k9714L3196M8785j2377j18471j95412k02189j46241l4370J21420
10564f41689K42579K36370J59478M5036o8641n3098P3652J08617j1369p7891O111
$$ y = [782116, 719747, 514639, 202341, -132906, -418706, -593923, -691184, -771387, -819333, -742359, -522161, -269578, -79633, 40884, 83727, 78040, 123061, 228328, 285362, 194480, -12796, -233952, -392667, -485915, -579015, -720704, -856751, -895933, -829997, -713383, -636059, -640396, -681947, -730104, -766712, -741340, -609852, -409642, -228424, -84340, 24623, 110204, 179556, 222891, 279768, 370278, 469789, 553858, 585473, 547524, 454639, 313258, 149835, 3128, -103731, -115733, -42094, 54790, 149459, 212088, 199971, 112779, -9696, -106316, -136030, -102834, -54049, -66426, -184897, -380309, -582498, -728739, -763109, -641689, -399110, -162740, -3262, 41774, -26867, -79965, -6313, 102304, 90935, 13044, 19155]
10553A9155L2203o4001j37462j37603j09788p4818l7251l2230q0499j07972n1431
10542g81697N1760J11223J16591J34497K49781L65976L27797J75564N8320L1442
10532H41254K5294j8975j38170k42788k23802j64447j52593j28107p4803l4731
10522c11868l7065n7419m7140j4039M010N7509J11315J05796J06609P5518m1838
10511d8612j39615j52871q5423K2896Q7209J04684J05405O8305m177l3715L0039
10500d5875J05434R8994Q872r3489j20074r1460l4830R502j5635p7133j01091
10489c56785p7469o5416o4247o8633o2746n3366o3745k9131Q8837J92749J81180
10478c78772Q8926J4728l1117j7997L6348R299q9372j74232j81748j41574o6308
$$ y = [19155, 51358, -12643, -150105, -287708, -397496, -472314, -509565, -541795, -622294, -730266, -781697, -729937, -618714, -502123, -367626, -117845, 248131, 575928, 751492, 809812, 841254, 866548, 847573, 709403, 466615, 242813, 78366, -74227, -202334, -277137, -311868, -348933, -406352, -453492, -467531, -463521, -406012, -294697, -188901, -82292, -6774, -48612, -188227, -341098, -426521, -403625, -316416, -211732, -106327, -38022, -42199, -75914, -45875, 59559, 158553, 167425, 73936, -46138, -137598, -172428, -162926, -178561, -255694, -356785, -434254, -499670, -563917, -632550, -695296, -748662, -812407, -841538, -752701, -559952, -378772, -289846, -275118, -306235, -324232, -287884, -278585, -367957, -542189, -723937, -865511, -931819]
10467i31819M4825J54868K22721J97932J10761K507j38595k19453k11975k20718
10457i88946j94372o7719M3464Q6044J24039J31384N0709o4436j21608j43911
10447a145352j64082j39303j4786J73135L21983L33651J70445n5202j78319j42576
10437h40406p1227l9805p413P068k1804k4643O1735J15063Q9092Q3739J17589
10426e31012P5022k2595p5133q7608r4405q9773r2955q3671l201J37019K90653
10415e77659L69715L15332J25471p1875j18751q4926r7702m3727L4100N0984L8264
10404f0774m226l9456m6849n9283k5007L2254J5629o6618j27951j05904k7804
10393e15989M8112R3581J02406O6030K3480L768j3804l756L9678Q8277Q1207j4488
$$ y = [-931819, -886994, -732126, -509405, -311473, -200712, -198205, -336800, -556253, -768228, -988946, -1183318, -1251037, -1207573, -1121529, -997490, -866106, -815397, -879833, -1001441, -1145352, -1309434, -1448737, -1463523, -1290388, -968405, -634754, -464309, -519511, -697830, -840406, -911633, -951438, -958851, -951783, -973587, -998230, -936495, -821432, -732340, -648601, -531012, -455990, -478585, -553718, -641326, -735731, -825504, -918459, -1002130, -1005331, -868312, -577659, -207944, 107388, 232859, 160984, 42233, -42693, -140395, -184122, -150022, -99038, -60774, -65000, -104456, -151305, -210588, -235595, -203341, -187712, -254330, -382281, -488185, -515989, -467877, -374296, -271890, -205860, -182380, -178612, -192416, -196172, -156494, -68217, 12990, -1498]
10381a498j09865j62576j91000j59265j22217p3664J2590M1066K5660K0705N3936
10370f66128Q2221J12674J53935J54602J34430J08480O5393Q1602J40077J22693
10360D89979L3296m3319q5299j45552k20661k33963j93082j51796j44225j20619
10350h15241k9591R7334K33273K84560J96277J24086R8634M0925j7476l9776l7171
10339A35834O691P8932M5964q9671j89283j76990j05158m5165m0573m5840J1113
10328d14146R6043J14845K2935r3535j54441j07564M853O6216N9345J1562l1834
10317d25721j4239L7270O1510N9483O7095R3957J29880J31997N8676l5590n8295
10306A06023K2625R1216J9170q5572q5259k4627j7492o5461m8270O8253J29997
$$ y = [-1498, -111363, -273939, -464939, -624204, -746421, -820085, -807495, -766429, -740769, -720064, -666128, -583907, -471233, -317298, -162696, -28266, 80214, 145607, 227209, 367286, 489979, 523275, 479956, 394657, 249105, 28444, -205519, -398601, -550397, -694622, -815241, -844832, -747498, -514225, -229665, -33388, 90698, 189332, 230257, 212781, 173005, 135834, 142525, 221457, 267421, 177750, -11533, -188523, -293681, -338846, -379419, -425259, -414146, -318103, -203258, -180323, -273858, -428299, -535863, -531010, -464794, -405449, -393887, -425721, -439960, -402690, -341180, -281697, -214602, -120645, 9235, 141232, 199908, 164318, 106023, 128648, 219864, 239034, 153462, 68203, 43576, 26084, -39377, -87647, -19394, 110603]
10295A10603R1720K3842k8432m4177j1867K3744J7406m3391j12585j38371j22905
10284b34413r8113m6278K8774L2036l4795o6666o7289p7737q9956q9781n8947
10273h03165K09O0705N7220J5109k9958m7546K2336J08614J07185O3105M9009
10262c97177M3432N8890Q8260O9859j1077r1212j44977j99539j96859o5937O8025
10251g78312Q3331K6342k7935q8926j68796j66049r0648P001P9802J08831J21807
10240h93552J43474K11834K52728K04121J03947l0301j47455j88539j49160n1828
10230e44731N4942J17689J29366J25095J34166J74273J66846L8787j06942j76799
10220A12692j65531j20420p0760J3123J33046K18398K01048R9398N3957J12854
$$ y = [110603, 202323, 226165, 197733, 153556, 141689, 165433, 182839, 139448, 26863, -111508, -234413, -332526, -378804, -350030, -317994, -352789, -419455, -486744, -564481, -654437, -744218, -803165, -802956, -742251, -685031, -669922, -699880, -747426, -725090, -616476, -509291, -446186, -397177, -353745, -294855, -206595, -136736, -147813, -239025, -384002, -583541, -780400, -846337, -778312, -694981, -668639, -696574, -785500, -954296, -1120345, -1210993, -1203992, -1124190, -1015359, -893552, -750078, -538244, -285516, -81395, 22552, -7749, -155204, -343743, -492903, -544731, -489789, -372100, -242734, -117639, 16527, 190800, 357646, 396433, 289491, 112692, -52839, -173259, -244019, -230896, -97850, 120548, 321596, 420994, 474951, 587805]
10210E87805J49143J34478J21543O5996k3379j17423j58494j19708k3443J05554
10200G22072J93257J61274J538j81044l16864m06560m08914k75848j21109n8219
10190f90417l9919j5613L483j4786l8446K4454J16996J20112R6798R7018O4917
10179b75403J8209m718j9369l3359j6245K2172K1506j2829j4719J1230R737j8031
10167c11819o2400o3542M592O0033P5803J22987J54457J11026N4723L2340m25
10156A77775n3207m6299M2770J69187J95118J04660K7366J7659M8256O1748M0906
10145G85939L2590K7773J124m8689n2518k7134o6298j36306j88774j95154j39352
10134f799p1009p3970m9752Q0861J56359J07243J1250j24259j96600j15574L5349
$$ y = [587805, 736948, 871426, 992969, 1058965, 1035586, 918163, 759669, 639961, 616518, 722072, 915329, 1076603, 1078141, 897097, 580233, 173673, -235241, -511089, -632198, -690417, -730336, -745949, -742466, -757252, -795698, -771244, -654248, -534136, -437338, -340320, -275403, -257194, -261912, -281281, -314640, -330885, -308713, -287207, -300036, -314755, -303525, -293788, -311819, -374219, -437761, -433169, -373136, -297333, -174346, -19889, 91137, 145860, 178200, 177775, 124568, 78269, 121039, 290226, 485344, 590004, 617370, 635029, 683285, 745033, 785939, 818529, 846302, 847426, 798737, 746219, 719085, 652787, 516481, 327707, 132553, -6799, -77808, -151778, -201530, -120669, 35690, 142933, 154183, 29924, -166676, -282250, -246901]
10123b46901J27847J28404M2254m2848o8223r2350r0886m0042J415K3389N9881
10112a98060R1001O8226J4388k1260J2023M4452L4635P5919J63266J58464M7166
10101D90220l2696n4847m2675L6299O5842o3156j83065j86781j27323n0557L667
10090a45072K6659P374l8584k9230K6651K1452m1537o3884j92P4317J09333J18108
10078F5395J05229M0937l2984m0120k030O2113P2778j9824j14309j90265k57962
10067c11042k46916j54320o137N2147J5044p436o3600j38034j48432j01924J623
10056a109027J34006J71714J07144N6031N0479j2725j30074j72778r9759K4878
10046i80111J36313J94549J80890J59790J90343K19453J35352o246r1885r3869
$$ y = [-246901, -119054, 9350, 51604, 8756, -59467, -151817, -242703, -282745, -281330, -257941, -198060, -107059, -38833, -24445, -45705, -33682, 10770, 45405, 121324, 284590, 443054, 490220, 457524, 402677, 360002, 396301, 462143, 398987, 215922, 29141, -98182, -148739, -145072, -118413, -111039, -149623, -178853, -152202, -130750, -172287, -236171, -236363, -162046, -52713, 65395, 170624, 211561, 178577, 138457, 136427, 198540, 271318, 251494, 137185, -53080, -311042, -557958, -712278, -718415, -666268, -651224, -658660, -722260, -860294, -1008726, -1110650, -1109027, -975021, -803307, -696163, -640132, -589653, -602378, -732452, -905230, -1004989, -980111, -843798, -649249, -468359, -308569, -118226, 101227, 236579, 230333, 138448, 44579]
10036D4579o4346k1583j083l3581o6550n8591O771J02705J31497O4098k4767o4059
10024A5090k0533O6852R8908O8451L6472L7267O6347Q2485R3757R3940N3213j6261
10012F75988p7411q9994k3611N4306O9161K7890k8704k8815P083j7796p5587p6859
10000D15651l4006j1467l4086j00321j65762j83514j69045j58233p8163M3445
9990d75501N1949n9814j18110o3876K006N9690J12561J47740J68590J63395J14448
9979A03078M3399K8009Q1390J36261J29946L1324r1084j56917j26649m1731L3307
9968A70333N1943K3192L3035J21410J92227J25031k2859r8439r2570n7811m9151
9957C96341o2992p7427p9065k9440L4023L0939k32J2010J5628l3616j01774j33316
$$ y = [44579, -19767, -41350, -42433, -76014, -142564, -201155, -194384, -91679, 39818, 103916, 79149, 15090, -5443, 61409, 160317, 228768, 265240, 302507, 368854, 451339, 545096, 639036, 692249, 675988, 598577, 508583, 484972, 539278, 608439, 636329, 607625, 578810, 585893, 568097, 492510, 415651, 381645, 370178, 336092, 235771, 70009, -113505, -282550, -440783, -518946, -475501, -423552, -483366, -601476, -665352, -663346, -603656, -491095, -343355, -174765, -11370, 103078, 146477, 174486, 255876, 392137, 522083, 553407, 462323, 305406, 178757, 137026, 170333, 222276, 245468, 278503, 399913, 592140, 717171, 694312, 595873, 503303, 445492, 396341, 333349, 255922, 176857, 147417, 181440, 212379, 212147, 224157, 239785, 206169, 104395, -28921]
9945b8921q5578k8957J562m524n2910p3135j5037M4143J9290m7702p5203m6617
9933c93589M4144J46743J10215j4448o7373p1597n1604k6714L458J8191j5212
9922c17786l1090m3528q8109q7676k9547J5814N1645R0170J06544Q5528Q1688
9911a66347J28337J62200J15038p419j03635j03303n2454K5345Q9186P6550J204
$$ y = [-28921, -114499, -143456, -141894, -146418, -199328, -272463, -287500, -243357, -224067, -271769, -346972, -393589, -349445, -202702, -92487, -106935, -174308, -245905, -297509, -324223, -320765, -302574, -317786, -348876, -392404, -480513, -568189, -597736, -581922, -530277, -440107, -333563, -248035, -166347, -38010, 124190, 239228, 231809, 128174, 24871, -27583, -2238, 86948, 163498, 164702]
$$ [...]
##END NTUPLES=NMR SPECTRUM
##END=
