##TITLE=C13_Aleurific-aced
 Py-d5, 22500 sc

 26.9.2019
##JCAMPDX= 6.0         $$ Bruker NMR JCAMP-DX V2.0
##DATA TYPE= NMR SPECTRUM
##DATA CLASS= NTUPLES
##ORIGIN= UXNMR, Bruker Analytische Messtechnik GmbH
##OWNER= root
$$ XWIN-NMR		Version 3.5
$$ Fri Sep 27 14:01:10 2019 Russian Standard Time (UT+4h)  she@DPX200
##.OBSERVE FREQUENCY= 50.327896
##.OBSERVE NUCLEUS= ^13C
##.ACQUISITION MODE= SIMULTANEOUS
##.ACQUISITION SCHEME= undefined
##.AVERAGES= 22500
##.DIGITISER RES= 17
##SPECTROMETER/DATA SYSTEM= spect
##.PULSE SEQUENCE= zgpg30
##.SOLVENT NAME= Pyr
##.SHIFT REFERENCE= (INTERNAL, Pyr, 0, 222.624)
##AUDIT TRAIL= $$ (NUMBER, WHEN, WHO, WHERE, WHAT)
$$ ##TITLE= Audit trail, XWIN-NMR		Version 3.5
$$ ##JCAMPDX= 5.01
$$ ##ORIGIN= Bruker BioSpin GmbH
$$ ##OWNER= she
$$ F:/spectra/data/she/nmr/c13/1/pdata/1/auditp.txt
$$ ##AUDIT TRAIL=  $$ (NUMBER, WHEN, WHO, WHERE, WHAT)
(   1,<2019-09-27 13:58:59.95 +0400>,<she>,<DPX200>,
      <created by zg, POWCHK disabled, PULCHK disabled
       terminated by command 'halt'
       configuration hash MD5:
       00 E9 B6 7A A2 85 ED C7 34 08 36 98 17 FE 4E 26
       data hash MD5: 32K
       A3 0D BD B1 3D 4C E9 1A A6 92 2B FB BB C0 52 6F>)
(   2,<2019-09-27 13:59:02.81 +0400>,<she>,<DPX200>,
      <Start of raw data processing
       efp BC_mod = 2 LB = 1 FT_mod = 6 PKNL = 1 PHC0 = -372.0838 PHC1 = 22.00636 SI = 32K 
       data hash MD5: 32K
       A4 64 F1 D1 58 A0 97 AD 41 83 74 3B 56 43 2C E8>)
(   3,<2019-09-27 13:59:05.53 +0400>,<she>,<DPX200>,
      <abs ABSG = 5 
       data hash MD5: 32K
       B6 83 B3 03 E5 4C C9 8D D1 0B 90 9C E0 56 14 F6>)
(   4,<2019-09-27 14:00:18.57 +0400>,<she>,<DPX200>,
      <pk PHC0 = -0.6609518 PHC1 = 0.8000017 
       data hash MD5: 32K
       11 99 BC 75 3A A8 98 46 40 6E 5A 3E 6F 93 90 B3>)
$$ ##END=
$$ 
$$ hash MD5
$$ 65 2D 3C D6 46 53 F4 29 E3 EF 37 E5 8D 9F 6C F8
##$RELAX= 
##$RELAX= 
##$RELAX= 
##$RELAX= 
##$RELAX= 
##$RELAX= 
##$RELAX= 
##$RELAX= 
$$ Bruker specific parameters
$$ --------------------------
##$DU= <F:/spectra>
##$EXPNO= 1
##$NAME= <c13>
##$PROCNO= 1
##$TYPE= <nmr>
##$USER= <she>
##$AMP= (0..31)
100 100 100 100 100 100 100 100 100 100 100 100 100 100 100 100 100 100 
100 100 100 100 100 100 100 100 100 100 100 100 100 100 
##$AQSEQ= 0
##$AQ_mod= 1
##$AUNM= <au_zg>
##$AUTOPOS= <>
##$BF1= 50.322709
##$BF2= 200.13
##$BF3= 50.322709
##$BF4= 500.13
##$BF5= 500.13
##$BF6= 500.13
##$BF7= 500.13
##$BF8= 500.13
##$BYTORDA= 1
##$CFDGTYP= 0
##$CFRGTYP= 5
##$CHEMSTR= <none>
##$CNST= (0..31)
1 1 145 1 1 1 1 1 1 1 1 1 1 1 1 1 1 1 1 1 1 1 1 1 1 1 1 1 1 1 1 1 
##$CPDPRG= <waltz16>
##$CPDPRG1= <>
##$CPDPRG2= <waltz16>
##$CPDPRG3= <>
##$CPDPRG4= <mlev>
##$CPDPRG5= <mlev>
##$CPDPRG6= <mlev>
##$CPDPRG7= <mlev>
##$CPDPRG8= <mlev>
##$CPDPRGB= <>
##$CPDPRGT= <>
##$D= (0..31)
0 2 0.00345 0 0 0 0 0 0 0 0 0.03 2e-05 3e-06 0 0 0 0 0 0 0 0 0 0 0 0 0 
0 0 0 0 0 
##$DATE= 1569501547
##$DBL= (0..7)
120 120 120 120 120 120 120 120 
##$DBP= (0..7)
150 150 150 150 150 150 150 150 
$$ [...]
##$SUBNAM4= <"">
##$SUBNAM5= <"">
##$SUBNAM6= <"">
##$SUBNAM7= <"">
##$SUBNAM8= <"">
##$SUBNAM9= <"">
##$SW= 239.972175391363
##$SWIBOX= (0..15)
0 1 3 0 0 0 0 0 0 0 0 0 0 0 0 0 
##$SW_h= 12077.2946859903
##$TD= 32768
##$TD0= 1
##$TE= 0
##$TE2= 300
##$TE3= 300
##$TEG= 300
##$TL= (0..7)
120 120 120 120 120 120 120 120 
##$TP= (0..7)
150 150 150 150 150 150 150 150 
##$TP07= 0
##$TPNAME0= <>
##$TPNAME1= <>
##$TPNAME2= <>
##$TPNAME3= <>
##$TPNAME4= <>
##$TPNAME5= <>
##$TPNAME6= <>
##$TPNAME7= <>
##$TPOAL= (0..7)
0.5 0.5 0.5 0.5 0.5 0.5 0.5 0.5 
##$TPOFFS= (0..7)
0 0 0 0 0 0 0 0 
##$TUNHIN= 0
##$TUNHOUT= 0
##$TUNXOUT= 0
##$USERA1= <user>
##$USERA2= <user>
##$USERA3= <user>
##$USERA4= <user>
##$USERA5= <user>
##$V9= 5
##$VALIST= <valist>
##$VCLIST= <CCCCCCCCCCCCCCC>
##$VD= 0
##$VDLIST= <DDDDDDDDDDDDDDD>
##$VPLIST= <PPPPPPPPPPPPPPP>
##$VTLIST= <TTTTTTTTTTTTTTT>
##$WBST= 1024
##$WBSW= 4
##$XGAIN= (0..3)
0 0 0 0 
##$XL= 0
##$YL= 0
##$YMAX_a= 146812646
##$YMIN_a= -78016883
##$ZGOPTNS= <>
##$ZL1= 120
##$ZL2= 120
##$ZL3= 120
##$ZL4= 120
##$ABSF1= 222.624
##$ABSF2= -17.3728
##$ABSG= 5
##$ABSL= 3
##$ALPHA= 0
##$AQORDER= 0
##$ASSFAC= 0
##$ASSFACI= 0
##$ASSFACX= 0
##$ASSWID= 0
##$AUNMP= <proc_1d>
##$AZFE= 0.1
##$AZFW= 0.5
##$BCFW= 0
##$BC_mod= 2
##$BYTORDP= 0
##$COROFFS= 0
##$CY= -3
##$DATMOD= 1
##$DC= 0
##$DFILT= <>
##$DTYPP= 0
##$F1P= 0
##$F2P= 0
##$FCOR= 0.5
##$FTSIZE= 32768
##$FT_mod= 6
##$GAMMA= 0
##$GB= 0
##$INTBC= 1
##$INTSCL= 4.134877e-10
##$ISEN= 128
##$LB= 1
##$LEV0= 0
##$LPBIN= 0
##$MAXI= 10000
##$MC2= 0
##$MEAN= 0
##$ME_mod= 0
##$MI= 0.1934396
##$NCOEF= 0
##$NC_proc= 3
##$NLEV= 6
##$NOISF1= 120.0001
##$NOISF2= 80.00006
##$NSP= 0
##$NTH_PI= 0
##$NZP= 0
##$OFFSET= 222.624
##$PC= 1.4
##$PHC0= -372.7448
##$PHC1= 22.80636
##$PH_mod= 1
##$PKNL= yes
##$PPARMOD= 0
##$PSCAL= 0
##$PSIGN= 0
##$REVERSE= no
##$SF= 50.3227315989248
##$SI= 32768
##$SIGF1= 140
##$SIGF2= 120
##$SINO= 11.81781
##$SIOLD= 32768
##$SREGLST= <13C.CDCl3>
##$SSB= 0
##$STSI= 32768
##$STSR= 0
##$SW_p= 12077.2946859903
##$SYMM= 0
##$S_DEV= 0
##$TDeff= 32768
##$TDoff= 0
##$TI= <>
##$TILT= no
##$TM1= 0
##$TM2= 0
##$TOPLEV= 0
##$USERP1= <user>
##$USERP2= <user>
##$USERP3= <user>
##$USERP4= <user>
##$USERP5= <user>
##$WDW= 1
##$XDIM= 32768
##$YMAX_p= 372821098
##$YMIN_p= -1155387
$$ End of Bruker specific parameters
$$ ---------------------------------
##NTUPLES= NMR SPECTRUM
##VAR_NAME=  FREQUENCY,     SPECTRUM/REAL,   SPECTRUM/IMAG
##SYMBOL=    X,             R,               I
##VAR_TYPE=  INDEPENDENT,   DEPENDENT,       DEPENDENT
##VAR_FORM=  AFFN,          ASDF,            ASDF
##VAR_DIM=   32768,         32768,           32768
##UNITS=     HZ,            ARBITRARY UNITS, ARBITRARY UNITS
##FACTOR=    0.368581032318806, 1,           1
##FIRST=     11203.0474431902, 0,            0
##LAST=      -874.247242800138, 0,           0
##MIN=       -874.247242800138, -1155387,    0
##MAX=       11203.0474431902, 372821098,    0
$$ Real data points
##PAGE= N=1
##DATA TABLE= (X++(R..R)), XYDATA
$$ [...]
24437 -131294 -39213 105750 255195 176837 58015 105624 176687 -11523 -217885 -269538
24427 -269538 -269210 -330683 -521749 -505260 -429635 -525900 -628981 -566506 -404148 -155005 -1748
24416 -1748 59105 -32847 -99587 36980 209296 219212 49788 -229753 -391796 -186281 74440
24405 74440 89132 53476 56369 -46343 -81131 -52321 -28841 -38395 -17739 126389 41267 -191734
24393 -191734 -169328 52658 240224 144887 -114581 46645 308644 226185 63718 -68453
24383 -68453 -111054 -47345 -6925 33176 80158 126449 144459 63542 -63528 -268775 -319225
24372 -319225 -227336 -20256 173994 306498 405660 203295 -164620 -472930 -556960 -471864
24362 -471864 -134752 169174 178196 130409 260328 340761 126154 22191 99130 -32368
24352 -32368 -176985 -387505 -445623 -348699 -86862 277755 402730 312834 230003 165966 239961
24341 239961 419050 520153 343312 191300 119406 158598 196471 48087 3551 -65388
24331 -65388 -437680 -630734 -379956 -61327 50244 18655 -233316 -89129 6267 -179449
24321 -179449 -234840 -355423 -464866 -323868 -191476 -318674 -554259 -617945 -586936 -649032
24311 -649032 -684756 -561759 -224362 226183 463719 368877 340492 346469 88093 -239858
24301 -239858 -371046 -526492 -299637 -21992 37425 -76325 -302421 -671627 -988275 -1076074
24291 -1076074 -1081020 -1155387 -998071 -614944 -364595 -361693 -253686 -74969 59170 163846
24281 163846 -2905 -340593 -512235 -556221 -405681 -196124 -13069 11360 -198627 -358734
24271 -358734 -334047 -201356 -74458 44918 220671 329390 293278 101191 -62153 74257
24261 74257 136249 89424 27021 -252422 -569275 -714052 -622133 -408678 -215738 -177971 -34268
24250 -34268 86983 85926 5215 -222500 -134034 177947 365354 517350 506280 308531 175153
24239 175153 -62588 -227321 -77552 -69565 -341858 -545857 -536726 -480611 -387504 -276535 -306502
24228 -306502 -252085 -167636 -76810 -87576 -364362 -484414 -505854 -413680 -236513 -105090 -62571
24217 -62571 -26422 -121415 -241781 -325803 -190195 -74520 -127199 -147157 -138579 -109309 -145929
24206 -145929 -202029 -346487 -532434 -518964 -421781 -637583 -715689 -574622 -475358 -314385
24196 -314385 -64810 235077 383140 123508 -223499 -269697 -67649 241182 467689 480185
24186 480185 421751 317086 10905 -190590 -257135 -489386 -661825 -655593 -502123 -227795
24176 -227795 -5020 135011 108592 61447 122058 152475 180202 342737 252023 -15945 8408
24165 8408 175960 214294 150804 197707 225038 226539 11210 -260428 -323848 -205572 58754
24154 58754 162961 109469 90449 19652 -110265 -122712 -21159 20743 -88869 -172464 -58770
24143 -58770 40512 77671 16911 -197007 -442416 -488682 -421258 -354111 -419411 -679712 -842142
24132 -842142 -867755 -833300 -745953 -571727 -422722 -254165 -27940 707 -128550 -116228
24122 -116228 -27931 96930 21760 -64136 -191664 -243585 -68181 128271 10793 -205704
24112 -205704 -156958 -36398 -122851 -238062 -328702 -421945 -400259 -310681 -124688 -18265 -11484
24101 -11484 -232833 -241157 -32645 127491 222245 276721 241881 171909 90892 -58011 -193597
24090 -193597 -69806 -19031 -275250 -479317 -394561 -390798 -652717 -730326 -561646 -525871 -603999
24079 -603999 -549169 -443136 -449684 -379882 -247301 -117465 -145189 -313895 -404081 -436182 -267377
24068 -267377 -22381 144285 179888 -44265 -288929 -363761 -239150 -156329 -79978 -14534
24058 -14534 11800 -37584 -79707 142339 175131 53040 -224332 -378221 -231591 -199534 -477489
24047 -477489 -694731 -477202 -212739 -90681 133317 240975 149454 -86198 -207192 -79806
24037 -79806 -181305 -291756 -182568 -162406 -144768 46484 263581 426774 404709 128190
24027 128190 -89391 -242469 -268439 -241501 -234010 -231965 -350157 -541728 -792011 -831040 -599909
24016 -599909 -576742 -591961 -588544 -638458 -913930 -1094526 -993921 -709345 -666906 -800576 -843247
24005 -843247 -727731 -643948 -495161 -251755 -90402 -194295 -204433 -145848 -161604 -201557
23995 -201557 -107004 52781 65083 209188 171712 -21065 -133081 -170171 -263457 -254504 -132600
23984 -132600 -273638 -214039 -187564 -107375 -42805 -74360 21514 -36580 -190559 -199967 -356532
23973 -356532 -502793 -528593 -454768 -236840 -124964 -154583 -406336 -397630 -146391 24428
23963 24428 12760 -170790 -318897 -353632 -474352 -453135 -418116 -465440 -384220 -268919 -332621
23952 -332621 -188272 48922 66288 -90944 -105777 -26623 9139 -116945 -226304 -337932
23942 -337932 -519173 -498063 -332952 -388285 -446269 -506612 -510161 -494100 -352464 -279604 -285436
23931 -285436 -248610 -163621 -225738 -323116 -482011 -455205 -169332 79465 -11094 -365034 -672216
23920 -672216 -434656 -150796 -265008 -281910 -276209 -430070 -584796 -640019 -587183 -491520 -384118
23909 -384118 -236014 -70681 171969 225555 191097 237947 122161 -273753 -544367 -519467
23899 -519467 -421312 -347574 -282929 -242379 -74070 9348 -23243 -38017 -254256 -318106 -320164
23888 -320164 -365837 -402826 -244039 -108914 -84073 -219992 -258872 -13769 203904 332835
23878 332835 171629 -50381 -232704 -524844 -628305 -553523 -291969 -146684 -120756 -231587
23868 -231587 -480789 -428236 -230984 -56249 5585 -53489 -163114 -156819 -149414 -341832 -726133
23857 -726133 -1058662 -978655 -697220 -564032 -552669 -768474 -894248 -815515 -555678 -273844
23847 -273844 -96616 -42729 13002 -114651 -406002 -501141 -596538 -486241 -213277 -372109
23837 -372109 -675188 -590720 -419625 -435411 -577134 -712888 -551463 -284266 -408802 -588101
23827 -588101 -477998 -541730 -725061 -785272 -671477 -650585 -738457 -605325 -433227 -342970
23817 -342970 -193221 37905 -13513 -278338 -243234 -351027 -610187 -589897 -457794 -244443
23807 -244443 -194139 -186986 -51718 147334 328339 237313 26749 -75874 -84516 -214607 -261936
23796 -261936 -330391 -369021 -430941 -431656 -277780 -333313 -351155 -193929 -94238 -98300 -166903 -147570
23784 -147570 -187420 -217633 -160240 -289194 -390394 -267933 49840 141537 -100314 -297996
23774 -297996 -246069 -210564 -395039 -401323 -485768 -593095 -438038 -375739 -371974 -433748 -522961
23763 -522961 -372645 -315944 -531240 -520450 -341635 -272393 -442781 -535808 -633546 -719940 -621893
23752 -621893 -614403 -491411 -269791 -136191 -327653 -507335 -648104 -780265 -633975 -378370
23742 -378370 -385777 -339105 -256982 -173966 -164271 -178564 -153195 -231098 -309290 -424217 -499205 -363053
23730 -363053 -248409 -282694 -477396 -513500 -231548 -78372 -33414 -46687 -169215 -320448
23720 -320448 -379762 -409443 -266041 -231690 -354342 -110476 100735 51052 -115887 -85554
23710 -85554 -40803 -249443 -492119 -479643 -404014 -429258 -494257 -576085 -502622 -589043 -826441
23699 -826441 -765155 -564112 -383989 -233056 -177145 -180803 -215127 -167806 39231 144140 -36563
23688 -36563 -176231 -191989 -184505 -162117 -27331 14104 -84565 -175118 -77691 -70536 -12172 217740
23676 217740 143786 -134032 -146982 -44184 74209 -55622 -158132 -5964 -422 -43472
23666 -43472 95884 208003 177913 95146 -75308 -292178 -398861 -446907 -550721 -571301
23656 -571301 -650650 -676181 -538313 -297419 -135156 9368 -12155 -206149 -262877 -261249 -248453
23645 -248453 -345129 -414195 -357911 -330505 -447997 -468372 -370716 -251362 -7375 75951 -38201
23634 -38201 -249172 -399941 -355718 -388596 -699350 -907243 -724278 -561596 -539661 -425180
23624 -425180 -213312 -59896 -174505 -169259 84215 101140 -138123 -451008 -587610 -460620
23614 -460620 -286770 -261133 -272727 -44145 254632 314179 128296 -76127 -188815 -203210
23604 -203210 -127330 7240 108380 -34561 -372493 -638953 -636101 -697434 -932986 -934068 -660668
23593 -660668 -349159 -168762 -292477 -485270 -378810 -352618 -380525 -283178 -146017 -178116
23583 -178116 -152362 -87138 -248229 -443830 -513555 -534768 -448842 -347816 -501727 -616742
23573 -616742 -690665 -705491 -644369 -427800 -193314 -142989 -301338 -354898 -169496 -89666 -173078
23562 -173078 -250107 -133381 -281532 -493814 -517652 -502749 -389204 -120235 -76296 -130981
23552 -130981 -78171 -49325 -177032 26585 143710 190674 208097 93371 45915 -127468
23542 -127468 -257518 -425736 -536490 -597580 -595993 -476896 -165900 177470 420870 481688
23532 481688 316606 145109 189617 312860 297954 154413 92130 -585 -181474 -432131
23522 -432131 -553924 -399032 -450214 -526487 -445226 -348897 -258959 -83649 -62544 -328710 -561732
23511 -561732 -462052 -305315 -368223 -265284 -123474 -161930 -374019 -622445 -573276 -526791
23501 -526791 -626362 -680557 -511815 -82347 139004 -62204 -469571 -465854 -311048 -424403
23491 -424403 -369591 -201401 -3338 149083 72840 -66035 106988 204621 138184 207756
23481 207756 264239 190565 75049 41024 17845 102034 110831 125042 69308 -56308 -131853
23470 -131853 -55857 -292 -57539 -21082 250773 460053 378263 237127 399119 328784 44174
23459 44174 -269324 -404016 -300738 -144689 -94861 -171029 -367185 -483736 -425576 -157379
23449 -157379 66653 -100783 -196498 -172117 -392046 -503324 -374564 -180541 -6731 91806
23439 91806 95692 -62725 -218735 -243433 -135995 31279 164923 240473 221251 260943 386918
23428 386918 363202 351663 259636 102170 197997 335656 310514 6679 -315112 -276932 -149949
23417 -149949 -24369 -26439 -24588 -97150 -355444 -347292 -57165 66839 -52442 29822 320563
23406 320563 473308 513455 567638 713519 940034 1023463 991349 797389 361477 139925
23396 139925 28262 -37281 -110265 -369664 -365919 -118548 322435 823285 864456 752292
23386 752292 609939 501730 585897 614902 840268 1041251 1015818 832245 647379 533079
23376 533079 425619 325429 425855 614196 690624 525407 212736 -115837 -259300 -366102
23366 -366102 -412291 -394981 -440254 -260374 112681 314380 319155 156071 26878 77189 176132
23355 176132 213054 117703 110501 44497 -229896 -520265 -625018 -504912 -361351 -140701
23345 -140701 -68515 1695 -112613 -216383 34170 199075 170579 116067 239486 423555
23335 423555 269624 -4031 -183497 -237451 -238816 -150955 205897 591410 720043 474106
23325 474106 285653 274768 238277 92848 112913 296534 592574 560533 379812 446078
23315 446078 522935 419795 255200 271642 380098 312462 261918 381885 489386 513453
23305 513453 346419 208156 -2606 71024 248667 343707 428637 349780 222867 120407
23295 120407 265300 574235 864897 869129 725803 699547 869257 820258 633758 424924
23285 424924 305115 267690 1826 -294742 -211505 -22099 33539 107622 278085 310752
23275 310752 354759 373550 407770 527507 490230 299943 -48549 -326901 -396679 -157270
23265 -157270 90090 206815 227643 285700 395191 332602 -7398 -102679 134264 311546
23255 311546 373449 221401 24876 -43579 36512 106245 77520 -42186 -131786 -140255 -189114
23244 -189114 -385204 -380897 -192300 36861 124158 359820 647489 672563 603420 481286
23234 481286 362425 373001 483121 514377 331638 272127 294784 167102 -19252 -149788
23224 -149788 -40967 212164 268794 197299 236851 488406 482605 210213 34767 127425 186709
23213 186709 152340 262749 430049 509313 530193 521281 479896 363383 344214 297259 88412
23202 88412 -142600 -97762 133590 75287 37458 231719 479804 488417 478224 640113 694509
23191 694509 555589 473734 452524 557775 708401 640925 377010 283693 430128 562394
23181 562394 947291 1316342 1331467 1281458 1348503 1315939 1045679 870780 684239 366517
23171 366517 186085 180225 398608 363404 92334 3941 164165 316398 247167 178982 124098
23160 124098 92936 246343 485635 414458 260483 161268 129728 190927 161588 187113 178556
23149 178556 120771 143290 42735 -74593 35569 238901 168616 -2376 151456 152305 -138445
23138 -138445 -399276 -191668 191993 374558 230453 164983 375181 664560 716425 466084
23128 466084 39610 -160701 86246 317860 317736 472938 613135 583866 646745 624086 459165
23117 459165 254643 230939 46927 -163727 -417362 -471118 -70606 216135 354326 547072
23107 547072 811748 1004369 890220 755277 527714 421048 473802 515146 660554 755487
23097 755487 464649 149627 -41689 -75933 94730 159044 214747 303970 306840 307001 490777
23086 490777 491076 566857 851282 964150 708540 480402 510653 665918 925253 976632 866218
23075 866218 681343 575459 644258 705357 709451 528168 411409 479830 764068 801420 440985
23064 440985 524848 824127 933130 854876 755454 606161 533379 479378 378740 237786
23054 237786 83719 40561 106146 218824 250895 254451 314000 308582 219789 3211 -79319
23043 -79319 -27779 62777 94455 106469 27394 -95926 -9157 135132 164269 262200 397915
23032 397915 598292 664227 723041 826494 837993 922754 1093675 1201126 1416653 1503399
23022 1503399 1511099 1501285 1202864 898343 926721 891680 675492 645994 782348 885123 868791
23011 868791 821590 783266 842808 957628 1057257 991925 763426 700146 845171 864573 846733
23000 846733 820994 1091539 1295602 1156381 935216 691681 763057 928714 798072 820823
22990 820823 1025446 1027450 993888 1022358 962334 640165 417389 504888 674775 640496 737076
22979 737076 1167835 1487133 1420369 1295715 1103192 1046857 1082839 1062208 992744 923381 856186
22968 856186 975650 1120268 1202752 1200679 1133276 1218691 1365689 1625256 1769157 1619910
22958 1619910 1496772 1557921 1637904 1897341 2119324 2343963 2757834 3020742 3014206 2934186
22948 2934186 2893829 3104893 3324536 3608383 3904151 3916345 4069585 4253262 4047634 3744911
22938 3744911 3773003 3737984 3612439 3495147 3395995 3361446 3212732 3043832 3105940 3226313
22928 3226313 3194015 3036457 2950479 2917817 2907172 2871662 3022903 3170709 3199460 3199010 3224973
22917 3224973 3346036 3577805 3790017 3891871 3781073 3581398 3690948 3886814 4108163
22908 4108163 4361153 4681111 4901951 5055419 5092689 5335176 5613772 5764261 6024542 6392703
22898 6392703 6933055 7477129 7930143 8413279 8928430 9485063 10109244 11063950 12431245
22889 12431245 14092770 16005567 18399835 21386475 25239388 30496199 37688304 47534393
22881 47534393 61113443 80353344 106312594 137552317 171698969 206502259 240429565
22874 240429565 272402845 299418535 318570759 329903132 334973471 335132505 329388486
22867 329388486 316112690 294907862 267611648 237318346 205504605 173131242 141753278
22860 141753278 114214514 92672947 77061008 65703427 57163669 50995666 46591901
22853 46591901 43871825 42810515 42887943 43561973 44863083 46529991 48264925 49641282
22845 49641282 50352907 50219325 49412764 48228455 46889802 44957235 42124058 38749539
22837 38749539 35176036 31487106 27783289 24192185 20921663 18527785 16772452 15384775
22829 15384775 14555830 13979863 13324315 12939815 12987504 13049597 13033018 13025429 13297309 13802650
22819 13802650 14520134 15323098 16085372 17068217 18435786 20319660 22849041 26162489 30486715
22810 30486715 36174252 44102434 55151395 71016684 93206701 121799161 154757443
22803 154757443 189389512 224168908 258494865 290083202 315367026 332357127 341545699
22796 341545699 344717022 342676818 333925361 316400853 290795170 260619728 228462668
22789 228462668 195153668 161683077 130291336 103999356 84258439 70022984 59241017
22782 59241017 51080577 44854168 39850301 35644755 32400329 29704396 27244685 24925791
22774 24925791 22889014 21257340 19582336 18058409 17066808 16283978 15335896 14417162 13638715
22765 13638715 13068864 12621053 12070225 11486894 10975750 10745684 10502036 10155152 10020347
22756 10020347 9925062 9923471 9890758 9907024 9994780 10306706 10722485 11175151 11686383 12313133
22746 12313133 13097755 13876179 14804795 15852891 17107640 18831672 21210707 24261028
22738 24261028 28210900 33283520 39930818 49161357 62115143 80240988 104748412 134587818
22730 134587818 167549598 201516580 235098960 267571259 295921766 316838942 329765800
22723 329765800 336198735 337788646 333586422 321482727 301245225 274412049 243948882
22716 243948882 211854758 178883665 146562452 117548287 94140045 76425489 63215693
22709 63215693 53476230 46265373 40640460 36024967 32147990 28870839 26131376 23645832
22701 23645832 21438528 19665760 18023213 16667284 15448609 14210349 13174657 12273377
22693 12273377 11294650 10311305 9416956 8828387 8550429 8438759 8277396 7979670 7659243
22684 7659243 7225953 6801004 6553675 6321406 6043390 5863343 5736396 5424155 4923237
22675 4923237 4561075 4323086 4161237 4039037 3900560 3756748 3668558 3627478 3468876 3306896
22665 3306896 3248433 3201780 3024056 2901956 2955082 3119258 3311367 3421105 3465782 3552162
22655 3552162 3662212 3889554 4172339 4513716 4715896 4756690 4373994 4199335 4278326 4442674
22645 4442674 4556115 4502257 4208895 3842013 3376341 2945416 2753980 2821850 2797627 2712799
22635 2712799 2586898 2565615 2564105 2486332 2332515 2150154 2121357 1942405 1575802 1223592
22625 1223592 1099964 1224203 1273546 1290637 1318920 1249686 1235211 1350908 1520285 1648655
22615 1648655 1688675 1794051 1928838 1685485 1221467 956109 979565 1172319 1263319 1279704
22605 1279704 1398471 1463252 1344864 1119607 1177377 1045762 736158 677419 1012825 1362468
22595 1362468 1529001 1690386 1851605 1845117 1740913 1680451 1696412 1501397 1193862 1257787
22585 1257787 1352113 1372086 1546862 1856486 2057697 1857271 1623770 1312766 1060182 1006642
22575 1006642 1029803 1174556 988036 718648 557302 454416 394801 464388 501378 487793
22565 487793 673830 820868 1032157 1262459 1315492 1171625 876545 599423 597913 699539
22555 699539 909993 1002282 949583 972278 1053484 1192261 1090979 1037242 1263822 1387596
22545 1387596 1277152 1117970 975307 648240 292861 199839 244335 300885 396923 549474
22535 549474 635173 720609 791926 946671 1077582 1029426 943664 806531 626606 567337 831182
22524 831182 904519 795586 679433 738217 858653 778270 615510 442212 467968 648695
22514 648695 603955 752099 927420 953444 728095 709841 760837 649297 444030 360673
22504 360673 393554 548690 685967 532484 457724 661103 906801 880570 818084 937074
22494 937074 1033061 971203 764915 505289 539478 793777 848929 779526 664368 639563 749036
22483 749036 795478 805169 598361 560732 749649 860105 949273 1025815 1095688 1109582 841724
22472 841724 481965 475540 646327 717391 607273 566983 573996 653530 726192 894605 1078479
22461 1078479 1036524 888877 833068 687446 614240 576427 572007 446313 356313 139542 102890
22450 102890 315291 205418 154883 303987 520072 556288 427507 368250 480095 641649
22440 641649 743832 574035 461186 422804 271048 274509 262961 316701 704780 838160
22430 838160 691527 671222 741219 650170 596817 687238 648312 590350 743085 987520 1030066
22419 1030066 904671 768122 528519 424185 309732 292718 461481 539326 676248 835905
22409 835905 638472 427934 517081 573528 547028 365182 234934 350901 255616 117204
22399 117204 226148 461371 527132 652259 708252 671322 596138 580826 585633 711536 857682
22388 857682 863321 784844 715310 810811 739226 724129 548095 165567 -17711 18997 232166
22377 232166 484260 835503 1044566 794482 382103 99370 52336 181074 294075 291390
22367 291390 311058 302720 331528 432058 551882 877803 990024 956791 909416 707773 527732
22356 527732 448628 229370 36051 145420 466172 679785 729142 364583 11375 -241780
22346 -241780 -285359 -70875 80852 30657 -66682 32558 409318 698450 931205 1041811
22336 1041811 760780 450903 328767 256182 173436 157208 207924 250987 97266 141999
22326 141999 372496 455885 393881 341278 342793 355623 473618 441003 315809 310781 164799
22315 164799 175623 448458 508359 205990 -215805 -451617 -372472 4959 236532 172631
22305 172631 -38072 -165086 -124412 195051 752297 982215 678980 282062 235065 287202
22295 287202 233676 190958 152276 133642 93400 -4446 80376 281525 506998 566675 483348
22284 483348 275565 -48322 -234352 -242946 72006 263578 68969 145723 383496 552236
22274 552236 693895 853914 1000616 841774 608830 530879 463911 445131 424591 298645
22264 298645 187198 -4827 42983 218569 162338 9037 77919 239524 410899 422884
22254 422884 383387 469463 687199 819163 621150 184714 57658 330362 452003 312547
22244 312547 172984 175002 140497 150148 91166 130914 442596 589201 460128 574448 704804
22233 704804 482543 20351 -173516 -220681 -377466 -293386 60338 209026 31093 -209146
22223 -209146 -276085 -252880 -348716 -208461 -48848 -26804 -56413 37647 88021 -58856 -109164
22212 -109164 -58334 72526 235032 371050 216754 37730 -69322 -115673 147720 447116
22202 447116 671543 611807 414756 310479 409649 318693 154881 41082 -97681 -153936
22192 -153936 -272181 -207526 -151356 -147390 -339496 -371904 -364921 -441150 -579054 -413223 -314214
22181 -314214 -307513 -356337 -380425 -447874 -422734 -230801 992 178193 377598 492613 391097
22170 391097 329872 441617 537869 663044 569648 320307 463637 586839 480745 384278
22160 384278 493150 351289 158377 163430 142877 261484 247580 296725 292187 80088 -148590
22149 -148590 -344868 -389367 -455507 -612360 -565138 -384091 -205508 -123418 -117919 179745 470117
22138 470117 429450 247724 157077 380753 570145 511010 533635 563714 515950 394854 276587
22127 276587 369273 433532 391435 422835 370354 350511 411217 215336 20824 33485 88491
22116 88491 294418 490875 609697 571254 439758 504377 507534 305880 188119 203260 271380
22105 271380 256721 151120 70876 138935 138130 73600 46854 -21988 -28057 310909 538440
22094 538440 461690 226563 227239 551413 702409 694792 540312 392776 301087 336331 414457
22083 414457 520846 645933 581697 579838 379601 -40461 -285052 -326158 -138571 17215
22073 17215 129183 326341 573873 888844 1140573 1112141 955429 911744 663854 387615
22063 387615 341347 318024 149512 164044 165365 -70021 -168908 -39862 -59903 -311511 -451148
22052 -451148 -284124 67390 163232 106530 265952 499264 625605 514332 391741 284876
22042 284876 113050 11904 -37977 -29540 305806 431328 105453 -65171 -60869 -12937 302754
22031 302754 541347 497946 524831 674722 622988 343413 210804 344713 417261 258211
22021 258211 329079 286087 -120626 -324600 -205396 -34697 95095 161397 185331 205227
22011 205227 160935 52123 -30650 368169 706623 758680 917129 836109 514508 310678
22001 310678 273489 229774 139734 77644 193656 289499 305659 429253 444012 355501 268546
21990 268546 80282 8964 226847 383174 283914 200744 140667 145178 131701 135513 360691
21979 360691 677317 590231 359136 102666 -194544 -225542 -169783 -249645 -332413 -301967 -158294
21968 -158294 -59603 50175 279627 198696 25405 48630 -13183 12574 148772 85867 21818
21957 21818 71593 182005 513603 733691 671963 543423 532918 657790 762789 674665
21947 674665 680377 413551 220427 158066 89789 108012 131187 193438 393520 403864 223758
21936 223758 139357 177575 160279 -61356 -171769 -28399 -145 16233 86139 317380 553209
21925 553209 413933 286603 98451 -62369 -54730 36852 -43485 -217615 -193740 -84612
21915 -84612 9168 -154154 -370823 -80736 143397 167925 149319 135373 -10334 -179222
21905 -179222 -225682 -278110 -457059 -636532 -520408 -433745 -449871 -449918 -433552 -161738 40020
21894 40020 -29151 -94030 100763 216136 262468 304864 41673 -179032 -60900 119031
21884 119031 154778 100824 148751 250898 355789 406708 258011 128758 163749 182317 196306
21873 196306 370155 481686 553506 501795 177546 -79642 -219867 -123712 104928 244337
21863 244337 291088 349233 336559 421521 440648 272860 287739 267228 -145331 -446924 -359773
21852 -359773 -279623 -68269 403003 562958 248641 -325217 -570691 -433153 -104284 -7392
21842 -7392 9007 181118 257939 240049 115958 163168 104467 157495 266617 61659 -76390
21831 -76390 -14381 88474 76235 97117 -16389 -63412 13979 -18638 -61189 18462 188430
21820 188430 93017 8831 173651 293013 283058 166081 -27445 -191925 -334977 -445457
21810 -445457 -318038 -152982 -107390 -89590 -73203 142322 487415 552711 471446 642665
21800 642665 785344 611107 363688 197099 -29769 -331510 -337841 -287545 -348313 -232636
21790 -232636 117424 340533 250386 63346 44968 150361 376082 505011 365529 40573
21780 40573 -126787 86829 286090 228673 -3001 -234017 -272949 -29929 99026 -13236
21770 -13236 -50658 20360 -29163 -98167 -379379 -650404 -639795 -450370 -257113 -137865 -79897
21759 -79897 -96748 -232797 -221210 -101403 74808 351688 327228 29235 -105250 4937
21749 4937 33955 -104555 -343415 -449573 -240518 24522 89079 156025 193029 138772 -6033
21738 -6033 7118 36333 46751 86593 145781 307225 491651 446047 265397 113059 -190074
21727 -190074 -353920 -161648 268970 295854 121749 -123967 -293213 -243860 -191607 -51601
21717 -51601 84063 -72205 -466034 -615311 -306761 -17614 -85749 -271833 -180677 -20029
21707 -20029 -73264 -305957 -548194 -656748 -446392 -112286 8840 92534 73771 -51498
21697 -51498 -117853 -15312 56240 171274 150644 -2054 62007 24197 -43142 139712 465127
21686 465127 745580 801987 626579 620642 781308 809192 696616 377057 144258 -29245
21676 -29245 -117863 -100409 -239907 -350647 -195778 -87174 -10932 49770 112761 263312 360374
21665 360374 392609 351735 216162 -80910 -351718 -505041 -379467 -364766 -419915 -399530
21655 -399530 -386590 -184459 -10264 -375051 -738571 -719749 -718089 -636152 -395697 -164338
21645 -164338 -207465 -355856 -254409 -46012 164199 328803 364059 264631 206717 137659
21635 137659 10694 -9573 167211 248472 225128 363251 476708 676305 815873 754118
21625 754118 637003 593145 713494 607405 313893 214001 211456 19143 -161576 -103536
21615 -103536 9736 23031 41298 52415 -74837 -188615 -196497 -303474 -308547 -91301 -98905
21604 -98905 -233708 -363427 -516220 -623399 -568754 -252683 -209605 -257601 -321799 -298943 -198162
21593 -198162 -122220 -152540 -141695 -104455 117832 532173 692620 454638 407462 587479
21583 587479 585435 512779 307499 203305 343855 417758 277611 43239 6109 142192
21573 142192 259358 106707 -129530 -171611 55663 191340 73957 -26913 -83239 -170894
21563 -170894 -393333 -459606 -333355 -291269 -235905 -156233 -183482 -262879 -360416 -498123 -557173
21552 -557173 -537785 -617908 -751002 -627177 -469244 -498520 -588905 -228407 138936 -20845
21542 -20845 -369877 -365591 -115577 -2818 -165666 -369052 -487739 -668599 -395248 26037
21532 26037 135768 117895 122470 165743 304351 363508 282435 283207 463157 437437 147668
21521 147668 -71330 -33229 10972 45927 126793 218262 130624 171446 297173 174245 -20838
21510 -20838 -110449 20177 200316 285470 449113 585110 517780 377441 210017 150943
21500 150943 138539 243853 498198 611297 657819 530767 372879 -34707 -310613 -300423
21490 -300423 -284427 -273339 -58587 145952 100511 150848 294654 443128 392287 178588
21480 178588 33246 -19106 -58902 -135911 -155627 -34044 94507 120295 218182 299569 275136
21469 275136 131371 15058 101778 84194 78338 186850 212606 -2699 -175260 51042
21459 51042 90869 67877 29041 133967 314116 338375 355473 355668 263634 111526 -141775
21448 -141775 -121017 6190 54629 40926 54483 232250 471169 666467 840132 897435
21438 897435 748524 542825 602916 836272 959831 929119 661380 512297 343206 284108
21428 284108 444414 612308 508899 292404 209542 161881 154120 251262 595961 725418
21418 725418 638566 576656 552069 399663 35767 -162370 -20305 457189 613639 653829
21408 653829 706929 580614 399825 145591 -23375 -5585 66624 60442 -21199 -23778 35603
21397 35603 -19698 -88240 20654 156300 94451 -153975 -226070 -88824 34454 275653
21387 275653 494165 627185 736989 579996 257344 217829 90757 38853 229984 144963
21377 144963 -29490 44125 154889 218979 281513 376138 372036 383274 320547 2708 -265132
21366 -265132 -250498 -126285 127822 288715 305927 291140 387202 282824 299446 463273
21356 463273 353362 234411 232554 179830 -97331 -284826 -54314 184756 109855 -38078
21346 -38078 -66050 -169290 -262100 -142431 11220 164354 147235 -5483 -39364 -122073 -175231
21335 -175231 -95478 -117324 61458 299957 205701 97187 13434 -77013 8031 8934 -36228
21324 -36228 -69326 -9636 -9640 -56581 -5309 204648 173448 97747 101157 -72968 -278612 -177278
21312 -177278 -85619 -112552 -126114 -146630 -231817 -451083 -682425 -755765 -682081 -589615 -378123
21301 -378123 -257017 -164545 -37029 52089 -4461 -50508 -31448 83622 210687 103979
21291 103979 53631 354375 467902 530334 364655 62152 39317 97174 483335 1022122
21281 1022122 1000906 765616 913905 1017269 715747 348524 139866 93232 178303 316413
21271 316413 412559 299942 195505 159850 250455 523396 771821 613216 265711 47536
21261 47536 -104941 -12657 120587 -150656 -370453 -347437 -137710 231137 289308 74141
21251 74141 -150640 -277929 -358166 -324678 -209470 141583 634936 718299 447807 242286
21241 242286 248351 277772 415312 573619 720395 590972 602963 772964 628958 372799
21231 372799 279668 279492 225597 38372 -154595 -125416 -115438 -193092 -220972 -67679 279948
21220 279948 681463 714027 277324 55035 106049 148677 184929 490500 579012 208988
21210 208988 6717 125381 392537 646151 683265 619830 499636 551529 669278 674409
21200 674409 551390 344509 122745 -74782 -196745 -145103 -109112 105863 505310 939112
21190 939112 1071688 994870 696497 401024 381413 424310 368105 373564 375805 265072 222128
21179 222128 274413 529080 679722 489173 265779 228698 486262 761298 683368 467389
21169 467389 350448 401686 532033 634323 692610 634593 564324 590933 620085 502160 448872
21158 448872 388506 227551 314405 434666 350764 134677 44644 142479 213279 150886 57966
21147 57966 -187479 -290151 -26672 293292 662271 806345 809443 786101 980782 1006028
21137 1006028 768426 721516 553340 185606 171768 449161 348573 140489 184752 444005
21127 444005 709754 871115 871141 629697 334749 255646 154719 47216 165078 487534
21117 487534 769356 758162 631260 771168 748542 575054 500577 580400 658053 639708 553426
21106 553426 333448 204970 308053 509040 606078 496549 420489 498559 535164 489312
21096 489312 507584 580292 671048 755065 800201 821721 716232 504257 338052 307821 376660
21085 376660 369205 373063 420505 526833 628372 675611 562327 687611 783342 680965 660929
21074 660929 676058 580723 328862 138519 284785 520007 651023 731814 821972 844532
21064 844532 908952 872743 709594 630786 725569 974044 1024298 894280 859263 924039 1052363
21053 1052363 1025486 756308 552489 696029 1029240 1328798 1342214 1151579 998397 910242
21043 910242 657294 315144 154833 309768 573396 703565 877729 1025475 1073998 1171657
21033 1171657 1014788 531211 91013 -49908 -39370 59645 137055 204134 325493 482121
21023 482121 654994 745995 1101337 1448701 1518912 1441323 1220345 1134723 1040800 772660
21013 772660 649787 648294 642499 715005 909191 1088349 1264223 1339742 1366701 1389113 1531933
21002 1531933 1550662 1300278 1158983 1337454 1545164 1460238 1243794 1113135 910700 791574
20992 791574 1013315 1303841 1648690 1882070 1979071 2217868 2640486 3095767 3438153 3472737
20982 3472737 3185906 2806034 2521563 2139967 1726040 1506014 1367631 1359044 1424811 1385097
20972 1385097 1238190 1229294 1429966 1680247 1642883 1587021 1539279 1330422 1131822 1130420 1185732
20961 1185732 1303353 1555336 1809318 1902233 1987936 2100863 2219574 2239848 2298182 2288924
20951 2288924 2218572 2154222 2040752 2000522 2276777 2613277 2997140 3285560 3348917 3490129
20941 3490129 3612921 3665018 3655107 3698903 3900532 4146287 4432418 4965620 5544207 6356723
20931 6356723 7210904 8220081 9388438 10730446 12139354 13818002 15666967 17903259
20923 17903259 20782921 24176928 28891624 35821062 45662282 59722292 78922543 102187345
20915 102187345 127463135 153922793 177571198 195407950 205852664 204221933 193293065
20908 193293065 175935441 152988321 128823675 105144914 83343683 65972707 52980884
20901 52980884 43287229 36273176 31132683 27266312 24285864 21954157 20033517 18446505
20893 18446505 17507631 17214510 17492503 18795421 21144989 23832234 26653916 29389035
20885 29389035 31508296 33106684 33569759 32359080 30200541 27159124 23442679 19858917
20877 19858917 16456122 13537465 11562578 10140547 9216605 8685210 8393317 8198965 7977895
20868 7977895 7896927 7954379 8190417 8617301 9125240 9792516 10847990 12215825 13846596
20859 13846596 15309703 16803956 18464021 20510330 23456387 27775050 33770297 42089410
20851 42089410 54029121 71368611 94076364 119171222 145743910 171920903 192558788
20844 192558788 207387445 211873831 203905727 189379418 168058847 142860916 117806979
20837 117806979 93863968 73667161 58406142 47307631 39099439 32953701 28296194
20830 28296194 24424446 21248792 18624832 16508682 14812044 13333853 12142633 10888548
20822 10888548 9749997 9062797 8717702 8480302 8170798 7797176 7474197 7331560 6980310
20813 6980310 6465399 6215370 6361973 6449708 6099610 5726528 5481085 5515465 5647817 5661995
20803 5661995 5765062 5718002 5770952 6043811 6491732 7254670 8026024 8856862 9941187 11284266
20793 11284266 12838788 14546070 16291311 17846925 19714539 22309615 25997672 31068234
20785 31068234 38087459 48280182 63179712 83303402 106912498 132088897 158251001
20778 158251001 181167246 198088266 208054994 205768929 193833781 175667739 151808863
20771 151808863 126935212 102735446 80576087 63217988 50517411 41052150 33905558
20764 33905558 28432395 24306831 21076211 18436871 16369110 14801973 13585630 12413463
20756 12413463 11146249 9766209 8501974 7640587 7032155 6523896 6050229 5583587 5240943
20747 5240943 5054251 4989532 4771740 4328432 4051345 3885247 3660631 3520091 3491022 3419237
20737 3419237 3177481 2819787 2439312 2175258 2035760 2022162 2233276 2424152 2249548 2056030
20727 2056030 1886634 1709514 1650641 1749070 1816657 2010181 2238404 2136004 1850783 1675001
20717 1675001 1718017 1817162 1741254 1771360 2083382 2251091 2402446 2423567 2532289 2864932
20707 2864932 3140221 3223924 3390618 3273570 3032956 2769767 2453424 2375138 2084275 1716487
20697 1716487 1575078 1381010 1242174 1037110 886998 841879 844032 827235 992363 1175945
20687 1175945 1175772 909189 623677 433254 389274 446095 557884 499848 443863 485557 347238
20676 347238 279462 393178 433486 440394 466225 647417 785848 778710 753341 553470 281977
20665 281977 47175 -52346 -118811 -246983 -244262 -56811 38210 173255 168034 106170 26622
20654 26622 -36479 -29310 44605 23212 69411 241760 547647 707746 674211 630444 658274
20643 658274 701773 646018 626118 730281 848762 878286 789405 937822 1121944 1194342 1124696
20632 1124696 967957 842596 607912 242511 -136494 -34734 163894 356953 386898 250387
20622 250387 146825 319730 410807 186011 87872 162230 219021 526052 757471 707561
20612 707561 860171 1090784 1171287 1000363 822357 687457 670989 725641 693201 449100
20602 449100 305371 186881 172258 -42860 -236128 -240468 -42676 252928 475249 426807
20592 426807 357069 568275 766898 813154 943046 935377 896276 799964 586524 394786 276469
20581 276469 69563 -84670 -117743 -246455 -360533 -346474 -302360 -190510 38404 91711
20571 91711 -44109 -226085 -109368 -6751 -19729 73033 89749 44710 -176899 -505252
20561 -505252 -517260 -447316 -366257 -252111 -348728 -314502 -45146 126382 -14675 -57332 -38372
20550 -38372 -112471 -168704 -249361 -221860 -228261 -48030 235459 382619 339174 478811 578283
20539 578283 530650 588970 663755 534168 286631 145146 151797 400707 375857 282182 467170
20528 467170 528071 384720 156092 35007 99815 178938 306853 398104 268727 244208
20518 244208 353663 266482 90560 60871 223082 458400 587144 495552 578078 521676
20508 521676 326247 258697 298857 333745 394246 501027 460614 427013 535250 560692 429477
20497 429477 501988 429607 289347 157384 -84998 -292819 -354575 -248462 -35745 54681
20487 54681 29213 95211 21526 -51744 -51887 -10255 -90252 -64440 -1721 -169639 -290536 -204061
20475 -204061 -150964 -315606 -513882 -523918 -529468 -506760 -132583 175595 199456 136852 171709
20464 171709 99804 -75183 -100938 -28762 23185 244659 498042 488933 421487 338440 249350
20453 249350 460326 598492 323572 89620 1184 -130941 -178024 -207777 -272478 -357305
20443 -357305 -394403 -365988 -126544 107006 41208 -57638 51141 110367 203074 286746 314205
20432 314205 238889 -24754 -122206 170669 546880 658035 467290 305930 33259 -245261
20422 -245261 -340239 -344388 -165121 -84812 -130373 8205 38573 -79297 22312 224434 143061
20411 143061 -2986 -66319 -65588 122099 263535 309840 332344 529381 574141 260031 36220
20400 36220 -131711 -247336 -202780 -75420 103496 196211 297673 264507 90384 91378 -27560
20389 -27560 -214740 -36327 93381 105014 21263 22019 27003 -182840 -388807 -423843 -309450
20378 -309450 -250113 -310390 -338394 -184529 -76136 73585 289268 342654 183649 5580
20368 5580 100472 127793 -43094 -237222 -394421 -202544 97386 413445 522953 418984
20358 418984 322153 16259 -515176 -755878 -556776 -265114 -183427 -199920 -146936 81238
20348 81238 197272 166320 30646 -15831 -104020 -150348 -118579 -211019 -222000 121318 294918
20337 294918 278290 264200 185892 124445 31743 7064 -44072 50522 188948 134777 159748
20326 159748 159531 32851 29752 4780 -95034 -195602 -55407 434508 639499 416138 199101
20315 199101 124778 -48479 -216636 -291380 -252446 -157416 -39285 259044 194001 -20967
20305 -20967 -3396 221992 217828 81190 -95796 -361044 -516005 -588701 -692605 -682878 -413509
20294 -413509 -99626 29585 182539 115159 -22500 -135917 -166513 54709 296997 475018
20284 475018 502398 299275 208847 288208 155748 -28465 -195892 -238659 -79963 126184
20274 126184 163759 -15854 -245218 -418040 -498693 -571161 -732981 -720396 -496579 -221468
20264 -221468 -102555 -195496 -408943 -456449 -248780 -45619 -137440 -329086 -410257 -374188
20254 -374188 -183138 -46621 22900 -88296 -225369 -206181 -73196 20555 27521 139625
20244 139625 156643 188673 209806 156835 73201 20490 -5889 12949 64908 173949 95917
20233 95917 -176769 -231930 -200515 -246960 -364568 -254566 -222402 -139846 72087 277038 334123
20222 334123 313318 94554 -246422 -350060 -273624 -193949 -172817 -385670 -484896 -434781 -668062
20211 -668062 -577439 -224809 -44463 -133878 -186976 -3115 187847 282399 -28280 -250392
20201 -250392 -329694 -371923 -371765 -191347 9082 -87077 -56261 32550 -153768 -295276 -264854
20190 -264854 -34282 216192 88356 -72591 35827 39869 -97620 36799 80020 53658
20180 53658 41699 -85280 -163617 -291892 -343097 -96834 14774 -196690 -116114 141253
20170 141253 171667 70555 -140887 -568657 -823822 -776105 -526060 -217178 95317 97430
20160 97430 -264920 -353453 -242586 -343909 -470893 -332085 85583 501221 613250 596626
20150 596626 462819 355158 329802 283259 280485 321753 296038 346298 412853 377071 164001
20139 164001 -92467 -210189 -293488 -207468 -187771 -219947 -137365 82854 -11082 -187352 -302834
20128 -302834 -480705 -460320 -346539 -339348 -342331 -307444 -234863 -106718 -178387 -236211 -154619
20117 -154619 202750 535620 650822 829104 801047 818218 796307 736841 559729 447242
20107 447242 440234 280955 107083 73384 199584 240879 434505 796155 642079 299783
20097 299783 191202 184088 281558 398675 517794 348235 183322 274583 188325 -93498
20087 -93498 -438859 -723012 -766759 -550210 -219711 79166 363424 431115 480044 333588
20077 333588 -158059 -389857 -184549 126737 216442 143464 146100 160168 150400 58162 -86615
20066 -86615 -200117 -290366 -424959 -431429 -266255 -188007 1159 300466 415619 322389 334552
20055 334552 421326 402003 292600 421403 468590 353846 366169 308580 372725 388933 354469
20044 354469 389000 433412 425559 538672 519239 318336 184376 245576 343322 126349 -27221
20033 -27221 8758 -22268 133970 307931 264543 187821 238041 297742 106477 -170251 -301771
20022 -301771 -387512 -298157 -218058 -143556 54207 116710 137322 212036 89466 -192626 -172689
20011 -172689 -87200 -109753 -107419 -85668 -42570 58959 80832 -63800 -358302 -488680 -501743
20000 -501743 -444121 -336054 -289825 -65468 134313 167669 319858 251952 366854 603737
19990 603737 332488 296749 383341 541646 744772 691509 520050 357875 -117469 -459096
19980 -459096 -773148 -848012 -633768 -362810 -120634 59820 60411 -58384 -26165 29602 2255
19969 2255 116279 109152 85392 124080 122309 80057 228368 309779 368509 365328 330413 295024
19957 295024 121226 -36411 -292142 -421298 -380988 -243785 -209079 -137336 55587 194013
19947 194013 303241 405601 362052 342272 230762 15937 91936 516206 522144 10839
19937 10839 -258435 -224520 8534 224347 -6112 -215582 -149205 -158983 -107774 -2569 -44957
19926 -44957 -264201 -266133 -226394 -175527 10748 181270 365947 532846 523320 508281 523725
19915 523725 240210 -4673 79960 338617 520065 409383 397479 455305 260715 13379
19905 13379 -135412 -175524 -135444 -62154 60014 195658 196920 168129 125790 29660 66339
19894 66339 34154 -96405 2757 70567 -57935 -320070 -478487 -370548 28664 92198
19884 92198 44213 40752 -15244 -88903 -270791 -326750 -170161 -1400 10128 -25038 10442
19873 10442 123900 307905 417995 428362 530938 635686 506960 326041 74999 -78340
19863 -78340 -281 122214 189595 135580 48397 166280 297388 268102 254620 335677 519616
19852 519616 509211 502155 508742 294299 283610 645391 832920 757057 581422 443689 349644
19841 349644 155283 -37255 57562 253373 214894 173860 246044 382029 448024 453799 216058
19830 216058 -199958 -329731 -203379 -24055 244334 322767 371915 531106 475056 599487
19820 599487 775474 692098 642876 646413 571314 426888 349592 71748 -130251 -141581 89816
19809 89816 286138 146212 152723 264089 278794 380576 393393 123353 -101677 -112046 27144
19798 27144 -412 -178240 -175778 -67021 241509 457741 575978 570360 485009 411782 417871
19787 417871 389847 327508 370539 148034 127633 344703 592460 797983 984760 1016413
19777 1016413 981150 787514 699818 754864 735386 672128 567664 491034 327747 224481
19767 224481 507699 701162 636882 641977 754878 726252 840170 936551 768735 632582
19757 632582 739160 778358 834459 993452 1080285 1085279 1058143 800830 384756 143549 195114
19746 195114 272420 157746 329427 437399 344434 244613 313998 310472 426281 675569 700405
19735 700405 282863 96322 317691 349388 219509 136565 191149 176347 138473 329430
19725 329430 404908 433988 539803 454509 354818 285878 326170 466978 597028 656126 795074
19714 795074 1050222 1291828 1288078 1238226 1140236 970303 705660 520730 651293 798531
19704 798531 838204 554583 311712 323731 561284 604457 553101 492380 716678 910358
19694 910358 982744 941986 789378 853404 955181 1030963 1009860 774611 720676 775921 629063
19683 629063 443526 376417 190767 154419 152518 232517 318782 152714 95345 387406 561119
19672 561119 458145 359932 141659 253008 485270 495723 550285 523952 481756 698381
19662 698381 939817 772227 524633 552250 726795 860016 986340 1035544 852288 488415
19652 488415 313035 154710 49945 234228 493351 566763 522687 433714 266203 338462
19642 338462 640040 754803 861115 895507 746011 521182 440736 602689 716013 655649
19632 655649 525352 424153 488759 524522 475632 309996 417757 631150 660422 867922
19622 867922 913239 660076 395080 295104 302082 372488 297620 423912 630352 717536 721145
19611 721145 877424 1081249 1103974 1038625 1162738 1206585 1286350 1461015 1423359 1096656
19601 1096656 871910 655509 365641 328266 462197 523614 415427 293224 224794 165539
19591 165539 414782 748126 874047 890846 606661 285016 132651 119189 -25889 -156863
19581 -156863 -149992 -104006 -114477 -15760 333996 598586 569261 564758 738685 763534 646105
19570 646105 568193 691433 809951 857068 852650 764974 449396 295507 304411 281211 473647
19559 473647 854555 1110280 1257713 1290509 1253963 971582 766247 536775 480625 737628
19549 737628 676011 608748 581844 549364 694050 1050165 1286821 1282301 1128539 962707 957476
19538 957476 966823 1026750 1047980 858316 655633 775995 1196411 1383875 1343206 1306607 1439398
19527 1439398 1596673 1360787 1005166 895605 1005082 1101645 976591 722803 619180 565723
19517 565723 750836 1203527 1346631 1216129 1131762 1093342 1130605 1136468 975298 788718
19507 788718 902786 987316 930063 858428 950269 1317886 1553664 1587074 1426447 1031448
19497 1031448 817368 734251 787923 818609 981796 1167593 1129277 1035862 1094975 1226053
19487 1226053 1347412 1334558 1077527 906397 892768 757613 594109 775276 986991 895233
19477 895233 767776 774629 599790 452174 371732 427480 616697 832916 799348 542783
19467 542783 357212 528189 804717 940352 994582 936244 724884 516204 468345 613606
19457 613606 759957 784225 905240 912897 985056 1132887 1131098 997065 880184 860386 1049543
19446 1049543 1125662 1166297 1139514 1114813 1110235 1191320 1196433 1110491 1007796 861284 729073
19435 729073 700944 838463 906271 771492 747943 996589 1099948 984650 1049876 1238665
19425 1238665 1483864 1494625 1302612 1211848 1102031 1068132 1098345 1278400 1399163 1315061
19415 1315061 1153643 1060772 1122761 1086377 1016140 968578 1142428 1216252 990393 681507
19405 681507 719783 960272 1101797 1216329 1269528 1235526 1193565 1349894 1391527 1600795
19395 1600795 1846703 1904675 1716180 1514460 1543343 1553301 1529405 1557175 1543928 1469735 1433980
19384 1433980 1579808 1715422 1699070 1865981 1897622 1669211 1596447 1754927 1968043 2088509
19374 2088509 2010829 2009993 2056338 2257260 2322823 2125905 2191865 2272126 2286754 2413378 2739852
19363 2739852 3036279 3105361 2875228 2652676 2620090 2634729 2586721 2622930 2749598 2932506
19353 2932506 2824145 2707171 2714405 2743106 2847002 2962116 3029411 3331619 3862616 4218599
19343 4218599 4524357 4779092 5237343 5760075 6115833 6424758 6713325 6896928 6773052
19334 6773052 6301502 5890692 5641116 5488646 5239072 4863374 4588119 4385089 4243133
19325 4243133 4268306 4354060 4334664 4157247 3974158 4041539 4183530 4313247 4432474 4336243
19315 4336243 4332244 4716505 5174945 5436000 5663569 5717924 5808434 5926124 5899296 5857835
19305 5857835 5861286 5995829 6147104 6396985 6593765 6867324 7297767 7824252 8229355 8648962
19295 8648962 9304782 10170531 11449626 13053936 14636219 16540795 18544932 20346686
19287 20346686 21802107 23277010 24838398 26596855 29149750 32799945 37916815 45431306
19279 45431306 56542728 73021946 97087043 129638477 167699485 207248461 248841126
19272 248841126 290184370 323628819 348394238 363932939 364512869 351803983 330327224
19265 330327224 298586809 260299686 222375925 184836564 148497833 117905782 95054464
19258 95054464 78487761 66207128 57307772 50869874 46127482 42385536 39635871 38096147
19250 38096147 37781570 38769734 41226873 44759854 48764157 53644922 58512501 61880628
19242 61880628 64087545 65163223 64061581 61080634 57168036 51856436 45816912 40076663
19234 40076663 34287989 28885237 24591119 21318383 19312954 18345915 17701039 17422020
19226 17422020 17653646 18274035 19193964 20493293 22131349 23607123 24997036 26396666
19218 26396666 28169226 29750210 31434083 33729686 37371500 43027446 51499910 63834746
19210 63834746 81744848 107821991 142498929 181852828 222327742 265228738 305986616
19203 305986616 337550209 360629339 372821098 368936020 353000683 328350693 293052183
19196 293052183 253064384 214659300 176575664 140736778 111783687 90623015 75523901
19189 75523901 64320135 55531510 48541221 42927311 38274336 34476270 31283674 28277312
19181 28277312 25591280 23449474 21471925 19718466 18406602 17386565 16490347 15438314
19173 15438314 14374073 13616162 13210375 13113592 13061356 12751304 12356626 12174447 12037162
19164 12037162 11680116 11447240 11655774 12341945 13016968 13533580 14072627 15192434 16875271
19155 16875271 18561995 20153691 21910285 23562530 25272151 27098154 28936483 30932118
19147 30932118 33789859 38173585 44910411 54531939 68255391 88201623 116164330 151643588
19139 151643588 190063224 229477767 270529412 307383384 335471476 355629816 363740366
19132 363740366 356271487 338172942 310743454 274384181 235993212 198631351 161218235
19125 161218235 127603639 101669989 82840755 69128081 58761428 50644621 44222797
19118 44222797 39165021 34912234 31213662 28008012 25148218 22634227 20640949 18807704
19110 18807704 16958064 15415662 13926339 12412032 11105532 10213215 9650485 9021101
19102 9021101 8518151 8143786 7771207 7451428 6852857 6361128 5968573 5547843 5099425
19093 5099425 4618496 4301512 4053240 3881476 3989646 3949413 3740622 3512613 3329566 3142687
19083 3142687 3164566 3191828 3114644 3025239 2966887 2896951 2741757 2591155 2511427 2589945 2569945
19072 2569945 2358340 2284587 2419740 2716792 2969571 3166057 3133526 2999346 3148475 3399910
19062 3399910 3728992 4098927 4366992 4601072 4898620 5209951 5363233 5391970 5299559 5117571
19052 5117571 4938594 4676764 4302602 3940634 3323471 2883018 2581318 2311686 2185951
19043 2185951 2234063 2407534 2323896 2213117 2031489 2011448 2083874 1885337 1814057 1872662
19033 1872662 1682507 1585154 1623960 1533872 1525145 1549811 1430318 1196799 1011828 861534
19023 861534 904090 1016865 939821 761422 620295 631348 768218 939736 1031860 1204271
19013 1204271 1326001 1303306 1227532 1339317 1397159 1599691 1854252 1817990 1623801 1224421
19003 1224421 730740 661545 747412 634707 430999 346128 667696 1121012 1330201 1458546
18993 1458546 1417010 1419701 1561498 1630448 1488052 1543759 1678200 1722406 1637447 1398323 1060005
18982 1060005 638245 473711 552680 631012 586157 692969 795378 810893 903468 1250895
18972 1250895 1594334 1404287 1092577 882049 833548 785782 676617 566775 532540 411527
18962 411527 418505 595637 808571 872430 711457 453461 248602 341582 535927 735480
18952 735480 886057 1062098 1220632 1315750 1350223 1162413 889859 721374 670117 642477
18942 642477 623019 750645 779785 778082 834288 898104 920389 903986 788927 834452 877107
18931 877107 714469 643339 737905 905070 1265615 1414986 1031231 605172 559386 638550
18921 638550 446567 373212 474280 545742 542422 500180 432085 446550 661649 813103 854518
18910 854518 760402 509465 375000 198277 86581 235567 281358 353051 647082 779404
18900 779404 791307 834458 845819 786930 706202 758797 727947 317843 11549 -41800 -186443
18889 -186443 -287445 -293279 -83419 297497 523137 624240 528597 394853 489430 497207 396249
18878 396249 315089 281320 563368 845225 850602 678439 581517 534296 335872 314753 549552
18867 549552 476332 292278 183383 112690 9385 -54539 249646 392810 289400 536988
18857 536988 920106 1157856 1083199 1071597 1146884 1196472 1104521 934885 645169 227189
18847 227189 122622 373192 572810 692765 472500 340846 322360 351636 284430 97060
18837 97060 263249 481236 751746 777910 705741 748437 673679 462809 259342 98336
18827 98336 40823 7884 -165492 -171089 26244 265763 409035 594907 555076 391761 451397
18816 451397 341054 239915 337597 554530 818496 912628 710933 635302 682497 431810
18806 431810 81944 156719 320965 466849 479954 411788 480834 523239 506516 517491 565872
18795 565872 513281 525965 234263 -125723 -108217 -33093 493 254671 397036 395594 397919
18784 397919 457027 508185 514493 402958 260334 203545 102782 298980 477759 477121 419672
18773 419672 332585 198256 64029 69824 342330 634757 601136 294326 120640 339497
18763 339497 706469 766960 582030 256471 54428 82515 229791 241320 273195 298113
18753 298113 263551 251759 338580 190079 -88145 44803 318951 233286 205523 479482
18743 479482 647171 589629 483553 501035 503818 479374 717935 1085140 1079670 708492 438650
18732 438650 318762 287992 397751 432224 555151 475610 211775 157399 178776 220337 79377
18721 79377 120669 224246 240523 330093 257704 238802 356000 589108 737741 950072 821229
18710 821229 583188 740455 1039412 1053511 847728 730936 459289 191619 42515 -116878
18700 -116878 -43181 72590 207655 315896 289050 198622 148316 77463 -121967 -235294
18690 -235294 -237327 -23847 124401 10087 -73543 -79810 1885 276320 471017 326927 20507
18679 20507 218247 684974 924693 814840 594520 490738 583517 708129 667528 596151
18669 596151 470374 408350 390816 320056 133163 -88578 46062 214263 132298 23838
18659 23838 73790 191515 242042 284801 414572 368471 303263 409376 508694 550016 550314
18648 550314 494672 282647 253615 387332 349836 222528 88022 1932 80705 186303
18638 186303 342973 358658 146040 -76076 -57199 186758 138766 162979 273553 204286
18628 204286 210075 189634 376414 392104 85377 -275469 -523986 -482516 -370007 -124442
18618 -124442 82576 254026 215139 -92878 -375810 -594725 -660837 -413082 -224493 -25794
18608 -25794 148340 367788 670747 640402 484934 448390 310729 314 -179856 -326264
18598 -326264 -304337 -236399 -246225 -292223 -166224 -236248 -278932 -268108 -410284 -302714 -81756
18587 -81756 74697 188148 350312 477990 485103 476483 540001 443781 358842 407678 379567
18576 379567 300004 300899 325151 249143 290380 373719 292069 88499 -104412 -165179 -94870
18565 -94870 92084 61781 45529 269482 359946 232320 223437 407413 675570 662835 534379
18554 534379 367527 244044 105064 92534 171609 94927 84905 249328 302132 37755
18544 37755 -186301 1908 328478 197371 -146842 -60149 102858 180867 80224 -87686
18534 -87686 9776 180734 120938 -227385 -380172 -308822 -179498 -67640 -19724 2272 -205367
18523 -205367 -288023 -221164 -302536 -213613 177131 396896 499148 621312 626850 498628 492108
18512 492108 654808 676568 607166 503710 194564 -135198 31923 275938 264680 49559
18502 49559 14760 22840 -142954 -227034 -60933 164342 402314 423549 357712 267103 283191
18491 283191 101355 -194853 -154257 -33281 -93974 -61073 -20642 56055 241696 81805
18481 81805 43315 233609 119483 -187294 -234275 -273058 -281978 35433 310420 229631 139980
18470 139980 167320 177414 259594 497900 732215 637144 432658 316232 207341 26688
18460 26688 -86599 8981 -7780 -116970 -202068 -202436 -296898 -201484 145849 204834 15183
18449 15183 -98304 -191726 -275174 -342381 -253341 134961 266032 345848 489964 419662 341383
18438 341383 442661 576047 739883 792375 742667 587867 373401 320383 531281 725621
18428 725621 508647 293312 129352 57683 181427 348868 610466 817318 787741 709343
18418 709343 686478 605255 396395 277078 221154 203796 395641 658808 1019176 983824
18408 983824 539683 47601 -86566 438138 852364 945265 937861 844740 827301 791736 825355
18397 825355 922452 799491 642881 438816 282988 266331 92504 19848 67091 39479
18387 39479 165952 403139 501347 603428 622497 587874 654833 571400 333617 16897 -237130
18376 -237130 -203591 -136523 -188131 -220127 -58842 -65835 -102024 51382 99607 92071 384988
18365 384988 397769 195292 164462 293349 158789 44424 47292 -5202 35254 148203 346402
18354 346402 463645 576616 625404 520840 423134 405118 464397 388132 315544 436603 401849
18343 401849 237595 -27146 -284792 -308014 -462706 -590023 -319505 -24566 -33368 -252301
18333 -252301 -155247 123218 282141 408665 475523 475306 467954 370426 273955 137950 140219
18322 140219 314516 83894 -175325 52171 372794 573889 780350 878475 678520 352510
18312 352510 109126 129402 237367 232813 274562 417489 440159 386075 125559 -226475 -341961
18301 -341961 -286423 -222068 -246874 -227346 -169603 -121772 -80563 -87225 -14332 88872 9076
18290 9076 -101327 23852 30925 11371 100880 263436 296226 192274 -20939 -138688 -98326
18279 -98326 35999 310035 472731 220789 -72148 -28208 241302 575280 758453 742658
18269 742658 518695 265834 22753 -15158 39211 53753 75343 -49853 -88347 -119188 -243027
18258 -243027 -271900 -116809 60167 304695 498100 503750 362309 79039 -297878 -435185
18248 -435185 -361269 -377047 -159756 70045 184958 130853 30681 173694 365988 478441
18238 478441 599796 591819 270929 125720 179829 178782 -62741 -440592 -615759 -331582
18228 -331582 -17377 63769 -20162 -125916 -220260 -286197 -196251 -66545 -203964 -21664
18218 -21664 250838 165226 86850 22100 -145415 -275158 -124835 55166 130035 165941 200256
18207 200256 328693 342012 383078 682162 725824 587533 492775 460996 543248 570972 480393
18196 480393 410013 317536 188961 99400 38696 96523 97990 -119447 -229727 -76712 -63869
18185 -63869 -175839 -236335 -239870 -219855 -92130 49321 8153 -44457 -107292 -39336 -17437
18174 -17437 -90813 -259229 -337479 -260125 -263242 -103293 15989 38111 85832 236114 162130
18163 162130 -111150 -36870 4568 -80371 44366 64539 9277 -8326 -12562 91325 353755
18152 353755 541201 548372 689792 701847 568068 380771 209965 226042 214958 212902 261541
18141 261541 320714 551497 568692 528738 548907 532389 364131 154334 232345 303375 289851
18130 289851 308043 370967 441974 473227 397928 252211 55316 6732 103126 158663 196864
18119 196864 279499 486841 752309 798832 519504 203522 -50153 -15985 237913 273814
18109 273814 113568 110618 231505 296789 412356 294687 61657 16057 10688 112693 262165
18098 262165 176485 -23729 -80469 -22291 -11365 -69181 88416 169528 149754 36719 -209670
18087 -209670 -549725 -617803 -411600 -269850 -265229 -388598 -325407 -284875 -195281 62813 54956
18076 54956 -69867 -56733 -78864 -42141 -73238 -126675 38044 118103 14362 116472 294958
18065 294958 -2537 -217725 -3952 156916 20231 30171 19976 -143285 -222046 -219475 -251883
18054 -251883 -407214 -554820 -410236 -372517 -385850 -262200 11937 205032 392352 380358
18044 380358 134389 -18159 -121757 -61883 270501 494186 516454 615499 582575 280911
18034 280911 -52638 -115315 -55674 -9039 -104587 -57627 131060 268380 353146 417399 331483
18023 331483 155925 81484 121675 101145 24908 65255 177225 355350 394644 307061 227561
18012 227561 -114062 -323570 -299288 -251450 -221585 -215462 -166305 -153977 -34116 37835 44507
18001 44507 49000 118766 229179 323790 566735 798858 854578 646346 332036 98172 -8186
17990 -8186 112670 312192 161272 -236368 -474101 -417972 -215395 -83749 30364 -31808
17980 -31808 -204971 -241628 -155491 -120474 -385123 -520482 -439096 -479046 -465151 -478192 -438801
17969 -438801 -373691 -451056 -449675 -313712 -228329 -195547 -314166 -443177 -293046 74957 433543
17958 433543 538135 331894 133633 95636 125982 172334 45198 -394315 -724775 -683264
17948 -683264 -623003 -542166 -462231 -199512 -85839 -78698 -195869 -168327 102045 250705 165399
17937 165399 38405 121831 239710 262446 219767 -27911 -392997 -394335 -72316 242837
17927 242837 268019 30461 -232387 -243408 -84215 150588 225148 9568 -56987 -201545
17917 -201545 -224955 6752 -42640 -226931 -237392 -157893 -222323 -141976 -130382 -353319 -443936
17906 -443936 -244098 -84075 -127132 -362483 -507670 -293121 242507 633328 496470 275067
17896 275067 147617 76973 54734 105067 73460 -135118 -135629 -15642 78413 178338 215502
17885 215502 235391 59375 -102086 -109437 -298490 -499971 -544383 -470157 -388793 -269024 -137027
17874 -137027 -210646 -303807 -295109 -279672 -211177 -112642 18755 211004 266065 337082 398833
17863 398833 499304 525044 545738 523591 246558 56507 285920 354370 282082 307709 491171
17852 491171 617676 473492 296155 151684 -9609 -106556 -140492 -219259 -135446 -14420
17842 -14420 11604 103922 275111 365873 520563 672592 549091 208348 5360 -20966
17832 -20966 34494 162463 144421 118470 161193 185323 115093 146051 52412 -274797 -382052
17821 -382052 -257376 -263550 -386086 -440804 -390734 -305959 -154928 -186365 -329498 -198318 7615
17810 7615 202828 264769 234358 253447 287438 276542 146737 -148443 -249759 -55021 77411
17799 77411 287241 388948 554331 594257 552184 452556 293679 195278 33270 59328 -103674
17788 -103674 -126705 161188 254355 319865 415909 426218 325998 143226 170264 149530 94345
17777 94345 346334 570725 810846 937285 677784 386598 133140 -63781 -162914 -116300
17767 -116300 -46112 -177168 -204816 -174574 -122469 -13816 124542 300497 291378 335354 465537
17756 465537 327071 279529 373795 388966 450864 352400 90166 -331257 -307770 76088 269916
17745 269916 203741 149304 109104 94165 11640 43230 221172 298648 484612 473077 345922
17734 345922 259963 -65273 -339019 -591536 -718581 -524916 -266311 -313998 -307289 -392800
17724 -392800 -251070 -101646 -333677 -383581 -220204 -237481 -334572 -311899 -180632 35513
17714 35513 7827 -164028 -413465 -786343 -1001629 -834957 -458288 -19122 155167 -520
17704 -520 -37079 60563 82144 -35144 -288140 -328128 -185865 -32823 223162 271112 71624
17693 71624 -4806 32207 204109 319094 328118 161389 -4821 47686 66465 -14584 -174830
17682 -174830 -463543 -438249 -200223 -176510 -203302 -111921 -4426 148185 317545 384920
17672 384920 443175 313971 295569 327183 349708 326363 216649 124936 -6357 -244347 -319400
17661 -319400 -223928 -174584 -145105 -144230 76718 46821 -74767 -65432 -118069 -22027 9655 -131755
17649 -131755 -131472 84736 134723 -184030 -296941 -95776 362535 472530 230246 253641
17639 253641 327773 359205 406359 321567 46104 -83792 42394 124156 189942 115202 171110
17628 171110 267835 387361 501898 414813 157288 -45352 -142369 -73349 147609 264313
17618 264313 373536 596649 706184 526432 417199 201467 -88228 -195995 -221246 -189887
17608 -189887 -132046 28006 231524 211073 -55741 -253987 -225381 -224994 -54228 62935 6315
17597 6315 58097 322395 383569 319355 275187 70355 -175754 -297577 -306407 -171049 -117352
17586 -117352 -272886 -373812 -311588 -393646 -295727 -261422 -200399 19546 86726 -22296 -69716
17575 -69716 -17967 -121252 -311635 -421034 -452702 -468519 -317873 -176412 -152520 -209780 -321841
17564 -321841 -431809 -478198 -583150 -486162 -183857 10418 -108010 -104273 80735 306734
17554 306734 454161 294784 338593 695171 701923 243470 -93247 -123229 -29259 -86189 -85321
17543 -85321 -84486 -153535 -59569 209607 342544 135239 -155963 -68272 197532 383225 475948
17532 475948 433847 457429 358307 221558 36519 -329083 -621822 -455567 -29753 245191
17522 245191 395998 533545 446560 294954 127455 -60672 -203105 -255386 -193518 -89682
17512 -89682 -274047 -471876 -559455 -621805 -525410 -418805 -236703 -114142 -162295 -276618
17502 -276618 -117551 -31719 -179549 -233098 -211500 -119302 -52220 -27477 -117029 -151200 -145932
17491 -145932 -49578 -77875 -231460 -86162 182338 216417 208028 289261 232438 142658 125528
17480 125528 212937 424777 660980 570082 77591 -94482 91478 162237 48439 -207823
17470 -207823 -445719 -657345 -768125 -886529 -874643 -575415 -109926 112794 212718 411524
17460 411524 489721 263685 24777 -103355 -130425 167777 325351 194918 153568 180969
17450 180969 217477 70090 -215688 -312386 -207651 -183015 -283763 -280414 -79332 75904
17440 75904 16776 57065 175224 204921 103374 173054 388844 225459 -100949 -120901 88872
17429 88872 171169 101529 77555 146872 36193 -5105 -459 22350 113650 41751 -123143
17418 -123143 -255873 -285885 -247064 -185827 -138093 45137 405385 590921 383241 -93249
17408 -93249 -308603 -45658 70652 217773 357649 473404 501935 349091 135740 15524
17398 15524 -260399 -254947 40279 224424 362379 336488 90436 -36177 -154801 -157147 -108792
17387 -108792 -156249 -331323 -228025 23015 116535 171978 57018 6791 14494 67301 160969
17376 160969 225039 306979 373854 171772 26893 88500 58197 -85593 -89326 -275792 -437792
17365 -437792 -455037 -396886 -345053 -155482 130112 151107 65800 131260 191231 173905 127889
17354 127889 200990 498015 507482 295258 71293 -95275 -150777 -134972 -62633 -57422 -163077
17343 -163077 -241282 -145071 -149426 -71505 -73637 -159043 -185335 -60518 137818 214913 335225
17332 335225 210146 71816 287966 358286 304422 294792 274022 183613 -39498 71627 198253
17321 198253 200802 233532 293217 407162 481372 416202 221452 35002 -95627 -272454 -410307
17310 -410307 -434221 -130829 62409 28027 188347 321716 331652 121256 15263 120503
17300 120503 87447 75535 97558 198376 200419 163600 205583 218718 253247 146822 58424
17289 58424 150181 28574 -236421 -331219 -309545 -96603 124920 143425 125946 186372 389281
17278 389281 451654 284485 104509 -218282 -522924 -518007 -259263 -23417 -50430 -413780
17268 -413780 -524475 -540817 -549943 -375594 -209483 63402 306903 222749 139241 246957
17258 246957 326431 66551 -28405 186945 524927 655222 589151 324909 16212 -184399
17248 -184399 -207791 -277192 -448633 -641531 -606128 -333576 -192170 -213648 -284493 -406779
17238 -406779 -505558 -432400 -331575 -301929 -456466 -582452 -627914 -840144 -854633 -670611
17228 -670611 -508704 -405153 -228186 -16916 140188 93315 -77555 -302757 -568113 -810319
17218 -810319 -795978 -609853 -385337 -206712 -241729 -139006 31597 112340 237689 264484
17208 264484 285269 243294 -93981 -141049 191703 296360 21293 -143663 -363506 -458532
17198 -458532 -300132 -56716 -128025 -398570 -208344 50135 170502 99413 82319 163948
17188 163948 145031 221812 338569 399641 339718 286791 246123 150572 120516 227212 220692
17177 220692 97552 69413 152146 62438 1955 -251043 -599486 -600053 -518716 -564010 -375684
17166 -375684 -289879 -445411 -538055 -425712 -342689 -380793 -415725 -328842 -163755 -5891 26967
17155 26967 127388 26190 -182119 -260648 -269138 -280880 -216311 -40696 74936 114918 178836
17144 178836 92196 -143741 -60404 -20868 42780 340323 530843 296132 -87529 -318964
17134 -318964 -253810 -111007 -69588 -28192 -95982 -90744 37290 112524 62490 -86815 -204858
17123 -204858 -313036 -450859 -494064 -366106 -380426 -326911 -330763 -374095 -51008 171153 56672
17112 56672 -130081 -229483 -327208 -262961 -77017 -82731 -237262 -296881 -251136 -155794 -238500
17101 -238500 -185019 -205749 -97372 121464 120102 -17585 -160350 -273113 -482922 -519748
17091 -519748 -286882 -85051 95172 46400 146659 435219 440190 243633 233956 62934
17081 62934 -12380 -24095 -279817 -518220 -668953 -564790 -399508 5286 393051 606532
17071 606532 669961 498700 303444 332350 402277 290600 261295 360355 345610 500935 699787
17060 699787 636050 567779 509379 200097 -32669 -209043 -277923 -43486 172852 -1999
17050 -1999 -152988 -148027 -44670 29849 52308 101650 277662 367047 95156 -308088 -359310
17039 -359310 -109900 45066 118974 285473 454930 548546 422599 233012 213738 281360
17029 281360 143671 -70020 -236570 -396796 -448622 -345793 -246576 -136924 -102489 -243391
17019 -243391 -202368 -236020 -409001 -492754 -521492 -496012 -290365 -16999 253881 436332
17009 436332 402963 173546 -181093 -381712 -348874 -295464 -177954 7716 170661 327923
16999 327923 164935 -276121 -526011 -481785 -361378 -231630 -319377 -294049 -45927 222443
16989 222443 330619 238696 98496 -141903 -115983 -48802 -189978 -358072 -327103 -177412
16979 -177412 -308455 -371166 -135350 151110 123270 168849 392933 387670 172414 -25275
16969 -25275 -79223 -210254 -189565 -236034 -234190 -163454 -159544 -253313 -370260 -466050 -445281 -232524
16957 -232524 -234720 -121593 39127 145625 267389 93288 25331 99134 -69605 -292767
16947 -292767 -307400 -368139 -631536 -628194 -507572 -545928 -503575 -385325 -374921 -276928 -28761
16936 -28761 165114 101340 87128 302139 390444 68267 -133689 -44673 123549 284239
16926 284239 293579 283819 313581 298615 313800 271783 286660 258586 163808 44420 -144226
16915 -144226 -444006 -429807 -268387 -199938 -130904 -85691 -141470 -245933 -413719 -493604 -437176
16904 -437176 -447725 -411084 -122972 298757 446457 239945 23217 237982 541731 584351
16894 584351 406553 345115 257429 -23520 -122523 -32995 173453 306929 215688 126396 3874
16883 3874 -11196 230392 431556 335969 341698 615126 795829 711250 580081 455851 248646
16872 248646 14455 -96327 59763 231599 464828 694910 739186 609629 281050 263369
16862 263369 531591 801969 852103 673960 454896 387466 353269 151439 -15788 81015
16852 81015 162760 -112271 -320979 -293244 -336777 -284653 -225374 -177721 -163317 -232697 -361641
16841 -361641 -528183 -615444 -534137 -283187 -110074 -206025 -406531 -626303 -823883 -870431
16831 -870431 -844377 -726435 -423673 -414694 -417409 -265897 -97180 4935 67934 316652 458560
16820 458560 331189 164785 228309 130768 -36034 56645 -2839 -73386 -186851 -447730
16810 -447730 -423807 -187541 -279798 -633824 -626316 -306914 -198854 -296581 -233189 20654 82697
16799 82697 121789 186115 4653 -97991 -165333 -39293 24904 -71750 64112 252515 68723
16788 68723 -201674 -277261 -282440 -233610 64299 374642 360939 289449 278469 198126 85410
16777 85410 101630 208977 234286 -4661 -79042 -31980 -216867 -402011 -427240 -440184 -377387
16766 -377387 -141688 -35788 -110223 -45736 21937 6793 -225180 -322297 -174206 110806
16756 110806 240808 199263 78132 200414 398650 285635 67771 -94205 26232 213638
16746 213638 72615 -189249 -267339 -145620 -29902 -176212 -426597 -519448 -601937 -526959
16736 -526959 -387734 -301201 27876 337258 270656 148622 152078 51540 -28731 70535 401987
16725 401987 681577 927639 1094968 1148606 1050728 764018 391708 122895 158060 261584
16715 261584 209672 -101499 -261578 -192027 1041 57923 196983 375864 267210 140733
16705 140733 291736 268145 286802 340724 224980 255565 358923 250122 21844 17808 -163473
16694 -163473 -422162 -332981 -65592 31348 115033 77382 -34601 -56410 18236 42114 119381
16683 119381 452078 625249 544269 492312 344573 164796 173046 160420 619 -74404 59092
16672 59092 284924 527877 655123 497746 269984 66967 -42265 -98981 -170897 -236764
16662 -236764 -105017 9170 110670 370834 664538 725908 620367 504075 411652 314246
16652 314246 251249 115010 113387 93773 -25802 70591 256998 383224 271250 7395
16642 7395 -237157 -297341 -188125 -145270 -6588 134138 381068 286784 20887 -205394
16632 -205394 -324872 -386560 -532326 -669353 -394222 2361 164070 160726 115116 87710
16622 87710 250577 430024 332339 128757 -94933 -233821 -248535 -348196 -447988 -352018 -294586
16611 -294586 -410085 -371913 -140277 82651 274177 335928 371443 343991 160394 48784
16601 48784 147825 219627 41694 -139841 36776 413594 554108 508315 492564 230692
16591 230692 -74383 -223667 -136692 5836 106355 201281 350697 354618 38659 -224545
16581 -224545 -191375 -240585 -364084 -242184 121693 189218 -48714 -286420 -449482 -622760
16571 -622760 -613496 -613791 -675535 -506034 -237536 -171870 -336186 -538376 -467102 -97788 104611
16560 104611 71548 34981 73304 -6023 -108653 -78520 -94589 -37796 321085 501388 414968
16549 414968 222408 145780 261346 253263 258811 240557 224951 257045 318883 178122 6861
16538 6861 -161272 -246418 -178069 -115089 -67121 -96790 -237114 -244225 8096 213501 306559
16527 306559 310592 168914 -101623 -238084 -183859 -31815 -18217 -171342 -324370 -355755
16517 -355755 -314598 -258021 -17913 145909 95896 -109237 -156186 -104373 -200579 -253885 -186317
16506 -186317 -217397 -319085 -497469 -443445 -196145 -222704 -148705 -78817 -281857 -539373
16496 -539373 -737832 -611542 -423248 -461330 -589166 -638248 -419919 -136319 -48018 -120635
16486 -120635 -237547 -412183 -460123 -432141 -391115 -245537 -58912 26558 80332 140520 -21
16475 -21 -298875 -429074 -514567 -400322 -266272 -368634 -548714 -664581 -539896 -479948 -470461
16464 -470461 -419712 -411392 -363738 -249919 -128575 29940 88990 -6194 -233221 -357669 -311939
16453 -311939 -147646 -59443 -57004 -48245 105864 319337 408537 228719 -64706 -330965 -495899
16442 -495899 -404747 -312842 -338897 -389808 -278421 -92565 161846 283722 245216 454869
16432 454869 781660 753314 415532 320552 331115 103964 -74308 -9019 -27275 128896
16422 128896 149859 -78389 -375 18738 -57425 -188566 -462208 -449599 -182479 -145577 -225026
16411 -225026 -312905 -93373 136693 208726 227324 96620 -182530 -246906 -369 247730
16401 247730 338187 260035 295747 523703 696254 601718 417138 216398 119173 31419 -164156
16390 -164156 -299093 -226629 -142575 -101066 -21756 -75958 -303060 -414655 -321139 -241724 -117260
16379 -117260 -60261 -205745 -198077 -107769 -124593 -139907 -75664 -225953 -400057 -271943 -133985
16368 -133985 -102228 -84040 -61110 106082 424001 645938 510440 354511 583200 654030
16358 654030 474229 550976 598290 220558 -157280 -350734 -321119 -135590 20837 150604
16348 150604 177869 216838 221142 101782 -5989 -235671 -358662 -325895 -302486 -275998 1127
16337 1127 -33750 -235380 -515144 -689776 -566327 -464961 -429625 -344688 -207914 -7404
16327 -7404 -61330 -101607 198023 273556 108477 114003 208432 298808 240947 -23340 -222858
16316 -222858 -226713 -182607 -213631 -200552 -200711 -151977 -100415 -39623 -52724 -127329 -47991 -12565
16304 -12565 -212618 -396606 -512898 -349010 50904 93915 2837 69215 264744 383240
16294 383240 376246 222327 6991 -157071 -90331 38867 138723 -74629 -226410 -127735
16284 -127735 34402 11086 -262486 -380489 -298238 -53252 186111 308100 256141 25369
16274 25369 -61280 111654 287115 535936 781318 882091 822414 832595 726311 415982
16264 415982 211783 -53192 -138663 140860 220069 179493 6266 -297222 -380110 -283994
16254 -283994 -148065 -174960 -154512 -16606 132080 322467 245012 89512 16269 -63598
16244 -63598 -233403 -262311 -93316 -178262 -393584 -451430 -356270 -363615 -350434 -223256 -172881
16233 -172881 -55526 315521 607362 646897 393142 86402 -55333 -301008 -326883 -181772
16223 -181772 -228929 -250640 124588 421374 350338 261610 153115 -50945 -251736 -424953
16213 -424953 -543611 -496873 -572156 -646308 -310722 19644 52643 -30027 -124561 -363665 -601911
16202 -601911 -648256 -481370 -412995 -17279 395226 563604 456758 289698 222125 230969
16192 230969 396557 539862 445255 189187 38754 -31946 -75286 -26755 -137109 -325182
16182 -325182 -438725 -521338 -420399 -242910 -43674 258288 513160 496075 297194 192873
16172 192873 167144 135282 73226 -180264 -409214 -438401 -413951 -371829 -222586 -134986 -207414
16161 -207414 -227983 -161660 -128675 -199294 -128974 223262 522481 521385 270384 -192977 -345033
16150 -345033 -387263 -321557 -11363 410082 497399 353603 170902 155302 145051 201386 238104
16139 238104 228981 262840 296972 158695 -128247 -158454 -177181 -128462 112557 195163 206261
16128 206261 267105 252522 274430 138843 -112363 -137937 5655 79616 142998 405982 629852
16117 629852 643418 354055 -82300 -180309 -187930 -74629 118684 115944 78797 124145 209862
16106 209862 186990 136467 53894 29527 240492 479324 375082 304884 118619 -187122
16096 -187122 -261335 -279728 -433697 -464796 -382808 -210038 91501 166126 101602 -50677 -107598
16085 -107598 -147079 -203180 -326535 -571735 -720024 -654915 -479102 -296901 -147223 80786
16075 80786 128781 18604 263 -162942 -512786 -727531 -700742 -632198 -565703 -319152 160585
16064 160585 336574 329541 319532 288761 252096 77923 -126391 -336800 -300827 -362599 -439854
16053 -439854 -364611 -206680 -147995 -25315 125886 2415 -226222 -305680 -208761 -82322
16043 -82322 -141303 -100215 16682 -35244 -3504 -29334 -286594 -516589 -691328 -747488 -740015
16032 -740015 -713085 -548861 -265849 -164525 -200834 -321308 -383541 -161507 143054 258724
16022 258724 216089 84606 -204525 -595264 -1066182 -1063777 -607993 -163500 -109516 -233444
16012 -233444 -148120 38442 51857 -7076 -23090 -88295 -137613 -160629 26913 103808 193985
16001 193985 175617 23072 -107893 -221481 -227382 -61269 -105914 -129122 -30610 81116 178793
15990 178793 469640 681344 636293 522929 504826 530247 413145 510314 630293 325505
15980 325505 147119 178398 219415 197132 66846 19948 -149704 -453935 -782649 -973654
15970 -973654 -905740 -756290 -609055 -528560 -378740 -91887 258354 160092 -193626 -259447
15960 -259447 83332 177541 145540 349584 610421 599500 415666 387437 324430 361959 463517
15949 463517 211640 -139744 -241629 -276843 -112743 -78580 -53153 -7052 -103508 -212078
15939 -212078 -241576 -147260 -261534 -370789 -348871 -368426 -464873 -486796 -363422 -259073 -129508
15928 -129508 124360 238312 134810 117403 160199 130521 159769 80164 3236 -66039 -26094
15917 -26094 -139600 -352887 -143437 79867 52634 125291 93839 -69803 -113298 -55624 -89409
15906 -89409 -79218 -135341 -199322 -290790 -556513 -617792 -650714 -771346 -660865 -450812 -502602
15895 -502602 -470024 -467035 -378655 -280273 -374110 -467502 -496150 -377505 -160923 -178197 -503444
15884 -503444 -737590 -597342 -597751 -615708 -532889 -493486 -534409 -482332 -198344 5232 84944
15873 84944 19378 -22823 -102078 -208762 -83742 118479 275773 362974 251604 317420 431604
15862 431604 351714 247001 168284 59529 -107225 -338890 -434042 -391369 -379449 -261530
15852 -261530 -146665 -170632 -344273 -352855 -229634 -104312 -252517 -312128 -202582 -95669
15842 -95669 3423 -46280 -197447 -300031 -489769 -448372 -106160 114596 99785 61257 -84337
15831 -84337 -40632 104644 151088 127220 5267 -132652 -177885 -488945 -693466 -566152
15821 -566152 -384764 -368382 -511918 -603640 -453170 -101115 27026 26713 15960 -136352 -275973
15810 -275973 -239130 -196820 -19376 150860 178906 72910 12747 72915 159835 27920 -181098
15799 -181098 -275576 -300206 -158958 -99454 -226665 -481612 -581791 -432258 -178187 -94023
15789 -94023 -15134 -69887 -280540 -439521 -478327 -320793 -237206 -171319 -212018 -244169 -265039
15778 -265039 -299852 -264170 -107317 48464 77862 136161 227814 312901 174805 -196846 -376887
15767 -376887 -228211 -186213 -211248 -210909 -259633 -433581 -591676 -660237 -543093 -310913 -172832
15756 -172832 -195809 -155104 46840 -57437 -209741 -164859 -19152 154073 104785 4093
15746 4093 192115 371466 338357 302019 297562 259116 388182 468046 468285 472400 579800 372571
15734 372571 170275 140089 165396 242828 132681 94116 36807 -77480 -188293 -267903 -157553
15723 -157553 225176 311039 293474 501880 673958 791516 709096 408950 12411 -216386
15713 -216386 -253292 -169925 -55071 -132579 -247709 -367666 -523336 -375441 -101971 49088
15703 49088 -21693 -231316 -447889 -732705 -781545 -617938 -318040 -199362 -190683 -139307 -15964
15692 -15964 65548 164516 158010 201756 163355 154648 240389 219878 203523 197058 96356 64158
15680 64158 107535 120393 2964 -147416 -165727 -198968 -238487 -184868 -190591 -224160 102018
15669 102018 303866 -88909 -349580 -262273 68531 326743 375087 391178 489859 717382
15659 717382 808134 815592 664478 587148 543746 495035 384611 308519 169023 -41509 -291601
15648 -291601 -428578 -339104 -228526 -92476 -37740 47988 370369 534702 502815 492858 325311
15637 325311 399756 601767 644998 458489 186161 102393 210318 335358 390245 306606
15627 306606 173106 326070 308085 277398 355811 350348 487045 440982 363679 371667 511046
15616 511046 586738 454637 329117 316843 235224 283845 258919 191316 130012 -131689 -316369
15605 -316369 -311125 -251627 -297588 -339499 -331612 -317289 -303882 -290257 -313743 -203180 -25093
15594 -25093 -73619 -252676 -125536 -16095 20973 -32400 54069 -109062 -230193 -122115
15584 -122115 9265 282564 229790 -36745 -123729 -72049 -42779 19028 -193763 -496410
15574 -496410 -473732 -443402 -142372 152610 245895 238427 93826 -104020 -86738 15038 -36921
15563 -36921 41217 18601 -39309 -1679 80577 187762 189675 178805 198306 167336 167991 106999
15551 106999 295092 545025 584550 496112 313915 132373 -85997 -314748 -387496 -157881
15541 -157881 250749 497323 195812 -175621 -297763 -213031 -173742 -165838 -65763 -99123
15531 -99123 -240390 -415301 -372369 -95144 -26126 -263343 -442214 -395987 -294440 -107986
15521 -107986 -79268 -27002 170667 356199 259787 18541 -217320 -237409 -6331 41871
15511 41871 43460 204595 187884 99673 154452 225016 197078 142278 203505 139435 124039 253340
15499 253340 319462 203115 120464 92019 -151059 -256212 -1274 157983 292283 481557
15489 481557 516072 416849 321250 200428 10392 -39210 162852 151734 43327 -45321 -167791
15478 -167791 -314454 -349802 -332194 -421026 -549590 -491254 -308780 -309964 -512280 -803336 -867485
15467 -867485 -801730 -733840 -744050 -623196 -531849 -507833 -646137 -499026 -216725 -44582
15457 -44582 -181047 -376533 -522712 -403066 -148368 -283462 -479512 -417530 -301323 -214186
15447 -214186 9775 200991 337951 283481 101641 -4531 80995 210628 272375 280682
15437 280682 169540 70221 234360 377849 485475 589624 400631 75403 39253 243931
15427 243931 403773 376623 163046 -100730 -264032 -207265 -115162 -130643 -336743 -504375
15417 -504375 -307810 -30434 28799 -36137 -179434 -301496 -270273 -282546 -299405 -453947
15407 -453947 -466611 -380226 -225984 -28182 193165 296614 246658 142661 -55895 -224740
15397 -224740 -308006 -448010 -427074 -294697 -274386 -229214 -83286 34475 -144138 -353164
15387 -353164 -343735 -415365 -529680 -508210 -304117 -237037 -460454 -444316 -407709 -372765 -323188
15376 -323188 -194197 2580 70526 79795 173852 174124 -26654 -253390 -324065 -206090 82781
15365 82781 45316 -118876 -98876 -13593 91423 80597 173193 545677 562398 294347 47128
15354 47128 -114957 -262631 -123918 136290 170688 214794 452087 413086 279767 382090
15344 382090 432671 293954 166282 43878 -120944 -179451 -179157 -229649 -241761 -266215 -367455
15333 -367455 -457639 -547703 -635666 -557241 -476529 -463468 -244555 -99025 3505 181608 299068
15322 299068 233772 148235 32798 -24715 -112099 -118669 -124047 -214904 -406116 -290244 47458
15311 47458 244419 175667 120817 330569 562049 467530 196507 -89486 -159331 -263646
15301 -263646 -405371 -456290 -428756 -341796 -256172 -186682 -92984 -6935 154876 277233 243225
15290 243225 192528 44448 -86783 -244285 -427011 -490215 -418798 -367531 -425737 -369397 -401308
15279 -401308 -540569 -609451 -645645 -732802 -700502 -483432 -274133 -116738 -34383 78230
15269 78230 279132 452595 516706 480039 333798 169911 141127 93698 -81214 -97186 -171533
15258 -171533 -257381 -218078 -2660 298300 383801 265299 203416 381406 365063 172494
15248 172494 3353 -55064 -207457 -321720 -180598 -48302 -90737 -244318 -359408 -562227
15238 -562227 -748509 -585431 -302582 -46279 102663 164735 82128 53860 -23330 -113170
15228 -113170 -232119 -409529 -409197 -384431 -341012 -287701 -213762 -263974 -448682 -511740 -400301
15217 -400301 -272479 -299836 -172641 175062 478471 503697 404470 117991 -156517 -306172
15207 -306172 -373395 -448681 -453782 -354034 -373346 -364627 -224485 -266473 -525095 -698105 -837291
15196 -837291 -859045 -752469 -625250 -352302 -290786 -305131 -146134 -122589 -52846 -26983 -77341
15185 -77341 27661 13975 -237282 -306804 -142012 -59392 -14926 176410 306205 239003 200604
15174 200604 145067 207798 252803 321397 441863 570803 524106 526308 717729 968990 1020796
15163 1020796 821552 621682 541593 410541 446258 398343 191082 178562 273560 289636
15153 289636 97682 -245756 -640108 -593334 -369270 -61930 138888 362536 460152 385203
15143 385203 338187 117162 -10826 -63826 26263 298254 430468 507561 489226 324046
15133 324046 203791 102698 -97040 -286219 -443859 -422560 -481135 -568566 -554067 -451829
15123 -451829 -380625 -253877 -2779 92044 93096 129644 149114 52250 -4908 34508 -43991
15112 -43991 -101679 -111292 -153540 -284200 -302691 -326570 -281317 -252900 -321095 -337581 -325636 -101104
15100 -101104 117431 122351 42700 -53691 -103916 -167484 -132437 -48699 120036 325152 243415
15089 243415 80148 72956 36155 -61267 -220289 -346797 -347008 -98102 72507 94856 91892
15078 91892 -29465 -172117 -189064 -90346 44882 -32603 -58087 34045 196888 115368 -121480
15067 -121480 -193604 -200776 -255623 -421616 -378540 -26736 271089 158740 -28764 -4455 85331
15056 85331 3443 -256171 -329021 -322147 -221479 -416482 -728002 -779330 -604721 -509910 -495358
15045 -495358 -349794 -340038 -111476 61436 -57574 -266491 -400525 -552834 -525093 -520841
15035 -520841 -545031 -585702 -705999 -641004 -322289 -140053 -75100 78265 251194 346989
15025 346989 5665 -287514 -238696 -244197 -324551 -348600 -404759 -507106 -411067 -242310 -123144
15014 -123144 66458 -21134 -176816 -298252 -449480 -492894 -434110 -390880 -172996 -69473
15004 -69473 -187786 -167056 98764 290192 519601 633058 467636 172669 -154095 -320820
14994 -320820 -284878 -66259 47509 -121237 -202532 -104682 78938 107915 9304 139305
14984 139305 214592 145023 -92868 -401779 -515810 -468689 -328592 -112904 169047 151306
14974 151306 -27569 31531 6316 54990 220191 37145 -207113 -269296 -216803 -208389 -118167
14963 -118167 41834 41277 -205313 -314886 -193587 78714 227364 -10563 -37057 88739
14953 88739 95041 155977 139729 -14389 -41490 -139395 34648 358669 307438 48595 -111516
14942 -111516 -88875 -118021 -87945 153472 324029 270654 268129 208733 -57561 -160366 -203386
14931 -203386 -213517 -176775 -158464 -214821 -247746 -176006 -102551 -216416 -213994 -32587 209921
14920 209921 417003 458144 227133 149176 259763 273395 204475 158909 149908 171665 148369
14909 148369 158176 72304 55202 91485 208709 204216 283405 355827 161665 -105884 -320408
14898 -320408 -119901 223958 369036 416185 371222 135203 115125 114829 32960 -18423 -121593
14887 -121593 -189317 -272194 -198706 -179025 -224776 -188935 -320364 -337069 -343256 -349943 -468041
14876 -468041 -588623 -679858 -604608 -410763 -308056 -69450 120286 263310 303299 223202
14866 223202 289260 219464 27883 -142064 -292972 -385031 -237324 -13014 134327 201521
14856 201521 -101893 -533277 -482542 -137835 197278 292719 157574 94871 140628 134027 14517
14845 14517 -66129 -141743 -272966 -252538 -84398 210464 329077 277285 321288 483299 540533
14834 540533 290720 -47688 -116181 -52510 -26043 30416 5070 -13442 75554 96134 36182
14823 36182 -140829 -124465 114180 87179 58921 336268 543326 489596 388895 180945
14813 180945 7576 66156 -28955 -152984 -64910 -80061 -191760 -209119 -159256 -54696 45982
14802 45982 92 -73115 -63637 -102984 -159255 -161318 -59184 -18480 174543 239719 27780
14791 27780 -228359 -420398 -258154 -252329 -312048 -348501 -399221 -348041 -190173 -69808 -9512
14780 -9512 -111750 -196976 -126465 11017 82869 -237936 -421775 -419728 -385818 -330862 -391369
14769 -391369 -346449 -397655 -558275 -732073 -687822 -575472 -376346 -282008 -384825 -582104
14759 -582104 -684607 -374514 -210126 -290853 -304024 -414947 -436959 -441139 -304176 -192037
14749 -192037 -318032 -503530 -492593 -407056 -387837 -330847 -152830 88164 105406 -202531
14739 -202531 -269433 -250955 -180663 -26229 79249 51302 49453 90683 19745 673 60867
14728 60867 128745 328346 288217 193441 -5453 -214552 -356078 -228323 -76382 119181
14718 119181 334128 213464 -5733 -378070 -606889 -607916 -301125 108722 376812 315947
14708 315947 88497 -165536 -391679 -527499 -619055 -693934 -719879 -695364 -385072 12052
14698 12052 336108 574859 530692 485184 634511 534416 440817 451964 475277 432399 269837
14687 269837 238268 166533 205049 182698 33172 -24383 105748 277704 280329 294182 210745
14676 210745 -71571 -40596 97776 12989 -17747 111989 187573 190313 143620 141129 451195
14665 451195 556457 493459 570719 534887 503979 506816 445818 284609 288228 529122 528395 382177
14653 382177 214364 168466 229599 240632 -55303 -238696 -257286 -355642 -346853 -295981 -396272
14642 -396272 -533986 -510645 -521624 -565201 -360431 -338809 -299966 -229894 -40964 -69221 -173573
14631 -173573 -76891 -75831 -165606 -111747 -106259 -35339 7609 -183810 -183165 -86584 -166513 -221978
14619 -221978 -169940 -13731 98267 186235 106104 -36332 -39430 31831 3905 -224367 -424446
14608 -424446 -449028 -326764 -125150 4106 -27754 -157737 -121567 45073 48119 178197
14598 178197 373234 483724 155155 -62233 -68877 -23049 124036 224955 -33658 -161108
14588 -161108 -81359 -68148 -146881 -233073 -186757 -3115 124804 192077 252920 313007 425288
14577 425288 395474 160692 -25678 -202215 -237650 -177237 -135599 -207333 -325535 -310602 -189138
14566 -189138 -29600 210309 99382 -202914 -263965 -377866 -440698 -402108 -281795 -123218
14556 -123218 77874 350263 270526 19482 25626 -565 -57600 -119379 -62246 46668 98952
14545 98952 214269 238320 138165 46244 -28691 -105893 -99381 47566 153307 11479 -193742
14534 -193742 -375323 -334784 -211912 -200541 -317082 -491116 -610946 -638228 -518187 -360396
14524 -360396 -356824 -173308 70988 -66822 -136752 -72251 43633 108212 51543 73516 93622
14513 93622 6397 -4283 -43408 -70137 -18037 49812 -131545 -151198 -123424 -329218 -354027
14502 -354027 -116727 -69662 -127521 -159691 -165707 -77521 38138 115547 317388 478928 582956
14491 582956 585218 454937 498978 556701 465870 389336 386349 331071 306687 174594 -27182
14480 -27182 -192758 -30921 66520 -53213 71010 330285 586374 402614 129893 38105
14470 38105 -64009 -115078 9893 82296 -150038 -207939 -27067 140264 177316 80524 130449
14459 130449 178278 135749 -90180 -244999 -133598 26491 196957 159631 54581 292748
14449 292748 515562 459808 306920 138158 -174958 -250963 -172019 -15099 49125 20227
14439 20227 -113930 -234403 -282476 -120181 165203 336198 394139 230754 -58026 19065
14429 19065 381654 562482 535393 445109 298734 200459 -128227 -407613 -484399 -285539
14419 -285539 60230 187128 162755 97735 -26122 -113621 -130923 -131514 -287047 -454008 -344181
14408 -344181 -342520 -492286 -398438 -250227 -201540 -152219 -246501 -283517 -139870 143953 327756
14397 327756 427303 412383 207516 -84787 -75190 -104688 -278635 -347127 -332701 -425571 -484040
14386 -484040 -426223 -307030 -227182 -188281 -211114 -101726 -49442 -76961 -95290 -125521 -34054
14375 -34054 136554 359681 519406 540050 506051 343660 147587 62176 -62468 -264928
14365 -264928 -280324 -286589 -50062 195305 231291 33199 -120756 -172595 -300114 -227365 -251435
14354 -251435 -412456 -393338 -175831 72648 25373 -112133 -5712 110511 2296 -147253
14344 -147253 -120608 -119399 -89485 84398 321049 382590 476353 604387 464461 210989 -101860
14333 -101860 -258183 -362568 -488888 -313951 -26991 147547 258703 204187 83214 124986
14323 124986 182598 242028 203300 -60298 -185267 -271906 -397637 -445679 -506758 -274962 -127153
14312 -127153 -98334 -146900 -246635 -5033 342569 419289 385685 235166 108457 117365 79407
14301 79407 127428 147636 213886 96424 -47627 -163585 -372739 -378020 -341949 -391706 -203559
14290 -203559 30162 102164 152740 270282 365091 325116 301849 190465 70749 -104609
14280 -104609 -209425 -92127 147779 385330 400855 243166 50763 24272 63225 -150822
14270 -150822 -238006 -98684 25199 228531 356302 207482 -7814 -213101 -336370 -309251
14260 -309251 -357716 -124925 350818 632789 628024 539249 578770 621699 690454 797377 704128
14249 704128 442189 267826 112481 -26011 -2365 47178 111925 80420 22006 -65793 -140823
14238 -140823 -217853 -175729 -45302 -286724 -588678 -473747 -411729 -357057 -353815 -431765 -455182
14227 -455182 -433684 -457444 -530495 -526919 -381615 15502 288267 235665 281088 205228 20498
14216 20498 -57734 -33651 -92696 -466515 -699171 -544785 -190599 108396 146230 -82469
14206 -82469 -227669 -211878 -190925 -250899 -236237 -75276 -243638 -573601 -455761 97526
14196 97526 413709 435048 611959 582479 311619 274713 344374 300153 50529 -83946 79226
14185 79226 5791 -93374 77891 158371 151827 -80265 -317145 -379171 -454142 -401907 -184908
14174 -184908 -29542 39485 156687 231427 282306 269905 264838 155298 67667 -142612 -196344
14163 -196344 -103044 7470 217926 311866 142751 39279 56973 -70909 -126545 -21240
14153 -21240 101288 226985 410311 518457 504207 573508 563933 271110 -18692 -127850
14143 -127850 -30740 -54465 -92222 -94207 -50267 179050 380998 381893 279614 156159 168497
14132 168497 -63631 -481380 -590555 -271387 -139553 -401358 -705237 -687903 -401717 -378614
14122 -378614 -395686 -267272 -99108 -1772 -11827 -106374 -227962 -238518 -64347 -27384 -144761
14111 -144761 -135288 19505 212067 392208 478565 492242 337903 105801 29941 143733
14101 143733 142972 76925 11074 -206213 -299250 -310270 -272576 -140011 -191860 -193925 28324
14090 28324 140294 99978 86087 85702 -179109 -337727 -324214 -351158 -383191 -383740 -214901 197269
14078 197269 435050 322039 197626 142303 111189 139943 157859 285235 455079 438375
14068 438375 287527 56387 -241498 -249377 -88477 -160919 -200562 -292974 -258854 -67927 112210
14057 112210 329307 300375 111227 264194 371890 183781 -75780 -169398 -224625 -210780
14047 -210780 -114824 -116154 -1486 238704 318222 212147 275802 594059 530177 354414 603083
14036 603083 784821 684050 567915 538130 575046 508864 360348 123853 49910 61106
14026 61106 340772 643369 586039 422919 413065 352548 113598 -143068 -337389 -455923
14016 -455923 -563888 -638885 -732465 -857520 -768055 -393413 -180591 -231643 -290791 -68961
14006 -68961 173849 275203 239562 53255 31405 66803 108578 52411 -154696 -228827 -285350
13995 -285350 -381275 -230520 -101566 -111771 -248171 -189409 -144488 -196617 -188971 -205587 43405
13984 43405 199416 267898 392514 493833 381300 114768 101527 -54264 -271534 -195850
13974 -195850 -126851 -192280 -133983 72586 235670 204585 3062 181566 327005 306698
13964 306698 408386 620285 735082 636070 224289 -130886 -59948 139176 166698 107272
13954 107272 -29900 -115321 -80406 16352 -70604 -238339 -369713 -407565 -519060 -605612 -439306
13943 -439306 -222452 -221671 -308907 -446539 -407117 -184015 18085 7756 38479 235516 350476
13932 350476 311016 176515 88681 -10046 81953 204360 169418 -41636 -123550 -115444 -32752
13921 -32752 30165 -78654 -377244 -313198 -122328 -34929 31394 233966 432750 553473
13911 553473 472017 349552 188109 -51216 -249731 -425444 -629182 -711820 -564144 -260458
13901 -260458 -96179 -147802 -214922 -206668 -270763 -349654 -146165 99981 125080 113327 -85507
13890 -85507 -268187 -362433 -396982 -351630 -360872 -253139 -182561 22089 155207 215491 198168
13879 198168 94834 -78900 -159488 -49716 133800 474440 722503 725095 621946 568876
13869 568876 566479 583820 496155 382115 268600 316695 384065 362889 310918 223342 264887
13858 264887 194210 -63063 -202492 -161642 -164778 -712 86184 -128144 -470024 -484148 -258026
13847 -258026 -99522 5870 36577 52213 -39221 -221845 -312230 -289864 -243038 -194493 -194960
13836 -194960 -395419 -583383 -572369 -266366 133612 168564 358297 513659 425723 156542
13826 156542 -292090 -535373 -566743 -252231 -27221 -25415 -259425 -485529 -449472 -338191
13816 -338191 -321910 -504081 -549577 -467752 -282270 -197894 -171414 -265874 -472500 -527914 -445723
13805 -445723 -257159 -159746 -145862 -165831 -309475 -354800 -121251 -25547 -16353 -80925 -100612
13794 -100612 -84447 -71044 40200 -67979 -428374 -562906 -482688 -508945 -361416 -389130
13784 -389130 -339070 -384365 -549679 -696575 -931005 -821160 -539674 -602298 -827321 -803811
13774 -803811 -621545 -371479 -143786 -111525 -125935 -127290 -91245 17993 9254 -37536 -112416
13763 -112416 -153486 -256030 -246413 -233174 -344033 -232469 -3170 60531 98551 282203 395208
13752 395208 264884 320488 422712 403775 327716 223106 125114 57019 -154273 -210056 -222164
13741 -222164 -315033 -403356 -337527 -332638 -406554 -124736 48953 -2669 45445 -57643 -188898
13730 -188898 -200493 -404120 -585394 -413762 -213558 -171253 -308304 -540409 -545193 -374841
13720 -374841 -342934 -143330 -46778 -233395 -449820 -449461 -61417 250233 437302 494376 186150
13709 186150 -49487 -103815 -121036 -382381 -556506 -539446 -516512 -501005 -423422 -220444 -103577
13698 -103577 63917 276358 125440 -71781 61351 244852 313631 331149 196400 90794
13688 90794 285109 449705 549016 738365 550666 102985 -76220 -88467 23196 125958
13678 125958 -175735 -394171 -338354 -221456 -73334 7546 117048 131805 118171 217001
13668 217001 229688 108446 91786 217336 230934 167515 139564 120322 -740 -163796 -315411
13657 -315411 -619707 -793152 -695492 -355117 -36444 189288 235831 -7186 -344538 -348056
13647 -348056 -147376 -28054 -20126 -253670 -342694 -172234 15248 83500 -16812 -65615
13637 -65615 -188027 -207538 -170812 -126767 -109893 -78198 -4064 10822 -29249 2342 286674
13626 286674 529212 358770 140709 -97188 -41695 146370 -37767 -201454 -91514 -97334
13616 -97334 -106459 -75833 -155319 -127129 -72896 19616 74614 40129 393300 568366 549187
13605 549187 577880 526046 258325 3268 -62959 -206792 -358660 -392846 -348064 -334652 -271789
13594 -271789 -172573 -346064 -603738 -539924 -331860 -205193 -108637 85657 60527 -73452
$$ [...]
##END NTUPLES=NMR SPECTRUM
##END=
