##TITLE=C13_5ID(B2)
 DMSO-d6, 20000 sc

 20.1.2022
##JCAMPDX= 6.0         $$ Bruker NMR JCAMP-DX V2.0
##DATA TYPE= NMR SPECTRUM
##DATA CLASS= NTUPLES
##ORIGIN= UXNMR, Bruker Analytische Messtechnik GmbH
##OWNER= root
$$ XWIN-NMR		Version 3.5
$$ Fri Jan 21 10:25:40 2022 Russian Standard Time (UT+4h)  she@DPX200
##.OBSERVE FREQUENCY= 50.327896
##.OBSERVE NUCLEUS= ^13C
##.ACQUISITION MODE= SIMULTANEOUS
##.ACQUISITION SCHEME= undefined
##.AVERAGES= 20001
##.DIGITISER RES= 17
##SPECTROMETER/DATA SYSTEM= spect
##.PULSE SEQUENCE= zgpg30
##.SOLVENT NAME= CDCl3
##.SHIFT REFERENCE= (INTERNAL, CDCl3, 0, 222.961)
##AUDIT TRAIL= $$ (NUMBER, WHEN, WHO, WHERE, WHAT)
$$ ##TITLE= Audit trail, XWIN-NMR		Version 3.5
$$ ##JCAMPDX= 5.01
$$ ##ORIGIN= Bruker BioSpin GmbH
$$ ##OWNER= she
$$ F:/spectra/data/she/nmr/c13/1/pdata/1/auditp.txt
$$ ##AUDIT TRAIL=  $$ (NUMBER, WHEN, WHO, WHERE, WHAT)
(   1,<2022-01-21 10:24:16.67 +0400>,<she>,<DPX200>,
      <created by zg, POWCHK disabled, PULCHK disabled
       terminated by command 'halt'
       configuration hash MD5:
       00 E9 B6 7A A2 85 ED C7 34 08 36 98 17 FE 4E 26
       data hash MD5: 32K
       2A 9C 8A 1B B4 83 83 67 9E 2D 68 2F 39 22 D5 26>)
(   2,<2022-01-21 10:24:24.32 +0400>,<she>,<DPX200>,
      <Start of raw data processing
       efp BC_mod = 2 LB = 1 FT_mod = 6 PKNL = 1 PHC0 = -343.5404 PHC1 = 38.56232 SI = 32K 
       data hash MD5: 32K
       F2 48 8E 8E A1 76 08 32 5E FD 42 55 0F ED 86 6A>)
(   3,<2022-01-21 10:24:31.51 +0400>,<she>,<DPX200>,
      <abs ABSG = 5 
       data hash MD5: 32K
       B5 EE B2 0D 93 85 AF DE B1 8F 1E DF CD D3 60 80>)
(   4,<2022-01-21 10:25:10.06 +0400>,<she>,<DPX200>,
      <pk PHC0 = -0.5739577 PHC1 = 0.7999998 
       data hash MD5: 32K
       29 14 07 CB B0 10 50 9C 42 BD D8 61 1F CB 3D 3A>)
(   5,<2022-01-21 10:25:15.82 +0400>,<she>,<DPX200>,
      <abs ABSG = 5 
       data hash MD5: 32K
       7D 06 74 BE 09 35 62 F1 3A B4 60 B4 22 89 56 F6>)
$$ ##END=
$$ 
$$ hash MD5
$$ 95 37 5A 7B C7 D8 63 18 66 4D 14 FA 94 91 B3 35
##$RELAX= 
##$RELAX= 
##$RELAX= 
##$RELAX= 
##$RELAX= 
##$RELAX= 
##$RELAX= 
##$RELAX= 
$$ Bruker specific parameters
$$ --------------------------
##$DU= <F:/spectra>
##$EXPNO= 1
##$NAME= <c13>
##$PROCNO= 1
##$TYPE= <nmr>
##$USER= <she>
##$AMP= (0..31)
100 100 100 100 100 100 100 100 100 100 100 100 100 100 100 100 100 100 
100 100 100 100 100 100 100 100 100 100 100 100 100 100 
##$AQSEQ= 0
##$AQ_mod= 1
##$AUNM= <au_zg>
##$AUTOPOS= <>
##$BF1= 50.322709
##$BF2= 200.13
##$BF3= 50.322709
##$BF4= 500.13
##$BF5= 500.13
##$BF6= 500.13
##$BF7= 500.13
##$BF8= 500.13
##$BYTORDA= 1
##$CFDGTYP= 0
##$CFRGTYP= 5
##$CHEMSTR= <none>
##$CNST= (0..31)
1 1 145 1 1 1 1 1 1 1 1 1 1 1 1 1 1 1 1 1 1 1 1 1 1 1 1 1 1 1 1 1 
##$CPDPRG= <waltz16>
##$CPDPRG1= <>
##$CPDPRG2= <waltz16>
##$CPDPRG3= <>
##$CPDPRG4= <mlev>
##$CPDPRG5= <mlev>
##$CPDPRG6= <mlev>
##$CPDPRG7= <mlev>
##$CPDPRG8= <mlev>
##$CPDPRGB= <>
##$CPDPRGT= <>
##$D= (0..31)
$$ [...]
##$SUBNAM4= <"">
##$SUBNAM5= <"">
##$SUBNAM6= <"">
##$SUBNAM7= <"">
##$SUBNAM8= <"">
##$SUBNAM9= <"">
##$SW= 239.972175391363
##$SWIBOX= (0..15)
0 1 3 0 0 0 0 0 0 0 0 0 0 0 0 0 
##$SW_h= 12077.2946859903
##$TD= 32768
##$TD0= 1
##$TE= 0
##$TE2= 300
##$TE3= 300
##$TEG= 300
##$TL= (0..7)
120 120 120 120 120 120 120 120 
##$TP= (0..7)
150 150 150 150 150 150 150 150 
##$TP07= 0
##$TPNAME0= <>
##$TPNAME1= <>
##$TPNAME2= <>
##$TPNAME3= <>
##$TPNAME4= <>
##$TPNAME5= <>
##$TPNAME6= <>
##$TPNAME7= <>
##$TPOAL= (0..7)
0.5 0.5 0.5 0.5 0.5 0.5 0.5 0.5 
##$TPOFFS= (0..7)
0 0 0 0 0 0 0 0 
##$TUNHIN= 0
##$TUNHOUT= 0
##$TUNXOUT= 0
##$USERA1= <user>
##$USERA2= <user>
##$USERA3= <user>
##$USERA4= <user>
##$USERA5= <user>
##$V9= 5
##$VALIST= <valist>
##$VCLIST= <CCCCCCCCCCCCCCC>
##$VD= 0
##$VDLIST= <DDDDDDDDDDDDDDD>
##$VPLIST= <PPPPPPPPPPPPPPP>
##$VTLIST= <TTTTTTTTTTTTTTT>
##$WBST= 1024
##$WBSW= 4
##$XGAIN= (0..3)
0 0 0 0 
##$XL= 0
##$YL= 0
##$YMAX_a= 131612618
##$YMIN_a= -46903713
##$ZGOPTNS= <>
##$ZL1= 120
##$ZL2= 120
##$ZL3= 120
##$ZL4= 120
##$ABSF1= 222.961
##$ABSF2= -17.03589
##$ABSG= 5
##$ABSL= 3
##$ALPHA= 0
##$AQORDER= 0
##$ASSFAC= 0
##$ASSFACI= 0
##$ASSFACX= 0
##$ASSWID= 0
##$AUNMP= <proc_1d>
##$AZFE= 0.1
##$AZFW= 0.5
##$BCFW= 0
##$BC_mod= 2
##$BYTORDP= 0
##$COROFFS= 0
##$CY= -3
##$DATMOD= 1
##$DC= 0
##$DFILT= <>
##$DTYPP= 0
##$F1P= 0
##$F2P= 0
##$FCOR= 0.5
##$FTSIZE= 32768
##$FT_mod= 6
##$GAMMA= 0
##$GB= 0
##$INTBC= 1
##$INTSCL= 4.134877e-10
##$ISEN= 128
##$LB= 1
##$LEV0= 0
##$LPBIN= 0
##$MAXI= 10000
##$MC2= 0
##$MEAN= 0
##$ME_mod= 0
##$MI= 0.1934396
##$NCOEF= 0
##$NC_proc= 3
##$NLEV= 6
##$NOISF1= 120.0001
##$NOISF2= 80.00006
##$NSP= 0
##$NTH_PI= 0
##$NZP= 0
##$OFFSET= 222.961
##$PC= 1.4
##$PHC0= -344.1143
##$PHC1= 39.36232
##$PH_mod= 1
##$PKNL= yes
##$PPARMOD= 0
##$PSCAL= 0
##$PSIGN= 0
##$REVERSE= no
##$SF= 50.3227146458226
##$SI= 32768
##$SIGF1= 140
##$SIGF2= 120
##$SINO= 11.81781
##$SIOLD= 32768
##$SREGLST= <13C.CDCl3>
##$SSB= 0
##$STSI= 32768
##$STSR= 0
##$SW_p= 12077.2946859903
##$SYMM= 0
##$S_DEV= 0
##$TDeff= 32768
##$TDoff= 0
##$TI= <>
##$TILT= no
##$TM1= 0
##$TM2= 0
##$TOPLEV= 0
##$USERP1= <user>
##$USERP2= <user>
##$USERP3= <user>
##$USERP4= <user>
##$USERP5= <user>
##$WDW= 1
##$XDIM= 32768
##$YMAX_p= 296823301
##$YMIN_p= -1751791
$$ End of Bruker specific parameters
$$ ---------------------------------
##NTUPLES= NMR SPECTRUM
##VAR_NAME=  FREQUENCY,     SPECTRUM/REAL,   SPECTRUM/IMAG
##SYMBOL=    X,             R,               I
##VAR_TYPE=  INDEPENDENT,   DEPENDENT,       DEPENDENT
##VAR_FORM=  AFFN,          ASDF,            ASDF
##VAR_DIM=   32768,         32768,           32768
##UNITS=     HZ,            ARBITRARY UNITS, ARBITRARY UNITS
##FACTOR=    0.368581032318806, 1,           1
##FIRST=     11220.0027064323, 0,            0
##LAST=      -857.291979557962, 0,           0
##MIN=       -857.291979557962, -1751791,    0
##MAX=       11220.0027064323, 296823301,    0
$$ Real data points
##PAGE= N=1
##DATA TABLE= (X++(R..R)), XYDATA
$$ [...]
10919B69319l3732k99286J164K70982J78097q1669l30329j85384J10596j6188
$$ 269319 235587 -63699 -62535 208447 386544 304875 -25454 -210838 -100242 -116430
10909a16430j22722J6300J53100j19341j60656q6926k2703M2379J7054K04138
$$ -116430 -239152 -222852 -69752 -189093 -349749 -436675 -459378 -416999 -399945 -195807
10899a95807K00398J0514J78310O2433p6718J669K6131J51208R6562r3628k25123
$$ -195807 4591 15105 193415 255848 179130 180799 206930 358138 454700 361072 135949
10888A35949n3854n0114L0017L9500Q361O1699O1183K7956M2130r9681j5653L25858
$$ 135949 82095 31981 61998 101498 109859 171558 232741 260697 302827 203146 187493 513351
10876E13351J12067j45120k46676k29257j41429N8424O6293p1669j8267J98308
$$ 513351 625418 480298 233622 4365 -137064 -78640 -12347 -84016 -102283 96025
10866I6025J14487k09566j71362j78453p7268P5960L12315K99021J33463K8280
$$ 96025 210512 946 -170416 -348869 -426137 -350177 -37862 261159 394622 422902
10856D22902n6933k61717r8920N8003q0116k14082J7404J12983q0359N6375R7839
$$ 422902 365969 104252 5332 63335 -16781 -230863 -213459 -100476 -180835 -124460 -26621
10845b6621J50927J03929j70520j97203L8970k6036k14836k88596O8703K66214
$$ -26621 124306 228235 57715 -139488 -100518 -126554 -341390 -629986 -561283 -295069
10835b95069K77103K09151m5316j03834j35300k07494N983K14932L8436n8531
$$ -295069 -17966 191185 145869 42035 -93265 -300759 -294776 -79844 -41408 -99939
10825i9939M1062Q0718J78381K87754O5059k24157q5900L0868J04906j4335j91920
$$ -99939 -58877 21841 200222 487976 553035 328878 242978 273846 378752 364417 172497
10814A72497k58127l71369q5189L7294L9009N2003K09727K34851J39664n7828
$$ 172497 -85630 -456999 -542188 -504894 -465885 -413882 -204155 30696 170360 112532
10804A12532r8899J76031R775q8369o560k02005j43964L2501r5093j8490L58281
$$ 112532 13633 189664 199439 111070 104510 -97495 -241459 -208958 -304051 -322541 35740
10793C5740K00498q0571k87054k87588q9039J5653J26316J50248J04737p462k05083
$$ 35740 236238 155667 -131387 -418975 -508014 -492361 -366045 -215797 -111060 -118522 -323605
10782c23605k71911J07337K09231K05303J37247l2834p0993J46985K32830p9836
$$ -323605 -595516 -488179 -278948 -73645 63602 30768 -40225 106760 339590 259754
10772B59754k59768m4200O8915K633K8904J25184p3303k10356K6025L4199r1077
$$ 259754 -14 -44214 24701 27334 56238 181422 108119 -102237 -76212 -42013 -133090
10761a33090p1626p5387k5909J06508M5288j94943k05215O6847K44113K20982
$$ -133090 -204716 -280103 -306012 -199504 -154216 -349159 -554374 -487527 -243414 -22432
10751b2432K8006j44116J7579K76662M0148j49278k99935k00235K25700L16637
$$ -22432 5574 -138542 -120963 155699 195847 46569 -253366 -453601 -227901 88736
10741H8736J06069q7140R0240R1706m0980O8741J93730P7548j51062j39948p0928
$$ 88736 194805 107665 197905 289611 248631 317372 511102 588650 437588 297640 226712
10730B26712q3007l15573k27770J11261J61707J01036J61655L0692o1765l4328
$$ 226712 143705 -171868 -399638 -288377 -126670 -25634 136021 166713 104948 70620
10720G0620j7402j00944J8834O1941L4034N4615N7000J46031J66331o2794k56834
$$ 70620 53218 -47726 -28892 33049 67083 121698 178698 324729 491060 428266 171432
10709A71432k75271k22352K1630N20j28159J86532K52982J11428P9430M4549M1715
$$ 171432 -103839 -326191 -304561 -304041 -432200 -245668 7314 118742 198172 242721 284436
10698B84436n5999j62336l5222K30226J09108J16731J12684j24000k03086M0074
$$ 284436 228437 66101 30879 261105 370213 486944 599628 475628 272542 312616
10688C12616J15646K8319k70492k21918j4475j62446O4941J77465r034l7024k47445
$$ 312616 428262 456581 186089 -35829 -50304 -212750 -147809 29656 20622 -16402 -263847
10677b63847k96738P7444Q9828k16984m0598P1260J03302L79803Q8249j69561
$$ -263847 -560585 -483141 -393313 -610297 -650895 -579635 -476333 -96530 -8281 -177842
10667a77842n8312r4603j654J39064J25595J21709Q3855j09733k51139j37441
$$ -177842 -236154 -330757 -332411 -193347 -67752 53957 137812 28079 -223060 -360501
10657c60501O1729J94956M5267q1477l563n0477N0424M6013j82736j14957N7083
$$ -360501 -298772 -103816 -58549 -140026 -143589 -194066 -143642 -97629 -280365 -395322 -338239
10646c38239P6510p1888j00323o8162k09968J2034K04123N8409K7327J43972M7918
$$ -338239 -261729 -333617 -433940 -502102 -712070 -700036 -495913 -437504 -410177 -266205 -218287
10635b18287k326M8193R0370P0163L859j11599j37736k00440r8863Q9340O0572
$$ -218287 -220613 -172420 -82050 -11887 -8028 -119627 -257363 -457803 -556666 -467326 -406754
10624d06754J87271J57081J85607K34958j9375k96495l64641R750J08520K56191
$$ -406754 -219483 -62402 123205 358163 338788 42293 -322348 -312598 -204078 52113
10614E2113K60012K7978m4785Q3992J10450p0780k98348l09825k79885p3871J02116
$$ 52113 312125 340103 295318 379310 489760 418980 120632 -189193 -469078 -542949 -440833
10603d40833p2862k10757m5605P0030J45261K0302M1775K11091Q9475k2519Q3735
$$ -440833 -513695 -724452 -770057 -700027 -554766 -534464 -492689 -281598 -192123 -214642 -130907
10592a30907J15505p0806j39560K2498N5187j20294P1010K37863N3595P2916n1698
$$ -130907 -15402 -86208 -225768 -203270 -148083 -268377 -197367 40496 94091 167007 115309
10581A15309l01133k50733J7391J99760J94958L9920j18863K8919J23387j852
$$ 115309 -185824 -436557 -419166 -219406 -24448 15472 -103391 -74472 48915 47063
10571D7063k7759N9406r6189k4578j76748k42974J0064K45015J58857n3259L3751
$$ 47063 19304 78710 -17479 -42057 -218805 -461779 -451715 -206700 -47843 -101102 -67351
10560f7351J62949J68723J76552L2408j99243j26717M7491J01137J56161J38214
$$ -67351 95598 264321 440873 473281 274038 147321 194812 295949 452110 590324
10550E90324j1301l2969R9954J70361j03781k13374K8581O7530j38581j01267
$$ 590324 579023 546054 646008 816369 712588 499214 527795 595325 456744 355477
10540C55477l2271j23482J5643n893j63038j29027M3595J41188o279k13469j60443
$$ 355477 323206 199724 215367 209474 46436 -82591 -38996 102192 95913 -117556 -277999
10529b77999R3814k0322p0603j11860q0363J12075K36295K44522M818j61666m9760
$$ -277999 -184185 -204507 -275110 -386970 -467333 -355258 -118963 125559 130377 -31289 -81049
10518h1049K954N1179P91j14132j75993j9739M3747N5021J51716J07234k46715
$$ -81049 -78095 -26916 -26125 -140257 -316250 -335989 -292242 -237221 -85505 21729 -224986
10507b24986j83974o9881k3879J76601J09415J04496J03658q946N4879J1461O4904
$$ -224986 -408960 -478841 -502720 -326119 -216704 -112208 -8550 -17496 37383 48844 113748
10496A13748o9392j33292J25702J68193J44880m0185o6272j9894j15374l2193
$$ 113748 44356 -88936 36766 204959 349839 309654 243382 223488 108114 75921
10486G5921M86L1582Q1374q1478k60816j35047l7131J32569J45691K17367L32064
$$ 75921 76407 107989 189363 107885 -152931 -287978 -325109 -192540 -46849 170518 502582
10475E02582K07117j2416k81885j99368l77415k89517O861J4307J19615L51972
$$ 502582 709699 697283 415398 216030 -161385 -450902 -444041 -429734 -310119 41853
10465D1853K33614o4220J3882J8640l0367j1779o2564q0668n9294r5863j61233
$$ 41853 275467 211247 225129 243769 213402 201623 139059 58391 -903 -96766 -257999
10454b57999k44541k88631O2400J07250Q9471K54049L02380O1541j37728l36350
$$ -257999 -502540 -791171 -728771 -621521 -532050 -278001 24379 85920 -51808 -388158
10444c88158j85324J23188K59761J73380n271j9711p0508j20960J24923L28659
$$ -388158 -573482 -450294 -190533 -17153 -22424 -42135 -112643 -233603 -108680 219979
10434B19979K1562k02768j23325q9165q835m7667j32204j01183J31116M59191
$$ 219979 241541 38773 -84552 -173717 -182552 -230219 -362423 -463606 -332490 126701
10424A26701K34881p2091j80791k13962j68141q2546o9923j17560J83851L46970
$$ 126701 361582 289491 108700 -105262 -273403 -355949 -425872 -543432 -359581 -12611
10414a2611K20735J17887R7849J67887N5149l2128O5791j51164l78524j37966
$$ -12611 208124 326011 423860 591747 646896 614768 680559 529395 150871 12905
10404A2905O3615j4113J44609R7002k751m150o5793k3878j69727k12519J37819
$$ 12905 76520 62407 207016 304018 301267 297117 231324 207446 37719 -174800 -36981
10393c6981K30130J86959k3323R2739J04204o5759k8653n6471k53471k03645L0561
$$ -36981 193149 380108 356785 449524 553728 487969 459316 402845 149374 -54271 -23710
10382b3710J36267j76090l29006j06037K7195j0193J1485N9288J73072j94939
$$ -23710 112557 -63533 -392539 -498576 -471381 -481574 -470089 -410801 -237729 -432668
10372d32668o5657L05649R3820L6616p7389r5236L6736j28506n4818K35096K39391
$$ -432668 -498325 -192676 -98856 -62240 -139629 -234865 -198129 -326635 -381453 -146357 93034
10361I3034O8387q5075o818n0189j53100o2708J18863j34n7425o3579k929j60193
$$ 93034 161421 76346 69528 19339 -133761 -196469 -77606 -77740 -135165 -198744 -201673 -361866
10349c61866r1390J18034J92997K6780j66086L8797J23798j69498j7319K34582
$$ -361866 -453256 -335222 -142225 -115445 -281531 -242734 -118936 -288434 -305753 -71171
10339g1171J37374O0147j60462q3996J22541J08295j08666j33711o3048J97279
$$ -71171 66203 126350 -34112 -118108 4433 112728 4062 -129649 -192697 4582
10329D582J32939j51483j32024O7084K11189J97867O401j83499j12618m5692l5863
$$ 4582 137521 -13962 -145986 -78902 132287 330154 336555 153056 40438 -5254 -41117
10318d1117j25170m1364J21332N9675L8533p6763j44413Q8021J38094M5733n6406
$$ -41117 -166287 -207651 -86319 -26644 11889 -64874 -209287 -121266 16828 62561 6155
10307F155o1619j23688j23810J40120R1211N5957J8477R9273k7502J07792K50256
$$ 6155 -55464 -179152 -302962 -162842 -71631 -15674 2803 102076 74574 182366 432622
10296D32622K7073k62922j23292n8443k31003j26805J21887K79825J56262Q0011
$$ 432622 459695 196773 73481 15038 -215965 -342770 -220883 58942 215204 295215
10286B95215L7228m8094j48198j21234J05749p2236j47045m6233p5878J1604m6876
$$ 295215 332443 284349 136151 14917 120666 48430 -98615 -144848 -220726 -209122 -255998
10275b55998l4395j91983k37590q8435M9287N8265R2374J27068M6699o4406L739
$$ -255998 -290393 -482376 -719966 -808401 -759114 -700849 -608475 -481407 -434708 -499114 -495375
10264d95375J05832J81163K06753K50781K2360O357Q0095m7947q6227j53347j70654
$$ -495375 -389543 -208380 -1627 249154 271514 277871 357966 310019 223792 70445 -100209
10253a00209j8222K20680L43467P2634j5820J46960Q8171k00026k73763j89085
$$ -100209 -118431 102249 445716 518350 502530 649490 737661 537635 263872 74787
10243G4787k9769p1441j05329J771j57183j93219M2944K41349L20301K93388Q8069
$$ 74787 45018 -26423 -131752 -129981 -287164 -480383 -437439 -196090 124211 417599 505668
10232E05668j30852j74835j08082O6279J42743K34637L55520M10281J02639j06583
$$ 505668 374816 199981 91899 158178 300921 535558 891078 1301359 1403998 1297415
10222A297415k14456r9806M3150P0412O7782K76084N50457Q56815R10640J024925
$$ 1297415 1082959 983153 1026303 1096715 1164497 1440581 1991038 2847853 3758493 4783418
10212D783418J131285J063065J94689r21455j142239j119773j107196r08051o01516
$$ 4783418 5914703 6977768 7172457 6251002 5108763 3988990 2881794 1973743 1372227
10203A372227l40508j24569k1207M7390j30140l60507j87667J27640J82555j46329
$$ 1372227 1031719 907150 885943 933333 803193 442686 255019 382659 565214 418885
10193D18885n2627Q0751J84842O8735p0210R6658J7228j98176j2339j6593p9390
$$ 418885 366258 447009 631851 700586 630376 727034 744262 546086 533747 517154 437764
10182D37764J16772N6576j73383k59696j50189j22590k3594L3805o3410K9860
$$ 437764 554536 611112 437729 178033 27844 -94746 -118340 -84535 -147945 -118085
10172a18085m43K962J54746r806M7773j22179j06444K37236K34092L5862j62149
$$ -118085 -118528 -115566 39180 29374 77147 -45032 -151476 85760 319852 355714 193565
10161A93565k44392M6280K01734O8372q4622J2704M3903J4824j23150o969O79
$$ 193565 -50827 -4547 197187 265559 180937 193641 237544 252368 129218 122249 122928
10150A22928L0595P5725j23529j61584j11072Q742k0969M3401J07158R2249n5805
$$ 122928 153523 229248 105719 -55865 -166937 -158195 -179164 -135763 -28605 63644 7839
10139G839j56173K9711J68687M502L9348K2082j32573k6915O5733Q9065R3816
$$ 7839 -148334 -118623 50064 54566 93914 115996 -16577 -43492 22241 111306 205122
10128B05122J74590J3486j9692K9753r9598j10906P9962O8439n2462l0822O7940
$$ 205122 379712 393198 373506 403259 303661 192755 272717 341156 288694 257872 325812
10117C25812J5315j17163J65199K23172R5328n7007k26467k27082q620n2809j47116
$$ 325812 341127 223964 389163 612335 707663 650656 424189 197107 188487 135678 -11438
10106a1438j90321k28580k9519J60978J24100m0268O7049L0063P037M9066J28659
$$ -11438 -201759 -430339 -459858 -298880 -174780 -215048 -147999 -117936 -110899 -61833 66826
10095F6826J98910R251k20131r3020m2241r1050r4544J858j1524J0702K2012K24020
$$ 66826 265736 274987 54856 -38164 -80405 -171455 -265999 -264141 -275665 -264963 -242951 -18931
10083a8931J31193r4489j48872J46904M57507J50096j35438j36059k6644m1710
$$ -18931 112262 17773 -131099 15805 473312 623408 487970 351911 325267 283557
10073B83557q1548p825L8834j57268r4076K551N9854p6714o4247P4142J32507
$$ 283557 202009 194184 233018 75750 -18326 -15775 44079 -32635 -96882 -22740 109767
10062A09767J49124Q721m1812M1762J54717n5223k41213j12916k6920j02769l4361
$$ 109767 258891 267612 225800 267562 422279 367056 125843 12927 -13993 -116762 -151123
10051a51123l2595j00980k27941J18163K72646J22108r6710p065J80855J20657
$$ -151123 -183718 -284698 -512639 -394476 -121830 278 -96432 -103497 77358 198015
10041A98015r4422k78126l44585j49711R5761J18043L7406n089J9944M3719K7728
$$ 198015 103593 -174533 -519118 -668829 -573068 -455025 -417619 -422708 -402764 -359045 -331317
10030c31317P0409j25577j48335l2235m1637K30090J64385k41900j2709J35889
$$ -331317 -260908 -386485 -534820 -567055 -608692 -378602 -214217 -456117 -468826 -332937
10020c32937O0715L3666J7001j4984O8182n5999k77371k00944L1561J24151L87246
$$ -332937 -272222 -238556 -221555 -236539 -168357 -224356 -501727 -702671 -671110 -546959 -159713
10009a59713K08583r1053l7443P3698J71322L736m7193P4995L34291J69538j89687
$$ -159713 48870 -42183 -79626 -5928 165394 169130 121937 196932 531223 700761 511074
9998E11074j91603k47524j84898J6084m5926k7311k00656k68602k70017N7392
$$ 511074 319471 71947 -112951 -96867 -142793 -170104 -370760 -639362 -909379 -851987
9988h51987N7667J5995J87435M99813J65113j09849N0180R5796k17707k67221
$$ -851987 -794320 -778325 -590890 -91077 74036 -35813 14367 110163 -107544 -374765
9978c74765R2978M04412L16152m2639k65335j87724m5143o853L1780j35703r7481
$$ -374765 -281787 122625 438777 396138 130803 -56921 -102064 -108917 -77137 -212840 -310321
9967c10321M9278J09840l0003k04042j94433j53255N1259K12081K16495J21116
$$ -310321 -261043 -151203 -181206 -385248 -579681 -732936 -681677 -469596 -253101 -131985
9957a31985N1130P865J06760J04384j19617k11340o9069N6654o4055j47912J36811
$$ -131985 -80855 -72990 33770 138154 18537 -192803 -261872 -205218 -269273 -417185 -280374
9946b80374K65145P7953m3901N4854l7972k17021p1102k7795k1031P7766o0145
$$ -280374 -15229 62724 18823 73677 35705 -181316 -252418 -280213 -301244 -223478 -283623
9935b83623k60829j35882J04468j01404l336J41416P1377k4993J32715K64266
$$ -283623 -544452 -680334 -575866 -677270 -680606 -539190 -467813 -492806 -360091 -95825
9925i5825M5218j07616N8266q962m3902j26064r0809n5594K9959J99513R4244
$$ -95825 -50607 -158223 -99957 -108919 -152821 -278885 -369694 -425288 -395329 -195816 -101572
9914a01572N9995j57998r5244m85K66019L16938R8000l4709K4416o8524l32133
$$ -101572 -41577 -199575 -294819 -295304 -29285 287653 385653 350944 375360 306836 -25297
9903b5297m03143r8698J13228K0479Q5873J84749P7668k4873p2267j54304r9594
$$ -25297 -428440 -527138 -413910 -393431 -307558 -122809 -45141 -70014 -142281 -296585 -396179
9892c96179o0481k9769J17954J51183K08827J00382p2562k09038j90247L3813
$$ -396179 -456660 -486429 -368475 -217292 -8465 91917 19355 -189683 -379930 -346117
9882c46117J35180o9779o9407K50257J66809l9888m0107o0390K6146J78603J61863
$$ -346117 -210937 -280716 -350123 -99866 66943 27055 -13052 -73442 -47296 131307 293170
9871B93170O099j12205j86545k76588l07982k05326P2095J17812J78031J60903
$$ 293170 299269 187064 519 -276069 -584051 -789377 -717282 -599470 -421439 -260536
9861b60536J10628K0550j00112j12749j33108r2508j7172r876J0988L4891R9010
$$ -260536 -149908 -129358 -229470 -342219 -475327 -567835 -585007 -594883 -583895 -549004 -449994
9850d49994J05485Q7472J5873j54174j4785N7612M2733J63772K20736J83201n1994
$$ -449994 -344509 -257037 -241164 -395338 -410123 -352511 -309778 -146006 74730 257931 205937
9839B05937j99963k57634k47659N2615L34467K07176M8694o3180K2193J10911
$$ 205937 5974 -251660 -499319 -446704 -112237 94939 143633 80453 102646 213557
9829B13557P9681j33835k46996j47421j18731j22359J6085O0573J08731L6817
$$ 213557 293238 159403 -87593 -235014 -353745 -476104 -460019 -399446 -290715 -253898
9819b53898j5782r1988p8019Q6044K09734j3312J09246K82786r6689j47020P5781
$$ -253898 -269680 -361668 -439687 -353643 -143909 -157221 -47975 234811 138122 -8898 66883
9808F6883k4765j02574j00149q186J18378j13522k6526r2065j18397j6627M0218
$$ 66883 42118 -60456 -160605 -168791 -50413 -163935 -190461 -282526 -400923 -417550 -377332
9797c77332M5820J6251J76904J88411J49835J22629j42846l5781N0002r4956k4405
$$ -377332 -331512 -315261 -138357 50054 199889 322518 179672 143891 193893 98937 74532
9786G4532k121m343K8523j0396q6917K7174Q6680O1917J06199O2137j66955j05279
$$ 74532 72411 68068 96591 86195 -722 26452 113132 175049 281248 343385 176430 71151
9774G1151J43220q5719n0363m5120k45324j58928J86727J79867l2079j13168M514
$$ 71151 214371 128652 78289 33169 -212155 -371083 -184356 -4489 -36568 -149736 -145222
9763a45222N403J40047J09513n8520k29381j34029K10727J60074P4329J50533
$$ -145222 -139819 228 109741 51221 -178160 -312189 -101462 58612 132941 283474
9753B83474o9320m9455M9714J8075m0433j41502m06591j82170o5272J06222J01544
$$ 283474 214154 164699 214413 232488 192055 50553 -356038 -538208 -603480 -497258 -395714
9742c95714O5402K55834J94728k9691j19718R2051O407k02582k77011j47528r2407
$$ -395714 -330312 -74478 120250 90559 -29159 62892 69299 -133283 -410294 -557822 -650229
9731f50229j55566K9857Q6157J15614M2237J07324L2965k26096P0293p3460p47
$$ -650229 -805795 -775938 -689781 -574167 -531930 -424606 -391641 -617737 -547444 -620904 -621651
9720f21651P3412p0567L7811L9677P0845J04031J68507J49985L6944p5250j50980
$$ -621651 -548239 -618806 -580995 -541318 -470473 -366442 -197935 -47950 -11006 -86256 -237236
9709b37236q1942J35810K9996M1754M2177l175o422K4472p0250k51496o102K40210
$$ -237236 -319178 -183368 -153372 -111618 -69441 -72616 -79038 -54566 -124816 -376312 -382414 -142204
9697a42204J11218P9802O0862l6443j5588o4024J60658J63390j17475q2511o7831
$$ -142204 -30986 48816 109678 73235 57647 -6377 154281 317671 200196 117685 49854
9686D9854M098R4527j7097m5153j17829j14714j24715p1548L7127K8721J08887
$$ 49854 53952 148479 131382 86229 -31600 -146314 -271029 -342577 -305450 -276729 -167842
9675a67842j4863J41149J99263J7562j8342o4422P94j47636k94164j83211J04497
$$ -167842 -182705 -41556 157707 175269 156927 92505 93299 -54337 -348501 -531712 -427215
9664d27215L27703J35876j95329j8102K52645J41763R3791o0442k08613j36436
$$ -427215 -99512 36364 -158965 -177067 75578 217341 311132 250690 42077 -94359
9654i4359p6144N2212N3054k1652k6221k3919m1768N7524n8008J066K08443J79177
$$ -94359 -170503 -118291 -65237 -86889 -113110 -137029 -178797 -121273 -179281 -178215 30228 209405
9642B09405o8091n4391r0647j15907M3198J50903J6874j43370j44427j08688R4541
$$ 209405 141314 86923 -3724 -119631 -76433 74470 91344 -52026 -196453 -305141 -210600
9631b10600R8069j7477l9215j00374j34693P5502J88962n913j05030m9911P1526
$$ -210600 -112531 -130008 -169223 -269597 -404290 -328788 -139826 -145739 -250769 -300680 -229154
9620b29154K81816J21896R0962O225k77520m13046n1956J58931N9426m1330R8409
$$ -229154 52662 174558 265520 271745 -5775 -418821 -470777 -311846 -252420 -293750 -195341
9609a95341J35556R9399Q4997O0040M6325r7038r9746l4218K0171k3899q391m7923
$$ -195341 -59785 39614 124611 184651 230976 133938 34192 -26 20145 -3754 -12145 -60068
9597f0068r2335k19730o3680R8261J53127J01355p4313j86455k482K27146J71111
$$ -60068 -152403 -372133 -435813 -337552 -184425 -83070 -157383 -343838 -346320 -119174 51937
9586E1937q3502j048J14711J51833k4409j05834j28436l4013L7385M0070j4088
$$ 51937 -31565 -32613 82098 233931 209522 103688 -24748 -58761 -21376 18694 4606
9575D606j10987n918J5322P381J99393J90133k8945j68497j24904O4596p7383
$$ 4606 -106381 -112299 -96977 -89596 109797 299930 270985 102488 -22416 42180 -35203
9564c5203k54479J3022L1233K9075K55381J83499N1284j95697j17957J68331K27512
$$ -35203 -289682 -276660 -245427 -216352 39029 222528 273812 78115 -39842 128489 356001
9553C56001k42208l73609K1621L750J07144K17266m6356l0445O1237q9414k21688
$$ 356001 113793 -259816 -238195 -234445 -127301 89965 43609 13164 74401 -15013 -236701
9542b36701k24060J7734N0680j07548j4717K73958K18861j72094l23703j54755
$$ -236701 -460761 -443027 -392347 -499895 -514612 -240654 -21793 -193887 -517590 -672345
9532f72345O0942M4004R7765J63322L1067m7324L0021M9816o9003J14694O8151
$$ -672345 -611403 -567399 -469634 -306312 -275245 -322569 -292548 -242732 -311735 -197041 -128890
9521a28890j77797o0011k9728m239J69947M7566j26146j1317j28221k10133p9563
$$ -128890 -306687 -366698 -396426 -400665 -230718 -183152 -309298 -320615 -448836 -658969 -738532
9510g38532n0316N655n0836O1249K66127L53594K02602J18106K8790o2989M463
$$ -738532 -788848 -783193 -834029 -772780 -506653 -153059 49543 167649 196439 133450 137913
9499A37913k06951l13111L4354J18760J34870J45528N4678R0810J50472P2212
$$ 137913 -69038 -382149 -347795 -229035 -94165 51363 106041 196851 347323 419535
9489D19535j49126q7572J6983M4530j05593l864K09427j3911j88368l7050j50608
$$ 419535 270409 182837 199820 244350 138757 134893 344320 330409 142041 104991 -45617
9478d5617l16049o1715N8042O6087J63939Q1368L0673o1683N1127J70471K93093
$$ -45617 -361666 -423381 -365339 -299252 -135313 -53945 -23272 -84955 -33828 136643 429736
9467D29736K07098n897j42789k93921o0720J32868j2456j76228o2077L8868J17058
$$ 429736 636834 630937 488148 194227 133507 266375 253919 77691 15614 54482 171540
9456A71540J63024J92683J3588j24282j14403j25943j91070l85220l78144J17041
$$ 171540 334564 527247 540835 416553 302150 176207 -14863 -400083 -778227 -661186
9446f61186K45971J5677o3867Q7976K15294J81639k6412j20976n9167K46596K97306
$$ -661186 -415215 -399538 -463405 -375429 -160135 21504 -4908 -125884 -185051 61545 358851
9435C58851J33676n176j1998j03756j28576j45444j0370J14386l9906J97610P1085
$$ 358851 492527 487351 475353 371597 243021 97577 87207 201593 161687 359297 430382
9424D30382p9463Q4665r2978q0210O179j21127j18219n6568N3876J31777j40160
$$ 430382 350919 435584 342606 262396 268575 147448 29229 -27339 26537 158314 18154
9413A8154j66481j22931k62172k40944n1059o0191J85802K98824P1247j75992
$$ 18154 -148327 -271258 -533430 -774374 -825433 -885624 -699822 -400998 -329751 -505743
9403e05743o9205J00446N2160O7747Q3914J05535j21690j78260m3284J06941J75578
$$ -505743 -574948 -474502 -422342 -354595 -270681 -165146 -286836 -465096 -508380 -401439 -225861
9392b25861L20448J88414r0539j25564j20928m7554J1160j72493j17657L2876
$$ -225861 94587 283001 192462 66898 -54030 -101584 -90424 -262917 -380574 -347698
9382c47698J18423K3928m0502J8672N3237Q1368J27970M712k76920j28269K49378
$$ -347698 -229275 -205347 -245849 -227177 -173940 -92572 35398 40110 -236810 -365079 -115701
9371a15701J86055L6313j88270l33841m4896J54201j05258k20280N7090L81161
$$ -115701 70354 106667 -81603 -415444 -460340 -306139 -411397 -631677 -574587 -193426
9361a93426K79239l5395j54284j43208k5321J3949j35210q9583O1743Q5698J28691
$$ -193426 85813 50418 -103866 -247074 -272395 -258446 -393656 -483239 -421496 -335798 -207107
9350b07107Q4958j70698n9428R8029J92962N9521j14456j1646K8724M7149k15009
$$ -207107 -122149 -292847 -352275 -254246 -61284 -1763 -116219 -127865 -99141 -51992 -267001
9339b67001k26578J77459K95258P1385l4700Q0151J57819J5737n0356o2192k58010
$$ -267001 -493579 -316120 -20862 50523 15823 95974 253793 269530 219174 156982 -101028
9328a01028j59696O0058J99191L15426M3598j27398j23781J30935P4965k07380
$$ -101028 -260724 -200666 -1475 313951 357549 230151 106370 237305 312270 104890
9318A04890o5023l19205l27544K79125L02529Q0127R219P505J52504J29887j01070
$$ 104890 39867 -279338 -606882 -327757 -25228 54899 64118 71623 224127 354014 252944
9307B52944k32325j63257j50207j54728k04426K3506J94810K09888L26157M4711
$$ 252944 20619 -142638 -292845 -447573 -651999 -628493 -433683 -223795 102362 147073
9297A47073j98453J06211K59400l1663k25745n1855M5009n1143J36j60610m2178
$$ 147073 -51380 54831 314231 282568 56823 4968 49977 -1166 -1030 -161640 -203818
9286b03818N5766J4097j3788j10390O958J19960J2935k23593j55994N5771Q7879
$$ -203818 -148052 -133955 -147743 -258133 -251175 -131215 -118280 -341873 -497867 -442096 -354217
9275c54217m9578R875N2538L803K5757L7322J35657J71279m7228j88808r1215
$$ -354217 -403795 -393920 -341382 -337579 -311822 -274500 -138843 32436 -14792 -203600 -294815
9264b94815J30221K24995J7773q7932L2246j58896k4526R3560M6749J51183K33989
$$ -294815 -164594 60401 78174 -9758 22488 -136408 -160934 -67374 -20625 130558 364547
9253C64547K24987N7990k22438k97812k92337k30772m4224K8715P8982j9613m0161
$$ 364547 589534 647524 425086 127274 -165063 -395835 -440059 -411344 -332362 -351975 -392136
9242c92136J84100K48768J09977r122l3025j9986K8558O6179O1233L9461M7387
$$ -392136 -208036 40732 150709 141587 108562 88576 117134 183313 244546 284007 331394
9231C31394j18005k78306j51066p3227r4835J13680J86866j38349k14064j88892
$$ 331394 213389 -64917 -215983 -289210 -384045 -270365 -83499 -221848 -435912 -624804
9221f24804R2483K73306J70209J73558j6443k23162j48167J72795J99197o0196
$$ -624804 -532321 -259015 -88806 84752 68309 -154853 -303020 -130225 68972 8776
9211H776k04414k64549j34235J80088J10502o2801j19775M6031J56343J48390
$$ 8776 -195638 -460187 -594422 -414334 -303832 -366633 -486408 -440377 -284034 -135644
9201a35644J14013N7770k14978l46303k19154R5461K88736J28218R720J20415
$$ -135644 -21631 36139 -178839 -525142 -744296 -648835 -360099 -231881 -222161 -101746
9191a01746p1079k71267k06249K15J96301J51253J39137N2300N4642O2436k24434
$$ -101746 -172825 -444092 -650341 -650126 -453825 -302572 -163435 -111135 -56493 5943 -218491
9180b18491o7048J66607O4109j92205J77939K21794R9705L9096j47345k06818
$$ -218491 -285539 -118932 -54823 -247028 -69089 152705 252410 291506 144161 -62657
9170f2657l0396Q5701m8001n1479j05935k38218p6630O9203M8039K5283K1989
$$ -62657 -93053 -7352 -55353 -106832 -212767 -450985 -527615 -458412 -410373 -385090 -363101
9159c63101R9477K9283J24048K95296J81025j32969j88967l10544k3965M53789
$$ -363101 -263624 -234341 -110293 185003 366028 233059 44092 -266452 -290417 163372
9149A63372M10813K31504J36147j9769k30902j54020k6853j00881J15679J54581
$$ 163372 574185 805689 941836 922067 691165 537145 510292 409411 525090 679671
9139F79671j28116j02310J24538j2588p5465J15563K9814k47877k57837Q6M663
$$ 679671 551555 449245 573783 561195 485730 601293 631107 383230 125393 125479 130142
9128A30142o1279j2761P3057J71049O530j50193j18234j8380L2599q3533k22739
$$ 130142 68863 56102 129159 300208 306738 156545 38311 19931 52530 -31003 -253742
9117b53742j2599J55589J54364j6052L7286P5203j12632k39970l2834J50302R2320
$$ -253742 -266341 -110752 43612 27560 64846 140049 27417 -212553 -245387 -95085 -2765
9106b765k25392q3598J77159J53425n9606j40197p654p833j02300J2J75257J65505
$$ -2765 -228157 -311755 -134596 18829 -40777 -180974 -188628 -196461 -298761 -298749 -123492 42013
9094D2013L5038n9510j22661M2702Q8957L3354J18561n1943k81101j44013R8134
$$ 42013 77051 17541 -105120 -62418 26539 59893 178454 126511 -154590 -298603 -200469
9083b00469R7682m3596M0664p8443n6029J10805n0787p4343K4249J14973N0447
$$ -200469 -102787 -146383 -105719 -184162 -240191 -129386 -180173 -254516 -230267 -115294 -64847
9072f4847M4040J83952J15757n6089j56749r9190o5666o9984p8409J54370M5323
$$ -64847 -20807 163145 278902 222813 66064 -33126 -98792 -168776 -247185 -92815 -47492
9061d7492j25833j24603j30946j62191m3627M7105R8834J05271O3421R2794J49993
$$ -47492 -173325 -297928 -428874 -591065 -634692 -587587 -488753 -383482 -320061 -227267 -77274
9050g7274J76619K7864K7842Q5161p6355k63877j21517J386K9697N786L1246L793
$$ -77274 99345 127209 155051 240212 163857 -100020 -221537 -220151 -190454 -184668 -153422 -149629
9038a49629L06553K20218j38702k65242r3353L2447r8058n8069Q150q0167R9904
$$ -149629 156924 377142 238440 -26802 -120155 -87708 -185766 -243835 -235685 -315852 -215948
9027b15948J08354k49647l63256q8328K29124J90038J28450j5523K2517L0513
$$ -215948 -107594 -357241 -720497 -808825 -579701 -389663 -261213 -276736 -254219 -223706
9017b23706O6525J56941J1654j68198j29727j60258j86630O0523J84978J88954
$$ -223706 -157181 -240 11414 -156784 -286511 -446769 -633399 -572876 -387898 -198944
9007a98944J90108K52189J01731J50708Q0845j79973l20435k36140J66300J31665
$$ -198944 -8836 243353 345084 495792 576637 396664 76229 -159911 6389 138054
8997A38054r8121o7046J31920J65350L5488q3578o7380k02935j46895J24638L0474
$$ 138054 39933 -27113 104807 270157 305645 222067 154687 -48248 -195143 -70505 -40031
8986d0031L446k2949J747k08124o8267j1020p628J86944P7892J76541R8195k4084
$$ -40031 -36585 -59534 -57787 -265911 -334178 -345198 -352826 -165882 -87990 88551 186746 162662
8974A62662j33324j76510j3200J48290K19779k6354j16864R8491J77090K171o361
$$ 162662 29338 -147172 -160372 -12082 207697 181343 64479 162970 340060 342231 335870
8963C35870J35966N255o7729j2180l2013j43701j17585M1357J08378K9268k12413
$$ 335870 471836 477091 409362 397182 365169 221468 103883 145240 253618 282886 70473
8952G0473o4825J03624j15366R4385J48028j70883k03717j11615p1732Q6372K52581
$$ 70473 5648 109272 -6094 88291 236319 65436 -138281 -249896 -321628 -235256 17325
8941A7325J74108M1219l6774j44314j76992p5253L8882J1872M9626j316L7238
$$ 17325 191433 232652 195878 51564 -125428 -200681 -161799 -149927 -100301 -101617 -64379
8930f4379j8453j39135n9806M9564J51230N7600r5191j16485p8908j75211l6119
$$ -64379 -82832 -221967 -281773 -232209 -80979 -23379 -118570 -235055 -313963 -489174 -525293
8919e25293J13502J89040J02825j13790K34402L53535J19903N1255r5861n7971
$$ -525293 -411791 -222751 -119926 -233716 686 354221 474124 525379 429518 371547
8909C71547N981k4069j00830k91400k23785q338K15526K22670j26640k63204j22737
$$ 371547 377528 353459 252629 -38771 -262556 -270894 -55368 167302 40662 -222542 -345279
8898c45279r5283K4386J67953M48761J70554k24678l08509o0185M32790N06180
$$ -345279 -440562 -416176 -248223 200538 371092 146414 -162095 -222280 210510 716690
8888G16690K43542j76984j54555j59630k98945m6449K5023K1267L3050j00389
$$ 716690 960232 783248 628693 469063 170118 123669 148692 169959 203009 102620
8878A02620J04352J66809j9099k3581j38993k47840q1423N1713J03422J15267
$$ 102620 206972 373781 354682 331101 192108 -55732 -137155 -85442 17980 133247
8868A33247l5611o7457L0349M7531p278n9385j02088J3400j16693j62850j12205
$$ 133247 97636 30179 60528 108059 100781 41396 -60692 -47292 -163985 -326835 -439040
8857d39040l7416K79242K33562R4607k9866n3408J24818M2439j02080j19941R6549
$$ -439040 -476456 -197214 36348 130955 101089 47681 172499 214938 112858 -7083 89466
8846H9466J33150j50569k19419r342N4770l3519N6382N8167O1065J4801K1621
$$ 89466 222616 72047 -147372 -156714 -101944 -135463 -79081 -20914 40151 54952 76573
8835G6573J05162l3209k73569j54870P0764n9057N0854J11669P5289J0196P6689
$$ 76573 181735 148526 -125043 -279913 -209149 -268206 -217352 -105683 -30394 -20198 56491
8824E6491O8613R1483J52486k04013l02400j18765L919R4735r062n0597R9639
$$ 56491 125104 216587 369073 165060 -137340 -256105 -252186 -157451 -166513 -217110 -117471
8813a17471L6506R080n3724j03756J74892M6331r5363k6565M8062K12802K1468
$$ -117471 -80965 -71885 -125609 -229365 -54473 -8142 -103505 -130070 -82008 130794 152262
8802A52262m8439j06171p6266l6112j20669j27118K35290L77123K48913J10583
$$ 152262 103823 -2348 -78614 -114726 -235395 -362513 -127223 249900 498813 609396
8792F09396o7633l6055M1706j62800k66470j70478J42097M19945J80757j42741
$$ 609396 541763 505708 547414 384614 118144 -52334 89763 509708 690465 547724
8782E47724j38107j02305m624P8074J94700J20283J87187K91478P7525R2115J97944
$$ 547724 409617 307312 302688 380762 575462 695745 882932 1174410 1251935 1344050 1541994
8771A541994L05666K80434L26735L93845K48908K72277M22594J86338j24774k89309
$$ 1541994 1847660 2128094 2454829 2848674 3097582 3369859 3792453 3978791 3854017 3564708
8761C564708m28662l78728k10205j08795k87596k95049j79562n8286j43185k79579
$$ 3564708 3136046 2757318 2547113 2438318 2150722 1855673 1676111 1617825 1474640 1195061
8751A195061k32379k50243j41014n2453j26020k04825j6948L6328k0697q0495
$$ 1195061 962682 712439 571425 518972 392952 188127 171179 207507 186810 106315
8741A06315j47567R6355K27797N7193k1443J14345j18948l45803J8155K9022o3537
$$ 106315 -41252 55103 282900 340093 318650 432995 314047 -31756 -13601 15421 -48116
8730d8116J2869p1042Q2602O7777N7689q8000q4531J14751k8793l1486N339q1958
$$ -48116 -35247 -106289 -23687 44090 101779 13779 -70752 43999 15206 -16280 -10941 -92899
8718i2899J0802N6268M4685k3853R6700L0482j3881l0888J1455j24849j73394
$$ -92899 -82097 -25829 18856 -4997 91703 122185 108304 77416 88871 -35978 -209372
8707b09372m5610J18863J98489j673O7496J1480j32946R2127m2643l2239n7110
$$ -209372 -254982 -136119 62370 60697 128193 139673 6727 98854 56211 23972 -33138
8696c3138l3503J20765K5157K6394l0606p271l6147j32738j7306K14817O1747
$$ -33138 -66641 54124 79281 105675 75069 67798 31651 -101087 -118393 96424 158171
8685A58171p2025N699l7240j86718J09882L71389J12807o4484k85110n0074K15282
$$ 158171 86146 91845 54605 -132113 -22231 349158 461965 397481 112371 62297 277579
8674B77579j4897n1017k947m267j35003j23252P6821J23346o5502n0699K700k40094
$$ 277579 262682 211665 208718 204451 69448 -53804 23017 146363 80861 30162 32862 -207232
8662b07232n2437M2719o988J1315n1340O5948r9347o9341K1165N708J4270J05077
$$ -207232 -259669 -216950 -223938 -212623 -263963 -198015 -297362 -366703 -345538 -339830 -325560 -220483
8650b20483K46771K79358m4813k97089p6153p384j49696m1727K23088L69899K38747
$$ -220483 26288 305646 260833 -36256 -112409 -119793 -269489 -311216 -88128 281771 520518
8639E20518O7672j48417k25295j71550j54303M1285J71316K0593Q1254R7088L5516
$$ 520518 588190 439773 214478 42928 -111375 -70090 101226 121819 203073 300161 335677
8628C35677N3806J41634p284k5040J6748o2305j2002j94706j24915k3145K2474
$$ 335677 389483 531117 523833 498793 515541 453236 441234 246528 121613 98468 120942
8617A20942J09336J13998O4966o9245M5138J18309l872j44105l09990m04268k17667
$$ 120942 230278 344276 409242 339997 385135 503444 499572 355467 45477 -358791 -576458
8606e76458K10373K12868r8148j67438j45025J38972K35693J22228J51110N1206
$$ -576458 -366085 -153217 -251365 -418803 -563828 -424856 -189163 -66935 84175 135381
8596A35381P6191L3262k9284K6011M226O6688p7734k45105p5510j02561k9392
$$ 135381 211572 244834 215550 241561 245787 312475 234741 -10364 -85874 -188435 -217827
8585b17827m8181j05182j21794J27568P7637j36725M3306j055L8987J80834k7827
$$ -217827 -266008 -371190 -492984 -365416 -287779 -424504 -381198 -382253 -343266 -162432 -190259
8574a90259l3296m3024j6881Q5351N2728K0065J00239N0016J0500m9927n6089
$$ -190259 -223555 -266579 -283460 -198109 -145381 -125316 -25077 24939 35439 -14488 -70577
8563g0577j57698k27288j35373j03547J40891K72646J80258K8786j14174k2874
$$ -70577 -228275 -455563 -590936 -694483 -553592 -280946 -100688 -71902 -186076 -208950
8553b08950K50819N5434J48913M2768j36750j54456j24118M3057J36277p4387
$$ -208950 41869 97303 246216 288984 152234 -2222 -126340 -83283 52994 -21393
8543b1393j07085q7388n1724m6038j72109j44586J37959J1761j87433k3914L5271
$$ -21393 -128478 -215866 -267590 -313628 -485737 -630323 -492364 -480603 -668036 -691950 -656679
8532f56679n5185k4335J13375P9230K4226R4336J59395J60830J16580L7804p498
$$ -656679 -711864 -736199 -622824 -543594 -519368 -425032 -265637 -104807 11773 49577 42079
8521D2079N5728Q7011M2142K4483L5602o0486Q7943o815l4729o6292k06860j92245
$$ 42079 97807 184818 226960 251443 287045 226559 314502 307687 272958 206666 -194 -192439
8509a92439Q5898l0622j43021Q3860J0532J03865K48489R0530M1284j70876j82345
$$ -192439 -106541 -137163 -280184 -196324 -185792 -81927 166562 257092 298376 127500 -54845
8498e4845O3453J39364J11659j3631N8173k281k23539k09296k12328j43602k03675
$$ -54845 8608 147972 259631 246000 304173 301892 78353 -130943 -343271 -486873 -690548
8487f90548j95643J39305L6553O728J44797K58039K81439M4600J01237K52596
$$ -690548 -886191 -746886 -710333 -703605 -558808 -300769 -19330 25270 126507 379103
8477C79103N9023r4274m9764J29144Q4367K03238M8470j94084j42207o6458q9168
$$ 379103 438126 343852 294088 423232 507599 710837 759307 565223 423016 356558 267390
8466B67390k14559j68020n3976J63212J22311m8421L8470J90326J24056j91381
$$ 267390 52831 -115189 -169165 -5953 116358 67937 106407 296733 420789 229408
8456B29408k47094N3988J03143j36204j06679p7820r1020L7982J1023k3759K74326
$$ 229408 -17686 36302 139445 3241 -103438 -181258 -272278 -234296 -223273 -247032 27294
8445B7294Q7567p1648j10865j79692r8467J24455q334O0344J51294N2091P9468
$$ 27294 114861 43213 -67652 -247344 -345811 -221356 -229690 -169346 -18052 34039 113507
8434A13507j21965J387J33490J29178K3737j23599n5546J17306M6349l5605q5282
$$ 113507 -8458 -7071 126419 255597 279334 155735 100189 217495 263844 228239 142957
8423A42957K4565j3799r8632j38952j02012L1327N8204O3510m7716o4612L0124
$$ 142957 167522 153723 55091 -83861 -185873 -154546 -96342 -32832 -80548 -145160 -115036
8412a15036r4751J8883P0410l7117J77029j40578O17M4345j30847J06607L20032
$$ -115036 -209787 -190904 -120494 -157611 19418 -121160 -120543 -76198 -207045 -100438 219594
8401B19594J55261Q916M3899r4050j43903k7155j30466j76115k31123k36795o4270
$$ 219594 374855 383771 427670 333620 189717 162562 32096 -144019 -375142 -611937 -676207
8390f76207J29971K97552J72963o7975j01999K7546l6740j92916n1586J7775Q2470
$$ -676207 -546236 -248684 -75721 -143696 -245695 -218149 -254889 -447805 -499391 -481616 -399146
8379c99146Q3107l2616P0073J72356J33380J30356P2731K3562N1298k7455j14439
$$ -399146 -316039 -348655 -278582 -106226 27154 157510 230241 253803 305101 277646 163207
8368A63207r1615j3698m823M3654J23173j1684l08598L4340K79966R3632P10p4567
$$ 163207 71592 57894 53071 96725 219898 208214 -100384 -66044 213922 307554 308264 233697
8356B33697r6499k0670r3037m8586K22954J76206j58133k17338p0017P0155J88523
$$ 233697 137198 116528 23491 -25095 197859 374065 215932 -1406 -71423 -1268 187255
8345A87255J93789J31061o6566L6620J43934p9280k00339k74258j14719J33523
$$ 187255 381044 512105 445539 482159 626093 546813 346474 72216 -42503 91020
8335I1020K49504J05367j59148l47861n6501J16740M3524K62967K18754j32060
$$ 91020 340524 445891 286743 -61118 -117619 -879 42645 305612 524366 392306
8325C92306j13822K3222J4482k26964l49795j69516j26694M7592J94540N598k1606
$$ 392306 278484 301706 316188 89224 -260571 -430087 -556781 -509189 -314649 -309051 -330657
8314c30657J23570n6326J9271Q1703J85776J86888L2673j34180j18553J65936
$$ -330657 -207087 -263413 -244142 -162439 23337 210225 242898 108718 -9835 156101
8304A56101j923O8471K07612r1724k86568j08052M1931L2276n8709N498L7633
$$ 156101 154178 222649 430261 338537 51969 -56083 -14152 18124 -40585 -35087 2546
8293B546R1968R2802K2819L4502r8281j24868m910J27471M27357J43603k18831
$$ 2546 94514 187316 210135 244637 146356 21488 16578 144049 571406 715009 496178
8282D96178p6625j04895j63441J585J49327m4707q2682k27893j01179M8009o9743
$$ 496178 419553 314658 151217 152802 302129 257422 174740 -53153 -154332 -106323 -176066
8271a76066j41901m9283L051M51J20052J73913R1284J30269P3684N3862O1250
$$ -176066 -317967 -367250 -364199 -363748 -243696 -69783 21501 151770 225454 279316 340566
8260C40566L0423K5169l56491k70027k1214Q1152N3103p1736J6438J84752N1536
$$ 340566 370989 396158 39667 -230360 -251574 -170422 -117319 -189055 -172617 12135 63671
8249F3671O216L970J04942K3346n5635J93863K68274N9154j49545l15179n7373
$$ 63671 69887 73857 178799 202145 146510 340373 608647 667801 518256 203077 145704
8238A45704L19264L93933M2204o5402j59382j54418r7587J7559J61894J84255
$$ 145704 464968 858901 901105 835703 676321 521903 424316 441875 603769 788024
8228G88024J18883o0024k34693k84139l17872j35065P7783j22011j6777L3997
$$ 788024 906907 846883 612190 328051 10179 -124886 -47103 -169114 -185891 -151894
8218a51894O6397K07396R5634K52320K25238J3178j02089j94695j57397K10863
$$ -151894 -85497 121899 217533 469853 695091 708269 606180 411485 254088 464951
8208D64951J41020j62867q3307O3049J12174l5700k70824k21683K7352J82069
$$ 464951 605971 443104 359797 422846 535020 499320 228496 6813 34165 216234
8198B16234K5331O3079J20033k5762o8862M4878J17151j25533q5125K30070L57214
$$ 216234 241565 304644 424677 398915 330053 374931 492082 366549 281424 511494 868708
8187H68708J86777m3028j57741k03976l61706q6728L66834L21337K6593Q746k6208
$$ 868708 1055485 1012457 854716 650740 289034 202306 569140 890477 917070 925816 899608
8176H99608j03455j88197Q2528n5630k23195k42891J30709J98494J11097J31800
$$ 899608 796153 607956 690484 634854 411659 168768 299477 497971 609068 740868
8166G40868n7039p0065J53483K4580k27928j28735J80920J49392p2035P95m6785
$$ 740868 683829 613764 767247 791827 563899 435164 616084 765476 693441 694236 647451
8155F47451j68585k9815J17435J38405Q4557j8891j91795j69319J25005M32457
$$ 647451 478866 449051 566486 704891 789448 770557 578762 409443 534448 966905
8145I66905L65050J7123k5640r9884k55050p2773K57558K25815o1952j11080l45685
$$ 966905 1331955 1349078 1323438 1223554 968504 895731 1153289 1379104 1317152 1206072 860387
8134H60387r6777K17244Q9523J03178J65306j39453k44650j62136m9630L4688
$$ 860387 763610 980854 1070377 1173555 1338861 1199408 954758 792622 742992 777680
8124G77680N2756J56857Q3027j6688L3992m3335l0708L1014J7146m7053k19595
$$ 777680 830436 987293 1070320 1053632 1087624 1044289 1013581 1044595 1061741 1014688 795093
8113G95093j61200K65264K45720P3650L7574M8296j31404q1001p3438r4933p0813
$$ 795093 633893 899157 1144877 1218527 1256101 1304397 1172993 1091992 1018554 923621 852808
8102H52808j31815j42947J80201J89675l5601J29662J16220L0579J19308K96438
$$ 852808 720993 578046 758247 947922 912321 1041983 1158203 1188782 1308090 1604528
8092A604528Q4709k26654j46542l0333j01291k5944K3369J7211n7006r6295M7973
$$ 1604528 1689237 1462583 1316041 1285708 1184417 1158473 1181842 1199053 1142047 1045752 1093725
8081A093725J37185O9663N6732q1451J59816K19977R8080m705P845l2129j75389
$$ 1093725 1230910 1300573 1357305 1275854 1435670 1655647 1753727 1749022 1756867 1724738 1549349
8070A549349j40526j7932J37111K11660J38118r4160j22854r9047q5372k472J19397
$$ 1549349 1408823 1390891 1528002 1739662 1877780 1783620 1660766 1561719 1476347 1473875 1593272
8059A593272N9083j0321L8269N3490J84186K45953l3k32008j7519J89604J23396
$$ 1593272 1652355 1642034 1680303 1733793 1917979 2163932 2163899 1931891 1914372 2103976 2227372
8048B227372K488R2569J95680J71626k18728l54585o8097O4727J17409J19634
$$ 2227372 2229860 2322429 2518109 2689735 2471007 2116422 2048325 2113052 2230461 2350095
8038B350095P0676P6682K00468K71315N1996p35p7539k67285j97658O7272p812
$$ 2350095 2420771 2497453 2697921 2969236 3021232 3020497 2942958 2675673 2478015 2545287 2537475
8027B537475n5064J47935J85566N3637K2573M2138K73973L79636K62577K41551
$$ 2537475 2482411 2630346 2815912 2869549 2892122 2934260 3208233 3587869 3850446 4091997
8017D091997K52391K92677J53816Q1449P1753M8478K77657M14723M28179O77860
$$ 4091997 4344388 4637065 4790881 4872330 4944083 4992561 5270218 5684941 6113120 6790980
8007F790980P44057P06489O37158N31398Q94858J239267J338217J580762K262117
$$ 6790980 7535037 8241526 8878684 9410082 10304940 11544207 12882424 14463186 16725303
7998A6725303K732171L084546L702375M136719M431866M215068L061242J347330
$$ 16725303 19457474 22542020 26244395 30381114 34812980 39028048 42089290 43436620
7990D3436620l06222k265248l528236m078736m425948m114807l181667k554258
$$ 43436620 43130398 40865150 37336914 33258178 28832230 24717423 21535756 18981498
7982A8981498k157469j470194j022473r25505m19465j16666k02842n5099k09465
$$ 18981498 16824029 15353835 14331362 13405857 12986392 12869726 12666884 12611785 12402320
7973A2402320M2380L81903L05423Q8439j71424m37465n10715m75913l35754k19454
$$ 12402320 12444700 12826603 13132026 13220465 13049041 12611576 12100861 11624948 11289194 11069740
7963A1069740j98393m37046j64563K96401N47844M06512J90957L12365M86747
$$ 11069740 10871347 10434301 10269738 10566139 11113983 11520495 11711452 12023817 12510564
7954A2510564P33254J096878J300111J200082J430902J452576J800029K575334
$$ 12510564 13243818 14340696 15640807 16840889 18271791 19724367 21524396 24099730
7946B4099730L159696L695050M254743N061888O470988Q173159R739497J1808689
$$ 24099730 27259426 30954476 35209219 40271107 46742095 54915254 64654751 76463440
7938G6463440J3141684J3369049J2357058R381657M362426j582039p357142j1682533
$$ 76463440 89605124 102974173 115331231 124712888 129075314 127493275 120136133 108453600
7930A08453600j3563529j3808274j2743937j0705522q437413o465193n044883
$$ 108453600 94890071 81081797 68337860 57632338 49194925 42729732 37684849
7923C7684849m062455l176550k244641j721668j256561n17967M4976K51029M37747
$$ 37684849 33622394 30445844 28201203 26479535 25222974 24705007 24749983 25001012 25438759
7914B5438759M61792J31405j05619l53958q85925j242785j043707q14301o76710
$$ 25438759 25900551 26031956 25926337 25572379 24686454 23443669 22399962 21585661 20908951
7905B0908951l61173k94357J65882L91844K60823N17904R29919J218527J573366
$$ 20908951 20547778 20253421 20419303 20811147 21071970 21589874 22519793 23738320 25311686
7896B5311686J729781J776618K280364K851531L257539L922882M779615N844531
$$ 25311686 27041467 28818085 31098449 33949980 37207519 41130401 45910016 51754547
7888E1754547O955253Q468224J0501195J3159578J5991547J9190431K2846478
$$ 51754547 58709800 67178024 77679219 90838797 106830344 126020775 148867253
7881A48867253K5914906K7180789K5013884J8594673Q392487l589617j5041097
$$ 148867253 174782159 201962948 226976832 245571505 253963992 250374375 235333278
7874B35333278k3453633k7695772k8006176k5470680k1708658j7500092j3686709
$$ 235333278 211879645 184183873 156177697 130707017 108998359 91498267 77811558
7867G7811558j0652483q229925o274455m854131l559694k454284j639233j001294
$$ 77811558 67159075 58929150 52654695 47800564 44240870 41786586 40147353 39146059
7859C9146059n84294j68200K60490J42881l96744r10991j483252k041681k277364
$$ 39146059 38561765 38393565 38654055 38796936 38400192 37489201 36005949 33964268 31686904
7850C1686904j926361j432188r30612m70277j75057k923M00542N70437R40114
$$ 31686904 29760543 28328355 27397743 26927466 26752409 26749486 27150028 27720465 28660579
7841B8660579J352616J522648J742595K133892K577364L076588L629292M540900
$$ 28660579 30013195 31535843 33278438 35412330 37989694 41066282 44695574 49236474
7833D9236474N568662O704248Q197512J0142818J2245265J5183516J8646448K2415878
$$ 49236474 54805136 61509384 69706896 79849714 92094979 107278495 125924943 148340821
7825A48340821K6845008L0462172L1791585K9000284K1118128R265303m823191
$$ 148340821 175185829 205648001 237439586 266439870 287557998 296823301 292000110
7818B92000110j8163761k8029565l3023091l3328624l0178550k5440614k0468604
$$ 292000110 273836349 245806784 212783693 179455069 149276519 123835905 103367301
7811A03367301j6167223j2672260r881817p622593n957952m752216l687061k744621
$$ 103367301 87200078 74527818 64646001 57023408 51065456 46313240 42626179 39881558
7803C9881558k027044j337188p90724m50784l60423n95617r87921j430542j728427
$$ 39881558 37854514 36517326 35726602 35275818 34915395 34319778 33331857 31901315 30172888
7794C0172888j865788j645714j264754r54656n37567p6934J32413K18289L50454
$$ 30172888 28307100 26661386 25396632 24441976 23904409 23827475 23959888 24178177 24528631
7785B4528631Q95451J128493J073572J350302J837374K444199K849569L301503
$$ 24528631 25424082 26552575 27626147 28976449 30813823 33258022 36107591 39409094
7777C9409094L891458M655848N726073O978578Q477967J0631119J3187988J6063600
$$ 39409094 43300552 47956400 53682473 60661051 69139018 79770137 92958125 109021725
7769A09021725J9248696K2613952K5584141K6691515K4082222J7539066P473277
$$ 109021725 128270421 150884373 176468514 203160029 227242251 244781317 252254594
7762B52254594m414364j5662547k3925792k8270221k8739785k6037406k1782452
$$ 252254594 247840230 232177683 208251891 179981670 151241885 125204479 103422027
7755A03422027j7605841j3855753j0823593q518830o743744n466443m470477l544476
$$ 103422027 85816186 71960433 61136840 52618010 45874266 40407823 35937346 32392870
7747C2392870k589803j957897j608766j292591j055900r33940n36280o54833j047531
$$ 32392870 29803067 27845170 26236404 24943813 23887913 22953973 22417693 21762860 20715329
7738B0715329j177979j179517j106852q41307n87359o10956m43242j89683N0008
$$ 20715329 19537350 18357833 17250981 16409674 15822315 15211359 14768117 14578434 14628442
7729A4628442K83206L05616N12193M73100O29293R03104R19467J192864J604952
$$ 14628442 14911648 15217264 15729457 16202557 16831850 17734954 18654421 19847285 21452237
7720B1452237J770776K129929K740099L299121M108492N106574O471855Q194637
$$ 21452237 23223013 25352942 28093041 31392162 35500654 40607228 47079083 55273720
7712E5273720R998972J1549475J2794528J2944043J1553044Q417375L427451k353085
$$ 55273720 65272692 76822167 89616695 102560738 114113782 122531157 125958608 123605523
7704A23605523p855684j1947377j3924727j4310009j3126237j0817881q957733
$$ 123605523 115749839 103802462 89877735 75567726 62441489 51623608 42665875
7697D2665875p112801n426493m387841l601999k692746k144396j934410j649645
$$ 42665875 35553074 30126581 25738740 22136741 19443995 17299599 15365189 13715544
7689A3715544j377271j052303q78620q31882p09608n74359l15447k29653k13780
$$ 13715544 12338273 11285970 10407350 9575468 8865860 8291501 7976054 7746401 7532621
7680G532621k47196m93899m41149j36562J38973J21334P0557J8035k69639k27372
$$ 7532621 7285425 6791526 6350377 6213815 6352788 6474122 6544679 6562714 6293075 6065703
7670F065703J08187L61843M44531M38177M33598L51308M51422N41086M69791O00156
$$ 6065703 6173890 6535733 6980264 7418441 7852039 8203347 8654769 9195855 9665646 10265802
7660A0265802R83052J469203J909793K050397K315057L244205L816994M167506
$$ 10265802 11248854 12718057 14627850 16678247 18993304 22237509 26054503 30222009
7652C0222009M112271L359609K515397R28782r67685k500556l715742m458401
$$ 30222009 34334280 37693889 40209286 41138068 40170383 37669827 33954085 29495684
7644B9495684m622998m181973l590903k925845k479768k027455j441918j012271
$$ 29495684 24872686 20690713 17099810 14173965 11694197 9666742 8224824 7212553
7636G212553q55420p11021m93120n01394l81871m41243m96072l98974j22023l4145
$$ 7212553 6357133 5646112 5152992 4651598 4269727 3828484 3332412 2933438 2811415 2777270
7626B777270k20700l51598m05925k81373k08691m4860J78664K41012J48871J31532
$$ 2777270 2556570 2204972 1799047 1517674 1308983 1264123 1442787 1683799 1832670 1964202
7616A964202j53173j28001p8453j43485k91694l00969q6190J26237j05082j26026
$$ 1964202 1811029 1683028 1604575 1461090 1169396 868427 782237 908474 803392 677366
7606F77366q685j6661l319j05404J6446J69060K3639L7217J19071K0580q1247
$$ 677366 668681 652020 648701 543297 559743 728803 752442 789659 908730 929310 848063
7595H48063k39266j09577j9549O1901Q7861j07921k83123j27817o7556p1596m5031
$$ 848063 608797 499220 479671 541572 629433 521512 238389 110572 43016 -28580 -73611
7584g3611K49064J88857k00003j23896J87578K37838J53557Q6503N4282R1692
$$ -73611 175453 364310 164307 40411 227989 465827 619384 705887 760169 851861
7574H51861p032j55325k70211j30506R3444P179J8820j6325M4130m230J04161
$$ 851861 844829 689504 419293 288787 382231 389410 408230 391905 436035 431805 535966
7563E35966J43312n8511r1457J11676j67965j59992O1319N565P8411Q4844K4162
$$ 535966 679278 620767 529310 640986 473021 313029 374348 379913 458324 543168 567330
7552E67330k26995j74185K5959m5433o6580N094M1298R7477L1204K9117p5400
$$ 567330 340335 166150 192109 146676 80096 85190 126488 223965 255169 284286 208886
7541B08886n9113m0034j16722K8624K73101J76662j77064j84097j17624q0591
$$ 208886 149773 109739 -6983 21641 294742 471404 294340 110243 -7381 -87972
7531h7972k16O4944P2948J33422J87920K02734N0372j66779l4019M6881K2692
$$ -87972 -88188 -23244 49704 183126 371046 573780 624152 457373 423354 470235 492927
7520D92927o299q3550k05847j07600J53222j5614j22861l0828J82452N2426O9066
$$ 492927 486628 403078 197231 89631 242853 227239 104378 73550 256002 308428 377494
7509C77494Q5045n1677O5481q905m8423K2660K13969K95948M5522k83750l77902
$$ 377494 462539 410862 476343 467438 419015 441675 655644 951592 997114 713364 335462
7498C35462j91095n498j0520J3995r0351P6929K31752J84000J93518m4092m39842
$$ 335462 144367 138869 128349 142344 51993 128922 360674 544674 738192 694100 254258
7487B54258k74878O4704l0987n6552K18394L78248J80242j22314j19043j62590
$$ 254258 -20620 44084 13097 -43455 174939 553187 733429 611115 492072 329482
7477C29482j48057J05732R780j92279j85658q3661j14465N4784K37959K95488
$$ 329482 181425 287157 296937 104658 -81000 -164661 -279126 -224342 13617 309105
7467C09105M2134j48637r4494K05M6087P0622J26711m6932l19843l14603J559
$$ 309105 351239 202602 108108 108313 154400 225022 351733 304801 -15042 -329645 -328086
7456c28086J24219J62488J81503K863k45301j50690N480K97396J38904m8184M3248
$$ -328086 -203867 -41379 140124 142987 -102314 -253004 -247524 49872 188776 140592 183840
7445A83840j91157k50282j6418l0694j2827K9782J54379P8962j0344J34659J16853
$$ 183840 -7317 -257599 -274017 -304711 -317538 -287756 -133377 -54415 -64759 69900 186753
7434A86753K33509N0308M4770J59701o5119j20596j47625k18283o3911r0622l3634
$$ 186753 420262 470570 515340 675041 609922 489326 341701 123418 59507 -31115 -64749
7423f4749R8293p7372l48005j79514N715o6819J73827K70601k1345k48801j73378
$$ -64749 33544 -43828 -391833 -571347 -565632 -632451 -458624 -188023 -209368 -458169 -631547
7412f31547L2063J81941N3511p0257K20453K13219p6849M2223J87091R4786k0024
$$ -631547 -599484 -417543 -364032 -434289 -213836 -617 -77466 -35243 151848 246634 226610
7401B26610q3046j05026j87635l20565N7734L13019J33389J01389J75293K38721
$$ 226610 143564 38538 -149097 -469662 -411928 -98909 34480 135869 311162 549883
7391E49883O2608r6922j32370o0365j05624l0500k9067o7209R5165J21067N869
$$ 549883 612491 515569 383199 322834 217210 186710 157643 90434 185599 306666 312535
7380C12535N1079p1500k39375p9662J65522L41808J77545o097j09877j46549o5667
$$ 312535 363614 292114 52739 -26923 138599 480407 657952 651855 541978 395429 329762
7369C29762j54410K7548J72417J46932j1195k07297n0629J55796J60983J58954
$$ 329762 175352 202900 375317 522249 511054 303757 253128 408924 569907 728861
7359G28861m7807k92120k28120j54003J59588M21492M96759K40907r7650k75476
$$ 728861 681054 388934 160814 6811 166399 587891 1084650 1325557 1227907 952431
7349I52431m7125J57532K31565J19004o6741M619K20388J04686K8052J70414J86234
$$ 952431 905306 1062838 1294403 1413407 1346666 1351285 1571673 1676359 1704411 1874825 2061059
7338B061059O8826P2932L6562O7506J07721R4658J59667p5752l66603j08719o55
$$ 2061059 2129885 2202817 2239379 2306885 2414606 2509264 2668931 2593179 2226576 2117857 2117202
7327B117202k74264j38552m290n806j70140k07192j65292l10856k35798j23028
$$ 2117202 1842938 1704386 1700096 1694290 1524150 1316958 1151666 840810 605012 481984
7317D81984j601L2479j74784j24455j14924k7925N3488J27992k6925O3131L16431
$$ 481984 480383 512862 338078 213623 98699 70774 124262 252254 225329 288460 604891
7306F04891J14331j1802k8206j00561m8317o3750m8206J75753J82690j18118k47545
$$ 604891 719222 707420 679214 578653 530336 466586 418380 594133 776823 658705 411160
7295D11160j02655R6331k5647m7888J08784N6237l542j92559k36625P6334K26988
$$ 411160 308505 404836 379189 331301 440085 496322 492780 300221 63596 139930 366918
7284C66918q7608o3248J7311M1962J05148o9024k09371P1745J09736O5347J94027
$$ 366918 279310 216062 233373 275335 380483 311459 102088 173833 283569 348916 542943
7273E42943Q6252m2230J4388L0632l2765j62706j58559p9202J600K8149n2401
$$ 542943 629195 586965 601353 631985 599220 436514 277955 198753 200353 228502 176101
7262A76101k14836o5128J77252J74726j4752l04631k50030O6533K29948J43794
$$ 176101 -38735 -103863 73389 248115 233363 -71268 -321298 -254765 -24817 118977
7252A18977K6151j23696j42266k1674J65531K76854J58243j76326l87951j13587
$$ 118977 145128 21432 -120834 -142508 23023 299877 458120 281794 -106157 -219744
7242b19744P5950J43271j75392k1689J73138m4402k16223o5160k7552j2866J03668
$$ -219744 -143794 -523 -175915 -197604 -24466 -68868 -285091 -350251 -377803 -390669 -287001
7231b87001N1245J27584J43798J29401n1547N345R2286j9397j08798k88639j53399
$$ -287001 -235756 -108172 35626 165027 113480 118825 211111 191714 82916 -205723 -359122
7220c59122J14327J23574J6753k0438L1057p7581J10206K11268J45122K4704j8341
$$ -359122 -244795 -121221 -104468 -124906 -93849 -171430 -61224 150044 295166 319870 301529
7209C01529o8611j88062p7944N0565K63539K11213j11714j31550n8378p965N7019
$$ 301529 232918 44856 -33088 17477 281016 492229 380515 248965 190587 182622 239641
7198B39641M1077m2623j38697j51773n5598J65983J70528J57922J87140j71672
$$ 239641 280718 238095 99398 -52375 -107973 58010 228538 386460 573600 401928
7188D01928k50091j7293l6471K59365M64814m9096l51505n9334N4834j05090k01249
$$ 401928 151837 134544 98073 357438 822252 773156 421651 362317 417151 312061 110812
7177A10812j35267N3497K01890J53420j79870k80340j57792j1530p8639J24860
$$ 110812 -24455 29042 230932 384352 204482 -75858 -233650 -245180 -323819 -198959
7167a98959J52075R9696J08184k19261k00809L8827M5678k6365p9328K6789j8571
$$ -198959 -46884 52812 160996 -58265 -259074 -220247 -174569 -200934 -280262 -253473 -272044
7156b72044J20348K77844J15960P4055r412r6455j35799j06282P864K30220J67871
$$ -272044 -151696 126148 242108 316163 306751 210296 74497 -31785 -23921 206299 374170
7145C74170j12292j10946j07518j17197k3951J02086P1999L6493n8841k01156
$$ 374170 261878 150932 43414 -73783 -97734 4352 76351 112844 54003 -147153
7135a47153j12844Q9600J14703N3096j05950k16585k36761m2007k7772j00606
$$ -147153 -259997 -170397 -55694 -2598 -108548 -325133 -561894 -603901 -631673 -732279
7125g32279L8630K29148L13483K29185l2924l8392j07432L7698L2494P6996o014
$$ -732279 -693649 -464501 -151018 78167 45243 6851 -100581 -62883 -30389 46607 40593
7114D0593j94004j19468k0260J4309J36911K26143k020j24111j3437Q8522j44575
$$ 40593 -153411 -272879 -293139 -278830 -141919 84224 82204 -41907 -55344 33178 -111397
7103a11397r7377J96524K13209j3185q4398k775P9376J03016J59243N561k18233
$$ -111397 -208774 -12250 200959 187774 103376 100601 179977 282993 442236 447797 229564
7092B29564j10125j06780j22283j00725J61827J16053l8753j78938j50895L1364
$$ 229564 119439 12659 -109624 -210349 -48522 67531 28778 -150160 -301055 -269691
7082b69691J2394J54414P3718k08598o6824J26575K43193M0371q2155J14554P9425
$$ -269691 -257297 -102883 -29165 -237763 -304587 -178012 65181 105552 23397 137951 217376
7071B17376k9364K2151J48338l337j17122q3444j15899j25284K4470M3074J19517
$$ 217376 188012 210163 358501 355164 238042 154598 38699 -86585 -62115 -19041 100476
7060A00476O2985j06545j08516j00115p2139J02566L0784m5841k4253j7984q5243
$$ 100476 163461 56916 -51600 -151715 -223854 -121288 -90504 -136345 -160598 -178582 -263825
7049b63825j91217J987J00157K43618J37638j68812j41925m5270o6404Q5086m2001
$$ -263825 -455042 -453055 -352898 -109280 28358 -140454 -282379 -327649 -394053 -308967 -350968
7038c50968k6551J62196J24653j8982j60387l09330q8354J02649J37789J78524
$$ -350968 -377519 -215323 -90670 -109652 -270039 -579369 -667723 -565074 -427285 -248761
7028b48761N1242j9092N2432K96595K27129J44498j06542j79144j98729j62956
$$ -248761 -197519 -216611 -164179 132416 359545 504043 397501 218357 19628 -143328
7018a43328q07O0599j31047j23063j23743n6230J03665J03177j95889k45126K1797
$$ -143328 -144135 -83536 -214583 -337646 -461389 -517619 -413954 -310777 -506666 -751792 -729995
7007g29995K86456K43382J17560p5617n1784O6390k3743N544r9190j50632P81
$$ -729995 -443539 -200157 -82597 -158214 -209998 -143608 -167351 -161807 -260997 -411629 -410848
6996d10848m6089k2139J2238Q5069O3091N7841O3777J22432Q6764J168p2598L0823
$$ -410848 -456937 -479076 -466838 -381769 -318678 -260837 -197060 -74628 12136 13304 -59294 -28471
6984b8471R293r5284M4517K49033L11834P1192m7376r0418O6593J40311l1867
$$ -28471 -19178 -114462 -69945 179088 490922 562114 514738 424320 490913 631224 599357
6973E99357j52112k21005k10751q7640m0317K2889P8424k1590N1815J04333K3885
$$ 599357 447245 226240 15489 -72151 -112468 -89579 -11155 -32745 19070 123403 147288
6962A47288J68678K20057j39703k75089m3609L41567K79972p8046k35760j62657
$$ 147288 315966 536023 396320 121231 77622 419189 699161 621115 385355 222698
6952B22698j61400j00884r2465j9187j0054p7758j93666j66397L4348P6726M6657
$$ 222698 61298 -39586 -132051 -151238 -161292 -239050 -432716 -599113 -564765 -488039 -441382
6941d41382O3625K20087K64789q896m3289r6771l3298J36026J37960j4291l2719
$$ -441382 -377757 -157670 107119 98223 54934 -41837 -75135 60891 198851 184560 151841
6930A51841l4507k19249j75605j08406J86480J68168R089o5979k63437k33703
$$ 151841 117334 -101915 -277520 -385926 -199446 -31278 -22189 -88168 -351605 -585308
6920e85308p6335P0120K87875K59865J40951m3050j26947p1373P4552P3734N9677
$$ -585308 -661643 -591523 -303648 -43783 97168 54118 -72829 -144202 -69650 4084 63761
6909F3761j20612q7115q894J70422J56739o4545o1672j4271j5432J11080J95018
$$ 63761 -56851 -143966 -152860 17562 174301 109756 48084 33813 18381 129461 324479
6898C24479M1084k45489j63582Q2614R5215L833j45135k33622j33272n2397J18291
$$ 324479 365563 120074 -43508 39106 134321 138154 -6981 -240603 -373875 -426272 -307981
6887c07981J73642J96539J49185j56209r7508J88741o2120k01111j88149l05015
$$ -307981 -134339 62200 211385 55176 -42332 146409 84289 -116822 -304971 -609986
6877f09986l09397L4328K62102L35172K19536M2144j20564j49290q2795N1386
$$ -609986 -919383 -885055 -622953 -287781 -68245 -26101 -146665 -295955 -378750 -327364
6867c27364J68954K50141J98795r9124k35968r6321N151l3139j51862j317J48873
$$ -327364 -158410 91731 290526 191402 -44566 -140887 -135736 -168875 -320737 -322054 -173181
6856a73181K82321J98719j84021k87740m6521N2474L5610J23549J33048r371j74607
$$ -173181 109140 307859 123838 -163902 -210423 -157949 -122339 1210 134258 124887 -49720
6845d9720k9994j84628k86978j08237R5967K40759K91414J92616J50533j960k79164
$$ -49720 -79714 -264342 -551320 -659557 -563590 -322831 -31417 161199 311732 309772 30608
6834C0608k40870J9613j6373J10602J14417o4817n4663J89293r876j1784M8194
$$ 30608 -210262 -190649 -207022 -96420 17997 -46820 -101483 87810 77934 66150 114344
6823A14344N644k24686m14915j55595N2229J64328J09755r9371Q2689L06229K31276
$$ 114344 119988 -104698 -519613 -675208 -622979 -458651 -348896 -448267 -365578 -59349 171927
6812A71927o5971j65431j04924k12362n5349j7083K4582L21913J91818j6592j27118
$$ 171927 105956 -59475 -164399 -376761 -432110 -449193 -424611 -102698 89120 72528 -54590
6801e4590j40203P489K518M3992P2492q7185P145P2043L9754j16903j09326J64575
$$ -54590 -194793 -187304 -184786 -140794 -68302 -155487 -148342 -76299 -36545 -153448 -262774 -98199
6789i8199J24829j46560l50356K3080J07370J70163J28796J8839J69052l6734
$$ -98199 26630 -119930 -470286 -447206 -339836 -169673 -40877 -22038 147014 110280
6779A10280k74368j09174J14406j70469j63087J40428J37953J0520q9097p2440
$$ 110280 -164088 -273262 -158856 -329325 -492412 -351984 -214031 -203511 -292608 -365048
6769c65048K5591K397o0301J64594K23563J41500R9355J03610p438j32487j37757
$$ -365048 -339457 -337060 -397361 -232767 -9204 132296 231651 335261 327823 195336 57579
6758E7579j30715j04709J20403M59187K1296j97553P1488L7843J51409R4741o7838
$$ 57579 -73136 -177845 -57442 401745 423041 225488 296976 334819 486228 580969 513131
6747E13131N001M1386K1732N2065R1530k3467q2164j02462p7665q6998o6053k03144
$$ 513131 518132 559518 581250 633315 724845 701378 619214 516752 439087 352089 286036 82892
6735H2892k30851K4233O1587j27094j8321J34996N9098Q6604J26034O3896J04908
$$ 82892 -147959 -123726 -62139 -189233 -207554 -72558 -13460 73144 199178 263074 367982
6724C67982K33494J31542L1707j51786j44762j05324N2818J22512J3898Q8415
$$ 367982 601476 733018 764725 612939 468177 362853 415671 538183 552081 640496
6714F40496P2492L3176J025p1489M4141L3668n5249P3656K86495J15407r8420
$$ 640496 712988 746164 747189 675700 719841 753509 698260 771916 1058411 1173818 1075398
6703A075398j2831K59399L61823J92674j4191q1043J22682K90220N6292K00813
$$ 1075398 1062567 1321966 1683789 1876463 1862272 1781229 1903911 2194131 2250423 2451236
6693B451236J78412O832q6000k76462k71387p6876m94o2800r7045j90062k03236
$$ 2451236 2629648 2636480 2550480 2274018 2002631 1925755 1925261 1862461 1765416 1575354 1372118
6682A372118j29203l5749j29001k43006k96808j03428R7862r718r3967j17081
$$ 1372118 1242915 1207166 1078165 835159 538351 434923 532785 523067 429100 312019
6672C12019j72765k76517j29380J08415J17163K1288j05452j1498J11613K26127
$$ 312019 139254 -137263 -266643 -158228 -41065 -19777 -125229 -136727 -25114 201013
6662B01013J79386n1260j73747K5023J8157o1246P9310J99577J36714k0014k72207
$$ 201013 380399 329139 155392 180415 198572 137326 216636 416213 552927 532913 260706
6651B60706k07855j51740j29007j25614R4353J61763N4878n6613R8655J08881
$$ 260706 52851 -98889 -227896 -353510 -259157 -97394 -42516 -99129 -474 108407
6641A08407q5682N87l5494n743M9874l5091l7549r4342j30928o6436k3421n1597
$$ 108407 22725 23312 -12182 -17925 31949 -3142 -40691 -135033 -265961 -332397 -355818 -407415
6629d07415K12684J68126R9295p9371j32878n7419j45523R5140K94456K01952
$$ -407415 -194731 -26605 72690 -6681 -139559 -196978 -342501 -247361 47095 249047
6619B49047J71876J91907J05734Q1426k45098j86234p7833j86469k43757j14033
$$ 249047 420923 612830 718564 799990 554892 368658 290825 104356 -139401 -253434
6609b53434K73595K72626r5137J3367n0328P0328J1128j62835n5702M6497j80919
$$ -253434 20161 292787 197650 211017 160689 231017 242145 79310 23608 70105 -110814
6598a10814j94115N4554J16278N1708L7252O1082j81724p187J56663q1789K6952
$$ -110814 -304929 -250375 -134097 -82389 -45137 15945 -165779 -172966 -16303 -98092 -71140
6587g1140J43188q2330j09322m7691M8876O7217K8304N7615R6999p2816j91226
$$ -71140 72048 -10282 -119604 -167295 -118419 -51202 -22898 34717 131716 58900 -132326
6576a32326q93K61864L07326P7308j04738j06083j60805o5883L3690j15313j17170
$$ -132326 -133219 128645 435971 513279 408541 302458 141653 75770 109460 -5853 -123023
6565a23023j65022j05355l120J45748J62362K52844K55900j3284j39357m6548
$$ -123023 -288045 -393400 -396520 -250772 -88410 164434 420334 407050 267693 221145
6555B21145o5761o3864J0282j36074j24325j49527J50800K74643n5304j14950
$$ 221145 155384 91520 101802 -34272 -158597 -308124 -157324 117319 62015 -52935
6545e2935k03377j15419j7085j8541L0683R5109J57672J32238O2978r3959k99504
$$ -52935 -256312 -371731 -388816 -407357 -376674 -281565 -123893 8345 71323 -22636 -322140
6534c22140p5819K2361J2454l7522R1505J34588K732j21423n8717J54617J82842
$$ -322140 -397959 -375598 -363144 -400666 -309161 -174573 -171841 -293264 -351981 -197364 -14522
6523a4522P2667K9019r9331l4394R6735j92647q9285p8983k2570J28487J95218
$$ -14522 58145 87164 -12167 -46561 50174 -142473 -231758 -310741 -333311 -204824 -9606
6512i606J89441q2357k52696j64581M4448L669j17824K3551K61804J72298q3110
$$ -9606 179835 97478 -155218 -319799 -275351 -271682 -389506 -365955 -104151 68147 -14963
6501a4963j22646k12849j34345J48374K44667J22784n9399q0900N7317L8542M701
$$ -14963 -137609 -350458 -484803 -336429 -91762 31022 -28377 -109277 -51960 -13418 -8717
6490h717k03877k62434N4770K21684L6634q2678J43194K83390r896j86641j21087
$$ -8717 -212594 -475028 -420258 -198574 -161940 -244618 -101424 181966 172070 -14571 -135658
6479a35658k17594k40620K8559K47533K63766K89213O8983n9456j10828k0522
$$ -135658 -353252 -593872 -565313 -317780 -54014 235199 304182 244726 133898 113376
6469A13376l4697j2952N7391j27893k21972p8046J07957J72322J54646k1684N956
$$ 113376 78679 65727 123118 -4775 -226747 -304793 -196836 -24514 130132 108448 114404
6458A14404J63993K13335P8433k039j51379k05909j9308L2388j29327j40977J00401
$$ 114404 278397 491732 570165 568126 416747 210838 191530 223918 94591 -46386 54015
6447E4015Q9592n8369K8177K34784L28240K07424m1900j38163j6997p8387k76144
$$ 54015 143607 85238 113415 348199 676439 883863 841963 703800 686803 608416 332272
6436C32272j79681k50881j94505k09251m1250K50930L39729K28309j75519k16198
$$ 332272 152591 -98290 -292795 -502046 -543296 -292366 47363 275672 100153 -116045
6426a16045l08994j35974J29952R4557J80158M34880K30187l5694m5320J3648
$$ -116045 -425039 -561013 -431061 -336504 -156346 278534 508721 473027 427707 441355
6416D41355q5334k19330l17252k25159q6945J63825K32751J01140m9654R1526
$$ 441355 356021 136691 -180561 -405720 -492665 -328840 -96089 5051 -44603 46923
6406D6923J58910J68114J47048o0391k7293K1772j18716m29564m01242L7987J91851
$$ 46923 205833 373947 520995 460604 433311 455083 336367 -93197 -494439 -456452 -264601
6395b64601J63660j1410j77004Q1959J87793J48871J59991N6532j34975r0036
$$ -264601 -100941 -112351 -289355 -207396 -19603 129268 289259 345791 210816 120780
6385A20780m5906j66534l3761Q2549N2848j5010j41263O1881J17065K2665O0154
$$ 120780 74874 -91660 -125421 -42872 9976 -5034 -146297 -84416 32649 55314 115468
6374A15468M304k18103j72727n3823j1344N0576J88790P423M3803K01589L6264
$$ 115468 119772 -98331 -271058 -324881 -336225 -285649 -96859 -89436 -45633 155956 192220
6363A92220o0787l1391r5708l46858k06429k3254J84504L13621J50457L4186o2263
$$ 192220 131433 100042 4334 -342524 -548953 -572207 -387703 -74082 76375 110561 48298
6352D8298j49733j28666N1623J59905J40252q2977n3683p2550N1448Q9821p9622
$$ 48298 -101435 -230101 -178478 -18573 121679 38702 -14981 -87531 -36083 53738 -25884
6341b5884J5631P0078J04072J42130Q2808m6449j07623n6114J4435q0007Q1398
$$ -25884 -10253 59825 163897 306027 388835 342386 234763 178649 193084 113077 194475
6330A94475j074Q526k9217k25987k76725k08152O5722J62230J07725J18181K44314
$$ 194475 193401 201927 172710 -53277 -330002 -538154 -472432 -310202 -202477 -84296 160018
6319A60018O4706m4011m3995L2050K31750R6557j43440j20378j00441o4236k03691
$$ 160018 224724 180713 136718 168768 400518 497075 353635 233257 132816 68580 -135111
6308a35111J7432J88990K74473R1668l382M9914J1786J15339J11086Q681o7901
$$ -135111 -117679 71311 345784 437452 434070 483984 495770 611109 722195 730876 662975
6297F62975j37368n2362O1235J4985o4178Q0048N1336P7620K07933J02392J48805
$$ 662975 525607 473245 534480 549465 485287 565335 616671 694291 902224 1004616 1153421
6286A153421P9572N0822J34198J84362Q7038K87677L95533K20323k0779j03861
$$ 1153421 1232993 1283815 1418013 1602375 1689413 1977090 2372623 2592946 2572167 2468306
6276B468306r8793k20180j96606r6610l4752J46156J32261r7478k21944m9616
$$ 2468306 2369513 2149333 1952727 1856117 1821365 1967521 2099782 2002304 1780360 1730744
6266A730744j9219o8964k22874l36102k62226Q4170K19251N3347n8344k37714
$$ 1730744 1711525 1642561 1419687 1083585 821359 905529 1124780 1178127 1119783 882069
6256H82069l26332k84372j17305R2646l4530k35675j88328J05389J69686J98305
$$ 882069 555737 271365 154060 246706 212176 -23499 -211827 -106438 63248 261553
6246B61553P7986j66610n5697Q1565p119q569M1553j23094j21051j3361o7821
$$ 261553 339539 172929 117232 198797 191678 183109 224662 101568 -19483 -32844 -100665
6235a00665j04639q2384J83445K17965j12916j81491l3812R2113p180Q0694J91122
$$ -100665 -205304 -287688 -104243 113722 806 -180685 -214497 -122384 -129564 -48870 142252
6224A42252J90374K05279o4797j91812l4719L0681J7488P085l1895l6871O1605
$$ 142252 332626 537905 473108 281296 246577 277258 294746 301831 269936 233065 294670
6213B94670N7935N4588p6395j59065r8301N4843J17036j10536k20495j4194K50301
$$ 294670 352605 407193 330798 171733 73432 128275 245311 134775 -85720 -99914 150387
6202A50387P5901q4962P1115K81666J53368j19126m18995k38301M9877J89371
$$ 150387 226288 141326 212441 494107 647475 528349 109354 -128947 -79070 110301
6192A10301K51217M8011p8569j15582Q0530J17882J1531R4789k20311l13894p8356
$$ 110301 361518 409529 330960 215378 295908 413790 425321 520110 299799 -14095 -92451
6181i2451m8489P5427O7923j76620r1333m0997o0359K18776O0703j80540R9907
$$ -92451 -140940 -65513 2410 -174210 -265543 -306540 -366899 -148123 -87420 -267960 -168053
6170a68053L08050J43218O1827l295K94j78256j52603N8033l578n9373k9970R8394
$$ -168053 139997 283215 345042 341747 342041 163785 11182 69215 65637 6264 -23706 74688
6158G4688J32957J86343J6580j4956M2360o7532j37468o769Q5964Q7655j28025
$$ 74688 207645 393988 410568 395612 437972 370440 232972 226203 312167 399822 271797
6147B71797l19756j42342P9623k4611j13222O0930K00206J59465O9633M262n5754
$$ 271797 -47959 -190301 -110678 -135289 -248511 -187581 12625 172090 241723 245985 190231
6136A90231j8889L2651j29880p8217k24170k49231j35880n2372M962M8985K33974
$$ 190231 171342 203993 74113 -4104 -228274 -477505 -613385 -665757 -660795 -611810 -377836
6125c77836K72908O1942J3867M0609q0385j21453j5361J46188J57770N2778n0365
$$ -377836 -104928 -42986 -29119 11490 -68895 -190348 -205709 -59521 98249 151027 100662
6114A00662N5391J21728R5764m5494j04378P2754m3131j55579Q2870K337j56309
$$ 100662 156053 277781 373545 328051 223673 296427 253296 97717 180587 182924 26615
6103B6615j54617l407J63957J99849P0438n4073Q9221J73548K08372J229k17137
$$ 26615 -128002 -131409 32548 232397 302835 248762 337983 511531 719903 721132 503995
6092E03995p8431M2462j34980l87144m01874o3022L00779J61468l9642j87375
$$ 503995 425564 468026 333046 -54098 -455972 -518994 -218215 -56747 -96389 -283764
6082b83764k7519P2204J73789J68032N6340j28815p1335P2335J08644P7889Q0608
$$ -283764 -311283 -239079 -65290 102742 159082 30267 -41068 31267 139911 217800 298408
6071B98408o405j86771j0875L8811j30575j47102j14161N5903N9777J47047J62409
$$ 298408 292003 105232 94357 133168 2593 -144509 -258670 -202767 -142990 4057 166466
6060A66466K31756L2270m7835m2390j09456l26793l82032j12557j20462J31985
$$ 166466 398222 430492 382657 340267 230811 -95982 -478014 -590571 -711033 -579048
6050e79048K38206k9823j7073J79926L36280K39008N0532k1601p3392j21931j04695
$$ -579048 -340842 -370665 -387738 -207812 128468 367476 418008 396407 323015 201084 96389
6039I6389r0579j67710j77794k73494R1151L12281j09916j93288J21524J63482
$$ 96389 5810 -161900 -339694 -613188 -522037 -209756 -319672 -512960 -391436 -227954
6029b27954J09753K66843l0689j07403L6761J764m9787Q3469J48866j82564j66905
$$ -227954 -118201 148642 117953 10550 47311 49075 -712 82757 231623 49059 -117846
6018a17846j06310r333L33413J55695j28092K8206J63375P2048j39232n9223l8829
$$ -117846 -224156 -233489 99924 255619 127527 155733 319108 391156 251924 192701 153872
6007A53872j4126J8599J23234J91408j36176q1114J87494J71945r9745m23072
$$ 153872 139746 158345 281579 472987 336811 255697 443191 615136 515391 92319
5997I2319l63674j25426n4625j6766O5472R4007P0776P2490K04098L35865K94886
$$ 92319 -271355 -396781 -451406 -468172 -402700 -308693 -237917 -165427 38671 374536 669422
5986F69422J90351r8846j63409k22010k56558j98622k2635J1910J4712J49558
$$ 669422 859773 760927 597518 375508 118950 -79672 -102307 -90397 -75685 73873
5976G3873K09766o5068k63776J8057J75037R4257k60403j65670Q874m26N0712
$$ 73873 283639 218571 -45205 -27148 147889 242146 -18257 -183927 -175053 -175479 -124767
5965a24767L3743Q6258J85639P8418j20399l9239m484m5045J3275J10711P4473
$$ -124767 -91024 -4766 180873 259291 138892 99653 95169 50124 63399 174110 248583
5954B48583J23647n7078J064p5908r3738J53802J90018o3645j87844j22470l2512
$$ 248583 372230 315152 316216 240308 146570 300372 490390 426745 238901 116431 83919
5943H3919j12711k37018l3916J71883K80703M7835j32993j33169j0612k30260
$$ 83919 -28792 -265810 -299726 -127843 152860 200695 67702 -65467 -76079 -306339
5933c06339j22092J12588J5550J13490K94329K02278J0767j03811R5190Q2762
$$ -306339 -428431 -315843 -300293 -186803 107526 309804 320571 216760 311950 394712
5923C94712k55066k93529J2818J77525J25130ro6865j12635p2698k0748q5239
$$ 394712 139646 -153883 -141065 36460 161590 161581 94716 -17919 -90617 -111365 -196604
5912a96604j01722k9754L7482K24482R6843j17091j06657L5759R3374j11092k637
$$ -196604 -298326 -328080 -290598 -66116 30727 -86364 -193021 -157262 -63888 -174980 -177617
5901a77617P0689R4013L2590q6859j16889j27553Q1962M6684k6268J59675R1650
$$ -177617 -106928 -12915 19675 -67184 -184073 -311626 -229664 -182980 -209248 -49573 42077
5890D2077j85882r3992R8584J05619j03503j02323J84745K68271J14596m326K8114
$$ 42077 -143805 -237797 -139213 -33594 -137097 -239420 -54675 213596 328192 323866 351980
5879C51980k7566q4677l22748k18237q5448m3155l9645J45989K02094L4265J2934
$$ 351980 324414 239737 -83011 -301248 -386696 -429851 -469496 -323507 -121413 -87148 -74214
5868g4214k5701J71017J28905q934m0980p6275J3924L3714M1404l141N385l1945
$$ -74214 -99915 71102 200007 191073 150093 73818 87742 121456 162860 159719 165104 133159
5856A33159p0104j11541j02403j04795l4409J19059K35340O4547J00171L18022
$$ 133159 63055 -48486 -150889 -255684 -290093 -171034 64306 128853 229024 547046
5846E47046l2102k27675k35861J3588J56367j32271l68922j66246K92121L92628
$$ 547046 514944 287269 51408 64996 221363 89092 -279830 -446076 -153955 238673
5836B38673R1715j86283k628p6744k20522P5791k1431j05647P0000J16564J51682
$$ 238673 330388 144105 141477 64733 -155789 -79998 -101429 -207076 -137076 -20512 131170
5825A31170k917j51058m0863j01997j5407J77332M59p0409N0508O1259J29963
$$ 131170 128253 -22805 -63668 -165665 -181072 -3740 -3281 -73690 -23182 38077 168040
5814A68040n405j35046j00769J15297P7549P0898N7256r6947J5397K37171K29003
$$ 168040 162635 27589 -73180 42117 119666 190564 247820 150873 166270 403441 632444
5803F32444J95484p7585k94200j87914L2636j63729j20192j06996p8742j1146
$$ 632444 827928 750343 456143 268229 300865 137136 16944 -90052 -168794 -179940
5793a79940J50253R0594J50048J70106r96j6718j04247j48385j0934O646n7515
$$ -179940 -29687 60907 210955 381061 380065 363347 259100 110715 99781 106427 48912
5782D8912L7424n9726k01620j3929J31113K31264J87615l58755j68346K07978
$$ 48912 86336 26610 -175010 -188939 -57826 173438 361053 2298 -166048 41930
5772D1930K77201N6649r0641K0664m8051j3518o7503j13811J16089J73169K17338
$$ 41930 319131 375780 285139 305803 257752 244234 176731 62920 179009 352178 569516
5761E69516M8577j27922j50731j16421o2926l8160J17137J61789J26065L87318
$$ 569516 618093 490171 339440 223019 160093 121933 239070 400859 526924 914242
5751I14242O74388O52349L73479O25286J125763J351517J478689P53272j191221
$$ 914242 1588630 2240979 2614458 3239744 4365507 5717024 7195713 7948985 6757764
5742F757764j714263j339558r82861o55003m97238j80336j8983K8515m2919j64311
$$ 6757764 5043501 3703943 2721082 2066079 1568841 1388505 1369522 1398037 1355118 1190807
5732A190807l19780j06722j48277k52758j71130N5289J2255p9223O6358L7389
$$ 1190807 871027 764305 616028 363270 192140 247429 259684 180461 246819 284208
5722B84208K5934k32291k57631j02026m0954J48579K56053J46898q2823k94701
$$ 284208 310142 77851 -179780 -281806 -322760 -174181 81872 228770 145947 -148754
5712a48754k81373k6795R9824n575n2292N0631K4172J26718K41683K75748k6220
$$ -148754 -430127 -456922 -357098 -362673 -414965 -364334 -340162 -213444 28239 303987 277767
5701B77767l66914q7752K10503Q6806l1383M7937L6012N7896M8817j2687r7079
$$ 277767 -89147 -176899 33604 120410 89027 136964 172976 230872 279689 267002 169923
5690A69923j25694k1026q2757M0037J45984K92306J93882p6828l24276j88810
$$ 169923 44229 23203 -59554 -19517 126467 418773 612655 535827 211551 22741
5680B2741l9355J34344J2513j70178o7520r9538o6592J20508L4321j68002k06983
$$ 22741 -16614 117730 130243 -39935 -107455 -206993 -273585 -153077 -118756 -286758 -493741
5669d93741p2739j08694r9150J71765Q3610j297J65446L44013J46249J94955J66184
$$ -493741 -566480 -675174 -774324 -602559 -518949 -520246 -354800 -10787 135462 330417 496601
5658D96601m4956j66260j02026j19099p7329p2804k6785L0905J77711k7095k12059
$$ 496601 451645 285385 183359 64260 -13069 -85873 -112658 -81753 95958 68863 -143196
5647a43196j46655R8775K10854j0704k51898l05983K866L1968l1381P8562O1295
$$ -143196 -289851 -191076 19778 9074 -242824 -548807 -545941 -513973 -545354 -466792 -405497
5636d05497q3603L6837M12447M45093K16117p213K8666R8977l4256K9734R1693
$$ -405497 -489100 -452263 -39816 405277 621394 614181 642847 741824 707568 737302 828995
5625H28995J4568j16542k59296k61338j48655j55578l6069J340m882q7708j96304
$$ 828995 843563 727021 467725 206387 57732 -97846 -133915 -132575 -137457 -225165 -421469
5614d21469m5386m0455j95857j01099k463k6233L741Q0574K25091J0305O0200
$$ -421469 -466855 -507310 -703167 -804266 -806729 -832962 -829221 -748647 -523556 -513251 -453051
5603d53051J65587J21118K35586J23940o0713p2189M8205Q6252p1066j32323r7450
$$ -453051 -287464 -166346 69240 193180 132467 60278 108483 194735 123669 -8654 -106104
5592a06104o1211j66848j25563J6237K21011M00137K19503j66716j66575L5538
$$ -106104 -167315 -334163 -459726 -443489 -222478 177659 397162 230446 63871 99409
5582I9409M9327M9910J22502J50015L3387j30627j17414L8463J21734N9905r3108
$$ 99409 148736 198646 321148 471163 504550 373923 256509 294972 416706 476611 383503
5571C83503k7677j1360k63181m47525k50374J765J04712L70491L41500N3134K1934
$$ 383503 355826 344466 81285 -366240 -616614 -614849 -510137 -139646 201854 254988 276922
5560B76922p1592k05022j11332j7538M4586J73698k7347j48968J61973K59275
$$ 276922 205330 308 -111024 -128562 -83976 89722 62375 -86593 75380 334655
5550C34655J13221o2393l9655j24957k26006j40323j7626J69212J27438R4686
$$ 334655 447876 385483 345828 220871 -5135 -145458 -163084 6128 133566 228252
5540B28252M3960n7043J12539J10257j61715j98972n2786Q8787K38854J76442
$$ 228252 272212 215169 327708 437965 276250 77278 24492 113279 352133 528575
5530E28575r2694j90725q4286j17876p0803K14762R3994m9550R0961N8486k78076
$$ 528575 435881 245156 160870 42994 -27809 186953 280947 231397 322358 380844 102768
5519A02768j31242j55436j46899L4917J29691K42607K44188L963k72708j61520
$$ 102768 -28474 -183910 -330809 -295892 -166201 76406 320594 324557 51849 -109671
5509a09671J24520J67594J28872o6249j81319k49079p3806K76672L90236J80706
$$ -109671 14849 182443 311315 245066 63747 -185332 -259138 17534 407770 588476
5499E88476J33012K7409Q7491J27409k49441n01275k04232K6087q0736q5272j09455
$$ 588476 721488 748897 836388 963797 714356 213081 8849 34936 -45800 -131072 -240527
5488b40527l8212o9395p6152P4758K21962q4154r3052J18391J5142k5480J10866
$$ -240527 -278739 -348134 -424286 -349528 -127566 -211720 -304772 -186381 -171239 -196719 -85853
5477h5853N2900o0531K14954L13039J39472L5282j57166k15161m2161P8011O1411
$$ -85853 -32953 -93484 121470 434509 573981 609263 452097 236936 194775 272786 334197
5466C34197m28j04561o3365r1086j01260M0692Q9204k47344k49688J99110K65512
$$ 334197 333769 229208 165843 74757 -26503 14189 103393 -143951 -393639 -194529 70983
5455G0983j5582r8771m0118p4379j73027R1456J95841N3336K22669K09257J04905
$$ 70983 55401 -43370 -83488 -157867 -330894 -239438 -43597 9739 232408 441665 546570
5444E46570n1795l73030k27234R2266J24252J43730m9757j04021J6727j26932
$$ 546570 494775 121745 -105489 -13223 111029 254759 205002 100981 117708 -9224
5434i224k05757j50917P7472J53269J5910q1512r1346K3989k8502P9106P6962
$$ -9224 -214981 -365898 -288426 -135157 -119247 -200759 -292105 -268116 -296618 -217512 -140550
5423a40550J0152k7582k26658j45253k9685j1033J67703K84683J20906R3565J52444
$$ -140550 -130398 -157980 -384638 -529891 -559576 -570609 -402906 -118223 2683 96248 248692
5412B48692K24210K8999o4033j10032j27697j94621j71113k1085r8496P0569J61355
$$ 248692 472902 501901 437868 327836 200139 5518 -165595 -186680 -285176 -214607 -53252
5401e3252Q5409J48625J90007J3197j50525k25875j36478k1414p3050J7867l6741
$$ -53252 32157 180782 370789 383986 233461 7586 -128892 -150306 -223356 -205489 -242230
5390b42230j41863Q1581J65919K284k42797k83018K3199R3379J90795o7036K3254
$$ -242230 -384093 -302512 -136593 -134309 -377106 -660124 -636925 -543546 -352751 -419787 -396533
5379c96533K95128J64498J05762K2002l7696r0554j12945J93869O2554m6153J7706
$$ -396533 -101405 63093 168855 190857 153161 62607 -50338 143531 206085 159932 177638
5368A77638J95250P7384K0537J38737O6858M2823k93678l33353j53953j06290
$$ 177638 372888 450272 470809 609546 676404 719227 425549 92196 -61757 -168047
5358a68047o7560R4935n369P3265P253r3036O7917M33834L15935l0301n4300j83355
$$ -168047 -235607 -140672 -146041 -72776 -65523 -158559 -90642 343192 659127 628826 574526 391171
5346C91171k97962k03556K5371J62468J9687j66287n8701k7884j8991k8642o8342
$$ 391171 93209 -110347 -84976 77492 97179 -69108 -127809 -155693 -174684 -203326 -271668
5335b71668j49971r2656J69669K32824K81759R9138k00853j80092n4112j05562
$$ -271668 -421639 -514295 -344626 -111802 169957 269095 68242 -111850 -165962 -271524
5325b71524J69655J92701j70505r5906O1059m3720m9399J61730K44192M5530j35535
$$ -271524 -101869 90832 -79673 -175579 -114520 -158240 -207639 -45909 198283 243813 108278
5314A08278k18797r7086L9652n5007l5013R7795Q5075Q6668R2811k759j93503
$$ 108278 -110519 -207605 -167953 -222960 -257973 -160178 -75103 11565 104376 101617 -91886
5303i1886k23107j16898K73457L11808Q6307K6774n3883r5436l3772J58935J07735
$$ -91886 -314993 -431891 -158434 153374 239681 266455 212572 117136 83364 242299 350034
5292C50034r4649k13918j08849j44239r0272J12234P3938p7095j62955l9790O6574
$$ 350034 255385 41467 -67382 -211621 -301893 -189659 -115721 -192816 -355771 -395561 -328987
5281c28987K14038m837j30352P2755J43589J71370J40701J9604k1131j33727j07165
$$ -328987 -114949 -119786 -250138 -177383 -33794 137576 278277 297881 276750 143023 35858
5270C5858J53644R9395j04187j53840j51532J6779R9403m3239J25510R5013N566
$$ 35858 189502 288897 184710 30870 -120662 -103883 -4480 -47719 77791 172804 178370
5259A78370r0123M0447J3573n6093Q5632j16025k09751j51862j21343q4956j8182
$$ 178370 88247 128694 142267 86174 171806 55781 -153970 -305832 -427175 -512131 -530313
5248e30313O4155J94703J97816L0103J8839j3926Q0016j32636k96361r5184J51524
$$ -530313 -466158 -271455 -73639 -43536 -24697 -38623 41393 -91243 -387604 -482788 -331264
5237c31264J97739K34846K0990j52310j01844l438P9998M6895j04637n9572J44526
$$ -331264 -133525 101321 122311 -29999 -131843 -135281 -55283 -8388 -113025 -172597 -28071
5226b8071L46745K48101M0495K175k38849k53382j98966j72892j1293K2190m125
$$ -28071 318674 566775 607270 609445 370596 117214 -81752 -254644 -265937 -243747 -247872
5215b47872O7349k7841j1258J65526J7051k73983r700P5883M0802J47025L02029
$$ -247872 -180523 -208364 -219622 -54096 -37045 -311028 -320728 -244845 -204043 -57018 245011
5204B45011N3877o3192l019r1076L5803Q0961j24407j81778M8611Q4509J4071
$$ 245011 298888 235696 232677 141601 177404 258365 133958 -47820 791 85300 99371
5193I9371k12897k07798P1080j81969j70209K74346J87177K4020K23006L82743
$$ 99371 -113526 -321324 -250244 -432213 -602422 -328076 -140899 -116879 106127 488870
5183D88870K21150M4602j41752L630r288l40163j30903J9715q7304r5011j55979
$$ 488870 710020 754622 612870 616500 607212 267049 136146 155861 68557 -26454 -182433
5172a82433k77633r3589K13115Q4986j33161M0813P1960m8383q2940r1310J61082
$$ -182433 -460066 -553655 -340540 -255554 -388715 -347902 -275942 -324325 -407265 -498575 -337493
5161c37493L61354J79649l9650o0918J20216J29168l3691j38095N4816j40040
$$ -337493 23861 203510 163860 102942 223158 352326 318635 180540 235356 95316
5151I5316l99308k28446M4732m792p2635J04765L08658J80348q2046j43708j17251
$$ 95316 -303992 -532438 -487706 -492498 -565133 -460368 -151710 28638 -53408 -197116 -314367
5140c14367J15228J46054N6564r316j92758l8341K22464K37474J09651k40595
$$ -314367 -199139 -53085 3479 -5837 -198595 -236936 -14472 223002 332653 92058
5130I2058k57473l0970J93220K54061M56r7288J03940J87420k8974o7424k172
$$ 92058 -165415 -196385 -3165 250896 251352 154064 258004 445424 416450 349026 346854
5119C46854j37368l89325j2644L25015K14794q3025k17910l67996j64524K88918
$$ 346854 209486 -179839 -192483 132532 347326 264301 46391 -321605 -486129 -197211
5109a97211K65571j65435j25585J63201j34772l35656j37969Q4589J67896j04023
$$ -197211 68360 -97075 -222660 -59459 -194231 -529887 -667856 -583267 -415371 -519394
5099e19394l90329j40136L37986L51795K31186Q6720q4100N0537P2613p964K12
$$ -519394 -909723 -1049859 -711873 -360078 -128892 -42172 -126272 -75735 -3122 -11086 -10874
5088a0874K1293j45297j60051J01880L6759M5149P5948p2218j1140N1016J37349
$$ -10874 10419 -134878 -294929 -193049 -156290 -111141 -35193 -107411 -118551 -67535 69814
5077F9814j01021l09882l14342j80322J80267J9562N3873J71219Q0509P6415N7934
$$ 69814 -31207 -341089 -655431 -835753 -655486 -635924 -582051 -410832 -330323 -253908 -195974
5066a95974k7148K4392K63037J17754j41024j34326l7263o2389n4689P9077P2221
$$ -195974 -223122 -198730 64307 182061 41037 -93289 -130552 -192941 -247630 -168553 -96332
5055i6332Q5059K26581L8261j52321j96453l39625j01268L28860L12705O866j08774
$$ -96332 -11273 215308 253569 101248 -95205 -434830 -536098 -207238 105467 112333 3559
5044C559p0734n5021K0929m4406j56510R429J92769J26888j6897J52593J08365
$$ 3559 -67175 -122196 -101267 -145673 -302183 -292754 -99985 26903 10006 162599 270964
5033B70964j65783m0997p2744k10573k95346o1630Q6990K20905R3316p4139j79556
$$ 270964 105181 64184 -8560 -219133 -514479 -576109 -489119 -268214 -174898 -249037 -428593
5022d28593k28297k7270J17477j35716r804J69316O8912O236K387l3571P0238
$$ -428593 -656890 -684160 -566683 -702399 -712203 -542887 -473975 -467739 -465352 -498923 -428685
5011d28685O9563l3746j30138p8843K33012J83823o1895k27134k50983R6314L89046
$$ -428685 -359122 -392868 -523006 -601849 -368837 -185014 -246909 -474043 -725026 -628712 -239666
5000b39666J96495j0007k068r2751K6558J64763K11198J19549k11866j61647L8813
$$ -239666 -43171 -53178 -55246 -147997 -121439 43324 254522 374071 162205 558 39371
4989C9371j1568R9876Q4738m1081R3661M7065K070o9152l7242K414K6402O7939
$$ 39371 27803 127679 212417 171336 264997 312062 314132 244980 207738 210152 236554 304493
4977C04493k28404k19418J6398j5247J6950J66294J76217K2645J01557K46855
$$ 304493 76089 -143329 -126931 -142178 -125228 41066 217283 239928 341485 588340
4967E88340K29091P0088M7228j26617l87326k85902j65951j73311j39733M7142
$$ 588340 817431 887519 934747 808130 420804 134902 -31049 -204360 -344093 -296951
4957b96951J49183O0764J32034q206J34006J54641l8485j64345j72744O47P6309
$$ -296951 -147768 -87004 45030 36824 170830 325471 286986 122641 -50103 -49456 26853
4946B6853J67979J36484N2074j24893j19294K1110Q167j16916k35015J16761L75122
$$ 26853 194832 331316 383390 258497 139203 160313 168480 51564 -183451 -66690 308432
4935C08432J14500l9655j20479j36453o4978k4377O6386Q8094l0330j57742l22843
$$ 308432 422932 383277 262798 126345 61367 36990 103376 191470 161140 3398 -319445
4924c19445j37478j01969M0429K22013K34852K70716J12374j32828k7422o1243
$$ -319445 -456923 -558892 -518463 -296450 -61598 209118 321492 188664 161242 99999
4914I9999m5908q5935j05170O6687P0723L3871P5744p2607l3315J76994L51518
$$ 99999 54091 -31844 -137014 -70327 396 34267 110011 37404 4089 181083 532601
4903E32601J88112k11386l08735j50282J57211O6116k16654l07711m958K40309
$$ 532601 720713 509327 200592 50310 207521 273637 56983 -250728 -255686 -15377
4893a5377J04003j6344M7448k9374M8490J1595p0640j86086j55046M0204J09341
$$ -15377 88626 72282 119730 90356 138846 150441 79801 -106285 -261331 -221127 -111786
4882a11786l1945l6158m8831q6520M2551N1278M7259J08624P4529O1739K06000
$$ -111786 -143731 -179889 -228720 -315240 -272689 -221411 -174152 -65528 9001 70740 276740
4871B76740J34998J2090R5435l6043q8256j53995j76349j2960k3181Q9055O6116
$$ 276740 411738 423828 519263 483220 394964 240969 64620 51660 28479 117534 183650
4860A83650K56518m4048k82764k86202j61158k1673M7763R3781j4079l549J9462
$$ 183650 440168 396120 113356 -172846 -334004 -355677 -307914 -214133 -228212 -231761 -212299
4849b12299R821M0351J47691J29569l2226M7547J6772q2641M9619K3640j80233
$$ -212299 -202478 -162127 -14436 115133 82907 130454 147226 64585 114204 137844 -42389
4838d2389j5007N4555j17536p1573N8132J70892K2273r4025m4600j92742N2755
$$ -42389 -57396 -2841 -120377 -191950 -133818 37074 59347 -34678 -79278 -272020 -219265
4827b19265J89523J35631Q9428L5803j53806m029N5159r9057j43671O3369Q7737
$$ -219265 -29742 105889 195317 231120 77314 73285 128444 29387 -114284 -50915 36822
4816C6822r9108K5326O8648J23159J72240K795j48012j76745J37079K50241L546
$$ 36822 -62286 -36960 31688 154847 327087 329882 181870 5125 142204 392445 395991
4805C95991K7858Q3637k8143r3214j08594r4311J52007L7578L6355k9002m00853
$$ 395991 423849 507486 479343 386129 277535 183224 335231 372809 409164 380162 -20691
4794b0691k70887P0928J99567J02327p8957k31325l61951k7975K04786K4732l0206
$$ -20691 -291578 -220650 -21083 81244 2287 -229038 -590989 -618964 -414178 -389446 -419652
4783d19652J7164J36410K19107m95r4197j47784J2746J59181J11961J00904J93802
$$ -419652 -402488 -266078 -46971 -47466 -141663 -289447 -276701 -117520 -5559 95345 289147
4772B89147J60123J6385J278Q1045j40236k01854j85848q3347j51590p4850K17903
$$ 289147 449270 465655 466933 547978 407742 205888 20040 -63307 -214897 -289747 -71844
4761g1844J25584l9121N1215q7818j70554m6309J67799J71562j46813j4362J72815
$$ -71844 53740 14619 65834 -21984 -192538 -238847 -71048 100514 -46299 -60661 112154
4750A12154p7631J6528P7734j9911j67898O3250J18865m0219j34866j15270K8289
$$ 112154 34523 51051 128785 108874 -59024 4226 123091 82872 -51994 -167264 -138975
4739a38975J27340K22845j00481J4717K60055R1819Q6191Q7422m1994K5919J97844
$$ -138975 -11635 211210 110729 125446 385501 477320 563511 650933 608939 634858 832702
4728H32702L28741K09901L33765L90124L70839M37182M35957N35796O38156R25948
$$ 832702 1161443 1371344 1705109 2095233 2466072 2903254 3339211 3875007 4513163 5439111
4718E439111J287671P77983k09379j102042j248624r74079p52716o04667n26833
$$ 5439111 6726782 7504765 7295386 6193344 4944720 3970641 3217925 2613258 2086425
4709B086425m19782m16964m15286l93719k43936l8643N9183k8984N1855l069R3816
$$ 2086425 1666643 1249679 834393 440674 196738 158095 217278 188294 240149 237080 330896
$$ [...]
##END NTUPLES=NMR SPECTRUM
##END=
