##TITLE=1H_lae-Cu-D-b
 CDCl3+Py-d5, 8 sc, 
 27.6.2019
##JCAMPDX= 6.0         $$ Bruker NMR JCAMP-DX V2.0
##DATA TYPE= NMR FID
##DATA CLASS= NTUPLES
##ORIGIN= UXNMR, Bruker Analytische Messtechnik GmbH
##OWNER= root
$$ XWIN-NMR		Version 3.5
$$ Thu Jun 27 14:08:22 2019 Russian Standard Time (UT+4h)  she@DPX200
##.OBSERVE FREQUENCY= 200.13155
##.OBSERVE NUCLEUS= ^1H
##.DELAY= (6, 6)
##.ACQUISITION MODE= SIMULTANEOUS
##.ACQUISITION SCHEME= undefined
##.AVERAGES= 8
##.DIGITISER RES= 18
##SPECTROMETER/DATA SYSTEM= spect
##.PULSE SEQUENCE= zg30
##.SOLVENT NAME= CDCl3
##.SHIFT REFERENCE= (INTERNAL, CDCl3, 0, 15.7039)
##AUDIT TRAIL= $$ (NUMBER, WHEN, WHO, WHERE, WHAT)
$$ ##TITLE= Audit trail, XWIN-NMR		Version 3.5
$$ ##JCAMPDX= 5.01
$$ ##ORIGIN= Bruker BioSpin GmbH
$$ ##OWNER= she
$$ F:/spectra/data/she/nmr/H-F/1/audita.txt
$$ ##AUDIT TRAIL=  $$ (NUMBER, WHEN, WHO, WHERE, WHAT)
(   1,<2019-06-27 14:07:17.07 +0400>,<she>,<DPX200>,
      <created by zg, POWCHK disabled, PULCHK disabled
       configuration hash MD5:
       00 E9 B6 7A A2 85 ED C7 34 08 36 98 17 FE 4E 26
       data hash MD5: 16K
       BD 05 1E 9E F3 67 67 D8 FB EB 34 15 36 8C 8E 32>)
$$ ##END=
$$ 
$$ hash MD5
$$ 49 62 65 5C F1 CE B9 55 E9 7D C8 34 A8 1A 8F 96
##$RELAX= 
##$RELAX= 
##$RELAX= 
##$RELAX= 
##$RELAX= 
##$RELAX= 
$$ Bruker specific parameters
$$ --------------------------
##$DU= <F:/spectra>
##$EXPNO= 1
##$NAME= <H-F>
##$PROCNO= 1
##$TYPE= <nmr>
##$USER= <she>
##$AMP= (0..31)
100 100 100 100 100 100 100 100 100 100 100 100 100 100 100 100 100 100 
100 100 100 100 100 100 100 100 100 100 100 100 100 100 
##$AQSEQ= 0
##$AQ_mod= 1
##$AUNM= <au_zg>
##$AUTOPOS= <>
##$BF1= 200.13
##$BF2= 200.13
##$BF3= 200.13
##$BF4= 200.13
##$BF5= 200.13
##$BF6= 200.13
##$BF7= 200.13
##$BF8= 200.13
##$BYTORDA= 1
##$CFDGTYP= 0
##$CFRGTYP= 5
##$CHEMSTR= <none>
##$CNST= (0..31)
1 1 145 1 1 1 1 1 1 1 1 1 1 1 1 1 1 1 1 1 1 1 1 1 1 1 1 1 1 1 1 1 
##$CPDPRG= <>
##$CPDPRG1= <>
##$CPDPRG2= <>
##$CPDPRG3= <>
##$CPDPRG4= <mlev>
##$CPDPRG5= <mlev>
##$CPDPRG6= <mlev>
##$CPDPRG7= <mlev>
##$CPDPRG8= <mlev>
##$CPDPRGB= <>
##$CPDPRGT= <>
##$D= (0..31)
0 1.2 0 0 0 0 0 0 0 0 0 0.03 0 0 0 0 0 0 0 0 0 0 0 0 0 0 0 0 0 0 0 0 
##$DATE= 1561630036
##$DBL= (0..7)
120 120 120 120 120 120 120 120 
##$DBP= (0..7)
150 150 150 150 150 150 150 150 
##$DBP07= 0
##$DBPNAM0= <>
##$DBPNAM1= <>
##$DBPNAM2= <>
##$DBPNAM3= <>
##$DBPNAM4= <>
##$DBPNAM5= <>
##$DBPNAM6= <>
##$DBPNAM7= <>
##$DBPOAL= (0..7)
0.5 0.5 0.5 0.5 0.5 0.5 0.5 0.5 
##$DBPOFFS= (0..7)
0 0 0 0 0 0 0 0 
##$DE= 6
##$DECBNUC= <off>
##$DECIM= 24
##$DECNUC= <off>
##$DECSTAT= 4
##$DIGMOD= 1
##$DIGTYP= 9
##$DL= (0..7)
0 120 120 120 120 120 120 120 
##$DP= (0..7)
150 150 150 150 150 150 150 150 
##$DP07= 0
##$DPNAME0= <>
##$DPNAME1= <>
##$DPNAME2= <>
##$DPNAME3= <>
##$DPNAME4= <>
##$DPNAME5= <>
##$DPNAME6= <>
##$DPNAME7= <>
##$DPOAL= (0..7)
0.5 0.5 0.5 0.5 0.5 0.5 0.5 0.5 
##$DPOFFS= (0..7)
0 0 0 0 0 0 0 0 
##$DQDMODE= 0
##$DR= 18
##$DS= 0
##$DSLIST= <SSSSSSSSSSSSSSS>
$$ [...]
##$SUBNAM2= <"">
##$SUBNAM3= <"">
##$SUBNAM4= <"">
##$SUBNAM5= <"">
##$SUBNAM6= <"">
##$SUBNAM7= <"">
##$SUBNAM8= <"">
##$SUBNAM9= <"">
##$SW= 24.9336996594482
##$SWIBOX= (0..15)
0 0 2 0 0 0 0 0 0 0 0 0 0 0 0 0 
##$SW_h= 4990.01996007984
##$TD= 16384
##$TD0= 1
##$TE= 0
##$TE2= 300
##$TE3= 300
##$TEG= 300
##$TL= (0..7)
0 120 120 120 120 120 120 120 
##$TP= (0..7)
150 150 150 150 150 150 150 150 
##$TP07= 0
##$TPNAME0= <>
##$TPNAME1= <>
##$TPNAME2= <>
##$TPNAME3= <>
##$TPNAME4= <>
##$TPNAME5= <>
##$TPNAME6= <>
##$TPNAME7= <>
##$TPOAL= (0..7)
0.5 0.5 0.5 0.5 0.5 0.5 0.5 0.5 
##$TPOFFS= (0..7)
0 0 0 0 0 0 0 0 
##$TUNHIN= 0
##$TUNHOUT= 0
##$TUNXOUT= 0
##$USERA1= <user>
##$USERA2= <user>
##$USERA3= <user>
##$USERA4= <user>
##$USERA5= <user>
##$V9= 5
##$VALIST= <valist>
##$VCLIST= <CCCCCCCCCCCCCCC>
##$VD= 0
##$VDLIST= <DDDDDDDDDDDDDDD>
##$VPLIST= <PPPPPPPPPPPPPPP>
##$VTLIST= <TTTTTTTTTTTTTTT>
##$WBST= 1024
##$WBSW= 4
##$XGAIN= (0..3)
0 0 0 0 
##$XL= 0
##$YL= 0
##$YMAX_a= 456446
##$YMIN_a= -600560
##$ZGOPTNS= <>
##$ZL1= 120
##$ZL2= 120
##$ZL3= 120
##$ZL4= 120
##$ABSF1= 10
##$ABSF2= 0
##$ABSG= 5
##$ABSL= 3
##$ALPHA= 0
##$AQORDER= 0
##$ASSFAC= 0
##$ASSFACI= 0
##$ASSFACX= 0
##$ASSWID= 0
##$AUNMP= <proc_1d>
##$AZFE= 0.1
##$AZFW= 0.1
##$BCFW= 1
##$BC_mod= 2
##$BYTORDP= 1
##$COROFFS= 0
##$CY= 11.3945322036743
##$DATMOD= 1
##$DC= 2
##$DFILT= <>
##$DTYPP= 0
##$F1P= 18.9103706918063
##$F2P= -1.10871071338519
##$FCOR= 0.5
##$FTSIZE= 0
##$FT_mod= 4
##$GAMMA= 1
##$GB= 0.15
##$INTBC= 1
##$INTSCL= 1
##$ISEN= 128
##$LB= 0.24
##$LEV0= 0
##$LPBIN= 0
##$MAXI= 10000
##$MC2= 0
##$MEAN= 0
##$ME_mod= 0
##$MI= 1.114404
##$NCOEF= 0
##$NC_proc= 0
##$NLEV= 6
##$NOISF1= 3.799351
##$NOISF2= 2.8
##$NSP= 1
##$NTH_PI= 0
##$NZP= 0
##$OFFSET= 15.70392
##$PC= 1
##$PHC0= -8499.072
##$PHC1= 17.80098
##$PH_mod= 1
##$PKNL= yes
##$PPARMOD= 0
##$PSCAL= 0
##$PSIGN= 0
##$REVERSE= no
##$SF= 200.130013532006
##$SI= 16384
##$SIGF1= 3
##$SIGF2= 2
##$SINO= 400
##$SIOLD= 16384
##$SREGLST= <1H.CDCl3>
##$SSB= 0
##$STSI= 0
##$STSR= 0
##$SW_p= 3612.71676300578
##$SYMM= 0
##$S_DEV= 0
##$TDeff= 0
##$TDoff= 0
##$TI= <>
##$TILT= no
##$TM1= 0
##$TM2= 0
##$TOPLEV= 0
##$USERP1= <user>
##$USERP2= <user>
##$USERP3= <user>
##$USERP4= <user>
##$USERP5= <user>
##$WDW= 1
##$XDIM= 8192
##$YMAX_p= 0
##$YMIN_p= 0
$$ End of Bruker specific parameters
$$ ---------------------------------
##NTUPLES= NMR FID
##VAR_NAME=  TIME,          FID/REAL,        FID/IMAG
##SYMBOL=    X,             R,               I
##VAR_TYPE=  INDEPENDENT,   DEPENDENT,       DEPENDENT
##VAR_FORM=  AFFN,          ASDF,            ASDF
##VAR_DIM=   8192,          8192,            8192
##UNITS=     SECONDS,       ARBITRARY UNITS, ARBITRARY UNITS
##FACTOR=    0.0002004,     1,               1
##FIRST=     0,             0,               0
##LAST=      1.6414764,     0,               0
##MIN=       0,             -600560,         0
##MAX=       1.6414764,     456446,          0
$$ Real data points
##PAGE= N=1
##DATA TABLE= (X++(R..R)), XYDATA
0 0 0 0 0 -5 8 -8 8 -16 24 -24 32 -40 48 -64 72 -88 107 -129 151 -177 209 -243 282 -325 374 -432 491
27 491 -555 631 -714 805 -905 1013 -1134 1268 -1413 1570 -1746 1938 -2147 2378 -2634 2914
43 2914 -3227 3575 -3965 4405 -4905 5475 -6140 6921 -7856 8997 -10430 12287 -14805
56 -14805 18435 -24137 34457 -59030 237849 -6139 -456182 218899 456446 -28461 -224901
67 -224901 268110 278998 -185378 -157591 336975 242344 -210747 -146534 236891 135341 -117847
78 -117847 32118 198609 -64697 -195375 120559 269009 -60031 -207566 70420 186766
88 186766 -53956 -111454 93109 81577 -133981 -81276 148737 97117 -136114 -113264 70891
99 70891 60747 -56629 -20279 44411 -34050 -81421 27925 77440 -36936 -94167 467 52287
111 52287 -10085 -36513 -1333 -14321 -48113 -14159 20810 -15761 -42251 -11316 -9482 -41511
123 -41511 -12872 30525 -21836 -80953 -9640 75375 5905 -97207 -43887 66061 40767 -52462
135 -52462 -42849 25892 22677 -19794 -7739 21076 -4031 -31911 -2304 32726 13338 -18836
147 -18836 -17099 -5118 415 22112 33944 -11227 -57844 -10242 69688 41718 -52273 -48237 38501
160 38501 46575 -20158 -17841 37920 13474 -50882 -12927 72038 43388 -52566 -51894 27119 48604
173 48604 9509 -8101 -11394 -22311 2927 50175 29236 -37616 -31688 29508 26647 -14167 10250
186 10250 39702 -17591 -59342 22556 89372 6393 -77777 -14204 57715 6202 -37204 19863
198 19863 30470 -52104 -50037 55838 56862 -59123 -69127 34404 43323 -35726 -25212 35034
210 35034 -2473 -55130 4885 59843 -3833 -52644 6505 37363 -15900 -16803 38783 9129
222 9129 -56946 -5330 74577 13441 -73311 -12465 68957 6593 -63351 5454 66282 -7682
234 -7682 -63998 8183 60720 -4490 -51897 281 38130 1949 -22084 -1726 3451 -8024
246 -8024 1247 2898 -21677 -16466 21283 12041 -38011 -29302 25527 16347 -38563 -23467 34586
259 34586 16759 -43915 -24394 38926 23345 -37072 -24709 29403 23921 -15301 -8468 17093
271 17093 2468 -15108 5676 22778 3569 -11576 -205 6684 3623 8640 8323 -11420 -13386
284 -13386 16558 25700 -5605 -20686 3600 15357 -3970 -6872 14157 10084 -17077 -13206 18015
297 18015 19237 -12636 -20886 4351 16047 36 -9348 -521 1910 -7087 -5516 8343 10229 -3224
311 -3224 -10568 -2743 5766 6119 1751 -4749 -7100 2988 14828 7009 -11366 -8787 11772 10759
325 10759 -8950 -6795 14507 10655 -14716 -12172 14480 14250 -11808 -13546 9854 13967 -5608
338 -5608 -9954 3049 5889 -2045 -2729 1961 1742 1845 2421 -3009 -4396 5921 9129 -7078 -12406
353 -12406 8393 15763 -9153 -21666 4984 21857 -4595 -25295 -1683 20868 -117 -23424
365 -23424 -6263 15105 1493 -18720 -7449 12143 4921 -14569 -12553 5317 10419 -3176 -14486
378 -14486 -6678 8841 7651 -9173 -13900 4576 12970 -5507 -15849 5896 20378 -4134 -23855
391 -23855 1524 28000 5475 -25153 -7652 26146 15751 -16331 -10387 17841 14166 -10080
403 -10080 -8364 13046 13567 -5805 -10862 3664 12632 3624 -10384 -9008 7147 13687 -3749 -18610
417 -18610 -3094 16835 1677 -22086 -6915 21116 7066 -24533 -11462 22787 12355 -23636
429 -23636 -15971 19737 16449 -15641 -15674 12106 14925 -7757 -11709 6250 12497 681 -6774 -1114
443 -1114 6777 7510 -922 -7329 2133 15095 7481 -10397 -5054 16295 12513 -11414 -10032 14867
457 14867 14914 -10897 -13727 11518 15849 -9244 -17045 5723 14731 -4064 -15503 -2145 8979
470 8979 -589 -10044 -4818 3090 487 -4871 -4017 222 1259 -1647 -6012 -4218 3347 4744 -5752
485 -5752 -10501 1056 9703 -1142 -12746 -3268 9545 1787 -10434 -3853 8011 2284 -9101
498 -9101 -3824 8542 6255 -5760 -7024 4244 10332 2395 -7992 -5201 6478 9709 -1746 -8618
512 -8618 861 8643 63 -8464 -602 9741 2240 -10712 -5815 8762 8848 -6608 -12670 1421
526 1421 13142 3574 -12200 -6891 10176 7361 -10459 -9726 9582 11129 -10303 -14704 7390 14821
540 14821 -5123 -16867 -1075 13690 4176 -10381 -7945 5252 7799 -2883 -8068 2249 11058
553 11058 1156 -11534 -807 16608 6351 -14813 -5978 19053 12760 -13101 -9294 15286 11770
566 11770 -10208 -6399 13651 8785 -9720 -5452 11410 7768 -7180 -7246 3574 8446 4038 -4267
580 -4267 -9366 90 12425 3171 -14460 -7081 14389 6241 -17679 -7337 18001 3975 -26120
593 -26120 -10792 24855 11948 -25843 -19346 15431 15105 -11990 -14958 3320 6713 -2907 -3520 1792
607 1792 2553 207 -4369 -6749 5811 18075 1384 -22651 -7826 25463 16774 -19429 -17619 14667
621 14667 15367 -9407 -6698 12171 2926 -16437 -4196 16974 9372 -9402 -9487 -471 3918 8181
635 8181 6150 -10223 -16282 4680 17202 -324 -13137 -2096 2387 -8692 -3004 13812 3764
648 3764 -20596 -12601 13888 11233 -9218 -9100 1450 -2033 -1724 11162 7132 -13778 -12111 10098
662 10098 12316 -2256 -2438 2417 -6016 -4636 14734 13269 -14254 -15237 13457 16447 -7158 -6597
676 -6597 11146 1588 -14513 3968 23692 1519 -20645 -2670 18142 6254 -6331 -232 -732
689 -732 -5564 7034 14711 -7113 -18701 5662 17346 -7469 -14887 10789 10609 -19567 -14117 22627
703 22627 16313 -24489 -22528 16159 19832 -9099 -15532 -341 2878 1152 6551 408 -11974 -3540
717 -3540 10196 258 -8987 7518 10351 -17290 -17294 23791 28299 -21169 -34157 13680 32637 -5311
731 -5311 -21377 5741 11469 -11052 -4603 19822 8246 -19066 -10683 13695 11995 -379 -1879
744 -1879 -7760 -11621 8476 24013 -1995 -26332 -5297 18267 1837 -11423 6822 6442 -23237
757 -23237 -16438 26297 23115 -25764 -31175 11569 22247 -5768 -10994 4845 -3074 -14463 3686
770 3686 20042 1351 -17356 -8658 4478 7837 11163 2941 -20313 -16570 19528 25933 -11399
783 -11399 -22993 8860 16802 -10510 -7066 22332 9785 -27341 -13297 30520 23690 -18426 -20038
796 -20038 9028 14055 1375 1800 248 -9931 -3257 13844 6799 -10497 -3266 6701 -6580 -9796
810 -9796 14609 15208 -19712 -24008 15178 24951 -11093 -22037 5416 11995 -7192 -4987 10070
823 10070 -1265 -15741 229 14764 -112 -10497 994 2937 -6188 2307 13821 -4149 -20023
836 -20023 3196 23017 557 -18637 541 14331 -2532 -7129 11304 8362 -14671 -8513 17117
849 17117 12498 -10900 -8624 6039 3110 -1015 7225 2271 -13442 -6218 14684 7932 -12180 -6268
863 -6268 8084 -2463 -10765 8387 14361 -14101 -22802 9295 23248 -5428 -21821 -1238 11567
876 11567 -1981 -5812 4784 761 -11097 -4818 8655 5693 -3235 -4666 -6255 -4836 9929 15170
890 15170 -7669 -21873 2659 22702 2034 -16909 1394 14533 -5462 -12912 12020 19460
902 19460 -9166 -20570 5877 21204 3340 -11364 -4698 3516 5030 4580 348 -5196 -1116 5397
916 5397 -953 -4579 6582 8305 -11503 -14985 11401 19362 -8924 -21818 3490 17624 -3138
929 -3138 -13956 2889 9190 -6834 -10203 5788 9281 -4550 -10472 -1261 5609 4471 -705 -6717
943 -6717 -4771 6224 8066 -4567 -8489 5692 8688 -6063 -8299 9644 11215 -9085 -11185 10289
957 10289 14306 -6181 -11492 5297 11681 -1208 -6875 1961 5990 485 -2377 -286 1178 1938
971 1938 829 -3454 -2256 5525 3731 -7697 -7070 7230 8129 -8375 -10988 4962 9436 -5684
985 -5684 -10043 2688 5539 -4838 -6616 2791 3858 -4014 -5517 216 2673 410 -1274 -3625 -3072
1000 -3072 3305 4931 -3135 -6682 2340 6917 -1638 -5260 3441 6334 -2817 -5136 4355 7951 -1531
1015 -1531 -5666 1174 5516 2320 -1284 -682 290 1716 2064 -214 -1709 1846 3168 -1795 -4323 2639
1031 2639 6257 -2685 -8274 668 7919 186 -8338 -2280 5676 1600 -6082 -2807 3846 1988 -5052
1046 -5052 -4628 2087 4242 -1154 -6029 -2546 4805 4241 -4634 -6367 3177 6935 -2501 -7506 2116
1061 2116 8943 -711 -8427 666 10272 2716 -8467 -2622 8886 5695 -5173 -4708 5528 7097
1075 7097 -2102 -6222 1771 8239 1877 -7195 -2475 8535 5675 -6502 -6771 5169 8206 -4390
1089 -4390 -9051 2616 9186 -1974 -10051 -967 8371 1464 -9596 -5028 6406 4529 -6778 -7762
1103 -7762 3097 6348 -3405 -8867 354 7959 81 -9088 -3065 8005 4290 -7643 -6294 6177
1117 6177 7569 -3937 -7480 3266 8701 -542 -7512 59 8837 2683 -6775 -2789 7239 5879
1131 5879 -4320 -5083 4450 6921 -1649 -5983 1147 6771 1303 -6185 -2397 5853 3962 -4853 -5477
1146 -5477 3469 5939 -3125 -7382 795 6305 -1012 -7679 -1977 5220 1306 -6488 -3668 3647 2573
1161 2573 -3893 -4272 958 3159 -537 -4016 -1616 3220 2752 -3051 -3911 1841 5290 -684 -5226 608
1177 608 6249 1352 -4836 -445 5745 2973 -3512 -1421 4451 3919 -679 -2149 698 2991 1968
1192 1968 -1103 -2324 1543 4167 16 -4715 -485 5981 757 -6873 -1730 6957 2568 -7325 -4536
1207 -4536 5614 3856 -5390 -5175 2935 3265 -3104 -4073 -445 1797 -429 -3152 -2802 1946 3749 -1786
1223 -1786 -7029 -695 7331 1413 -8341 -2689 8642 3809 -7604 -3576 7877 4329 -7124 -3534
1237 -3534 8153 5550 -5840 -5196 5409 6753 -1140 -4589 -52 4954 3515 -2423 -4102 2242
1251 2242 6052 -1142 -7353 1390 9234 -742 -11768 -1547 12253 2888 -13362 -5689 10645 5574
1265 5574 -10151 -6788 6933 4703 -6873 -5866 4684 4659 -4077 -6789 -853 5527 3472 -5081
1279 -5081 -7960 1934 9444 -100 -10341 -1882 10526 2577 -10085 -1574 11853 2744 -11515 -2387
1293 -2387 12948 5448 -9901 -5299 8422 6825 -3241 -3060 1758 2118 1013 1216 -197 -258 2017
1308 2017 77 -3561 1489 7283 -714 -10941 -1360 11530 2911 -11469 -4705 8538 2317 -7941
1322 -7941 -452 5993 -3213 -9396 2522 8502 -2195 -8450 -1616 3512 730 723 -283 -5198 -3715
1337 -3715 6000 5516 -4769 -4764 4453 2182 -5581 1580 9596 -1639 -12555 380 14517 3626
1351 3626 -10427 -3475 6857 2648 -1343 3183 1348 -5170 -1690 7247 3198 -3583 81 1804
1365 1804 -4867 -1586 10955 4742 -13740 -9243 12074 10406 -9405 -9899 5271 4051 -5964 -962
1379 -962 7007 -1909 -10134 -547 7247 894 -3294 -1597 -4080 -3702 7419 8673 -9056 -14103 5538
1394 5538 13350 -4180 -10388 5068 6524 -8435 -4750 13191 7195 -13188 -8474 11761 9610
1407 9610 -5563 -5280 2353 1005 480 6478 2063 -7811 -2862 8035 2738 -4226 2168 4515 -7444
1422 -7444 -5219 13000 10018 -14138 -13405 11823 13304 -9158 -10010 7353 4193 -10523 -1999 12340
1436 12340 706 -15238 -5022 10711 5107 -5632 -4738 -2539 -1394 5704 6330 -6923 -10763 4648
1450 4648 9530 -4874 -5847 8488 3578 -14164 -4321 19480 9023 -19388 -12391 15325 13746
1463 13746 -7593 -7785 4630 2007 -3225 4817 7437 -4263 -6736 2371 4819 1741 4329 976
1477 976 -11213 -6325 15026 12695 -12595 -15412 7616 11897 -5378 -6139 6865 -109 -13257 -336
1491 -336 15863 2405 -15380 -6551 7731 4175 -2065 766 -2943 -8984 1085 11950 1349
1504 1349 -11777 -3265 5885 -866 -2840 6812 2865 -12730 -6021 14755 10121 -11401 -9644 7328
1518 7328 6129 -3950 1614 6538 -4219 -8663 6229 11452 -2004 -7201 1108 2646 -1503 3941
1532 3941 6343 -6212 -10328 6622 12687 -4302 -11171 3186 7256 -5317 -4396 8053 2839 -11569
1546 -11569 -4671 10471 4806 -8535 -5905 2156 1044 -173 2631 -2643 -8751 605 9809 -257
1560 -257 -10011 -21 8045 -3342 -7198 7487 8766 -9599 -11343 9540 13689 -5987 -11669 2878
1574 2878 8424 -284 -2308 2723 -541 -3085 2861 5071 -366 -1840 1682 -1165 -2437 6891 8097
1589 8097 -7390 -11629 6736 14357 -3886 -12292 1869 8925 -3919 -6506 6426 5670 -9749
1602 -9749 -8849 7313 9522 -4146 -8752 -1818 2913 2807 1510 -2628 -5755 -122 4649 -254 -3468
1617 -3468 2571 2398 -7427 -5099 10412 8813 -9990 -12056 7620 12448 -3735 -8823 3219 6676
1631 6676 -3286 -3408 5679 4544 -4989 -4578 3161 6082 2004 -2249 -4185 -796 6233 5613 -4068 -6104
1647 -6104 3693 5628 -3623 -4873 5249 4397 -7387 -6108 7482 7232 -6691 -8469 3188 6530
1661 6530 -2738 -5061 603 1884 -1567 -1779 374 -66 -422 -387 -2148 -1405 2937 1565 -4032 -3696 4183
1678 4183 4647 -4452 -5051 4310 5466 -3152 -4270 3664 4760 -2511 -2757 2800 2849 -1326 -1450 2089
1694 2089 2218 673 239 -833 -479 2581 2853 -2246 -3047 2498 4371 -1673 -4150 1608 3545 -1806
1710 -1806 -3217 2013 3201 -2337 -4475 -47 2900 59 -2707 -2710 -277 1327 611 -2385 -2924 227
1726 227 1642 -1762 -2778 1862 2823 -3149 -4626 2616 5669 -917 -5797 -485 5216 1571 -3296
1741 -3296 -1010 3365 1680 -1994 -971 2914 2642 -1109 -2621 1070 4902 2195 -4002 -2787 3835
1756 3835 4518 -2256 -3722 2941 4938 -2164 -4802 2069 5903 -1264 -6388 -412 5825 1155 -5735
1771 -5735 -3372 3488 2405 -3386 -4117 1592 3364 -2161 -5570 -263 5101 877 -5786 -2929 4869
1786 4869 3669 -4539 -4448 3098 4675 -2464 -4788 2246 5481 -271 -5629 -369 6216 2646 -4547
1801 -4547 -2670 4510 4488 -2633 -3998 2693 5554 -1144 -4719 899 5703 1090 -4803 -1335 4882
1816 4882 3290 -3504 -3345 2963 3802 -1899 -4273 777 4118 -368 -5039 -1381 3971 1504 -4600
1831 -4600 -3314 2489 2714 -2716 -4299 671 3191 -846 -3584 -422 3062 587 -3410 -2153 2780
1846 2780 2200 -2221 -2717 1253 3176 -321 -2682 265 3089 1200 -1689 -1011 2548 2195 -1219 -2004
1862 -2004 1321 2938 728 -1682 189 2805 1302 -1253 -1129 1933 1816 -824 -2024 661 2039
1877 2039 -430 -2331 -684 1494 525 -2021 -1927 202 1299 -1280 -2441 -224 1646 284 -2486 -1891
1893 -1891 1628 1690 -2030 -3009 951 2821 -891 -3776 436 3385 -38 -3846 -665 3786 1751 -3340
1909 -3340 -2017 3048 3468 -893 -2564 1411 3858 1101 -2934 -796 4007 2952 -2706 -2959 3298
1924 3298 5362 -1689 -5225 1094 6160 194 -5849 -755 5418 1368 -5157 -1872 4605 2701 -4195
1939 -4195 -3626 2537 3701 -1929 -4785 -1138 3778 1579 -3951 -3775 2265 3525 -2864 -4853 1741
1954 1741 4567 -2102 -5999 1252 6185 -473 -6437 -698 6515 1569 -4920 -1469 4420 2117 -2905
1969 -2905 -1252 3321 2419 -1637 -1897 1438 3670 1421 -3110 -2253 3723 4604 -1967 -4956 1980 5776
1985 5776 -1461 -5717 1780 5842 -1999 -6456 1667 6688 -1274 -7232 -764 5829 819 -4361 -2480
2000 -2480 1492 1325 -597 -1661 -1266 426 1014 -1959 -3222 2461 3838 -3603 -6445 2592 7452 -1467
2016 -1467 -8091 40 6920 835 -4945 479 3880 -1111 -2736 2516 3809 -1036 -2091 582 1037
2031 1037 1307 2267 -253 -3807 -70 6395 2190 -5533 -2325 4688 1550 -3836 394 4585 -2128
2046 -2128 -5907 2001 6336 -979 -5672 -770 2677 -310 -305 1156 -2595 -4465 1613 4370 -1912 -4813
2062 -4813 1109 1643 -3203 -399 4912 -794 -8300 -1505 8736 2508 -7164 -2625 4715 1025 -2778
2077 -2778 1941 3118 -3195 -3759 3981 4384 -1342 -1930 281 -926 1003 5221 1656 -7057 -3288 8307
2093 8307 5387 -6288 -3534 5929 1594 -6422 590 8535 -1016 -10232 -1020 9412 2666 -6825
2107 -6825 -3644 2055 809 347 1001 -3048 -4026 1693 3463 -2355 -2483 3306 -348 -7427 77 10355
2123 10355 1212 -12843 -3901 11234 4581 -8651 -4503 6147 1919 -4799 1550 6446 -2482 -6299
2137 -6299 1887 5889 1192 -1715 -1395 -1854 827 6523 2908 -7106 -4110 7092 5052 -5151 -2596
2152 -2596 5718 -244 -7565 1931 10859 -1064 -12366 -1092 10600 2626 -7464 -2303 3067 -1079
2166 -1079 -1356 3305 840 -6007 -3117 3545 1736 -872 434 -2039 -6083 707 9177 1182 -11036
2181 -11036 -4297 8754 4195 -6242 -1285 4914 -2678 -6054 4969 8724 -3532 -9361 1537
2194 1537 7366 1140 -2166 -123 -1893 -2131 5119 6324 -3596 -6617 2711 5549 -1473 -1352 4505
2209 4505 -798 -7690 906 10488 1633 -10042 -3668 6694 2973 -3229 -92 502 -4719 -1901 6127
2224 6127 2224 -6179 -3966 2885 127 -2191 2849 1682 -7530 -4888 7811 6453 -7246 -6880 4248
2239 4248 4535 -3376 -1395 4301 -1015 -5772 1762 6639 -243 -5269 -482 2540 371 2158 2660
2254 2660 -3374 -4567 4293 7267 -3001 -6289 3011 5419 -3352 -2614 6331 2538 -8291 -2948 9071
2269 9071 4582 -7506 -5388 4426 3687 -2215 -1234 847 -2076 -1802 2438 1160 -2482 -1074 616
2284 616 -2453 -1104 4648 1656 -8138 -4705 7846 5976 -7476 -6604 5148 4202 -4725 -2188 5441
2299 5441 1012 -6620 -1147 7004 3658 -4425 -3417 1883 2987 2423 320 -2961 -2623 3352 4182 -1904
2315 -1904 -2693 3073 1998 -4148 -421 7856 2043 -8751 -3449 8755 5372 -6365 -4882 3684
2329 3684 2781 -2946 -826 2580 -808 -4081 -578 2600 963 -1367 -2257 -2676 75 4156 1034 -5893
2345 -5893 -3490 4602 3579 -4270 -2766 3888 870 -5105 -694 6495 1257 -6265 -2701 4915 3130
2360 3130 -2521 -1776 1300 1060 150 989 225 -1076 454 1453 -420 -356 2778 984 -3570 -1112 4721
2377 4721 2214 -4187 -2287 3991 2745 -3233 -1943 2762 1084 -2528 -727 2163 38 -2001 -485
2392 -485 691 26 -144 -223 -1822 -1497 1642 1313 -3030 -2681 2015 2040 -2483 -2717 2130 2068 -2406 -1975
2410 -1975 1987 1866 -1909 -1681 1593 1989 -354 -1180 -5 554 1676 737 -1406 -971 2234 2263 -1342
2427 -1342 -1450 2400 2148 -2226 -2357 3007 2920 -2355 -3145 1850 3757 -619 -3400 90 2364 296
2443 296 -1726 -757 1590 701 -1515 -1953 686 2400 -437 -3801 -1156 3299 1618 -4077 -3294 2530
2459 2530 2512 -2839 -3173 2315 2547 -2665 -3734 1781 3893 -986 -3857 93 3453 1552 -2864 -1604
2475 -1604 2295 2500 -1273 -2126 1503 3234 -231 -3331 517 4236 1461 -3576 -1670 3752 2890 -2495
2491 -2495 -2753 2370 2765 -1764 -3205 1443 3520 -979 -3733 -567 2886 879 -3058 -2141 1844 1572
2507 1572 -2129 -2769 865 2246 -1142 -3424 -118 2777 405 -3275 -1644 2300 1878 -2209 -2039 1722
2523 1722 2168 -895 -2167 816 2869 -298 -2283 6 2847 1460 -1721 -805 1932 2135 -511 -1158
2539 -1158 1297 1938 134 -1452 -127 2136 936 -1602 -1103 1709 1892 -787 -1800 758 1750 -553
2555 -553 -1332 -384 1244 -161 -1502 -912 898 706 -1107 -1570 -67 826 88 -1860 -1099 648 927
2572 927 -950 -1568 525 1396 -507 -2004 109 1970 530 -1732 -850 1311 1342 -677 -1164 381 1826
2589 1826 247 -1171 -589 2039 1442 -1499 -1257 1847 2375 -803 -2209 1007 2614 -58 -2222 289
2605 289 2719 666 -2373 -1110 2064 1199 -1847 -1732 423 1974 -453 -2603 -680 2025 427 -2446
2621 -2446 -1608 1939 1674 -2391 -2883 1662 2791 -1776 -3575 699 3210 -638 -3271 -157 3079 300
2637 300 -2904 -844 2724 1191 -2100 -1971 1615 2874 -76 -2629 -208 3103 1479 -2276 -1363 3258
2653 3258 2240 -2724 -2949 2947 3938 -2097 -4068 1609 4453 -848 -4084 172 3187 418 -2842
2668 -2842 -825 1628 688 -1966 -1799 1091 2034 -486 -3270 -1122 2825 1616 -3227 -3438 2196 3025
2684 3025 -2525 -3500 1848 2841 -2431 -2895 2251 3379 -1902 -2966 1220 2887 339 -1799 -326 1208
2700 1208 1319 638 -417 -807 586 1435 -843 -625 2054 2037 -1818 -1928 3111 3594 -2452 -3544 1876
2717 1876 3083 -1218 -2436 1060 1292 -1308 -1089 1646 196 -2113 -1209 767 26 59 189 -1333 -2583
2734 -2583 1045 3091 -1114 -4031 314 3380 -741 -2924 959 2253 -2180 -2949 2518 3216 -2171
2749 -2171 -3308 1110 2303 215 -39 -179 -1238 -146 2975 1524 -2533 -966 2754 566 -2223
2764 -2223 1337 3857 -1678 -4826 2230 6238 -757 -5495 -184 4571 879 -2361 361 1134 -1534
2779 -1534 -702 1799 710 -1144 -823 -400 -1111 1113 2740 -1963 -5914 159 6052 697 -6317 -1334
2795 -1334 4379 44 -4141 1043 3827 -2417 -4830 1877 5522 -1004 -4522 -646 2263 1234 577
2810 577 121 -2048 -981 2747 1791 -2013 -568 2408 -900 -2803 2960 5880 -2388 -6722 2102 8293
2826 8293 -119 -6435 123 4834 -489 -2824 2003 2262 -3362 -3166 2443 2911 -1234 -2361 -1106 -450
2842 -450 1654 2892 -1780 -5959 69 5394 415 -5189 -48 3483 -2092 -4335 3636 5095 -4279
2857 -4279 -7224 3000 6838 -1303 -5347 100 2491 -130 235 2033 -825 -2505 739 2997 49
2872 49 -813 1490 -1090 -2666 2771 5726 -1989 -6740 973 7374 217 -4821 269 2884 -1674 -1862
2888 -1862 4327 3000 -5096 -3561 3638 3416 -1573 -2078 -242 -1225 -183 3366 1308 -5147 -3228 3458
2904 3458 2732 -2650 -987 1803 -2068 -3628 2847 5033 -3015 -6351 1143 4963 -215 -2417 344
2919 344 -178 -1848 1813 4311 -818 -4510 631 3560 126 -1000 2078 -313 -4162 468 6759
2934 6759 1280 -6204 -2300 5273 2479 -2795 -235 1978 -1575 -2144 2955 2896 -2094 -3122 761 1502
2950 1502 353 1200 -120 -4308 -1315 4876 2528 -5221 -3345 3553 1855 -4089 -904 3965 -991
2965 -991 -5789 437 6135 -36 -6203 -1516 4162 1881 -1542 -516 -126 -924 632 1952 -214 -1428
2981 -1428 556 1073 -1162 758 3850 -584 -5314 543 7329 1475 -6178 -1933 5843 1835 -3724
2996 -3724 -223 3704 -1006 -4186 1233 4295 -387 -3721 -506 2253 1213 194 -1257 -2531 -425
3011 -425 3284 853 -3518 -1865 2626 108 -3200 617 4100 -2023 -6192 662 6121 416 -5761
3026 -5761 -1532 3689 1195 -2026 86 1238 -798 -1154 1759 1779 -344 -939 -364 -328 1434 3082 -112
3043 -112 -3904 -380 4439 1102 -3483 -809 2705 45 -2418 1176 3390 -1248 -3537 657 3648
3058 3648 -113 -2639 -507 603 227 154 470 -1176 -1571 461 1240 -987 -1055 973 -730 -2711 474
3075 474 3200 -211 -4093 -1224 2855 1100 -2255 -583 1483 -342 -1269 797 1388 -780 -643 847
3091 847 333 -118 600 355 -1457 -442 2443 959 -2283 -773 2787 1500 -1840 -1104 2499 1227
3107 1227 -2095 -717 2221 958 -1454 -629 1314 783 -223 -1078 -423 331 1043 -282 -2119 -663
3123 -663 1921 713 -2432 -1270 1911 762 -2715 -1321 2328 1222 -3102 -1996 2060 2103 -1842 -2417
3139 -2417 490 1863 -230 -1475 -306 1046 346 -757 -757 1290 1702 -839 -2127 989 3296 345
3155 345 -2762 -887 3199 1876 -2621 -1280 2577 1490 -2245 -1298 2443 2165 -1932 -2244 1036 2686
3171 2686 -194 -2507 -440 1820 776 -1439 -1340 1253 1202 -1252 -2059 849 2271 -844 -3238 -322
3187 -322 2733 600 -2938 -1313 2001 1325 -2175 -1832 1747 1887 -1411 -1975 975 2307 -316 -1981
3203 -1981 -446 1821 1183 -1486 -970 1628 1677 -768 -1139 1171 2320 133 -2052 278 2218 690
3219 690 -1540 -761 2021 1205 -1291 -1131 1228 1445 -734 -1454 438 1921 -65 -1976 -671 1078
3235 1078 584 -1183 -1193 228 950 -421 -1173 58 969 28 -1378 -617 1059 542 -1120 -1044 -105 817
3253 817 -451 -886 -36 673 271 -566 -459 768 748 -433 -653 362 1402 426 -630 -447 1023 989
3271 989 -360 -396 955 996 -271 -1100 393 1076 63 -854 -396 1141 752 -621 -967 608 1093 -327
3289 -327 -1225 -20 1418 -5 -1627 -664 1345 562 -1694 -1736 1105 1534 -1002 -1965 473 1451 -406
3306 -406 -1912 -238 1728 108 -1775 -933 1454 1197 -862 -1872 517 2144 -182 -1670 -34 2125
3322 2125 760 -2075 -752 2623 1638 -1698 -1837 1903 2575 -789 -2008 1159 2300 -316 -2064 -274
3338 -274 2002 614 -1844 -1135 1393 1627 -1149 -1998 254 1887 92 -2659 -598 2294 591 -2107
3354 -2107 -1547 1943 982 -2428 -2023 1750 1671 -1642 -2059 867 1545 -202 -1497 -61 1427 192 -1209
3371 -1209 -267 1406 1011 -851 -1608 687 2295 781 -2056 -443 2553 1304 -1957 -680 1910 1613
3387 1613 -1778 -1202 2011 1535 -1540 -1376 1875 1692 -597 -1498 59 960 293 -92 -947 -365 746
3404 746 436 -1511 -528 1164 4 -1945 -1051 2159 710 -2884 -1925 1765 1344 -1751 -1549 796 475
3421 475 -961 -27 747 -155 -704 373 515 -109 295 732 -782 -1070 1832 2027 -1255 -2247 1461 2613
3439 2613 -678 -1489 1172 1590 -890 -666 1785 935 -1126 -956 1298 1223 -91 14 -452 -821 720
3456 720 1971 -456 -2646 -92 2162 -276 -1981 503 1831 -2023 -2628 1845 2573 -2303 -3428 761
3472 761 2294 -452 -1784 23 172 -596 135 553 -497 -583 489 -326 -410 1595 1417 -1896 -2677 2486
3490 2486 3995 -1882 -3660 1341 3428 -850 -2440 1764 2537 -1662 -2205 2889 2863 -1584 -2512 495
3506 495 2198 938 -121 -1088 -1525 760 1939 -451 -2004 -62 1430 -1055 -2118 2265 2034 -3258
3522 -3258 -3849 3085 4294 -2897 -4414 1124 2995 -1150 -1629 1216 576 -2050 -537 2238 1054 -1325
3538 -1325 -873 -95 296 1715 1420 -1975 -2862 2175 4016 -961 -3002 1478 2602 -1179 -1314 3391
3554 3391 2016 -3712 -2295 3633 3683 -2419 -2880 1210 1473 62 433 389 -1327 -1069 1625 1349 -1232
3571 -1232 -944 495 -834 -1286 2342 1999 -3298 -3865 2201 3823 -1833 -3525 802 1764 -1414 -574
3587 -574 2046 -218 -3834 -693 3073 1004 -1580 -992 315 -894 714 2576 -437 -3584 251
3602 251 3853 981 -2362 -34 1704 -1053 -875 2862 2290 -3140 -2628 2355 3105 -1238 -1716 410
3618 410 -312 -373 1789 1455 -2417 -2273 1884 2049 -1321 -563 1308 -1021 -2641 1670 3563 -1754 -5089
3635 -5089 471 3818 -35 -2887 -233 663 -1235 -494 2021 563 -2419 -1257 1409 648 -293 294
3651 294 -1060 -2238 615 3783 421 -3814 -562 3665 784 -2730 500 2652 -1453 -2572 2196
3666 2196 4294 -1465 -3941 671 3429 643 -1608 -555 -337 119 886 1328 -1255 -969 1037 278
3682 278 -951 1101 1604 -1790 -3552 1700 4293 -1496 -4769 120 3727 -229 -3027 192 1905
3697 1905 -1746 -2283 1807 1928 -1794 -2254 455 1461 501 -356 -1140 -1671 844 2693 -18 -2550 4
3714 4 2499 -464 -1880 1414 2560 -2097 -2705 2640 3913 -1532 -3435 1324 2907 -230 -1199 657
3730 657 653 -1076 12 1587 247 -973 -322 16 71 883 816 -1559 -2784 1110 2726 -460 -3280 -193
3748 -193 2075 -831 -1756 871 1173 -2134 -1942 1452 2141 -1409 -1619 215 859 196 729 -257 -1350
3765 -1350 -566 1685 973 -1002 -676 1046 -59 -1051 1234 2081 -448 -2083 870 2671 -134 -1865
3781 -1865 214 1300 277 202 659 -130 -799 2 803 -120 -178 499 -255 -1128 148 1766 -91 -2644
3799 -2644 -857 2015 207 -2371 -427 1541 -168 -1397 -371 895 -11 -1579 -380 810 249
3814 249 -269 -475 -394 221 927 -442 -1315 122 1914 149 -1631 -11 1638 317 -1897 252 2305
3831 2305 368 -2156 -305 2530 983 -1663 -858 1246 987 -897 -924 392 850 328 -630 -289 1065
3848 1065 923 -1107 -1231 1483 1830 -848 -2484 138 2235 -207 -2632 -456 1784 349 -2029 -480
3864 -480 1752 435 -1752 -1305 1287 1165 -814 -1582 221 1371 114 -1169 -757 989 917 -943 -1028
3881 -1028 983 1606 -680 -1891 759 2246 -3 -1917 -242 1939 519 -1567 -357 1609 841
3896 841 -1098 -744 1048 1160 -557 -683 508 1531 199 -895 -350 922 778 -1059 -1060 801 1029
3913 1029 -645 -1257 342 1521 -357 -1522 -144 1156 121 -1374 -858 516 429 -781 -640 781
3929 781 543 -221 -851 346 664 306 -339 -685 724 1066 -172 -588 301 770 149 -761 251 1303
3947 1303 351 -397 -431 608 790 -440 -423 424 686 280 -534 -101 432 275 -245 -344 302 725 -140 -1092
3967 -1092 -169 751 790 -1059 -750 462 661 -507 -1050 131 590 -303 -873 -188 1039 376 -1194 -843
3985 -843 812 874 -687 -1083 378 1245 42 -1089 -119 960 269 -1331 -17 1099 1270 -762 -1030
4002 -1030 768 1231 -241 -1330 326 1526 -93 -931 123 1437 696 -1088 -941 1171 1193 -567
4018 -567 -1067 446 1457 -121 -1495 -107 1795 242 -1676 -703 1659 651 -1712 -1344 735 1084
4034 1084 -1075 -1523 308 1447 -148 -1692 -188 892 624 -1157 -939 893 1188 -687 -1360 425
4050 425 1605 79 -1506 -88 1891 87 -1741 -690 1775 1331 -1151 -912 1472 1307 -783 -1275
4066 -1275 341 1032 63 -614 -152 698 522 -758 -856 560 1277 -574 -1708 62 1621 -8 -1768
4083 -1768 -327 1045 232 -1720 -352 844 134 -1452 -326 1045 793 -999 -526 -67 741 295 -739
4100 -739 -603 -195 493 201 -720 -194 532 189 -742 -69 1353 280 -1222 -231 1039 743 -783 -448
4118 -448 762 123 -600 99 499 -571 235 489 111 -581 336 227 -485 -313 1004 648 -1531 -919 1138
4137 1138 1101 -1078 -1018 802 354 -947 -536 964 60 -999 -541 224 332 -282 -168 -523 -773 1145
4155 1145 1032 -1476 -1436 1313 1253 -1320 -1338 1173 1116 -1390 -780 2124 1169 -1738 -1293 1642 1718 -799
4173 -799 -798 538 542 387 -18 99 -684 53 576 -128 -248 1268 165 -2352 -728 2299 1779 -2357 -2191
4192 -2191 1686 1763 -1450 -1835 1210 1082 -2208 -1024 1601 834 -2057 -1232 730 805 110 -730 -998 -114
4210 -114 937 1191 -1152 -1272 1255 1240 -1300 -852 2149 398 -2924 -1082 3161 1799 -2690 -1951 2260
4227 2260 1870 -1126 -973 950 94 -762 35 1305 -80 -995 71 162 843 938 247 -2008 -1081 2417
4245 2417 1634 -2102 -1951 1268 1115 -1678 -845 1999 73 -3078 -555 3206 517 -2737 -1341 1286
4261 1286 783 -634 21 111 -1073 314 1497 -43 -1369 -119 876 -664 -207 1973 562 -2554
4277 -2554 -1145 3118 2075 -2006 -1508 1765 712 -913 417 1280 -878 -1461 897 1869 -414 -1421
4293 -1421 111 194 -628 1261 1289 -1642 -2076 1352 2638 -707 -2058 576 1127 -1419 -346 1727 -88
4310 -88 -2899 -1066 2280 1160 -2075 -1054 485 -119 33 1233 -319 -2293 -191 2036 290 -1913
4326 -1913 142 974 -735 -1267 2125 1697 -2359 -2727 2076 3282 -1078 -1747 934 1189 -400 382 1352
4343 1352 -80 -1526 274 1216 8 59 161 -703 -822 1550 2349 -1598 -2757 1756 2796 -1021 -2234
4360 -2234 1025 1281 -1991 -1418 2336 1664 -2859 -2084 1791 2106 -1079 -1618 -282 -34 316 468 -177
4377 -177 -1365 -353 1021 187 -844 929 611 -1911 -1235 2513 2221 -2647 -2579 1928 2784 -1176 -1618
4394 -1618 1133 1301 -1490 -548 2040 837 -1862 -825 887 1128 55 -380 -848 -438 1291 1546 -1038
4411 -1038 -1842 949 1446 -673 -1212 1594 452 -2240 -1310 2406 1249 -2446 -2168 1499 1490 -962 -1075
4428 -1075 65 -426 -836 474 867 -811 -902 -112 67 -73 565 403 -1597 -896 1752 1755 -1194 -1755 1010
4447 1010 1539 -594 -446 1161 369 -1251 106 2067 632 -1132 -746 546 472 256 326 -148 -776 164
4465 164 1188 32 -1563 -2 1017 -144 -881 607 830 -1194 -1244 1298 1342 -796 -1606 272 475
4482 475 -381 -248 126 -520 -742 577 271 -245 -341 282 -459 -722 503 1057 -811 -1812 522 1492 -270
4501 -270 -1580 180 1302 -41 -939 425 734 -524 -762 457 978 646 -410 -223 -66 785 786 -645
4519 -645 -1055 684 1429 -284 -1344 470 1262 -625 -1529 394 1558 -815 -1980 429 1405 -501
4535 -501 -1725 -111 1134 578 -1062 -710 264 259 -28 -787 -188 491 234 -829 -814 928 1440 -1055 -1679
4554 -1679 992 1683 -551 -1805 482 1383 28 -1311 268 1521 109 -1106 -132 1298 654 -816
4570 -816 -837 698 1147 244 -738 38 1152 578 -767 -660 1030 581 -834 -1020 681 1251 -986 -1645
4588 -1645 496 1356 -608 -1219 127 1278 23 -794 -591 316 367 -507 -467 495 666 -273 -888 -60 810
4607 810 370 -921 -788 881 846 -540 -906 664 708 -374 -874 575 1537 126 -798 3 699 152
4625 152 -21 -162 222 387 -329 -413 210 519 39 -256 -99 365 354 49 -871 116 564 -415 -388 50 375
4646 375 244 -689 -380 357 196 -457 -764 -151 277 -228 -316 -695 543 324 -386 -226 441 816 -543 -811
4666 -811 122 709 169 -741 -173 886 538 -675 -390 565 825 -281 -782 432 1122 110 -675 58
4684 58 875 546 -425 -619 790 658 -117 -439 282 1072 -62 -1184 -71 1044 100 -1103 -686 907
4702 907 771 -915 -1043 532 671 -647 -1302 207 1028 143 -1016 -316 991 329 -899 -868 772 1090
4720 1090 -427 -987 345 1316 12 -1410 130 1358 254 -1388 -320 1153 537 -715 -984 605
4736 605 1038 59 -883 182 1108 253 -888 -220 1122 505 -863 -967 916 1098 -315 -1013 403 1214
4754 1214 -218 -1310 -218 1030 -140 -1307 -203 619 488 -788 -509 308 304 -365 -637 -93 392 -252
4772 -252 -738 -580 407 304 -892 -571 768 740 -440 -667 134 975 14 -892 283 699 -211 -1017 427
4791 427 1158 265 -412 12 393 89 55 -375 -391 176 457 7 -403 24 380 -248 -491 85 520 -840
4811 -840 -562 22 1210 -1 -862 -352 195 153 -428 -36 -136 -618 -334 103 -251 -355 485 147 -519 -286
4831 -286 1056 5 -1157 -197 1283 332 -911 -593 1005 456 -751 -23 244 258 -475 471 507 257
4849 257 461 -69 -377 258 945 192 -1046 -349 1276 658 -1016 -572 774 8 -1535 -208 1327 39
4867 39 -1534 -227 1622 498 -1150 -908 249 302 -243 -314 -425 -174 165 -83 -724 120 749 -384 -1297
4886 -1297 307 1959 -155 -1898 -375 2127 524 -1631 -556 1533 74 -780 271 1450 25
4901 25 -1046 127 1032 952 -411 -634 -720 325 1478 80 -1309 -390 1401 506 -913 306 1459
4918 1459 -242 -1596 410 1822 -364 -2367 -284 2116 610 -1509 -545 744 -257 -566 513
4933 513 364 -617 -343 157 425 167 524 -718 -1341 134 1545 199 -1987 -566 1730 606 -1499
4950 -1499 48 1251 -497 -1644 965 2055 -534 -1702 167 1162 416 -197 268 -416 -335 702 960
4967 960 -713 -979 498 610 -620 298 1299 3 -2070 267 2077 -204 -2010 -436 1213 173
4983 173 -591 137 453 -1158 -534 1045 315 -1169 -618 357 8 -143 500 215 -1687 -1049 1992 1178
5001 1178 -1388 -1604 1009 738 -891 1 1142 -375 -1541 437 1890 59 -979 -176 427 216
5017 216 330 726 -858 -1030 1218 1841 -718 -1286 845 636 -1070 -545 1595 197 -2324 -839 2344
5034 2344 1171 -2037 -1554 612 555 -385 -273 294 -1005 -611 641 732 -495 -200 -340 -942 -168 1737
5052 1737 103 -2255 -1203 1967 1688 -1628 -1317 1127 548 -1289 -210 1725 142 -1818 -416 1757
5068 1757 1120 -1258 -831 229 464 563 362 -664 -734 613 705 -563 -214 1145 325 -1669 61 2039
5086 2039 356 -2528 -651 2446 1252 -1899 -1166 1278 299 -923 214 1143 -411 -1309 100 995
5102 995 304 -390 -509 -632 -180 1154 590 -1056 -1054 1083 656 -1142 -542 1182 -142 -1459 343 1754
5120 1754 -125 -2256 -461 1622 602 -1033 -300 946 -24 433 713 279 -448 -150 584 276 -267
5137 -267 406 52 -1299 69 1455 905 -1858 -1092 1147 591 -1188 -390 617 -262 -1150 258 1042
5154 1042 -594 -1207 393 367 -219 -145 -144 -760 -694 804 658 -816 -1008 589 912 -820 -369 629 143
5173 143 -777 -298 1107 392 -1155 -515 772 558 -220 22 -191 -7 358 414 -341 -670 -68 824 -311
5192 -311 -397 848 902 -993 -949 1356 1174 -683 -1190 670 898 -614 -573 468 378 -512 -421 177 268 -187
5212 -187 -305 -184 -136 771 60 -868 -553 746 846 -1064 -1040 859 475 -1031 -813 687 662 -904 -910 1007
5232 1007 1310 -434 -1024 102 1135 46 -432 -455 579 384 209 -789 52 362 -135 -731 -78 1338
5250 1338 439 -1274 -383 1159 809 -1041 -1242 727 963 -724 -770 772 693 -735 -938 365 547 -255
5268 -255 -750 -362 647 721 -275 -925 64 723 169 -1034 -298 508 161 -775 -420 906 383 -1098 -613
5287 -613 1020 847 -681 -773 422 662 -235 -631 22 447 -133 -241 -168 753 114 -31 -356 242 813 -79
5307 -79 -531 -299 450 393 -662 -430 449 459 -838 -582 349 330 -372 -250 118 413 12 -334 -359 255 84
5328 84 -179 -193 -65 119 146 -251 -483 369 345 -508 -477 81 424 -77 -785 305 513 177 -227 49 271
5349 271 217 -163 -223 348 594 207 -479 -242 673 338 -763 -298 284 320 -319 -814 136 744 -8 -800 215
5370 215 813 124 -638 -665 589 445 -369 -637 9 462 -468 -874 -117 638 17 -859 -407 304 330 -735
5390 -735 -795 224 1045 -450 -533 567 768 -223 -1066 234 1044 356 -744 -535 950 1001 -374 -456 479
5409 479 579 82 -553 6 1075 211 -835 18 687 637 -565 -795 812 869 -630 -713 595 1048 30
5428 30 -1233 -82 830 -164 -884 -317 778 311 -838 -849 263 701 -256 -1076 293 686 -142 -845 -683
5447 -683 624 568 -632 -594 461 858 -550 -576 325 802 -339 -1084 286 623 -57 -823 -17 532 379
5466 379 -246 -220 542 313 167 -520 113 607 -180 -563 39 798 389 -545 -287 680 812 -425 -387 142
5486 142 193 -312 -422 208 101 38 -502 -427 192 19 -22 -600 241 577 313 -236 -486 92 508 121 -324
5507 -324 303 560 -323 -585 270 485 -320 -294 112 287 31 187 -47 -277 67 226 79 -89 -18 564 -97
5528 -97 -441 329 639 -307 -663 380 873 -110 -874 50 594 159 -604 -28 461 65 -381 36 116 91 -241
5549 -241 -421 -452 348 519 -382 -875 251 989 -267 -1189 -30 833 -289 -943 130 1125 -575 -989
5567 -989 -31 946 222 -641 83 588 417 -117 -325 1 -191 438 -226 -267 638 462 -360 -821 957 1507
5587 1507 -635 -1321 733 1836 -216 -1549 220 936 -351 -825 414 938 -539 -780 435 513 -48
5604 -48 -786 -530 137 622 520 -563 -905 506 956 -486 -943 388 1017 -605 -698 960 1152 -1050
5622 -1050 -1329 758 1386 15 -1113 495 538 -216 18 546 -83 -707 101 469 43 345 377 -637 -291
5641 -291 739 1317 -521 -1199 219 1092 -69 -840 278 666 -842 -595 861 451 -726 -1049 508
5658 508 544 -540 -444 195 -185 -78 703 426 -616 -448 914 454 -518 -95 777 -317 -986 753 1266
5677 1266 -701 -1197 484 1130 -67 -493 200 18 -787 471 1204 -178 -405 396 649 -119 272 661
5695 661 -243 -1027 322 1685 290 -1507 -473 1194 444 -763 88 394 -546 -493 278 426 -479 -582
5713 -582 -136 283 -37 173 -356 -1036 -262 1147 677 -1101 -896 880 422 -1076 130 1067 -620 -1572
5731 -1572 431 1981 141 -1559 -384 1211 92 -460 152 231 -477 368 732 -54 -227 138 219 -509
5749 -509 182 1143 -471 -1857 49 1739 428 -1612 -333 1220 91 -748 338 1042 -590 -1261
5765 -1261 262 1279 30 -905 -414 240 616 -61 -307 -1004 -226 952 356 -774 -264 958 -779
5782 -779 -1223 860 1433 -824 -2143 570 1891 33 -1570 -236 1033 -33 -794 603 483 -440
5798 -440 -397 666 660 -88 -414 -139 -247 465 1102 -374 -1099 188 1308 632 -1281 12 597 -359 -1074
5817 -1074 727 911 -857 -1167 659 1266 -453 -839 -81 317 -149 -4 202 -173 -590 32 460 -18
5835 -18 -154 173 -315 -658 433 836 -235 -1185 -315 1209 99 -954 -215 456 -261 -78 670 354 -500
5854 -500 -171 460 330 10 -130 175 -445 -151 895 441 -1054 -561 899 779 -322 -201 536 109 -681
5873 -681 165 946 -206 -891 -109 477 201 -26 -281 -12 -3 396 238 -757 -439 590 357 -364 -483 567
5893 567 -38 -1132 -197 1117 229 -1458 -384 1235 569 -652 -517 361 339 -196 65 289 366 -136 -67
5912 -67 -165 291 779 -85 -856 101 962 284 -766 -251 1098 614 -922 -392 1105 171 -1264 -434 889
5931 889 680 -989 -274 490 408 -331 -522 72 192 107 -334 -462 155 273 -189 -669 -104 781 -257 -866
5951 -866 -107 985 32 -1237 -661 839 43 -530 -463 581 252 -779 -384 607 335 -332 -198 18 615
5970 615 91 -279 -256 322 547 -147 -482 583 673 203 -641 8 988 128 -795 222 908 87 -621 -163
5990 -163 502 -41 -253 -596 196 -86 -149 -151 101 97 152 -575 -95 116 546 -339 -491 -101 233 -276 -477 -293
6012 -293 273 62 -824 122 500 197 -375 -160 318 284 2 -17 94 312 119 -139 -70 -218 223 289 80
6033 80 -25 484 281 -370 -92 277 310 -354 -512 54 491 127 -384 175 148 27 -336 -243 -203 198 -140 -389
6055 -389 49 222 74 -394 -224 548 484 -345 -397 66 413 -554 -435 379 707 -244 -416 102 573 185 -88
6076 -88 -164 588 266 -344 -413 123 689 -339 -137 -59 664 160 -821 -246 767 159 -352 -161 486 464 -434
6097 -434 -774 168 619 -267 -721 107 584 -54 -353 -750 786 332 -574 -561 164 610 -236 -694 -78 608
6117 608 163 -663 -169 571 442 -707 -742 479 451 -438 -465 363 763 -323 -575 252 426 276 -548 -139
6137 -139 608 677 -313 -141 374 380 166 -650 88 483 278 -344 -38 674 346 -196 -336 653 702 -321 -511
6158 -511 20 175 -32 -237 293 192 174 -289 -37 -68 313 -275 -243 28 437 142 -332 114 402 -102 -486
6179 -486 -168 253 264 -461 -263 166 99 -158 -11 -8 30 25 -91 28 53 -124 262 3 12 169 45 -409 -124
6202 -124 524 99 -246 -477 -89 354 -238 -106 346 220 -71 -165 55 321 -15 52 -229 -32 420 350 111
6223 111 -490 272 327 -226 -534 246 520 -347 -437 316 387 -381 -734 -162 364 10 -250 -462 -52 210 -71
6244 -71 208 -97 131 227 -126 -29 421 281 -777 -260 906 383 -522 -781 468 776 -467 -887 103 722
6264 722 -512 -838 311 737 -476 -975 212 587 -10 -356 -146 183 392 9 -678 -375 447 243 -781
6283 -781 -541 649 417 -856 -869 647 618 -591 -966 414 848 -287 -547 168 540 -561 -370 290
6301 290 95 226 -363 -349 281 662 260 -744 -386 928 448 -725 -337 566 800 -636 -697 749 333
6320 333 -816 -450 809 819 -203 -450 248 470 -431 -290 161 -78 -442 -49 269 -116 -272 70 -479
6339 -479 -32 751 435 -922 -820 599 724 -719 -537 225 227 -597 -314 316 -18 -754 -179 812 -32 -409
6359 -409 -115 -175 -42 274 696 -213 -679 -31 671 74 -226 245 422 -414 -719 600 564 -887 -488 706
6379 706 739 -245 -339 98 -106 -278 607 268 -646 -570 -55 370 -496 189 315 -479 -831 566 1001 -649
6399 -649 -1173 34 663 -238 -654 -65 -29 -760 -365 448 17 -832 -435 149 237 37 231 -439 -911 195
6419 195 1086 -210 -1020 -111 1087 132 -415 453 888 -224 -857 804 902 -636 -898 27 633 -49 -218
6438 -218 -315 -295 11 252 252 -439 -43 4 -304 -391 497 401 -800 -933 457 1006 -526 -1341 123 1435 -290
6459 -290 -738 389 647 -500 -871 669 858 -189 -717 -42 275 50 -20 -409 -647 228 939 0 -666
6478 -666 -146 537 -95 -530 916 725 -601 -917 761 1349 -308 -1117 269 1008 -2 -407 665 213
6496 213 -386 -75 397 362 -299 -181 -165 -106 417 378 -234 -1012 508 994 -255 -1075 3 538 -560 -644
6516 -644 921 476 -984 -569 930 766 -149 -826 200 273 -30 521 125 -466 -487 400 200 -537 -227
6535 -227 379 36 -645 102 420 -651 -837 477 985 -7 -820 74 234 -78 328 265 -153 -512 -133 376
6555 376 114 2 498 -418 -419 93 683 125 -1047 -113 993 93 -775 -414 352 -83 -614 -85 399 -425
6575 -425 -568 345 339 44 -105 266 -2 418 270 361 -738 138 624 324 -649 -5 884 -67 -518 464 1061
6596 1061 -211 -761 -260 909 122 -572 -75 557 205 -34 -215 182 93 -72 -90 -321 421 192 -500 -1006
6616 -1006 222 680 -130 -1098 -205 846 63 -850 145 616 -253 -848 -134 1120 -17 -758 -286 435
6634 435 451 -312 -332 161 317 133 -358 -159 97 168 -134 -516 162 400 -222 -508 423 1038 -253 -531 108
6655 108 879 -5 -838 -92 533 7 -396 106 357 441 -37 -347 144 15 -8 -579 -250 160 297 -502 -497
6676 -497 93 228 -114 -543 455 530 -430 -580 -84 466 -138 -570 135 429 -42 -373 -258 -68 81 -30
6696 -30 -297 -5 -20 345 19 -40 255 -14 7 -308 178 720 173 -197 195 263 41 -148 10 134 -39 -63
6718 -63 169 75 10 -77 -22 142 -82 -41 81 -438 20 214 -97 -164 -180 215 189 -151 -295 324 250 -186 -108 -4
6742 -4 27 -259 -429 -160 48 -67 -162 -3 97 93 -27 -127 19 374 -118 -256 161 604 353 -313 -265 587
6764 587 195 -98 -222 239 729 -239 -350 115 614 -211 -182 132 444 367 -214 -449 356 661 38 -376 237
6785 237 324 -124 -460 -276 518 327 -656 -320 506 121 -726 -658 351 531 -445 -460 52 336 -39 -289 -248
6806 -248 347 326 -394 -88 420 517 -73 -529 149 426 70 -429 169 641 0 -598 -28 441 506 -324 -353
6827 -353 377 323 -247 -369 102 354 -94 -323 -294 282 75 -21 -314 261 13 -96 -490 103 294 -345 -514
6848 -514 233 162 10 -448 -251 126 -150 -353 -148 275 378 -57 199 23 212 -177 -185 -59 265 504 3
6869 3 -14 -51 195 14 -348 103 -73 154 -241 271 306 160 -307 -59 248 36 69 114 -133 277 41 -112
6891 -112 -175 -121 82 -147 -54 29 227 107 17 -367 7 -98 -507 -256 138 118 -325 3 -221 7 -84 -296
6913 -296 4 -200 -154 -339 -112 -47 14 153 -338 0 298 10 -131 -225 414 582 -231 -58 584 387 -137
6934 -137 -376 500 576 10 -314 126 401 311 -191 -232 47 428 -363 -546 -260 439 -41 -548 -123 402 465
6955 465 -669 -637 438 178 -634 -359 248 545 -340 -394 190 546 -151 -517 149 235 150 -298 29 22 102 227
6977 227 -371 -110 608 228 -527 -71 385 202 -617 -74 713 382 -744 -358 702 377 -134 -191 592 507
6997 507 -166 -109 331 52 192 29 -126 -28 218 -225 -380 -101 787 287 -571 -289 258 221 -707 -333 646
7018 646 116 -672 -251 522 367 -539 -407 219 413 -144 23 -351 -172 15 36 450 -11 -73 -62 -448 -306
7039 -306 526 8 -726 -257 624 282 -327 -247 478 110 -466 -32 499 -137 -633 58 584 -188 -36 12 29
7060 29 -386 99 246 -450 -475 555 368 -343 -347 64 227 -454 -165 395 412 -594 -328 656 18 -264 -144
7081 -144 180 363 127 128 102 -622 -67 537 76 -324 -39 352 -340 -117 651 867 -604 -419 431 631 -44
7102 -44 -202 -39 554 -221 186 194 477 -419 143 248 136 82 455 -413 -447 837 347 -505 -814 363 506
7123 506 -200 -401 579 357 -418 -451 589 243 -795 -307 397 535 -53 -285 -165 3 19 260 -13 -352
7143 -352 -1 278 -422 -322 334 303 -938 -621 1082 621 -629 -991 788 1001 -482 -542 390 281 -505
7162 -505 -150 570 170 -656 -244 383 256 245 -166 -357 -301 459 523 -487 -265 382 458 -540 -237 672 224
7183 224 -943 -596 599 483 -658 -815 411 474 -474 -302 182 86 -85 12 335 -228 -555 120 -7 -37
7203 -37 103 193 -242 -258 363 736 -507 -437 452 420 -141 -62 641 147 -645 -101 923 118 -574 -174 120
7224 120 246 257 225 -173 -376 134 646 332 -582 -13 549 -53 -114 103 595 -371 -420 607 299 -505 -392
7245 -392 -176 24 -581 -37 -15 -61 -335 483 389 -495 -197 180 -127 -407 494 564 -476 -685 352 696 -181
7266 -181 -464 335 394 160 -73 241 456 -197 -387 391 589 -132 -206 4 -333 146 393 -129 -563 236 443
7287 443 68 -438 130 683 -197 -544 226 532 -475 -901 409 482 -56 -739 -207 306 44 115 -83 -40
7307 -40 -56 -143 -3 -101 201 149 -466 -538 328 598 -352 -497 327 962 -56 -438 182 615 -162 -176 66 549
7329 549 -186 -471 340 729 203 -222 -186 433 239 461 -121 -43 291 321 -83 -60 412 500 -780 -480 478
7350 478 412 -542 -693 279 488 -470 -560 -70 5 -172 -339 105 -107 -413 -576 266 207 296 -195 -227 -223 306 149
7373 149 146 -443 254 383 -474 -7 288 431 -67 -171 379 475 118 -207 261 542 14 -323 211 183 -94
7394 -94 75 -300 135 -153 -104 -52 120 75 -33 100 -639 17 33 -5 -599 114 331 -29 -34 -60 -227 -52 -198
7417 -198 225 49 248 -106 -125 -196 196 -40 84 130 102 460 -102 -198 56 151 152 -229 -7 426 221 -247 -367
7440 -367 312 130 -232 179 61 323 -1 9 68 213 401 -210 -334 -75 387 -29 -394 -32 225 -75 -285
7461 -285 35 -63 110 -646 -163 337 332 71 -429 95 408 -113 -28 98 454 -66 -183 66 209 141 -439 -435
7483 -435 42 432 -198 -130 56 732 93 -373 -112 570 175 -466 -171 308 148 -243 -113 337 -82 -101 -640
7504 -640 50 328 178 -60 -271 183 287 -223 -83 143 118 -242 -276 173 375 -154 -640 183 153 90 -373
7525 -373 32 170 231 -260 -327 270 240 -248 -230 -8 63 -11 -31 0 157 -168 -78 -257 73 5 -179 -144 183 286
7549 286 332 -217 130 209 -43 -257 39 421 168 152 -83 98 -50 -183 -257 -64 136 -111 36 -277 -80
7570 -80 138 218 118 -218 72 181 -377 53 286 -123 79 -277 320 -95 -367 -311 80 151 85 252 -5 -112
7592 -112 100 59 -344 -69 124 -248 76 8 113 30 -207 -151 220 380 109 -163 -94 222 -53 -86 8 97 308
7615 308 -120 -238 194 245 -168 42 167 491 -42 -233 -73 202 162 4 111 175 137 -55 -101 211 -115 -18
7637 -18 -156 -250 441 -99 -356 -72 -41 180 -171 -48 437 200 -233 -289 423 306 136 -641 -180 597 96
7658 96 -284 -7 540 307 -234 -99 371 518 59 -171 -17 490 -78 -204 272 483 334 -142 -262 129
7678 129 412 -113 -315 -9 511 -40 -406 168 587 121 -576 -226 328 154 -564 -244 215 -100 -197 -144 215
7699 215 -91 -189 -352 -166 268 246 -410 -316 168 365 -106 -342 -139 532 52 -528 57 427 56 -291 358
7720 358 440 155 -404 -89 266 265 -3 -196 47 -178 310 148 -301 -143 43 39 -373 106 -3 -78 -462 77
7742 77 298 -1 -448 -52 203 -100 -261 35 217 -205 -287 80 372 -198 -244 263 -156 52 331 225 -287
7763 -287 19 484 325 -326 -364 264 198 -138 -146 61 185 -48 -169 382 85 -143 115 2 304 536 336
7784 336 -212 -69 309 -9 -172 -266 271 257 -157 283 304 188 -659 -183 455 153 -486 -316 225 223 -10 173
7806 173 153 -201 -250 -75 84 22 -67 -136 -336 -68 386 76 -529 -172 464 596 -513 -210 337 356 -268 -204
7828 -204 767 10 -766 -183 572 325 -388 -213 -28 186 81 199 -235 -152 334 131 -28 -157 471 -130
7848 -130 -335 -149 510 339 -619 -380 509 188 -485 -322 334 111 -621 -338 218 100 -636 -184 300 339
7868 339 -82 -284 -56 51 117 243 -739 -351 371 306 -511 150 401 -33 -527 193 338 19 -746 24 371
7889 371 226 -318 190 4 -340 193 123 299 2 -19 -295 113 304 408 -11 -180 -58 643 79 -497 -494
7910 -494 286 257 -239 -273 293 -327 -360 103 193 -41 -573 -207 368 -167 178 -202 -321 -394 103 505 22 -332
7932 -332 267 315 -25 -256 491 -71 -438 113 290 24 -241 -33 237 177 145 -61 229 -179 65 168 -62
7953 -62 -375 42 267 -214 43 407 500 -145 -361 166 733 -252 -552 15 349 -148 -84 -262 115 59 -74
7974 -74 50 130 323 -504 -371 51 91 202 -364 -126 232 424 -262 -284 213 296 -229 -23 302 173 -453 -208
7996 -208 497 516 105 -610 102 432 76 -101 92 -287 -227 99 -49 192 55 75 -112 49 223 299 -184
8017 -184 -351 710 575 -560 -612 250 100 107 -156 202 299 -453 -211 368 245 -309 -191 49 54 298 -281
8038 -281 -264 -187 321 220 19 -36 -67 -150 -493 19 258 6 -387 -212 121 492 -178 -223 222 138 -186 -56
8060 -56 306 -105 -29 41 4 160 -61 20 18 138 160 337 -273 -433 438 177 -266 -6 378 161 -28 -117 262
8083 262 -192 -202 -102 -5 -103 -206 -106 -54 -142 42 -19 213 -30 -63 255 -226 316 -201 -35 -350 -164 -6
8105 -6 200 -147 -345 -134 147 11 -17 122 282 -30 138 336 -276 108 202 177 -190 208 -94 85 -24 319
8127 319 347 -236 -235 -34 148 -168 -194 -216 357 -75 -285 6 85 -14 -208 -180 40 10 229 -264 -257 371 -35 -58
8151 -58 -81 70 -43 -424 -113 153 178 -53 -207 -12 300 -79 -328 181 -20 -19 -115 -36 190 77 -196 -24
8173 -24 105 -40 143 -206 34 146 203 -212 235 136 185 -340 -465 297 239 -174 -516 81
8191H1
$$ Imaginary data points
##PAGE= N=2
##DATA TABLE= (X++(I..I)), XYDATA
0 0 0 0 0 2 -8 0 -8 8 -8 8 -16 24 -24 32 -35 48 -56 64 -73 88 -104 120 -137 159 -184 208 -235 268 -306
29 -306 342 -385 430 -483 540 -600 668 -742 825 -914 1011 -1121 1239 -1373 1520 -1685 1871
46 1871 -2082 2323 -2603 2932 -3323 3797 -4389 5153 -6169 7602 -9772 13421 -20681 40546
60 40546 -202101 -600560 100092 412176 -126420 -363561 139340 231682 -227736 -216520 276738
71 276738 207358 -262492 -183257 250937 172498 -140939 -23389 184110 -24563 -161571 132800
82 132800 272781 -59320 -210012 94848 231785 -27921 -116688 100994 124023 -83065
92 -83065 -45398 176782 119186 -118450 -80331 132495 119889 -32272 -13509 71586 12358
103 12358 -41821 52946 97613 -20172 -77225 27621 82042 808 -43552 1082 6158 -27072
115 -27072 -1782 32793 -5202 -38721 -4703 10487 -19325 -5356 31559 -9013 -58896 5237
127 5237 77471 5228 -90116 -27010 81771 42520 -61252 -45746 35281 30390 -25085 -18814
139 -18814 15014 -3636 -30469 -1386 29879 4108 -31658 -21530 3345 8255 12590 13069 -21915
152 -21915 -49320 685 65665 26665 -62912 -47376 45481 50141 -26825 -32293 27467 14469
164 14469 -42960 -9407 65452 29055 -64193 -48540 42708 54783 -5630 -28970 -12681 -6841
176 -6841 10867 41309 15277 -45068 -31511 35032 33592 -18316 -8528 24093 -17124 -50933 21241
189 21241 74494 -11855 -90035 -16005 64813 9230 -49889 2044 27844 -40681 -42518 53840
201 53840 52112 -61327 -66127 46638 58659 -32178 -33014 35597 12110 -42582 8109 61781
213 61781 -1986 -55772 6100 47022 -8129 -25213 27601 12571 -48032 -6415 66870 8716
225 8716 -76427 -15118 70413 9010 -66779 -1678 63188 -8736 -67374 6108 60666 -8938
237 -8938 -59965 -535 42321 -2266 -33853 -6094 8989 -6455 -3712 2931 -13452 -11175 19716
250 19716 12959 -31258 -21228 32597 24974 -28539 -16380 40199 23843 -34822 -15661 46834
262 46834 28503 -33841 -19520 38269 29722 -17980 -13130 18292 7865 -12620 5430 22023
274 22023 599 -16651 -1499 10135 3040 1639 2487 -10551 -10211 15045 20326 -11829 -25152
287 -25152 3162 17409 -3888 -11660 7665 6168 -17622 -12622 17158 15068 -16720 -21269 7713
300 7713 18716 -2536 -13834 -1787 4357 -3471 -3111 8957 8475 -5442 -10407 488 9446 5911
314 5911 -1892 -5473 -4123 4650 11399 2305 -13726 -8463 11188 9844 -10247 -9048 11022 7494
328 7494 -16155 -12607 13680 12372 -13960 -14648 10361 13205 -8617 -13125 2956 7126 -3157 -5154
342 -5154 1228 1594 -970 -1103 -3324 -4457 3296 5672 -8303 -12134 5908 12246 -10956 -20872 5640
357 5640 20297 -6322 -25764 -66 22058 -427 -23047 -4100 18360 3658 -16921 -4438
369 -4438 15528 6255 -12713 -7934 11020 13088 -2973 -11120 -224 13345 9203 -7368 -8933
382 -8933 8803 15669 -2455 -11898 8469 20593 -2896 -19695 5221 28606 4605 -24806 -4421
395 -4421 27945 13596 -20328 -12445 17492 12814 -13277 -11632 11278 10181 -10606 -13433 3230
408 3230 10011 -2037 -13337 -7730 7388 10150 -6686 -17477 -871 16932 2090 -19570 -4573
421 -4573 21669 7091 -22474 -8477 24597 12864 -22462 -13028 22649 17442 -16745 -15206 15067
434 15067 16475 -8809 -12054 8588 13437 -1378 -8458 -237 7467 5037 -3291 -6885 1753 11127
448 11127 2586 -13270 -7096 12751 7504 -15206 -13060 11191 10045 -15492 -16682 8538 11585
461 11585 -13640 -19085 5142 13566 -7196 -17492 -1019 11007 -660 -10789 -3241 5556 1678
474 1678 -4463 -2645 2213 2569 -905 -3534 -1005 4831 4594 -4266 -7763 3744 11011 -586 -10464
489 -10464 -257 12127 4112 -8211 -1782 10328 4365 -6629 -1507 10200 6162 -6301 -5653
502 -5653 6458 10067 -101 -8417 -3502 7557 7528 -4075 -9025 1066 8306 -671 -9063 -339
516 -339 8896 1289 -9903 -4133 9814 7477 -8171 -11255 4104 13464 1013 -12943 -5443 11182
530 11182 7274 -10403 -8597 10373 9982 -10371 -12590 8922 14890 -6004 -15561 2619 16270
543 16270 3748 -11217 -5070 8788 9151 -2361 -6368 3971 11040 1174 -9712 162 15319
556 15319 4795 -14536 -5303 18056 9842 -16141 -11406 13527 10429 -13180 -9482 11230 6562
569 6562 -13136 -8324 9399 4906 -10741 -9070 4150 6391 -1598 -8546 -8651 417 9019 468
583 468 -14993 -7007 13110 5057 -17740 -8816 15609 4198 -23268 -7622 25379 10625 -26118
596 -26118 -16040 20908 18335 -13269 -14654 8621 12107 -1520 -3589 3598 4014 114 -1814 -1404
610 -1404 6902 13384 -1760 -20247 -4188 24877 12711 -22595 -17718 17128 17004 -11534 -10767 9565
624 9565 3680 -14561 -3275 16959 6162 -14594 -10687 3863 6747 4355 383 -10825 -12211
637 -12211 6981 16412 -3212 -16552 -2467 6924 -2787 -2074 12163 3405 -17906 -7709 19057
650 19057 13825 -10611 -9464 6124 5190 684 8583 5817 -11913 -8645 14254 14559 -4631 -6832
664 -6832 2724 -964 -2165 11900 9627 -14345 -14041 14590 17285 -9200 -11369 8512 3748 -12309
678 -12309 2016 19395 -2314 -23556 -2803 19972 4181 -13357 -4853 1393 -3659 2978 8798
691 8798 -9091 -18998 4427 17131 -7361 -17072 7603 11239 -16561 -13075 20979 14499 -24820
704 -24820 -20008 20762 21501 -12946 -18493 4232 9762 2062 2959 -408 -9445 -1957 12439 3196
718 3196 -8898 3312 9212 -12286 -13070 21736 23224 -23021 -31414 17820 35014 -8523 -27321
731 -27321 4627 16151 -7947 -7099 15800 5624 -20869 -9770 16859 11458 -7786 -9001 -5352
744 -5352 -5716 8133 17392 -7027 -27491 -3511 21844 3655 -15435 858 6687 -16101 -11011
757 -11011 25827 19582 -27415 -28134 19368 29010 -7188 -15888 5359 4267 -8201 6069 19130
770 19130 -838 -19102 -4502 13008 10880 4983 -2366 -15615 -8787 22204 23509 -14373 -25062
783 -25062 10373 21394 -7396 -10594 16285 7848 -24884 -10381 30538 18989 -25433 -23374 13007
796 13007 17047 -4106 -6941 -2355 -6996 -2694 11630 4533 -13797 -7137 6734 -2581 -8050 9994
810 9994 11229 -18607 -20592 17832 24937 -13516 -24654 7578 17645 -5635 -7791 8695 1524
823 1524 -12749 1807 16349 310 -12659 893 7306 -2677 711 10945 -2973 -16169 4944
836 4944 22679 -854 -21403 -138 17188 -568 -10329 7206 7320 -13855 -8565 16071 10079
849 10079 -15306 -11737 7577 5767 -3775 838 251 -11942 -5384 14007 6793 -14675 -9031 8857
863 8857 1325 -9626 4656 11131 -12541 -19040 11843 23526 -7566 -23889 1493 16815 529
876 529 -7974 3515 3139 -8099 -1976 11785 6592 -5762 -4995 -809 1439 9891 11272 -8320 -18181
891 -18181 6660 24292 1240 -19265 -328 15709 -2001 -12354 9669 16488 -10868 -20111
903 -20111 8055 21756 -1019 -16921 -5147 7520 5035 697 -3038 -6337 -2097 4570 -392
916 -392 -5033 2936 5292 -9936 -12150 11466 16598 -10940 -21959 5469 19674 -3216 -16006
929 -16006 2662 11043 -4911 -9388 6910 9877 -5405 -9378 2208 9423 3754 -2650 -5643 -1363
943 -1363 7743 7413 -4671 -7397 5893 9453 -5037 -7766 8768 10049 -8841 -11007 9845 12975
957 12975 -8015 -13272 5586 11742 -3948 -9842 911 5950 -1114 -4975 -1669 693 472 -1273
971 -1273 -3362 -2447 3389 1845 -7597 -6305 7064 6769 -8808 -11030 6193 9943 -6130 -10050 4175
986 4175 7603 -3832 -5974 4123 5409 -3188 -4114 2797 4782 462 -1510 -1381 335 4738 5234
1001 5234 -2088 -5224 3518 7676 -958 -5192 3407 6673 -2720 -5404 4503 7102 -2447 -6768 1205
1016 1205 5604 951 -3430 -1862 228 866 580 -1851 -2731 387 1688 -2574 -4384 2088 4628 -3722
1032 -3722 -8088 657 7504 -569 -8768 -1525 6815 1730 -5964 -2272 4842 2423 -4465 -2846 3864
1047 3864 4730 -1308 -4798 -322 5868 4187 -4088 -4729 4522 7214 -1885 -6676 3364 8757 -533
1062 -533 -7853 1308 9964 1094 -9236 -2207 8980 4714 -6920 -5269 5290 5887 -3706 -7256
1076 -7256 1472 7147 -394 -8767 -2994 6960 3338 -8289 -7605 4941 6764 -5620 -9077 2622
1090 2622 8256 -3122 -10124 -121 8871 537 -9583 -3581 7908 4798 -6964 -6049 5283 7519
1104 7519 -3252 -7404 1985 8690 493 -7760 -913 9165 4519 -6907 -4520 7560 7657 -4134
1118 -4134 -6726 4280 9067 -1277 -7557 1023 8893 1723 -7705 -2941 7363 4319 -5997 -5591
1132 -5591 4060 5658 -3238 -7299 763 5890 -539 -7286 -2428 4995 2449 -5989 -5088 3636 4929
1147 4929 -3533 -7425 1161 6345 -1152 -7065 -500 6113 1694 -5950 -2294 5302 3661 -3063 -3060 2736
1163 2736 4499 29 -3070 -65 4236 2980 -2132 -2544 2976 5672 -1001 -4254 1345 6510 1208
1178 1208 -5008 -582 5618 1991 -4205 -1962 4103 2975 -2463 -2963 897 2112 149 -3077 -2990 824
1194 824 2995 -1297 -5350 -884 4405 -182 -6947 -2107 6212 1666 -7767 -4112 6094 3819 -5968
1209 -5968 -5038 3609 4116 -2550 -3703 1226 3279 68 -2284 -1045 2935 3679 -1578 -4675 1415 7783
1225 7783 1279 -7385 -1510 9282 4150 -7692 -3530 8805 4378 -7119 -3322 8140 4577 -6635
1239 -6635 -4904 5536 5808 -3466 -5719 297 4470 1758 -4006 -4429 1670 4119 -2158 -7049 34
1254 34 7514 -1562 -11141 -1157 11342 1530 -13364 -4799 11683 5055 -10918 -6586 8119 5611
1268 5611 -7416 -5265 5686 5465 -4302 -5552 2063 6525 2302 -4854 -4949 3973 8973 -132 -9113
1283 -9113 -558 11325 3394 -9349 -1534 11415 2441 -11249 -1953 12959 4394 -11701 -5640
1296 -5640 9409 6012 -5953 -5097 1985 2134 -390 -557 -1399 -1905 336 -345 -2912 179 4934 -1649
1312 -1649 -10311 -998 10703 1722 -12462 -4487 9569 3194 -8328 -2049 6438 -1816 -7857 3329
1326 3329 9062 -2525 -8728 740 6491 2113 -725 -474 -2536 -1212 6896 5454 -5130 -5124 5428
1341 5428 4103 -3646 831 8090 -1353 -11154 1803 14416 1736 -12658 -3676 8896 3452 -3914
1355 -3914 224 1078 -4811 -1606 6457 2265 -5993 -2696 1694 -2703 -1562 7172 1853 -13491 -7363
1370 -7363 12842 9690 -11648 -11085 6285 6913 -5667 -2627 5725 -1132 -8930 425 9078 1103
1384 1103 -5342 -1634 -323 -209 6688 6520 -7940 -11140 8068 14869 -4134 -11431 5026 9017
1398 9017 -6057 -4509 11647 6078 -13011 -7144 12715 10007 -8547 -7987 3932 3667 -798 2771
1412 2771 564 -7480 -2645 7854 3068 -6577 -1201 3605 -5240 -5219 9962 7003 -14728 -12428 12515
1427 12515 13011 -11211 -12598 7361 6704 -9106 -3089 11090 558 -14250 -2729 13333 5160
1440 5160 -8311 -5200 1772 2448 5563 4878 -6192 -8681 6306 11089 -3707 -7200 6875 5026
1454 5026 -10345 -2803 17502 6649 -19613 -10511 18482 14262 -11381 -10938 5704 4924 -3306 1769
1468 1769 4951 -5270 -8023 2827 6114 -529 -853 -1608 -8897 -3234 13257 9248 -15195 -15501 9638
1483 9638 13971 -6598 -9513 5385 1965 -10284 373 14820 1170 -16425 -4951 11894 5950
1496 5950 -4710 -2162 -930 -4679 2806 11387 602 -11812 -2241 9232 2228 -3579 4507 2881
1510 2881 -9875 -3811 15428 9049 -12711 -9786 9563 8718 -4779 -1833 4965 -3098 -7876 5522
1524 5522 10346 -4508 -10201 942 5014 -1050 434 3420 -6364 -9116 6523 11155 -6015 -12926
1538 -12926 3481 8738 -4897 -6446 5936 2798 -10330 -4045 10869 4965 -9749 -5965 5588
1551 5588 3785 -1197 801 -1685 -5915 1682 10291 -78 -10129 693 9422 -899 -6744 6066
1565 6066 7987 -8462 -9091 10694 13056 -7359 -12444 4597 10426 -894 -4982 1613 573 -2376
1579 -2376 1795 4325 -1720 -3938 467 -89 -1654 4286 4295 -8086 -10428 6947 12858 -5709 -14368
1594 -14368 1847 10051 -3450 -7837 4697 5016 -9099 -7716 8697 9320 -6433 -10031 739
1607 739 6165 2752 -520 -2887 -3622 1627 5858 619 -3728 1341 3215 -4327 -2637 9986 7299
1622 7299 -10242 -10381 9588 13268 -5083 -10577 3561 8273 -2593 -4153 4691 4008 -5254 -4475
1636 -4475 4418 5574 -1058 -4706 -3810 706 5527 2961 -5897 -6544 3040 5576 -3701 -5765 3872
1651 3872 4138 -6995 -5948 7039 6528 -7684 -8508 4679 7083 -2946 -5857 1508 3298 -1526
1665 -1526 -1661 1298 1168 -179 -177 -388 133 2668 2021 -3260 -2278 4811 4823 -3928 -4214 4676 5684 -3125
1683 -3125 -4541 3959 4715 -2809 -3644 2703 2873 -2296 -2476 1664 2090 -739 -1289 -903 -467 1643 1254
1700 1254 -2781 -3570 1545 3725 -2301 -4395 887 3010 -1880 -3673 1671 2968 -3033 -4235 1122
1715 1122 3607 -530 -3094 -1431 953 1992 601 -2004 -1820 1279 2738 -512 -1760 2243 3259
1730 3259 -1981 -3199 3244 5926 -1336 -5574 699 6437 1325 -3841 -704 3622 1279 -2457 -1099
1745 -1099 2691 2112 -2072 -2809 1201 3912 457 -4497 -2934 3863 3443 -3408 -4549 2407 4069 -2898
1761 -2898 -5429 1586 5200 -2415 -6333 -41 5766 88 -6320 -2832 4098 2581 -3398 -3334 2721
1776 2721 3603 -2079 -4629 1179 5724 905 -5381 -1609 5880 3680 -4032 -3867 4064 5120 -2368
1791 -2368 -4404 2709 5672 -767 -5210 401 6355 1835 -5155 -2435 4692 3777 -3258 -4214 2558
1806 2558 4715 -2275 -5177 1025 5068 -136 -5580 -1774 4571 2023 -4404 -3979 2654 3122 -2664
1821 -2664 -4698 932 3839 -1158 -4936 -773 4106 1091 -4644 -2756 3093 3016 -2386 -3283 1913 3944
1837 3944 -457 -3290 673 4053 686 -3063 -994 3464 2918 -1875 -2018 1790 3245 -295 -2204
1852 -2204 752 3309 752 -2292 -645 2392 1558 -1717 -1869 1529 2292 -265 -2428 -411 1773 601
1868 601 -2302 -1338 1302 985 -1910 -2420 378 1294 -1185 -2613 -491 1500 620 -2282 -1581 726 773
1885 773 -962 -1829 346 1951 237 -1911 -1057 1983 1774 -1558 -2083 1632 3242 -293 -2928 984
1901 984 3791 275 -3384 125 4266 1736 -2968 -1502 3198 3130 -1719 -2821 1294 3536 -55 -3209
1917 -3209 -727 3099 1752 -3411 -3636 2962 3794 -2806 -5655 1267 5319 -888 -6565 -924 5376
1932 5376 493 -5674 -2398 4281 1802 -4877 -3378 2903 3470 -2216 -4716 251 4250 1474 -3978
1947 -3978 -2767 3267 3656 -2043 -3818 2394 5265 -1477 -5040 2215 6702 -470 -6222 258 6765
1962 6765 1556 -5138 -1497 5016 2336 -3186 -1327 3188 1958 -2596 -1922 1771 2989 -218 -3492
1977 -3492 -1809 2990 3290 -3220 -5079 1727 4919 -1963 -6199 750 5067 -2415 -6614 1304 6054
1992 6054 -1838 -7538 -158 5968 481 -5361 -2011 2834 1491 -1053 -1200 -507 899 1166 -974 -1581
2008 -1581 2563 3290 -2619 -4585 3512 7632 -1238 -7214 1097 7925 672 -5158 199 5080 -119
2023 -119 -3121 2247 3653 -1534 -2992 1026 1952 392 295 -1274 -3162 228 5233 1028 -6316 -2754
2039 -2754 4712 1859 -4687 -844 3682 -1647 -5506 1547 5737 -1935 -6565 -480 3997 150 -1624
2054 -1624 358 -1202 -3147 2020 4620 -1684 -4926 1485 3465 -1540 -621 4134 225 -6562 87
2069 87 9013 2224 -7512 -2609 6564 2479 -3161 499 3261 -2492 -3229 4204 4212 -2560 -3240 948 1139
2086 1139 409 3393 205 -6649 -2786 7801 4512 -7574 -4968 5619 2463 -6547 -503 7038
2100 7038 -1645 -10256 -109 9691 1305 -8527 -3692 3898 2463 -797 -324 -2103 -2978 2375 4018
2115 4018 -2444 -2916 2772 1077 -4952 775 9219 234 -11454 -1921 12596 4858 -9737 -4573
2129 -4573 7891 3616 -5050 465 5792 -1590 -6124 2412 6766 -54 -4425 -1204 25 1393 4225
2144 4225 429 -6847 -3733 7209 4916 -5978 -4368 5054 652 -6806 1331 8761 -2565 -12319
2158 -12319 -332 11472 1250 -9643 -3020 4836 530 -2102 2432 1135 -5235 -2268 4791 2448
2172 2448 -1899 -1241 -535 -3044 1872 8453 230 -10289 -2718 11011 4941 -7090 -2688 5828 -121
2187 -121 -4913 4027 7849 -4524 -9134 2823 8842 243 -4847 -772 -134 -727 3808 4482 -4698
2202 -4698 -7017 2682 6301 -2176 -3530 2383 -368 -6572 621 8929 -81 -11172 -3252 8123
2216 8123 3180 -5348 -1980 1545 -2835 -904 5537 1714 -6416 -3537 4525 2244 -2119 1410 1374
2231 1374 -5412 -2692 7865 6225 -7500 -6952 6133 6690 -3361 -2563 3876 465 -4604 1699 6985
2246 6985 -698 -6239 15 4471 1008 -325 1061 -2493 -3622 4136 6056 -3473 -7059 2714 5586
2261 5586 -3215 -4132 4455 1994 -7760 -3098 8578 3737 -8748 -5823 5651 4493 -3708 -3174 818
2276 818 -1175 -1455 2370 1150 -3001 -1259 1315 -494 -837 3847 1255 -6555 -2822 8543 5924
2291 5924 -7414 -6329 6596 6111 -4610 -3293 5362 2058 -5958 -554 7364 2516 -5806 -3210
2305 -3210 3268 3871 549 -1216 -2958 -1273 3768 3558 -2673 -3822 2711 2047 -3923 -1170 5975 804
2321 804 -9117 -2817 8314 4230 -7916 -6015 4619 3517 -3600 -1816 2334 -491 -3621 65
2335 65 3249 366 -2285 -1958 -1044 1376 3887 525 -5294 -2294 5507 4132 -4072 -2800 4023 2064
2351 2064 -3854 -400 6088 1610 -5835 -1539 6318 3240 -3673 -2346 1972 1692 -79 518 43 -1244
2367 -1244 217 1422 -430 -1055 1374 124 -3403 -1303 4256 1627 -4875 -2782 3827 2299 -3658
2382 -3658 -2295 2461 827 -2954 -894 1924 -39 -2116 -576 1287 -18 -440 37 -861 -917 1612
2398 1612 1501 -2039 -1971 2583 2592 -1942 -2269 2253 2438 -1416 -1752 2432 2373 -1822 -1425 2132 1876 -738
2416 -738 -1050 344 1092 1116 587 -1433 -859 1837 1872 -1651 -2160 1693 1877 -2577 -2368 2374 2277 -3293
2434 -3293 -3844 2157 3556 -1923 -3689 -57 2776 -33 -2413 -717 1139 195 -1748 -1232 976 1899
2450 1899 -841 -3218 -94 3711 1635 -3706 -2167 3455 2774 -2786 -2695 3023 3272 -2157 -3003 2692
2466 2692 3952 -973 -3693 773 4265 1439 -2583 -1691 2631 1900 -1684 -2258 1264 2765 -868 -3174
2482 -3174 36 3906 367 -4393 -1642 3571 2209 -3053 -2966 1999 2651 -2465 -3330 1263 2975 -1600
2498 -1600 -4203 -252 2757 138 -3292 -1666 2225 1657 -1819 -2137 1365 2557 -900 -2399 742
2513 742 3461 223 -3006 -821 3251 1987 -2041 -1730 2164 2450 -1197 -2051 1228 2599 -136 -1858
2529 -1858 405 2677 818 -2454 -748 1796 1720 -1422 -1593 680 1450 -584 -1940 -89 1379 187
2545 187 -2382 -1502 1274 1374 -1533 -2071 410 1368 -862 -1966 -459 1256 -211 -1500 -704 1033
2561 1033 764 -1456 -976 172 1286 188 -873 -437 1039 1236 -570 -894 1053 1463 -403 -1246 584
2578 584 1915 555 -1329 -422 1631 1377 -732 -995 725 1674 171 -1216 33 1705 827 -1693
2594 -1693 -1242 1302 2025 -1312 -2309 520 2475 -666 -2444 -409 2206 -23 -2972 -906 1511 714
2610 714 -2376 -2009 1095 1490 -823 -2251 -357 1970 795 -2255 -1214 2127 1797 -2413 -2254 2433
2626 2433 2969 -1480 -3046 1716 3747 -455 -3076 947 3298 435 -2553 -446 3152 1202 -1866
2641 -1866 -1527 1793 2887 -640 -2428 143 3052 921 -2643 -1655 2539 2001 -2574 -2642 2758 2980
2657 2980 -2947 -4066 2055 4078 -1624 -4674 83 3467 -122 -3348 -897 2200 437 -2342 -1277
2672 -1277 1307 1625 -1140 -3011 -389 3042 1320 -3283 -2342 2953 3328 -2354 -2997 2424 3633 -2046
2688 -2046 -2832 2519 3238 -1779 -2738 1688 3461 -199 -2093 172 1770 727 -97 -569 -500 700 1299
2705 1299 -436 -1095 1092 1110 -1814 -1947 2811 2563 -2810 -3871 1832 3220 -1796 -3332 400 1352
2721 1352 -1922 -1470 1734 350 -2132 -1048 1085 215 -341 -43 -543 -1196 1189 2840 -964 -3414
2737 -3414 325 3740 -409 -2835 967 2541 -1395 -1902 2883 3229 -2189 -2894 2188 2955 -45 -1094
2753 -1094 295 -297 182 2374 814 -2641 -1098 2564 909 -2471 367 2840 -1794 -4416 2129
2768 2129 5167 -1691 -6299 -205 4590 240 -3637 -718 1378 -1020 -1116 1775 267 -2146 -1021
2783 -1021 156 -223 440 1697 -1557 -4418 1305 6186 34 -6236 -1190 5577 1018 -4284 895
2798 895 4305 -1753 -4087 2836 5664 -1071 -4959 170 3929 1292 -681 -557 -1460 -164 2985 1688
2814 1688 -2250 -1196 2276 12 -2672 1877 4246 -2974 -6646 2357 7845 -1432 -7758 -235 5472
2829 5472 -132 -3944 629 2419 -2826 -2981 2631 2953 -2473 -3429 111 1100 1436 1409 -1889 -4467 846
2846 846 5957 130 -5099 -407 4589 -523 -3562 3020 4846 -3826 -6315 4080 7417 -1993 -6374
2861 -6374 974 4399 467 -835 1236 -251 -1983 1042 3238 -259 -2081 274 -76 -1562 2113
2876 2113 4152 -2877 -6219 1553 7255 -171 -6201 -426 3469 -1139 -2593 2806 2104 -4927 -3529
2891 -3529 4080 3604 -3057 -3038 292 55 -176 2757 613 -4905 -2214 4549 3128 -3149 -1764 2063
2907 2063 -252 -2446 2645 4170 -3344 -5892 2423 6211 -288 -3731 -38 1262 -766 1298 3318
2922 3318 -1558 -4457 837 4372 -119 -2165 1103 144 -3118 614 5750 315 -7151 -1826 5984
2937 5984 2395 -4036 -1744 2133 -1120 -2332 2166 2427 -3016 -3653 1397 2631 -559 -501 -822 -2775
2953 -2775 -980 4324 2041 -5011 -3225 4175 3011 -3851 -1597 3579 -1 -4609 1143 6468 -46
2968 -46 -5969 -826 5463 2127 -2418 -661 1082 304 659 1809 -506 -2200 528 1499 -781 232
2984 232 2651 -942 -4500 627 6600 811 -6821 -1983 5913 1968 -4863 -1108 3510 -681 -3743
2999 -3743 959 4104 -1238 -4533 -545 2693 1068 -1097 -1927 -1889 475 3004 523 -3291 -1543 2766
3015 2766 656 -2589 196 3562 -1540 -4688 1551 6448 -55 -6119 -961 4835 1720 -2418 -177
3030 -177 1605 -901 -938 1721 1827 -1194 -1241 511 405 1540 1810 -1165 -3473 323 4630 971 -3952
3047 -3952 -1338 2989 769 -2646 668 2737 -1476 -4214 1084 3587 -548 -3555 -997 1315 283
3062 283 -230 -336 -1570 -1467 1023 1251 -676 -1045 843 -3 -1807 460 3054 2 -3583 -242 3485
3079 3485 815 -2710 -599 2510 834 -992 527 1421 -443 -679 870 785 -205 239 358 -831 -17
3096 -17 1971 727 -2426 -1043 2597 1287 -2507 -1555 1917 912 -1863 -1121 1696 690 -2248 -796
3112 -796 1154 748 -1062 -883 -293 251 515 -335 -1811 -377 1517 472 -2162 -848 2256 942 -2229
3129 -2229 -1189 2695 1380 -2530 -1427 2603 1979 -2029 -2005 1526 2636 -118 -913 166 1366 609
3145 609 -673 -330 1363 1488 -815 -1619 969 2591 -97 -2817 -429 3034 1161 -2655 -1515 2333
3161 2333 1278 -2230 -1591 2112 1443 -2155 -2408 1412 1997 -1124 -2762 -555 1668 457 -2157 -1527
3177 -1527 971 1176 -1350 -1928 753 2276 -770 -2832 51 3385 478 -3054 -813 2252 1646 -1793
3193 -1793 -1402 2392 1975 -1412 -1525 1399 2562 -377 -1997 481 2430 709 -1507 -1025 1778 1285
3209 1285 -1178 -1613 1189 1916 -658 -2091 99 2328 580 -2310 -459 1572 1030 -1630 -1438 1044
3225 1044 1020 -1241 -1538 453 1212 -649 -1716 -530 1315 689 -1012 -1048 584 1005 -431 -1151 236
3242 236 1092 -164 -1139 97 1276 547 -1021 -281 950 820 -130 -571 352 1082 175 -328 112 812
3260 812 676 -274 -706 417 1140 189 -890 -227 950 434 -748 -430 388 815 -645 -979 385 602
3278 602 -488 -1363 -330 898 309 -1289 -606 393 965 -683 -1461 -158 957 55 -1433 -391 1405
3295 1405 620 -1254 -1206 1079 1419 -1098 -1627 1040 1885 -211 -1399 291 2013 351 -1436 -560 2011
3312 2011 1188 -1158 -1109 1281 1948 -368 -1818 484 2221 601 -1843 -699 2205 1187 -1767 -1831
3328 -1831 1758 1930 -1635 -2326 912 1791 -690 -2126 143 1539 282 -2054 -957 1335 1029 -1512
3344 -1512 -2135 298 2022 -420 -2543 -751 1982 359 -2405 -992 2416 1287 -2327 -1665 2307
3359 2307 1930 -1335 -1932 1214 2069 -94 -1309 590 1868 204 -1299 -15 1174 1068 -786 -1007
3375 -1007 762 1965 266 -2265 -374 2161 783 -2400 -1257 1931 1027 -2087 -1072 1830 1056
3390 1056 -2304 -1543 1298 1371 -1179 -1618 -44 1018 153 -753 -657 -334 672 121 -908 -651 806 429
3408 429 -1440 -851 2190 1168 -2016 -1427 2307 1562 -1327 -1251 1469 1063 -674 -211 573 158 -325 442
3426 442 791 5 267 427 -444 -719 1289 1737 -1385 -1852 1265 2572 -1173 -2155 805 1487 -1067 -1062
3444 -1062 1024 811 -1786 -1179 1167 778 -682 -890 -518 -398 575 1384 -692 -2358 -74 2121 -196
3461 -196 -2384 663 1644 -1546 -1970 2387 2730 -2095 -3088 1425 3321 -707 -1899 317 1208 13
3477 13 2 824 46 -625 175 445 -104 969 754 -1740 -1545 2615 3447 -1959 -3759 1650 3535 -836
3495 -836 -2714 1355 2305 -1816 -2265 2424 2273 -2267 -2994 1150 2399 -154 -1356 -1438 -999 943 1479
3512 1479 -830 -2278 -271 1694 -620 -1872 1889 1954 -3167 -2889 3563 4055 -3022 -4472 1982 4096
3528 4096 -945 -2658 1281 1235 -1551 -200 2719 782 -1754 -837 933 1015 1675 887 -1888 -1805 2479
3545 2479 3266 -1705 -3376 1012 3026 -1090 -2071 2145 1663 -3745 -2384 3689 3129 -3526 -3323 1725
3561 1725 1996 -612 -539 475 -1216 -1059 1571 1252 -1366 -1260 666 -234 -1053 1494 1678 -3363 -3175
3578 -3175 2846 4018 -2285 -3952 1314 2434 -1109 -591 2265 218 -2967 -58 3591 1065 -2508
3593 -2508 -1215 1177 192 777 1915 -433 -3124 269 3712 837 -3157 -494 2264 -559 -1321 2157
3609 2157 1694 -3267 -2417 3070 3088 -1905 -2819 459 684 -510 711 850 -2567 -2314 2007 2105 -1664
3626 -1664 -1591 982 -552 -1993 1352 3048 -2243 -4647 1212 4300 -159 -3598 -66 1842 -441
3641 -441 -628 1901 738 -2676 -772 2245 1245 -624 -400 -269 -912 1141 3382 -209 -3913 -309
3657 -309 4146 887 -3090 -198 2643 -862 -2526 2117 3275 -2171 -4446 1026 3638 -72 -2567
3672 -2567 -786 567 111 556 355 -1576 -1289 704 595 -1029 -35 1274 -1680 -2566 2118 3936 -1818
3689 -1818 -4915 504 4454 71 -3300 536 2691 -1101 -2110 2108 1935 -1726 -1982 1202 1926 253
3705 253 -680 -785 -481 1121 2180 -92 -2628 64 2954 144 -1913 1166 1873 -1715 -2544 2499
3721 2499 3413 -1814 -3857 936 2845 -446 -2161 284 432 -888 -648 1138 34 -1288 -454 297
3737 297 -138 359 657 -1634 -2293 1096 2770 -1115 -3334 416 2362 -266 -2009 829 1516 -1566
3753 -1566 -1262 2041 1964 -1526 -1769 765 1040 270 265 75 -791 123 2179 1080 -1221 -690 1557 420
3771 420 -1124 643 1644 -907 -1924 712 2616 -38 -2414 -160 1421 -26 -436 356 -370 -1057
3787 -1057 -125 608 -81 -546 221 294 -1166 -77 1217 -464 -2602 -465 2106 20 -2187 -663 1797
3804 1797 273 -1370 -151 1455 -72 -1194 414 1245 403 -268 -231 108 640 785 -179 -839 341
3821 341 1909 411 -1561 94 1904 210 -1676 62 2451 54 -2287 -515 2114 458 -1999
3836 -1999 -810 1202 696 -1056 -1264 580 764 -155 -801 -602 499 418 -1242 -1346 464 1486 -1263
3853 -1263 -2360 471 2221 -69 -2538 -200 2430 180 -1875 -664 1834 305 -2097 -560 1628
3868 1628 1227 -789 -1534 909 1743 406 -1259 -473 1558 968 -752 -539 882 1325 -751 -1730 1042
3885 1042 2128 -337 -1991 59 2366 151 -1689 -506 1390 415 -1356 -724 1197 557 -1060 -1320
3901 -1320 222 1157 -273 -1454 -850 1110 561 -1423 -1015 506 1077 -839 -1058 322 1009 -568 -1037
3918 -1037 97 1277 459 -1278 -243 1126 457 -619 -427 886 958 -231 -628 404 848 331 -430
3935 -430 -356 1165 620 -388 -591 537 1082 189 -513 -16 795 122 -1004 -470 660 483 -698 -711 91
3954 91 383 -53 -892 -565 299 444 -537 -141 135 168 -101 -910 -11 899 266 -767 -549 410 833 -638
3974 -638 -937 345 1017 32 -513 178 1001 625 -842 -361 1047 900 -622 -575 339 1187 -135 -1089 425
3993 425 1547 111 -888 -613 1226 749 -651 -694 808 978 -932 -1129 739 1146 -137 -1079 -294 955
4011 955 111 -1392 -776 1031 966 -1069 -1528 367 1398 -443 -1765 -171 1346 130 -1537 -619 1482
4028 1482 884 -1469 -924 1421 1580 -815 -1193 635 1279 37 -1267 298 1359 457 -1000 -644 836
4045 836 1007 -568 -1127 549 1594 -2 -1692 235 1333 504 -1482 -567 1570 837 -1704 -898 988
4062 988 1247 -979 -1077 457 778 -426 -1027 -273 706 332 -842 -770 679 656 -832 -1357 387 1504
4080 1504 -3 -1755 -441 1480 300 -904 -217 1171 273 -1277 -273 1244 337 -876 -168 721
4096 721 998 -177 102 -140 142 787 343 -727 243 890 87 -881 394 1232 45 -1205 49 1707
4114 1707 202 -1109 -508 784 420 -497 -28 359 66 -114 392 86 -666 125 -65 -751 -238 1049
4132 1049 500 -1523 -1102 1230 841 -1214 -1189 663 729 -927 -584 485 249 -1038 8 929 286 -106
4150 -106 -365 194 94 1007 971 -1270 -812 1559 1626 -866 -1027 1079 899 -1566 -803 1693 1457 -1804
4168 -1804 -1469 1953 1635 -1217 -1440 470 621 -117 -174 -177 -581 114 194 -306 -493 661 -157 -1838 -761
4187 -761 2211 1230 -2829 -2176 2164 1811 -1723 -1882 1496 1035 -1788 -831 1675 782 -2049 -769 1634
4204 1634 1518 -485 -912 -147 371 1509 751 -1266 -1201 1160 1454 -905 -727 1601 443 -2121 -781
4221 -781 3542 1523 -2971 -1710 2983 1859 -1484 -1348 958 666 -1006 0 1008 -237 -1252 -98
4237 -98 169 383 6 -458 -1755 -386 2220 1161 -2482 -2129 1755 1813 -1688 -1160 1814 142 -2652
4254 -2652 -241 3267 654 -2935 -1168 1897 821 -1001 -152 292 -503 546 1846 402 -1675 276
4270 276 1563 -230 -109 1481 784 -2066 -700 2897 1537 -2779 -1751 1843 1509 -964 -447 1035
4286 1035 -832 -1573 1083 2087 -972 -2027 267 719 -275 128 534 -1344 -1807 1260 2402 -1178
4302 -1178 -2582 390 1655 -830 -707 1247 168 -2179 -812 2696 839 -1993 -1123 1072 442 324
4318 324 659 -109 -1598 141 2295 315 -1742 -84 1743 -350 -887 1668 1471 -2098 -2198 2412
4334 2412 2775 -1833 -2582 685 1631 -606 -485 637 -455 -1604 379 1262 -94 -443 -357 -707 -632 1175
4352 1175 1419 -1865 -2552 1214 2821 -1140 -2575 513 1788 -1570 -1208 1863 1529 -2826 -1787 2265
4368 2265 2289 -1409 -1885 30 810 608 244 47 -947 70 1601 267 -774 606 780 -1374 -888
4385 -888 2794 2040 -2440 -2640 2475 2827 -1702 -2111 1116 1304 -1276 -1080 1579 468 -1597 -905 1325
4402 1325 1186 -436 -888 -451 -306 956 893 -1568 -1782 884 1637 -750 -1600 1006 457 -2197 -1035
4419 -1035 2431 1304 -2707 -1915 1798 1777 -1311 -1481 407 381 -316 277 1016 -532 -517 663 357 180
4437 180 567 530 -826 -367 1480 1659 -1262 -2000 1307 1924 -821 -1157 733 601 -1052 -66 1765 340
4455 340 -1896 -556 846 470 -502 31 -286 -767 120 1189 -267 -1574 -375 1205 -143 -1190 177
4472 177 424 -1370 -909 1140 1095 -1068 -1316 514 968 -64 -419 249 -417 -362 401 712 -439 -372 722
4491 722 432 -518 322 1194 -776 -1530 1066 1897 -203 -1728 218 1636 -125 -1153 112 785 -399
4508 -399 -495 200 627 -206 -659 -233 373 687 257 -438 -892 290 1489 -423 -1698 247 1132 -622
4526 -622 -1956 353 1834 -607 -2104 -13 1566 -703 -1860 -93 1335 217 -1026 -587 462
4541 462 346 61 -453 -235 976 547 -660 -390 1033 790 -975 -1385 1276 1569 -717 -1623 612 1453
4559 1453 -220 -1441 233 1393 -287 -961 289 1075 -21 -1087 -420 338 614 -353 -1400 -218
4575 -218 729 244 -1158 -1065 698 743 -1086 -920 710 1116 -911 -1113 1049 1437 -683 -1545 337 933
4593 933 322 -923 21 465 112 -640 -149 889 511 -507 -427 165 832 485 -707 -341 963 638 -587
4612 -587 -510 656 613 -186 -351 590 852 -325 -796 170 690 125 -651 -385 316 154 -359 -80 -47 299
4632 299 -115 -351 -239 187 37 -682 -241 -52 478 -226 -576 198 209 -79 -775 -196 633 137 -309 -278 -93
4653 -93 550 -68 -206 -216 441 288 60 -354 172 885 -184 -200 225 946 295 -528 15 854 345 -455 -350
4674 -350 867 524 -250 -412 381 709 -294 -865 8 794 451 -754 -707 707 433 -835 -1121 257
4692 257 500 -399 -909 -71 996 -294 -1182 -433 932 595 -883 -510 841 1084 -551 -1251 295 921
4710 921 -19 -1080 -4 1259 311 -952 -510 863 1132 -394 -1265 710 1269 -268 -1051 420 1166
4727 1166 263 -1185 -321 1149 783 -1121 -812 445 1045 -642 -855 618 1187 -355 -1480 -350 1193
4744 1193 437 -1038 -789 663 601 -972 -1211 168 1085 -580 -1478 168 1014 -269 -1327 -13 1131
4761 1131 299 -1122 -607 755 287 -89 -481 146 799 -42 -676 -325 988 449 -439 -354 858 994 -575
4780 -575 -1013 494 921 -32 -804 306 645 -79 -583 138 763 -290 -542 -156 452 245 -183 -614 -406
4799 -406 211 467 -571 -1078 8 693 -180 -746 125 483 -370 -932 118 635 -272 -869 -77 674 -40
4818 -40 -147 47 -217 -47 250 203 -119 -674 405 78 -485 209 735 -139 -782 208 1360 450 -1068 -128
4838 -128 1093 383 -579 -323 753 -96 -466 -69 429 -68 -260 -151 -120 301 581 -140 -1056 -527 1273
4857 1273 241 -1557 -552 1192 239 -1500 -129 1184 17 -1552 -575 1284 302 -1515 -525 666
4873 666 504 -357 -288 183 128 368 -62 -369 193 659 -219 -954 201 1554 302 -1852 -234 2175 772
4892 772 -1800 -459 1563 200 -1256 223 848 -184 -1246 -227 1179 593 -552 -769 -275 673
4908 673 841 -292 -1220 -428 1236 516 -1485 -444 1228 -154 -1749 322 1888 -790 -2403 193
4924 193 2191 328 -1609 -539 915 217 -769 356 483 -469 -373 469 411 140 152 -424 -533 570 1902
4943 1902 -28 -1980 -628 2115 785 -1357 125 1547 60 -1150 745 1810 -775 -1836 182
4958 182 1119 -54 -880 -397 -185 -247 803 635 -741 -1325 558 672 -612 -254 567 -515 -1480 368
4976 368 2065 -52 -2225 -317 1656 817 -891 -176 306 -718 -148 1245 662 -960 -593 888 356
4993 356 -400 698 433 -1171 -521 1812 1458 -1617 -1197 1284 1332 -914 -426 1083 -48 -1021 381
5010 381 1704 -121 -1650 -79 829 113 172 84 -1047 -1060 1015 1040 -891 -2065 507 951 -873 -788
5028 -788 1463 298 -2043 -642 2272 703 -1809 -1529 1277 1022 -608 -389 402 -383 -95 405 636
5045 636 -469 -510 -199 -402 307 1373 493 -1892 -726 2162 1650 -1801 -1186 1574 1398 -1057 -127 1714
5063 1714 322 -1704 -176 2151 695 -1575 -1320 548 470 363 -81 -713 -814 462 906 -740 -733 467
5081 467 63 -1338 122 1982 265 -2250 -740 2484 1234 -1743 -1163 1466 457 -1213 47 803
5097 803 -359 -1192 381 1114 402 -482 -308 -134 284 687 238 -1359 -614 1605 1260 -1250 -713 1086
5115 1086 464 -1271 12 1827 -214 -1794 135 1985 465 -1162 -456 720 167 -20 919 -226
5131 -226 -1093 -55 640 57 -213 165 219 -773 -219 1206 75 -1672 -523 1324 779 -1242 -466 520
5149 520 -111 -746 351 980 -618 -1013 494 786 -38 -463 217 -402 -298 841 902 -1047 -1119 1001 1405
5168 1405 -310 -800 556 625 -903 -168 1152 390 -1177 -687 1340 709 -314 -173 139 -119 235 658
5186 658 -63 -547 97 736 -206 -560 746 171 -999 -944 1252 1048 -1094 -1122 835 1140 -752 -915 244
5205 244 414 -562 -399 486 133 -326 -355 48 317 447 321 -635 -449 957 848 -988 -826 937 937 -587
5225 -587 -649 1000 965 -1016 -754 903 847 -621 -818 687 1076 90 -580 -129 434 172 -272 -358 -19 428
5245 428 -85 -860 65 739 141 -1306 -586 1189 711 -1228 -968 819 1009 -882 -996 480 517 -724
5263 -724 -707 632 617 -249 -352 -9 489 461 -427 -393 198 876 -43 -632 -141 794 305 -1066 -167 1060
5283 1060 65 -805 15 1090 799 -609 -449 313 1153 -399 -601 12 199 68 -567 -23 518 -133 -486
5302 -486 -74 115 466 87 -644 -460 642 365 -754 -347 497 179 -387 -391 310 449 -378 -360 44 364
5322 364 -162 -301 -81 258 4 -8 -168 -72 558 -66 -326 120 292 410 -207 -38 656 165 -26 -402 138
5343 138 483 231 -391 189 366 60 -90 -283 162 73 -172 -184 -74 640 232 -376 -29 433 229 -580 -475
5364 -475 266 393 -455 -856 -94 536 -244 -715 -187 721 231 -562 -549 153 327 -263 -483 118 932 -93
5384 -93 -608 -100 841 505 -421 -274 742 1188 -224 -935 260 826 102 -779 205 1306 25 -536 -60
5403 -60 972 558 -472 -809 888 613 -429 -693 169 701 -16 -1030 -198 725 401 -718 -351 686
5421 686 800 -649 -1197 442 573 -318 -963 -262 1036 -350 -1378 -68 440 346 -533 -666 306 631
5439 631 -399 -787 -96 714 -190 -623 -19 985 288 -765 -470 704 542 -305 -727 521 545 -205 -595
5458 -595 342 929 -66 -814 -54 803 298 -567 -195 556 307 -207 -612 -80 397 207 -427 -43 603 329
5478 329 -607 -496 525 551 -346 -696 290 426 -104 -467 -173 324 49 -202 -295 379 -119 11 -267 -153
5498 -153 68 -187 -289 -458 360 422 -280 -373 381 389 -379 -362 243 819 -96 -111 293 629 282 13 23 119 600
5521 600 126 58 -354 145 806 -210 -243 257 477 -308 -755 453 776 99 -1083 -36 832 299 -748
5540 -748 -216 253 -82 -549 2 235 45 -214 -247 177 187 63 -240 -716 275 931 -255 -876 176 1415
5560 1415 83 -899 405 1136 -499 -1005 162 1097 15 -960 -140 752 616 -478 -483 175 315 310 -245
5579 -245 -494 211 499 -293 -747 447 776 -809 -1319 620 1184 -724 -1614 7 1051 -447 -1208 70
5597 70 829 -99 -780 470 608 133 -319 -645 31 570 36 -596 -736 750 1129 -570 -991 162 740
5616 740 -407 -909 1038 1134 -615 -1275 746 1575 -535 -858 236 656 -133 -275 521 133 -279 -54
5634 -54 625 421 -12 157 -231 -565 679 726 -458 -1553 579 1116 -522 -1251 266 578 -884 -609
5652 -609 573 534 -1148 -1375 567 950 -259 -431 42 88 138 506 -16 -1256 -203 989 629 -486
5670 -486 -144 773 -340 -738 455 1428 -644 -1498 396 1222 -317 -860 -25 378 -277 55 735 -229
5688 -229 -789 307 889 79 -317 367 -155 -1175 2 1500 156 -1533 -790 1335 549 -1225 -280
5705 -280 295 -206 -432 502 546 -1024 -660 426 244 -46 -143 -115 -788 131 976 274 -1209 -644 867 481
5725 481 -882 -202 1024 -67 -1404 281 1603 -126 -1925 -501 1250 268 -725 -224 246 -192 478
5742 478 762 -209 -457 -60 281 -629 290 871 -262 -1524 -30 1997 -116 -1743 -650 1358 78
5759 78 -1234 -170 1009 -257 -1060 429 1152 -568 -1379 -499 754 359 -137 -381 -866 -126 881 233
5777 233 -775 210 593 104 -621 797 1547 -483 -1404 755 2310 -260 -1964 -26 1532 664 -712
5794 -712 559 588 -244 -392 355 598 -312 -194 -231 163 498 433 -224 -1221 4 1318 169 -924 -320
5813 -320 738 185 -697 279 861 -1004 -1006 312 1311 -457 -952 105 704 -425 -172 190 -213 -257 458
5832 458 538 -329 -372 423 164 -614 356 652 -575 -1213 130 1171 108 -880 52 427 -329 35 185
5851 185 121 -717 -212 930 554 -482 -164 63 -431 -164 744 263 -918 -481 984 566 -723 -759 449
5870 449 84 -363 -196 488 -265 -578 42 894 -106 -245 -454 12 -425 349 390 -555 -440 606 400 -348
5890 -348 -479 624 250 -587 45 1118 277 -1203 -643 1190 499 -939 -261 565 544 -274 -43 212 -45
5909 -45 -99 145 82 253 409 -89 -489 -127 895 277 -926 -321 862 627 -910 -123 1034 7 -915
5928 -915 -220 1014 351 -1224 -707 714 449 -488 -731 -335 581 54 -258 -333 211 509 -69 -450 318
5947 318 1059 -207 -1113 -99 890 -63 -730 -148 1172 178 -752 -48 591 460 -405 -445 711 648 -254
5966 -254 -468 226 459 -253 -126 -299 507 527 -162 -502 -67 699 -126 -631 -56 739 -312 -1048 -21 622
5986 622 526 -1087 -312 529 458 -374 -506 90 132 -249 -122 -31 270 -37 -68 72 193 49 -219 -377 127
6007 127 594 -76 -635 -211 811 217 -280 -246 298 0 -301 21 401 208 106 -317 254 209 95 -123
6027 -123 72 101 223 529 -196 55 166 117 -128 -461 166 160 -323 -541 294 413 -84 -329 15 571 64
6048 64 -160 -359 188 113 -4 -366 15 230 -30 -382 -204 455 181 -432 -200 254 668 -611 -533 191 410
6069 410 85 56 177 592 122 -322 -233 591 338 -169 -255 397 530 -330 -451 62 665 -38 -579 -374 594
6090 594 254 -545 -436 534 569 -520 -638 251 546 -379 -652 49 580 82 -565 -349 377 160 -676 -672 402
6111 402 382 -385 -917 -5 916 143 -541 -330 737 135 -528 -137 622 852 -751 -414 401 701 -8 -669
6131 -669 534 650 144 -334 -207 549 534 -575 -181 206 308 -277 -639 149 859 107 -444 -273 394 63
6151 63 -631 -280 642 407 -777 -367 488 214 -456 -334 -263 377 15 -273 -255 357 219 -396 -313 145 508
6172 508 -177 -449 -78 467 76 -310 -87 489 275 -413 -420 450 462 -160 50 216 206 -93 -298 2 257
6193 257 -103 125 -203 45 359 177 -415 -16 280 384 -538 -431 59 442 -323 -313 191 395 -207 -350
6213 -350 -182 49 -438 -397 -268 -7 -81 -97 -209 -282 217 318 -239 -517 520 160 -380 -310 685 559 -300
6234 -300 -536 329 551 45 -458 145 466 96 -55 60 78 -19 -258 95 230 603 498 -528 -190 662
6254 662 722 -544 -661 570 802 -432 -869 594 486 -318 -915 181 518 -400 -692 68 705 -123 -628
6273 -628 -212 450 225 -92 -270 -200 452 234 -691 -602 793 1008 -780 -489 918 982 -872 -895 565 695
6293 695 -287 -776 213 584 -269 -466 176 283 -406 -98 -38 86 -1 -181 -445 -325 649 984 -629 -461
6313 -461 660 529 -564 -306 553 429 -700 -740 1033 636 -789 -971 542 430 -295 -297 303 -356 10
6332 10 96 64 -288 -302 -50 -257 -513 385 167 -899 -763 569 787 -504 -376 526 334 -178 -103 402 77
6353 77 -631 -50 773 349 -199 128 86 -53 192 564 -86 -823 271 1015 8 -785 227 441 -307 -409
6373 -409 461 580 -914 -725 729 769 -460 -637 226 -189 8 292 174 -533 -438 302 103 -442 -270 486
6393 486 -101 -593 509 983 -544 -1203 276 1036 -184 -635 -25 414 -36 116 465 249 -867 -213
6411 -213 424 395 -36 -33 337 -407 401 893 -114 -1278 211 1297 5 -604 434 1023 -382 -742 720
6430 720 885 -633 -1183 420 1065 51 -573 18 63 252 185 202 -396 -381 104 187 -423 385 409 -591 -953
6451 -953 615 1386 -688 -1146 415 1261 -246 -910 480 547 -518 -786 764 728 -612 -928 429 474
6469 474 20 -140 -374 -472 350 651 -246 -623 -102 579 -284 -533 568 650 -896 -768 766 915 -875
6488 -875 -1342 243 1063 46 -726 -43 25 -560 -92 391 238 -361 -300 26 140 228 138 -678 -577 420 975
6509 975 -616 -1197 111 511 -16 -499 410 415 -658 -450 916 532 -476 -475 115 305 158 207 304 -394
6529 -394 -41 541 598 -462 -434 307 -99 -433 302 604 -469 -540 469 938 -69 -825 -57 342 -359 -205
6549 -205 375 -186 -461 -147 409 43 -265 140 -12 -366 194 464 60 -739 59 1052 155 -932 -168 500
6569 500 172 -277 105 692 -132 -242 404 293 -140 -485 192 89 11 345 -78 -564 16 791 57 -687
6589 -687 -234 495 -142 -591 189 968 -202 -930 -72 1090 218 -700 -466 517 -18 -467 200 -80 -68 11
6609 11 102 66 52 -13 -634 -287 468 780 -373 -1029 -69 1113 47 -1011 23 1041 -101 -976 172
6628 172 676 -317 -972 38 807 375 -440 -179 277 528 149 -229 -34 145 645 -379 -203 537 706
6647 706 -498 -734 326 761 -566 -1067 63 816 -35 -773 -235 506 99 -575 -84 326 -244 -360 -323
6666 -323 378 -68 -313 -341 12 1 261 78 -629 159 756 -279 -637 225 533 -155 -333 321 511 4
6686 4 -266 213 648 -147 -361 232 310 164 -144 -184 -119 144 203 -147 202 328 411 -142 -311 193 409 36
6708 36 -439 -114 520 194 -532 153 212 -3 -195 -32 -85 85 -134 -56 -329 77 297 -226 -356 11 30 -35
6730 -35 -42 -2 289 -149 -146 390 320 29 -374 -397 319 264 -232 -274 127 363 86 -315 -285 205 470 -216 -223 2
6754 2 118 -75 -279 101 588 105 -566 -137 632 210 -413 -312 532 233 -126 -189 21 459 -154 -380 186
6775 186 84 299 -713 -109 -66 111 -566 -670 194 368 -31 -730 67 311 115 -502 2 365 31 -510
6795 -510 -515 401 425 -328 -386 291 725 -241 -268 -5 489 -7 -144 8 337 609 9 -355 275 559 -76 -667
6817 -667 35 722 -231 -712 -98 394 -3 -303 -314 286 405 -525 -603 137 306 -217 -523 98 255 -104 -226
6838 -226 -327 20 333 -315 -517 -74 -114 -437 -557 -140 407 -272 -458 -66 498 129 -291 -184 469 326
6858 326 -357 -380 -136 491 84 -336 -35 127 582 4 28 388 534 8 -192 168 351 140 -17 163 220
6879 220 183 -52 -6 458 93 -176 -291 5 -45 -86 -57 -282 296 46 52 -173 -211 72 -40 -488 -223 247 22
6902 22 -246 -158 551 190 -38 -216 142 272 25 -143 83 246 -18 -158 -194 145 567 40 -232 -339 342
6923 342 324 -104 -139 295 245 -452 -222 215 413 -339 -444 293 550 -48 -239 68 50 287 -174 -70 128
6944 128 -205 -183 -361 63 346 105 -289 -41 470 94 -773 -441 738 624 -832 -428 443 75 -252 -670
6964 -670 186 199 -232 -452 340 468 -51 -5 -181 165 131 -142 -359 205 471 -93 -505 -187 525 261 -652
6985 -652 -413 906 343 -379 -429 833 682 -533 -443 318 95 -163 -489 271 422 -432 -325 -157 260 -167
7005 -167 100 -235 -305 439 -5 -389 -674 178 348 -532 -107 655 389 -622 -58 685 270 -845 -174 507
7025 507 430 -450 -438 197 -123 -106 177 -123 -474 66 304 -414 -19 352 171 -670 -189 775 354 -776 -265
7046 -265 330 -13 -395 -15 499 -23 -432 -67 554 -359 -310 -420 194 -100 -262 76 -361 -822 -253 509
7066 509 -123 -323 226 297 -255 -196 383 165 -444 121 656 170 -175 -432 342 53 183 370 155 -508 66
7087 66 639 185 -456 88 350 -101 -311 571 579 -608 -731 389 770 -97 -595 40 636 30 144 248
7107 248 -11 -439 27 326 143 -150 114 -222 -183 -3 -7 -264 -649 757 921 -164 -688 579 469 -313
7127 -313 -614 638 290 -748 -528 672 643 -29 -203 0 370 194 192 -10 -230 -165 343 157 -203 228
7147 228 150 -524 -130 560 627 -609 -977 671 565 -202 -730 667 546 -586 111 736 182 -780 -437
7166 -437 323 326 14 -217 -46 177 388 349 -277 -756 -140 523 -411 -662 354 65 -665 -575 849 640 -933
7187 -933 -655 511 681 -217 -150 55 33 -213 657 628 -202 -149 264 429 149 258 -35 -253 -444 451 562
7208 562 -451 -739 409 263 -313 -122 313 92 -645 106 585 274 -666 -374 272 156 -148 124 -47
7227 -47 -206 -315 333 229 -516 -73 134 -55 -352 24 362 -375 -138 557 529 -393 -466 419 394 -85 -20 215
7249 215 -374 -115 535 107 -177 -187 204 -189 -51 325 260 -256 -541 231 738 -41 -602 73 777 -27 -147
7270 -147 -27 382 -129 -211 117 90 230 -267 -33 -294 24 281 -319 -135 239 346 -283 -701 69 266 -82
7291 -82 -436 410 553 -383 -734 276 437 -440 -758 66 711 197 -349 276 249 202 -65 22 405 296 133
7312 133 -340 -448 330 577 -371 -540 381 445 -73 -541 300 558 -184 -305 44 660 -404 -546 208 508
7332 508 -2 -353 -9 235 136 -41 -276 -375 413 96 18 -78 158 360 -156 -409 145 367 -431 -668 418
7353 418 540 -382 -152 43 440 -48 -428 -66 459 43 -378 -28 333 179 -340 -218 -37 324 337 -493
7373 -493 -33 433 361 -280 -325 235 213 -173 -160 580 250 -253 -521 228 110 -198 -230 -235 58 -97 -82 -228 -263
7396 -263 24 100 -94 -293 -26 166 -137 -174 153 126 -158 -449 105 365 129 -258 196 -36 55 83 -152 424
7418 424 23 -126 7 4 6 225 -175 -104 398 309 195 -233 -250 457 -171 -264 39 263 85 -181 289 386 95
7441 95 -508 -159 161 175 45 -237 -142 264 176 -430 -210 98 -9 222 19 7 320 -276 -259 -228 574 116
7463 116 -472 158 522 -16 -468 -60 216 268 -573 -479 149 110 -150 -228 187 409 355 -183 -209 168 455 -25
7485 -25 -476 387 246 -290 -471 -320 321 100 -361 -422 522 -249 -224 -403 129 68 -217 -180 24 369 -79 -199
7507 -199 -209 55 29 -437 -93 457 -20 -184 -370 0 176 -475 -351 -62 412 349 -669 -303 418 191 -87
7528 -87 -83 287 74 96 -437 28 210 -121 -251 -127 457 155 -29 -121 310 309 -165 -344 439 197 -266 -477
7550 -477 -56 531 174 -78 -79 402 -201 -343 152 -46 286 -326 -48 3 141 172 -78 -35 29 27 156 -224 85
7573 85 89 -125 -270 -133 157 -59 -125 -198 92 -59 -198 -206 -113 65 109 136 -204 -113 182 81 -201 -19 284 20
7597 20 -394 -135 132 -19 -442 -215 197 205 270 -216 7 255 -119 -38 32 71 34 -267 -127 160 122 -237 -509
7620 -509 -59 399 31 -251 -113 122 -39 -257 -399 441 30 -302 14 274 177 -394 -344 -37 353 -212 -175
7641 -175 -70 298 -195 -425 -142 73 183 -70 -95 -39 622 199 -605 21 766 408 -205 -149 557 353 -196
7662 -196 78 264 334 -277 249 388 454 123 -326 -121 243 303 24 -236 244 320 -74 -200 -426 107 -14
7683 -14 -135 240 348 111 -737 -144 395 409 -359 89 357 163 -428 20 205 272 48 -122 -74 -2 243 -35
7705 -35 -51 83 570 150 -312 -21 326 -74 -143 -275 321 384 -332 241 440 -42 -196 272 408 65 -266
7726 -266 123 -127 -402 444 -93 -137 -298 244 30 -112 54 74 -197 -390 143 204 -153 -299 -29 506 -16
7747 -16 -210 -35 69 -141 -97 117 53 -407 -142 135 113 73 146 338 -384 -66 521 370 -407 -271 136 357
7769 357 -321 -154 193 -19 -295 121 255 16 -276 -144 206 -59 226 97 -384 -371 -30 271 -290 -307 -10
7790 -10 132 -375 -355 636 42 -543 -160 951 330 -477 -506 310 276 -130 -191 -46 -107 -26 80 39 54 19 -29
7813 -29 -358 -14 331 201 -527 -329 750 430 -554 -525 280 470 -264 65 647 222 -385 188 511 11
7833 11 -294 -515 52 395 159 -85 -163 -162 0 88 -278 95 289 126 -243 -26 162 236 -730 -448 658 343
7855 343 -677 -428 430 39 -222 -120 481 44 -437 -48 202 -32 -270 -242 -182 -138 322 369 -450 -171 567
7876 567 637 -433 28 277 4 -564 171 756 133 -536 -244 562 -35 -376 -143 238 -253 -4 58 314
7896 314 -499 -232 315 28 -158 242 -149 -317 -37 426 148 -590 -191 269 216 -88 -129 622 -223 -208 217
7917 217 269 -203 -372 268 424 147 -35 281 78 -239 206 172 165 -206 279 576 -145 -315 117 49 -309 -33
7939 -33 154 342 -380 -379 219 219 221 149 -98 56 101 185 25 -144 -94 91 -88 -227 199 350 -328 -14 406 348
7963 348 -123 -712 5 545 -254 -423 3 38 -55 98 149 -42 -170 -253 -27 203 186 100 -161 -269 212 347
7985 347 -341 -415 -79 433 14 -131 341 189 -442 -473 307 308 -390 -304 317 115 173 -185 261 216 360 -172
8007 -172 94 90 263 -299 133 114 569 54 -602 -506 -64 221 -353 -303 189 -157 -275 -238 165 487 -711 -244
8029 -244 87 353 -387 -322 57 171 162 -111 -689 -46 173 -81 -138 -216 68 35 -221 197 81 96 -358 -193
8051 -193 366 -54 -360 18 449 335 -86 111 170 234 213 -1 -105 -106 -167 -50 -232 -11 204 -146 -527 -104
8073 -104 210 215 -197 -374 -94 214 -168 -6 372 -47 -323 -87 -27 70 40 -335 78 268 -2 -80 -63 -94 373
8096 373 57 48 50 -11 127 -178 -88 -2 60 -76 -49 190 188 -94 -333 164 85 247 -156 206 69 -43 -27 -20 22
8121 22 -58 62 -43 139 -57 356 -9 -201 75 132 -195 -373 94 107 -73 -42 -295 106 25 -81 -171 259
8143 259 -119 -120 20 -30 5 98 15 -42 289 346 -246 -441 46 444 -33 -352 245 532 45 -584 287 543 186
8166 186 15 -33 578 -68 -309 -301 86 -55 -232 -134 -108 324 4 -102 -107 186 281 -323 -278 159 61 -124 -291
8189 -291 35 468
8191D68
##END NTUPLES=NMR FID
##END=
