##TITLE=1H_lae-Cu-B
 CDCl3+Py-d5, 8 sc, 
 27.6.2019
##JCAMPDX= 6.0         $$ Bruker NMR JCAMP-DX V2.0
##DATA TYPE= NMR FID
##DATA CLASS= NTUPLES
##ORIGIN= UXNMR, Bruker Analytische Messtechnik GmbH
##OWNER= root
$$ XWIN-NMR		Version 3.5
$$ Thu Jun 27 14:26:59 2019 Russian Standard Time (UT+4h)  she@DPX200
##.OBSERVE FREQUENCY= 200.13155
##.OBSERVE NUCLEUS= ^1H
##.DELAY= (6, 6)
##.ACQUISITION MODE= SIMULTANEOUS
##.ACQUISITION SCHEME= undefined
##.AVERAGES= 8
##.DIGITISER RES= 18
##SPECTROMETER/DATA SYSTEM= spect
##.PULSE SEQUENCE= zg30
##.SOLVENT NAME= CDCl3
##.SHIFT REFERENCE= (INTERNAL, CDCl3, 0, 15.7039)
##AUDIT TRAIL= $$ (NUMBER, WHEN, WHO, WHERE, WHAT)
$$ ##TITLE= Audit trail, XWIN-NMR		Version 3.5
$$ ##JCAMPDX= 5.01
$$ ##ORIGIN= Bruker BioSpin GmbH
$$ ##OWNER= she
$$ F:/spectra/data/she/nmr/H-F/1/audita.txt
$$ ##AUDIT TRAIL=  $$ (NUMBER, WHEN, WHO, WHERE, WHAT)
(   1,<2019-06-27 14:25:54.45 +0400>,<she>,<DPX200>,
      <created by zg, POWCHK disabled, PULCHK disabled
       configuration hash MD5:
       00 E9 B6 7A A2 85 ED C7 34 08 36 98 17 FE 4E 26
       data hash MD5: 16K
       A4 43 F6 FF 2C 17 DB 77 6C DD 17 F7 2C C7 CF 10>)
$$ ##END=
$$ 
$$ hash MD5
$$ 05 B0 22 27 1C 06 D5 93 D5 A4 F1 86 BD 36 75 09
##$RELAX= 
##$RELAX= 
##$RELAX= 
##$RELAX= 
##$RELAX= 
##$RELAX= 
$$ Bruker specific parameters
$$ --------------------------
##$DU= <F:/spectra>
##$EXPNO= 1
##$NAME= <H-F>
##$PROCNO= 1
##$TYPE= <nmr>
##$USER= <she>
##$AMP= (0..31)
100 100 100 100 100 100 100 100 100 100 100 100 100 100 100 100 100 100 
100 100 100 100 100 100 100 100 100 100 100 100 100 100 
##$AQSEQ= 0
##$AQ_mod= 1
##$AUNM= <au_zg>
##$AUTOPOS= <>
##$BF1= 200.13
##$BF2= 200.13
##$BF3= 200.13
##$BF4= 200.13
##$BF5= 200.13
##$BF6= 200.13
##$BF7= 200.13
##$BF8= 200.13
##$BYTORDA= 1
##$CFDGTYP= 0
##$CFRGTYP= 5
##$CHEMSTR= <none>
##$CNST= (0..31)
1 1 145 1 1 1 1 1 1 1 1 1 1 1 1 1 1 1 1 1 1 1 1 1 1 1 1 1 1 1 1 1 
##$CPDPRG= <>
##$CPDPRG1= <>
##$CPDPRG2= <>
##$CPDPRG3= <>
##$CPDPRG4= <mlev>
##$CPDPRG5= <mlev>
##$CPDPRG6= <mlev>
##$CPDPRG7= <mlev>
##$CPDPRG8= <mlev>
##$CPDPRGB= <>
##$CPDPRGT= <>
##$D= (0..31)
0 1.2 0 0 0 0 0 0 0 0 0 0.03 0 0 0 0 0 0 0 0 0 0 0 0 0 0 0 0 0 0 0 0 
##$DATE= 1561631153
##$DBL= (0..7)
120 120 120 120 120 120 120 120 
##$DBP= (0..7)
150 150 150 150 150 150 150 150 
##$DBP07= 0
##$DBPNAM0= <>
##$DBPNAM1= <>
##$DBPNAM2= <>
##$DBPNAM3= <>
##$DBPNAM4= <>
##$DBPNAM5= <>
##$DBPNAM6= <>
##$DBPNAM7= <>
##$DBPOAL= (0..7)
0.5 0.5 0.5 0.5 0.5 0.5 0.5 0.5 
##$DBPOFFS= (0..7)
0 0 0 0 0 0 0 0 
##$DE= 6
##$DECBNUC= <off>
##$DECIM= 24
##$DECNUC= <off>
##$DECSTAT= 4
##$DIGMOD= 1
##$DIGTYP= 9
##$DL= (0..7)
0 120 120 120 120 120 120 120 
##$DP= (0..7)
150 150 150 150 150 150 150 150 
##$DP07= 0
##$DPNAME0= <>
##$DPNAME1= <>
##$DPNAME2= <>
##$DPNAME3= <>
##$DPNAME4= <>
##$DPNAME5= <>
##$DPNAME6= <>
##$DPNAME7= <>
##$DPOAL= (0..7)
0.5 0.5 0.5 0.5 0.5 0.5 0.5 0.5 
##$DPOFFS= (0..7)
0 0 0 0 0 0 0 0 
##$DQDMODE= 0
##$DR= 18
##$DS= 0
##$DSLIST= <SSSSSSSSSSSSSSS>
$$ [...]
##$SUBNAM2= <"">
##$SUBNAM3= <"">
##$SUBNAM4= <"">
##$SUBNAM5= <"">
##$SUBNAM6= <"">
##$SUBNAM7= <"">
##$SUBNAM8= <"">
##$SUBNAM9= <"">
##$SW= 24.9336996594482
##$SWIBOX= (0..15)
0 0 2 0 0 0 0 0 0 0 0 0 0 0 0 0 
##$SW_h= 4990.01996007984
##$TD= 16384
##$TD0= 1
##$TE= 0
##$TE2= 300
##$TE3= 300
##$TEG= 300
##$TL= (0..7)
0 120 120 120 120 120 120 120 
##$TP= (0..7)
150 150 150 150 150 150 150 150 
##$TP07= 0
##$TPNAME0= <>
##$TPNAME1= <>
##$TPNAME2= <>
##$TPNAME3= <>
##$TPNAME4= <>
##$TPNAME5= <>
##$TPNAME6= <>
##$TPNAME7= <>
##$TPOAL= (0..7)
0.5 0.5 0.5 0.5 0.5 0.5 0.5 0.5 
##$TPOFFS= (0..7)
0 0 0 0 0 0 0 0 
##$TUNHIN= 0
##$TUNHOUT= 0
##$TUNXOUT= 0
##$USERA1= <user>
##$USERA2= <user>
##$USERA3= <user>
##$USERA4= <user>
##$USERA5= <user>
##$V9= 5
##$VALIST= <valist>
##$VCLIST= <CCCCCCCCCCCCCCC>
##$VD= 0
##$VDLIST= <DDDDDDDDDDDDDDD>
##$VPLIST= <PPPPPPPPPPPPPPP>
##$VTLIST= <TTTTTTTTTTTTTTT>
##$WBST= 1024
##$WBSW= 4
##$XGAIN= (0..3)
0 0 0 0 
##$XL= 0
##$YL= 0
##$YMAX_a= 93709
##$YMIN_a= -186929
##$ZGOPTNS= <>
##$ZL1= 120
##$ZL2= 120
##$ZL3= 120
##$ZL4= 120
##$ABSF1= 10
##$ABSF2= 0
##$ABSG= 5
##$ABSL= 3
##$ALPHA= 0
##$AQORDER= 0
##$ASSFAC= 0
##$ASSFACI= 0
##$ASSFACX= 0
##$ASSWID= 0
##$AUNMP= <proc_1d>
##$AZFE= 0.1
##$AZFW= 0.1
##$BCFW= 1
##$BC_mod= 2
##$BYTORDP= 1
##$COROFFS= 0
##$CY= 11.3945322036743
##$DATMOD= 1
##$DC= 2
##$DFILT= <>
##$DTYPP= 0
##$F1P= 18.9103706918063
##$F2P= -1.10871071338519
##$FCOR= 0.5
##$FTSIZE= 0
##$FT_mod= 4
##$GAMMA= 1
##$GB= 0.15
##$INTBC= 1
##$INTSCL= 1
##$ISEN= 128
##$LB= 0.24
##$LEV0= 0
##$LPBIN= 0
##$MAXI= 10000
##$MC2= 0
##$MEAN= 0
##$ME_mod= 0
##$MI= 1.114404
##$NCOEF= 0
##$NC_proc= 0
##$NLEV= 6
##$NOISF1= 3.799351
##$NOISF2= 2.8
##$NSP= 1
##$NTH_PI= 0
##$NZP= 0
##$OFFSET= 15.70392
##$PC= 1
##$PHC0= -8505.585
##$PHC1= 25.00098
##$PH_mod= 1
##$PKNL= yes
##$PPARMOD= 0
##$PSCAL= 0
##$PSIGN= 0
##$REVERSE= no
##$SF= 200.130013532006
##$SI= 16384
##$SIGF1= 3
##$SIGF2= 2
##$SINO= 400
##$SIOLD= 16384
##$SREGLST= <1H.CDCl3>
##$SSB= 0
##$STSI= 0
##$STSR= 0
##$SW_p= 3612.71676300578
##$SYMM= 0
##$S_DEV= 0
##$TDeff= 0
##$TDoff= 0
##$TI= <>
##$TILT= no
##$TM1= 0
##$TM2= 0
##$TOPLEV= 0
##$USERP1= <user>
##$USERP2= <user>
##$USERP3= <user>
##$USERP4= <user>
##$USERP5= <user>
##$WDW= 1
##$XDIM= 8192
##$YMAX_p= 0
##$YMIN_p= 0
$$ End of Bruker specific parameters
$$ ---------------------------------
##NTUPLES= NMR FID
##VAR_NAME=  TIME,          FID/REAL,        FID/IMAG
##SYMBOL=    X,             R,               I
##VAR_TYPE=  INDEPENDENT,   DEPENDENT,       DEPENDENT
##VAR_FORM=  AFFN,          ASDF,            ASDF
##VAR_DIM=   8192,          8192,            8192
##UNITS=     SECONDS,       ARBITRARY UNITS, ARBITRARY UNITS
##FACTOR=    0.0002004,     1,               1
##FIRST=     0,             0,               0
##LAST=      1.6414764,     0,               0
##MIN=       0,             -186929,         0
##MAX=       1.6414764,     93709,           0
$$ Real data points
##PAGE= N=1
##DATA TABLE= (X++(R..R)), XYDATA
$$ [...]
$$ plain form
2001 -707 -300 -477 -484 -890 -879 -724 -451 -368 -651 -475 -80 -505 -388 -119 -455 -511 140 222 -256 -75 351 393
2023 393 339 193 298 195 235 328 634 591 170 504 441 488 195 557 754 2 240 653 680 4 462 423 391
2046 391 224 1 425 -39 7 -21 115 100 -531 -123 -116 -162 -231 -430 -410 -763 -614 -223 -500 -1094 -180 -308 -334
2069 -334 -206 -535 -161 -246 -326 -429 -49 297 -55 24 365 323 84 733 349 172 707 583 199 412 850
2090 850 361 757 561 379 555 579 329 235 321 526 241 288 509 -368 334 440 -350 9 -71 -441 -434 -115
2112 -115 -75 -310 -173 -581 -549 -141 -287 -687 -225 -287 -495 -910 -7 -306 -557 -169 -385 -264 -47 -29 -185
2133 -185 -203 49 -188 89 238 83 269 536 343 414 577 554 71 445 667 476 446 620 293 231 663 358
2155 358 457 48 219 164 507 -7 -336 -61 305 -38 -162 -158 -332 -256 -93 -210 -737 -678 -179 -573 -720 -493
$$ packed form
2001g07M07j77pm06J1J55K73Q3k83J76L95m25J17K69l36n6O51Q2m78J81M26M2
2023C93n4j46J05j03M0R3L06m3m21L34o3M7k93L62J97p52K38M13K7o76M58l9l2
2046C91j67k23M24m64M6k8J36j5o31M08Pm6o9j99K0l53J49L91k77n94R14j28k6
2069c34J28l29L74q5q0j03L80L46l52P9L41m2k39O49l84j77N35j24l84K13M38
2090H50m89L96j96j82J76K4k50r4Q6K05k85M7K21q77P02J06p90L59q0l70PL19
2112a15M0k35J37m08L2M08j46m00M62o2k08m15R03k99k51L88k16J21K17J8j56
2133a85j8K52k37K77J49j55J86K67j93P1J63k3m83L74K22j91l0J74l27o2M32l05
2155C58R9m09J71n5L43n14l29K75L66l43j24Mj74P6J63j17n27N9M99l94j47K27
$$ plain form
2177 -493 -161 -350 -467 -670 -460 -113 -493 -307 373 126 -757 174 92 -359 201 209 -227 -121 -34 191 -47
2198 -47 402 490 161 574 515 391 943 408 312 344 661 617 188 626 421 27 461 232 188 227 515 -23 298
2221 298 -197 -244 -148 -150 -333 -443 -212 -430 -530 -419 -453 -557 -148 -277 -657 -351 -199 -159 -282 -355 -202 -45
2243 -45 -306 -16 -202 263 115 -247 236 327 -70 56 558 363 228 428 480 -122 290 467 157 245 236 418
2265 418 334 345 153 338 692 303 -143 479 344 -315 -131 545 4 -205 -64 -184 -346 -475 -522 -494 -407 -212
2287 -212 -769 -54 -212 -851 -433 -163 -577 -509 -301 -391 -504 -54 50 -161 -85 229 261 -53 -46 188 222 55
2309 55 79 226 747 257 61 406 762 327 329 726 295 274 564 307 -106 412 152 265 526 210 210 -2
2331 -2 -31 -18 389 75 -161 -470 -347 -136 -398 21 -260 -378 -338 -293 -412 -564 -426 -525 -174 -324 -200 -511
$$ packed form
2177d93L32j89j17k03K10L47l80J86O80k47q83R31q2m51N60Qm36J06Q7K25k38
2198d7M49Q8l29M13n9j24N52n35r6L2L17m4m29M38k05l94M34k29m4L9K88n38L21
2221B98m95m7R6kj83j10K31k18j00J11l4j04M09j29l80L06J52M0j23p3J53J57
2243d5k61K90j86M65j48l62M83R1l97J26N02j95j35K00N2o02M12J77l10Q8rJ82
2265D18q4J1j92J85L54l89m46O22j35o59J84O76n41k09J41j20j62j29m7K8Q7J95
2287b12n57P15j58o39M18K70m14O8K08r0j13M50J04k11P6L14L2l14PK34L4j67
2309E5K4J47N21m90j96L45L56m35KL97m31k1K90k57m13N18k60J13K61l16%k12
2331bk9J3M07l14k36l09J23K11k62M19k81j18M0M5j19j52J38r9L51j50J24l11
$$ plain form
2353 -511 -106 -255 -665 -306 233 3 -217 -22 30 21 -56 300 57 414 330 400 510 -28 126 386 369 201
2375 201 554 616 183 104 533 156 69 -5 335 -3 275 478 341 -198 207 7 30 -20 -581 -142 -288 -421
2397 -421 -514 -117 -547 -642 -489 -43 -333 -200 -209 -161 -815 -507 -639 -404 36 -535 -361 -13 80 -191 203 133
2419 133 89 90 593 -16 360 294 315 105 603 699 142 239 547 324 430 433 538 318 367 45 146 354 372 -254
2443 -254 231 158 -130 -405 -112 -228 -312 43 -116 -143 -162 -674 -423 -3 -543 -613 -322 -639 -551 -486 -412 -370 -521
2466 -521 -187 -31 -188 -164 192 -327 -9 109 -72 -96 422 149 -8 201 143 12 397 192 121 659 535
2487 535 208 441 567 526 -171 328 292 218 364 189 398 197 361 93 384 30 27 -130 -41 -282 -404 121
2509 121 -277 -502 -347 -135 -685 -592 -379 -353 -97 -87 -388 -384 -556 -362 -153 -369 -394 -182 11 77 -116 -365
$$ packed form
2353e11M05j49m10L59N39k30k20J95N2rp7L56k43L57q4P0J10n38J54K60j7j68
2375B01L53O2m33p9M29l77q7p4L40l38K78K03j37n39M05k00K3n0n61M39j46j33
2397d21r3L97m30r5J53M46k90J33rM8o54L08j32K35M40n71J74L48R3k71L94p0
2419A33m4JN03o09L76o6K1k10M98R6n57R7L08k23J06LJ05k20M9l22J01K08J8o26
2443b54M85p3k88k75K93j16q4L55j59k7j9n12K51M20n40p0K91l17Q8O5P4M2j51
2466e21L34J56j57K4L56n19L18J18j81k4N18k73j57K09n8j31L85k05p1N38j24
2487E35l27K33J26m1o97M99l6p4J46j75K09k01J64k68K91l54lj57Q9k41j22N25
2509A21l98k25J55K12n50R3K13K6K56J0l01Mj72J94K09k16k5K12J93O6j93k49
$$ plain form
2531 -365 297 -61 -290 385 130 292 435 376 14 614 471 178 486 504 145 377 418 218 128 390 14
2552 14 -68 221 40 187 171 236 12 15 -86 -310 -222 -46 -401 -235 -400 -519 -465 60 -240 -502 -387 -200 -390
2575 -390 -537 -135 -145 -407 -182 -85 -215 -80 116 -512 -62 -61 79 182 308 8 -285 632 299 -198 330
2596 330 455 515 420 402 365 431 443 605 311 441 450 189 163 431 -111 267 124 -495 -95 135 -349 -573 93
2619 93 -146 -150 -157 -345 -491 -442 -472 -283 -414 -450 -438 -302 -387 -459 -464 77 -420 -571 61 -96 -367 -150 -79 -130 -523
2644 -523 53 100 -55 465 193 455 173 157 115 -12 605 48 384 483 232 147 514 154 -31 488 378 103
2666 103 258 486 124 108 -219 24 -14 -89 -77 69 194 -392 -787 -292 -45 -453 -337 -319 -27 -195 -421 -622
2688 -622 -608 -178 -475 -501 -348 -487 -180 -155 70 -343 -87 318 -129 129 300 -195 177 335 673 -114 170
$$ packed form
2531c65O62l58k29O75k55J62J43n9l62O00j43k93L08J8l59K32M1k00r0K62l76
2552A4q2K89j81J47j6O5k24Lj01k24Q8J76l55J66j65j19N4N25l00k62J15J87j90
2575c90j47M02j0k62K25R7j30J35J96o28M50JJ40J03J26l00k93R17l33m97N28
2596C30J25O0r5j8l7O6J2J62k94J30Rk61k6K68n42L78j43o19M00K30m84k24O66
2619I3k39mpj88j46M9l0J89j31l6J2J36q5p2nN41m97j51O32j57k71K17P1n1l93
2644e23N76M7j55N20k72K62k82j6m2j27O17n57L36R9k51q5L67l60j85N19j10k75
2666A03J55K28l62j6l27K43l8p5J2J46J25n86l95M95K47m08J16J8K92j68k26k01
2688f22J4M30k97k6J53j39L07K5K25m13K56M05m47K58J71m95L72J58L38p87K84
$$ plain form
2709 170 120 161 275 673 265 270 877 249 404 532 219 176 285 651 5 114 83 -297 -258 139 82 -171 -148
2732 -148 -266 -185 -165 -149 -725 -66 -249 -639 -426 -20 -352 -376 -291 -342 -812 22 20 -292 -218 172 -23 -498 216
2755 216 -128 -245 542 347 105 616 33 413 544 313 136 461 586 351 190 495 559 222 295 601 279
2776 279 347 287 40 800 295 72 -469 271 41 65 138 -215 -277 -101 -487 -486 19 -137 -362 -577 -172 -450
2798 -450 -225 -212 -287 -350 -190 -137 -320 -19 123 -346 -158 -153 168 58 5 -34 83 222 130 246 244 408 248 528
2822 528 227 325 304 580 286 -12 480 320 141 424 139 94 274 109 -124 85 -79 -44 -41 103 -180 -256
2844 -256 -54 -195 -251 -347 -77 -481 -289 -255 -466 -591 -16 -217 -341 -274 -517 -255 -447 -327 -181 -77 8 -332
2866 -332 178 91 -259 -461 -28 -47 44 29 -29 283 127 200 118 414 352 153 308 491 512 529 679 570 168
$$ packed form
2709A70n0M1J14L98m08NO07o28J55J28l13m3J09L66o46J09l1l80L9L97n7k53K3
2732a48j18Q1K0J6n76O59j83l90K13M06l32k4Q5n1m70Q34kl12P4L90j95m75P14
2755B16l44j17P87j95k42N11n83L80J31k31j77L25J25k35j61L05O4l37P3L06l22
2776B79O8o0k47P60n05k23n41P40k30K4P3l53o2J76l86JN05j56k25k15M05k78
2798d50K25J3p5o3J60N3j83L01J42m69J88NL21j10n3l9J17J39r2J16kJ64j60K80
2822E28l01R8k1K76k94k98M92j60j79K83k85m5J80j65k33K09j64L5LJ44k83p6
2844b56K02j41n6r6K70m04J92L4k11j25N75k01j24O7k43K62j92J20J46J04Q5l40
2866c32N10q7l50k02M33j9R1j5n8L12j56P3q2K96o2j99J55J83K1J7J50j09m02
$$ plain form
2889 168 454 363 157 111 497 -79 238 154 -154 -270 -32 60 -385 177 -286 -91 -236 -223 -188 -269 -344 -500 -477
2912 -477 -75 -294 -400 -452 -286 -80 -71 -264 -277 -119 -203 -339 -179 15 -162 -3 245 170 251 111 206 102 -53
2935 -53 265 -84 211 474 284 129 477 247 473 -24 187 173 158 304 309 501 119 297 18 6 46 -54
2957 -54 86 -100 -382 -408 12 -67 -86 -106 -473 -129 -264 -495 -253 -205 -110 -440 -404 -275 -478 -168 -245 -226 44
2980 44 19 35 -1 204 32 79 331 218 254 256 507 197 217 149 122 235 376 331 79 495 228 -175 277 180
3004 180 18 68 83 50 355 110 93 133 -77 165 -102 51 -309 -275 -41 20 -103 -195 -167 -449 -637 -121 -556
3027 -556 -370 -78 -289 -191 -117 -227 -242 -316 -4 -29 -37 111 -166 211 184 156 -60 282 422 84 5 357 -51
3050 -51 212 420 381 444 373 293 324 462 556 130 501 228 102 68 80 134 12 20 21 1 -305 -189 -328 -2 -260
$$ packed form
2889A68K86r1k06m6L86n76L17q4l08j16K38R2m45N62m63J95j45J3L5q1p5j56K3
2912d77M02k19j06n2J66K06Rj93j3J58q4j36J60J94j77J59K48p5Q1j40R5j04j55
2935e3L18l49K95K63j90j55L48k30K26m97K11j4j5J46NJ92l82J78k79j2M0j00
2957e4J40j86k82k6M20p9j9k0l67L44j35k31K42M8R5l30L6J29k03L10p7J9K70
2980D4k5J6l6K05j72M7K52j13L6KK51l10K0o8k7J13J41m5k52M16k67m03M52r7
3004A80j62N0J5l3L05k45j7M0k10K42k67J53l60L4K34O1j23r2K8k82j88N16m35
3027e56J86K92k11R8P4j10j5p4L12k5qJ48k77L77k7k8k16L42J40l38p9L52m08
3050e1K63K08l9O3p1q0L1J38R4m26L71k73j26l4J2N4j22QJk0l06J16j39L26k58
$$ plain form
3075 -260 98 -48 -250 -412 -474 -113 -343 -226 -313 -243 -177 -343 0 -387 -173 9 -39 -284 217 -140 -361 120
3097 120 67 124 141 139 -54 429 195 271 0 416 356 36 231 97 326 182 324 104 328 213 -167 256
3119 256 118 -101 -350 90 -212 -219 148 -339 84 92 73 -478 -140 -216 -519 -226 -24 -109 -221 -262 -239 -391 -40
3142 -40 -400 -624 -274 -229 -533 -227 -444 -31 7 -63 -65 -221 433 -164 -239 -43 417 76 265 455 464 110 249
3165 249 -46 138 286 397 264 628 156 183 125 -89 394 116 64 30 -277 57 125 -75 -114 -115 -382 -217 -171
3188 -171 -262 35 198 -391 -316 189 -330 -475 -50 -234 -228 -75 -238 6 -244 10 -333 -57 188 -79 -8 117
3210 117 -105 67 304 57 77 471 394 7 484 555 72 293 594 379 299 188 213 44 224 62 -222 124
3232 124 705 131 231 -31 -213 29 -229 118 -223 0 -223 -253 71 53 -390 -142 -259 -237 -413 -127 -525
$$ packed form
3075b60L58j46k02j62o2L61k30J17q7P0O6j66L43l87K14J82m8k45N01l57k21M81
3097A20n3N7J7kj93M83k34P6k71M16o0l20J95j34K29j44J42k20K24j15l80M23
3119B56j38k19k49M40l02pL67m87M23Qj9n51L38p6l03K93K02q5j12m1K3j52L51
3142d0l60k24L50M5l04L06k17M13L8p0kj56O54n97p5J96M60l41J89J90Rl54J39
3165B49k95J84J48J11j33L64m72K7n8k14M83k78n2l4l07L34O8k00l9jk67J65M6
3188a71r1K97J63n89P5N05n19j45M25j84OJ53j63K44k50K54l43K76K45k67P1J25
3210A17k22J72K37k47K0L94p7l87M77P1m83K21L01k15q0j11K5j69J80j62k84L46
3232A24N81n74J00k62j82K42k58L47l41K23k23l0L24j8m43K48j17K2j76K86l98
$$ plain form
3253 -525 -528 -174 -164 -677 -95 -30 -377 -364 -104 -106 -37 60 138 172 163 214 109 371 174 384 20 249 8 201 348
3278 348 -52 375 375 219 457 458 260 237 -92 12 12 229 -130 29 -121 -313 -99 -217 191 -549 -502 -182 -111
3301 -111 -420 -485 -154 -480 -480 -459 -219 -478 22 -199 -334 -105 -330 -318 -150 -121 18 -70 -112 110 196 -54 292
3324 292 -83 190 329 34 117 209 -154 79 517 482 193 414 284 310 102 233 135 65 158 145 2 178 -17
3347 -17 -203 -93 151 -117 -225 -113 -383 -17 -278 -137 -216 -119 -281 -244 -295 -202 107 -158 -353 -237 -185 -125 -401
3370 -401 -291 111 -326 -45 7 -240 -237 -37 237 298 168 222 -6 104 318 -79 272 202 5 226 73 525
3392 525 222 265 697 239 183 377 327 335 309 26 322 -65 122 -40 -66 -109 -145 -32 107 -238 -200 102 -596
3415 -596 -436 -540 -353 -205 -117 60 -508 -385 -183 -214 -136 52 -124 -51 326 -102 279 -154 -146 -139 -14 344 170
$$ packed form
3253e25lL54J0n13N82O5l47J3K60kO9R7P8L4rN1j05K62j97K10l64K29k41J93J47
3278C48m00M27%j56K38Jj98k3l29J04%K17l59J59j50j92K14j18M08p40M7L20P1
3301a11l09o5L31l26%K1K40k59N00k21j35K29k25J2J68K9J39q8m2K22Q6k50L46
3324B92l75K73J39k95Q3R2l63K33M38l5k89K21j30K6k08J31r8p0R3j3j43J76j95
3347a7j86J10K44k68j08J12k70L66k61J41p9R7j62L7n1R3L09k65j95J16N2O0k76
3370d01J10M02m37K81N2k47LK00K74O1j30N4k28J10K14l97L51p0j97K21j53M52
3392E25l03M3M32m58n6J94n0Qk6k83K96l87J87j62k6m3l6J13J39l45L8L02o98
3415e96J60j04J87J48Q8J77n68J23K02l1P8J88j76P3L77m28L81m33QPJ25L58j74
$$ plain form
3438 170 -12 214 -25 136 135 319 369 484 -10 -91 75 488 218 285 288 41 197 356 194 52 45 48 -101 18
3462 18 5 -231 -34 45 -211 4 -307 -322 -28 -333 -252 -354 -105 -370 -478 -514 -289 -193 -169 -73 -226 -304 67
3485 67 -93 -216 -85 -265 18 -126 -230 66 -24 140 -12 233 101 365 207 27 315 302 194 234 218 46
3507 46 396 414 108 432 121 304 57 -29 -95 106 -64 -110 0 255 -327 -16 -289 -73 -314 -351 -434 -255
3529 -255 -129 -484 -258 -199 -530 -279 -229 -283 -239 -252 -132 -180 -198 55 -64 -180 212 14 89 209 213 138 201 -195
3553 -195 367 53 90 175 265 265 -128 236 524 359 400 88 122 170 426 272 94 41 49 350 68 -96 56 142
3577 142 107 87 -165 78 56 -117 -278 -156 -67 -305 -258 -352 -350 -82 -14 -171 -168 -322 -333 -44 52 -96 -502 164
3601 164 -56 -47 28 -63 -267 -67 76 207 -34 549 248 119 281 93 342 284 27 359 407 247 203 342
$$ packed form
3438A70j82K26k39J61jJ84N0J15m94q1J66M13k70O7Lk47J56J59j62j42pLj49J19
3462A8j3k36J97P9k56K15l11j5K94l05Q1j02K49k65j08l6K25R6K4R6j53p8L71
3485F7j60j23J31j80K83j44j04K96r0J64j52K45j32K64j58j80K88j3j08M0j6j72
3507D6L50J8l06L24l11J83k47q6o6K01j70m6J10K55n82L11k73K16k41l7q3J79
3529b55J26l55K26N9l31K51N0n4M4j3J20m8j8K53j19j16L92j98P5J20Mp5O3l96
3553a95N62l14L7Q5R0%l93L64K88j65M1l12L4M8K56j54j78n3QL01k82j64J52Q6
3577A42l5k0k52K43k2j73j61J22Q9k38M7r4KK68O8j57Lj54j1K89R6j48m06O66
3601A64k20RP5r1k04K00J43J31k41N83l01j29J62j88K49n8k57L32M8j60m4J39
$$ plain form
3623 342 -11 -302 301 334 101 -61 194 -11 -98 23 110 -64 -104 -195 -321 -271 24 -15 -271 -249 -288 -395 -132
3646 -132 -342 -323 -135 -283 -182 -110 23 -32 -52 -164 -85 -379 88 -267 214 -86 127 263 137 280 265 331
3668 331 171 224 305 302 209 84 56 326 142 136 115 164 83 302 -29 307 217 40 214 -40 -343 -228 83 -99
3692 -99 -252 -40 -105 -265 -204 -304 -224 -438 0 -228 -453 -310 -1 -432 -143 -61 -308 -247 96 -227 -195 75
3714 75 -162 -301 31 -256 -54 201 -72 142 349 -11 18 365 178 124 313 349 122 177 35 339 129 -82
3736 -82 250 -169 230 -58 -34 64 382 -36 139 37 -51 -242 10 -189 -217 -429 -299 -360 -333 -115 -194 -321 -279
3759 -279 -129 -391 -159 -313 8 -12 -32 -99 3 59 110 -3 289 -17 98 -326 98 -65 403 265 116 222
3781 222 191 12 -15 437 181 356 431 311 261 519 -77 38 145 -6 -210 209 317 154 61 92 82 -95
$$ packed form
3623C42l53k91O03L3k33j62K55k05q7J21Q7j74m0r1j26N0K95l9k56K2l9j07K63
3646a32k10J9J88j48J01P2J33n5k0j12P9k94M67l55M81l00K13J36j26J43j5O6
3668C31j60N3Q1lr3j25k8K70j84ok1M9q1K19l31L36r0j77J74k54l03J15L11j82
3692i9j53K12o5j60O1j00Q0k14M38k28k25J43L09m31K89Q2k47O1L43l23L2K70
3714G5k37j39L32k87K02K55k73K14K07l60K9L47j87n4J89L6k27N5j42L04k10k11
3736h2L32m19L99k88K4R8L18m18J75j02q8j91K52j99k8k12J30o1K7K18p9j27M2
3759b79J50k62K32j54L21k0k0o7J02N6N1j13K92l06J15m24M24j63M68j38j49J06
3781B22l1j79k7M52k56J75P5j20n0K58n96J15J07j51k04M19J08j63r3L1j0j77
$$ plain form
3803 -95 -319 -45 63 -86 135 54 -243 -133 196 -295 -276 -404 -528 -17 -126 6 -339 -134 -109 -198 307 -87
3825 -87 163 -141 270 206 -100 280 81 203 -2 -139 -53 54 58 -15 372 108 182 74 331 458 264 257 283
3848 283 -71 -39 -76 259 10 -48 -245 -114 148 113 263 -222 -26 57 189 -277 -146 71 -96 -252 -299 -164
3870 -164 -279 28 -260 -83 -275 128 -65 -197 -238 41 -218 -234 -86 213 124 -461 -68 160 306 -2 -257
3891 -257 176 107 350 -3 131 115 298 203 -167 20 213 297 31 76 292 143 144 -158 -22 -409 -21 153
3913 153 -76 -174 -61 183 54 91 -37 -46 -236 -240 4 -308 -61 222 -179 -139 -184 -70 -389 -485 -233 -196 17
3936 17 -47 -34 -42 -61 120 -110 25 69 -35 130 59 315 16 28 -131 113 446 116 254 275 369 320 342 -27
3960 -27 123 34 39 -59 -50 -27 165 24 -263 -170 -155 133 9 -354 51 103 -353 65 -193 -277 -333 -121 -434 -91
$$ packed form
3803i5k24K74J08j49K21q1k97J10L29m91J9j28j24N11j09J32l45K05K5q9N05l94
3825h7K50l04M11o4l06L80j99J22k05j37Q6J07Mp3L87k64P4j08K57J27j94pK6
3848B83l54L2l7L35k49n8j97J31K62l5J50m85J96Q3J32m66J31K17j67j56m7J35
3870a64j15L07k88J77j92M03j93j32m1K79k59j6J48K99q9n85L93K28J46l08k55
3891b57M33o9K43l53J34j6J83r5l70J87J93Q4k66M5K16j49Jl02J36l87L88J74
3913A53k29r8J13K44j29L7j28rj90mK44l12K47K83m01M0m5J14l19r6K52L7K13
3936A7o4J3qj9J81k30J35M4j04J65p1K56k99J2j59K44L33l30J38K1R4m9K2l69
3960b7J50q9Nr8RK3J92j41k87R3J5K88j24l63M05N2m56M18k58q4n6K12l13L43
$$ plain form
3984 -91 -289 -247 -39 -111 -23 -339 -173 -294 -259 -477 107 -175 -235 367 148 63 314 -94 -182 -68 84 122 133
4007 133 222 162 134 413 -3 3 208 161 394 289 530 56 376 -111 212 127 143 32 -17 86 129 -47 48 13
4031 13 20 -170 65 -349 28 -158 -39 -309 135 79 -186 -34 -53 67 -320 35 59 26 59 -175 -244 -279 -288 -153
4055 -153 163 135 16 149 69 148 425 219 48 195 154 324 15 306 643 -12 295 3 89 157 -29 -71
4077 -71 75 394 75 -86 -383 213 174 -113 98 -183 -244 -149 12 -159 -523 -346 -87 -147 -48 -272 -126 -173
4099 -173 -140 -303 149 54 -154 109 -125 81 -281 30 398 -98 27 47 150 -38 -69 -27 41 -87 93 -23
4121 -23 58 366 173 253 94 158 198 67 -262 459 63 -161 -81 34 311 -136 11 183 -163 32 -148 -61
4143 -61 50 -409 -137 50 -196 -236 -73 -418 -325 -128 -163 -101 123 -76 -67 152 82 56 -474 -123 -419 -34 93
$$ packed form
3984i1j98M2K08p2Q8l16J66j21L5k18N84k82o0O02k19q5K51m08q8J14J52L8J1
4007A33Q9o0k8K79m16OK05m7K33j05K41m74L20m87L23q5J6j11m9J03M3j76R5l5
4031A3Pj90K35m14L77j86J19k70M44n6k65J52j9J20l87L55K4l3L3k34o9l5rJ35
4055a53L16k8j19J33q0P9K77k06j71J47m1J70l09K91L37o55L07k92Q6O8j86m2
4077g1J46L19l19j61k97N96l9k87K11k81o1R5J61j71l64J77K59o0R9k24J46m7
4099a73L3j63M52r5k08K63k34K06l62L11L68m96J25K0J03j88l1M2O8j28J80j16
4121b3Q1L08j93Q0j59O4M0j31l29P21l96k24Q0J15K77m47J47J72l46J95j80Q7
4143f1J11m59K72J87k46m0J63l45R3J97l5O2K24j99RK19p0k6n30L51k96L85J27
$$ plain form
4166 93 270 -144 -119 -89 187 27 311 259 201 64 66 163 392 188 -328 160 162 93 324 182 129 91 160 277 377
4191 377 41 -94 99 -54 -85 195 -9 -257 -54 -224 -189 -91 115 -124 -202 -70 -159 -83 -197 -36 63 -128
4213 -128 -16 -205 -356 -186 -115 -208 -17 243 -56 -248 -268 -2 80 148 301 68 120 442 68 -277 291 13
4235 13 247 122 315 170 357 12 -26 91 -68 87 124 263 -42 -31 212 -101 -69 -215 -240 -392 -400 -123 -104
4258 -104 -214 256 -42 24 -169 53 -16 -288 311 -330 -85 -309 -22 -20 -197 16 -121 -56 -121 -31 10 -16 49
4281 49 37 252 146 86 28 219 85 -91 216 227 192 137 89 75 229 -40 63 190 248 103 338 204 -137
4304 -137 57 39 -107 220 250 -12 -167 -2 2 173 227 -402 -228 120 -98 -345 -165 200 -45 -59 -203 -29
4326 -29 -250 -230 -582 -47 89 -439 -201 159 27 22 151 176 283 -17 265 103 -127 -14 -124 -50 159 110
$$ packed form
4166I3J77m14K5L0K76j60K84n2n8j37KR7K29k04n16M88Ko9K31j42n3l8O9J17J00
4191C77l36j35J93j53l1K80k04k48K03j70L5R8K06k39p8J32q9P6j14J61R9j91
4213a28J12j89j51J70P1r3J91K60k99j92k0K66Q2O8J53k33N2L22l74l45N68k78
4235A3K34j25J93j45J87l45l8J17j59J55L7J39l05J1K43l13L2j46k5j52qK77J9
4258a04j10M70k98O6j93K22o9k72N99o41K45k24K87Kj77K13j37O5o5R0M1k6O5
4281D9j2K15j06o0n8J91j34j76L07J1l5n5m8j4J54k69J03J27N8j45K35j34l41
4304a37J94j8j46L27L0k62j55J65MJ71N4o29J74L48k18k47J80L65k45j4j44J74
4326b9k21K0l52N35J36n28K38L60j32nJ29K5J07l00K82j62k30J13j10P4K09m9
$$ plain form
4348 110 198 247 -90 -119 104 114 -6 58 176 157 -79 56 -9 -216 311 32 366 222 -83 -32 -87 45 -139
4371 -139 115 -85 -231 -283 -5 -221 -538 -115 -122 15 -103 34 108 33 -515 -296 130 -95 -43 73 173 -100
4393 -100 -224 102 -45 -128 67 132 -143 159 572 212 241 453 57 27 346 456 -8 106 253 356 207
4414 207 195 -99 141 129 247 51 -357 126 -142 145 481 23 -76 -104 -222 -312 12 -117 -113 -46 -166 -236 -146
4437 -146 -192 -308 -258 -485 -680 -204 -130 -45 104 213 33 -337 121 142 63 -55 21 159 272 95 431 -157
4459 -157 151 4 110 288 323 231 221 -10 49 -11 330 149 12 -173 46 11 88 199 -160 -70 -73 17 113 284
4483 284 -162 -165 29 -150 -93 -232 -633 -251 133 -44 -561 -167 -342 -225 -61 58 -182 -150 -129 -57 95 63
4505 63 -36 -311 -20 166 153 258 276 361 67 282 211 158 330 402 -94 132 596 -3 65 373 -140 -303 164
$$ packed form
4348A10Q8M9l37k9K23J0j20O4J18j9k36J35o5k07N27k79L34j44l05N1n5J32j84
4371a39K54k00j46n2K78k16l17M23pJ37j18J37P4p5n48K19M26k25N2J16J00k73
4393a00j24L26j47q3J95O5k75L02M13l60K9K12l96l0L19J10m64J14J47J03j49
4414B07j2k94K40j2J18j96m08M83k68K87L36m58r9k8j18r0L24j29MO7j20p0R0
4437a46m6j16N0k27j95M76P4Q5J49J09j80l70M58K1p9j18P6J38J13j77L36n88
4459a57L08j47J06J78L5r2j0k31N9o0L41j81j37j85K19l5P7J11l59R0lR0R6J71
4483B84m46lJ94j79N7j39m01L82L84j77n17L94j75J17J64J19k40L2K1P2J52l2
4505F3r9k75K91J86j3J05J8Q5k94K15p1n3J72P2m96K26M64n99O8L08n13j63M67
$$ plain form
4528 164 -179 248 174 179 -145 -30 -300 8 -278 -142 254 121 41 -371 105 46 -476 -156 -41 -275 8 -251
4550 -251 -226 -272 -326 -182 -130 -360 264 123 -191 161 74 -277 3 276 -154 316 154 -16 -104 85 -105 129
4572 129 77 278 151 226 -101 -4 312 159 180 -26 257 66 312 -64 107 92 156 185 50 236 276 -90 112
4595 112 -126 -46 -256 -291 -91 -345 -317 -14 -162 -108 -34 -177 -127 12 -211 -195 -72 -136 -291 -33 -146 -47 84
4618 84 -22 -29 10 168 191 371 -335 -17 238 293 198 160 70 276 215 345 -31 -3 343 -65 -213 173 -4 105
4642 105 157 -16 -69 -72 155 -6 -149 -148 -78 -143 -35 -53 -39 71 -17 -284 77 81 -95 -323 -223 -88 36 -256
4666 -256 154 -206 -122 77 -63 -121 1 -7 -94 -182 54 91 343 11 -150 73 271 308 -144 282 -118 -63 87
4689 87 82 -16 408 61 -392 214 162 51 68 17 108 -77 340 327 -8 185 187 -201 -163 -6 -269 -130 -37 -166
$$ packed form
4528A64l43M27p4Nl24J15k70L08k86J36L96j33q0m12M76n9n22L20J15k34K83k59
4550b51K5m6n4J44N2k30O24j41l14L52q7l51K80K73m30M70j62j70q8J89j90K34
4572A29n2K01j27P5l27R7L16j53K1k06K83j91K46l76J71j5O4K9j35J86M0l66K02
4595A12k38Q0k10l5K00k54K8L03j48N4P4j43N0J39k23J6J23o4j55K58j13R9J31
4618H4j06pL9J58K3J80p06L18K55N5r5l8r0K06o1J30l76K8L46m08j48L86j77J09
4642A05N2j73n3lK27j61j43JP0o5J08j8J4J10q8k67L61Mj76k28J00J35J24k92
4666b56M10l60Q4J99j40n8J22qq7q8K36L7K52l32j61K23J98L7m52M26m00N5J50
4689H7nr8M24l47m53O06n2j11J7n1R1j85M17j3l35J93Kl88L8J57k63J39R3j29
$$ plain form
4713 -166 290 -346 -80 -280 15 -55 -139 -178 30 -229 9 103 57 -229 -106 27 -166 12 170 -1 86 28
4735 28 -20 -125 353 -14 -4 108 4 -24 164 153 35 117 304 170 -118 153 -5 450 222 198 156 62 -125
4758 -125 22 -7 243 -106 75 63 -266 57 64 -106 -138 -127 -35 186 -183 -89 128 -319 -55 -70 260 -228 -254
4781 -254 210 140 -138 -7 -211 -71 -4 -115 -50 -11 121 327 3 109 268 -241 111 64 84 40 -127 164
4803 164 -20 -51 149 176 175 237 73 144 -19 -58 -49 238 -35 -93 -86 64 -236 -6 6 -331 111 -336 -342 -238 101
4828 101 -383 -257 55 57 -358 -166 64 15 -22 -54 200 -97 -84 -237 43 494 328 -43 -19 78 -98 -147 -129
4851 -129 -72 133 355 361 89 362 -63 -26 -25 -121 -36 48 89 272 -22 223 -90 -11 96 26 -73 69 -268 -146
4875 -146 54 -78 142 353 -87 -222 106 -253 6 90 -295 27 -73 -265 -70 -290 -372 -195 -62 -121 294
$$ packed form
4713a66M56o36K66k00K95p0q4l9K08k59K38R4m6k86J23J33j93J78J58j71Q7n8
4735B8m8j05M78l67J0J12j04k8J88j1j18Q2J87j34k88K71j58M55k28k4m2r4j87
4758a25J47k9K50l49J81j2l29L23Pj70l2J1R2K21l69R4K17m47K64j5L30m88k6
4781b54M64p0k78J31k04J40O7j11O5L9J32K06l24J06J59n09L52m7K0m4j67K91
4803A64j84l1K00K7jO2j64P1j63l9RK87k73n8PJ50l00K30J2l37M42m47oJ04L39
4828A01m84J26L12Km15J92K30m9l7l2K54k97J3j53K80M51j66l71K4R7j76m9J8
4851a29N7K05K22Ok72K73m25L7Jr6Q5Q4M1J83k94K45l13P9J07p0r9J42l37J22
4875a46K00j32K20K11m40j35L28l59K59Q4l85L22j00j92J95k20q2J77J33n9M15
$$ plain form
4896 294 -259 63 141 -145 -242 -90 102 -162 14 143 191 -109 11 -91 -24 -68 -164 -70 -40 605 -73 -26 238
4919 238 -25 150 171 -27 166 21 33 80 39 40 -108 43 14 72 232 -154 15 -246 -197 300 -149 -70 235
4942 235 -281 -71 -48 -178 -70 28 -422 164 101 -319 124 -177 29 122 108 187 -379 37 -122 27 272 214
4964 214 104 326 -14 -26 285 338 95 -8 390 220 272 -147 293 77 97 64 43 110 342 -3 -122 246
4986 246 92 -310 14 25 -30 -17 -245 -234 -304 275 -357 -346 -132 -305 -162 -154 63 -42 -21 48 -207 -129 -28 -105
5010 -105 60 -180 80 -42 341 84 24 -14 -121 -43 -87 265 126 343 176 264 145 297 120 7 142 126
5032 126 56 -220 136 196 210 86 103 48 -425 82 16 -43 -215 -97 -106 -182 -155 -192 5 -102 -12 -47 -321 -257 -35
5057 -35 -226 -194 -96 50 -42 -157 24 -117 -248 -105 -255 0 -24 112 -82 -160 132 206 0 250 374 88
$$ packed form
4896B94n53L22P8k86r7J52J92k64J76J29M8l00J20j02O7m4r6R4L0O45o78M7K64
4919B38k63J75K1j98J93j45J2M7m1Jj48J51k9N8J60l86J69k61M9M97m49P9L05
4942B35n16K10K3j30J08R8m50N86o3m20M43l01K06R3j4P9n66M16j59J49K45n8
4964B14j10K22l40j2L11N3k43j03L98j70N2m19M40k16K0l3k1O7K32l45j19L68
4986B46j54m02L24J1n5J3k28J1p0N79o32J1K14j73J43QK17j05K1O9k55P8J01p7
5010a05J65k40K60j22L83k57o0l8j07P8m4L52j39K17j67Q8j19J52j77j13J35j6
5032A26p0k76L56O0J4j24J7n5m73N07o6n9j72J18rp6K7l7J97j07R0l5k74O4K22
5057c5j91L2R8J46r2j15J81j41j31J43j50K55k4J36j94p8K92P4k06K50J24k86
$$ plain form
5079 88 -94 -13 173 202 136 135 172 224 74 77 184 5 290 -114 178 71 -27 149 161 116 -189 -43 -119 191 -133
5104 -133 280 -360 -301 14 -189 -330 -293 -365 -196 -43 -316 85 -497 118 -166 -275 181 107 -407 -206 173
5125 173 504 -117 4 41 72 -164 139 33 176 26 256 -48 160 36 36 123 47 334 189 156 34 401
5147 401 4 71 83 -52 -80 -221 101 -114 -37 106 -71 -143 -30 -49 -203 -247 -259 -130 -208 88 37 -113 -133 -106
5171 -106 99 -229 -151 115 -194 -215 240 -13 -310 83 41 92 -141 -105 138 61 -85 139 -13 102 -55 255
5193 255 122 140 -31 166 223 165 -38 -32 -119 86 85 -15 185 127 292 -102 91 -143 190 199 89 -47 -150 -126
5217 -126 -191 -109 -50 78 -277 24 32 149 -252 -221 150 -63 -129 -432 -108 -213 -121 -69 -255 109 -165 190 326
5240 326 147 20 66 -71 238 320 59 148 -119 261 85 86 25 28 -129 65 82 318 351 223 202 155 139 131 -8
$$ packed form
5079H8j82Q1J86K9o6jL7N2j50LJ07j79K85m04K92j07r8J76J2m5l05J46p6L10l24
5104a33M13o40N9L15k03j41L7p2J69J53k73M01n82O15k84j09M56p4n14K01L79
5125A73L31o21J21L7L1k36L03j06J43j50K30l04K08j24%Q7p6K87j45l3j22L67
5147D01l97O7J2j35k8j41L22k15P7J43j77p2J13j9j54m4j2J29p8K96n1j50k0K7
5171a06K05l28P8K66l09k1M55k53k97L93m2N1k33L6K43p7j46K24j52J15j57L10
5193B55j33J8j71J97N7n8k03Oq7K05jj00K00n8J65l94J93k34L33Rj10j36j03K4
5217a26o5Q2N9J28l55L01QJ17m01L1L71k13o6l03L24j05R2N2j86L64k74L55J36
5240C26j79j27M6j37L09Q2k61Q9k67L80j76Jo1Lj57J94J7K36L3j28k1m7j6qj39
$$ plain form
5265 -8 -161 119 -268 -71 54 -79 -129 -169 -9 -183 -42 35 20 211 -234 -388 -108 34 8 -34 2 -120 136
5288 136 106 17 -144 101 -142 2 76 60 129 324 402 16 -177 -153 -93 -148 -9 108 -20 -56 147 -28 105
5311 105 -2 -207 -184 58 88 -1 109 64 -108 163 90 10 -263 -41 -178 117 -226 -219 -211 50 -75 -204 -187 -36
5335 -36 -132 -54 115 -151 40 -239 -150 -70 112 -108 -76 62 70 -327 249 106 -142 -87 -112 141 29 94 174 -91
5359 -91 127 263 204 219 188 -176 22 41 -238 177 273 291 126 131 288 -24 214 228 215 25 -34 93 65 -55
5383 -55 -113 50 -67 181 -38 223 100 -275 -204 -387 -442 -100 -181 -57 -166 -178 100 -106 -70 -39 74 -20 -217
5406 -217 -3 -38 27 -334 -21 264 -177 39 -46 -177 61 101 183 8 184 33 -111 98 32 273 -28 96
5428 96 84 -5 273 189 -19 37 116 342 -3 74 -145 -113 3 -50 -17 71 274 -549 16 197 91 -7 156 -41
$$ packed form
5265hj53K80l87J97J25j33n0m0J60j74J41P7j5J91m45j54K80J42k6m2L6j22K56
5288A36l0q9j61K45k43J44P4j6O9J95P8l86j93K4O0n5J39J17j28l6K03j75J33
5311A05j07k05K3K42L0q9J10m5j72K71p3q0k73K22j37K95l43PQK61j25j29J7J51
5335c6r6P8J69k66J91k79Q9Q0J82k20L2J38Ql97N76j43k48N5k5K53j12O5Q0k65
5359i1K18J36n9J5l1l64J98J9k79M15R6J8j65NJ57l12K38J4j3j90n9J27k8j20
5383e5n8J63j17K48k19K61j23l75P1j83n5L42q1J24j09j2K78k06L6L1J13r4j97
5406b17K14l5O5l61L13K85m41K16q5j31K38M0Q2j75J76j51j44K09o6K41l01J24
5428I6j2q9K78q4k08N6P9K26l45P7k19L2J16n3L3Q8K03q23N65J81j06r8J63j97
$$ plain form
5452 -41 -134 -217 -113 -211 14 -162 -309 35 -167 -109 -122 53 123 -249 68 -87 128 -105 108 393 -51 -68 126
5475 126 21 -243 400 -7 46 -145 218 33 -35 115 -261 -31 -6 96 61 -59 391 41 -103 -67 -163 -175
5497 -175 39 143 -146 153 -241 42 41 -62 -199 310 -85 -41 -236 -190 -40 72 -159 -152 37 15 -357 -91
5519 -91 -48 -347 -217 11 -3 -11 -108 23 -35 268 167 26 80 -312 -155 -4 260 196 246 200 -111 -106 133 -114
5543 -114 166 -14 35 83 297 -273 34 89 137 191 -16 -118 348 162 -209 -163 -408 27 -106 -301 -207 -82
5565 -82 -56 108 -138 -157 169 24 -312 96 122 -7 10 12 -229 -340 -103 -105 122 -14 8 -5 -52 146 -28 166
5589 166 268 -86 -301 43 -99 -131 17 -210 49 32 78 90 5 178 -138 2 34 83 121 -333 32 -150 -27
5612 -27 27 -204 -219 -98 -84 -340 84 18 -308 -172 -157 -41 -86 -133 -61 -78 21 -142 84 -157 154 200 -102 241
$$ packed form
5452d1r3q3J04r8K25j76j47L44k02N8j3J75P0l72L17j55K15k33K13K85m44j7J94
5475A26j05k64O43m07N3j91L63j85o8J50l76K30K5J02l5j20M50l50j44L6r6j2
5497a75K14J04k89K99l94K83jj03j37N09l95M4j95M6J50J12k31PJ89k2l72K66
5519i1M3k99J30K28j4qr7J31n8L03j01j41N4l92J57J51K64o4N0m6l11NK39k47
5543a14K80j80M9M8K14n70L07N5M8N4k07j02M66j86l71M6k45M35j33j95R4J25
5565h2K6J64k46j9L26j45l36M08K6j29J7Kk41j11K37kK27j36K2j3m7J98j74J94
5589A66J02l54k15L44j42l2J48k27K59j7M6J2q5J73l16J40L2M9L8m54L65j82J23
5612b7N4k31j5J21J4k56M24o6l26J36J5J16m5m7P2j7R9j63K26k41L11M6l02L43
$$ plain form
5636 241 -8 44 94 -146 -11 74 84 182 17 161 343 89 357 118 224 272 -259 251 85 86 -39 150 -156
5659 -156 -42 129 88 -25 55 -90 -40 -131 -174 -244 -9 103 -278 -247 99 -7 -141 -62 145 -286 -70 -112 296
5682 296 22 -124 238 -362 -2 6 230 133 -258 -74 -92 -218 96 50 77 -153 -66 58 -48 207 -46 19 -280
5705 -280 -144 164 -33 286 -93 173 -97 278 -100 -120 190 243 -157 115 120 -101 127 130 -113 -14 -74 -251 -14
5728 -14 241 0 -214 -189 -279 -135 -3 -78 17 -180 203 -162 -183 19 -57 -105 6 -146 47 -52 118 6 349
5751 349 -261 -358 52 -103 120 214 303 194 170 30 -1 275 480 -15 -151 -6 135 14 20 57 229 35 131
5774 131 -273 103 31 -140 -239 -164 7 -193 -312 31 -113 -181 -26 -133 -33 44 -9 49 162 -152 73 46 142
5797 142 7 -59 -243 191 46 -80 126 -162 160 68 -227 -8 10 73 -38 -56 117 170 169 41 43 97 18 151
$$ packed form
5636B41k49N2N0k40J35Q5J0R8j65J44J82k54K68k39J06M8n31N10j66Jj25J89l06
5659a56J14J71m1j13Q0j45N0r1m3p0K35J12l81L1L46j06j34P9K07m31K16m2M08
5682B96k74j46L62o00L60QK24r7l91J84j8j26L14m6K7k30Q7J24j06K55k53O5k99
5705b80J36L08j97L19l79K66k70L75l78k0L10N3m00K72Nk21K28Lk43R9o0j77K37
5728a4K55k41k14K5r0J44J32p5R5j97L83l65k1K02p6m8J11j52J93r9J70j12L43
5751C49o10r7M10j55K23R4Q9j09k4j40l1K76K05m95j36J45J41j21OL7J72j94R6
5774A31m04L76p2j71r9P5J71k00j19L43j44o8J55j07J00P7n3N8J13l14K25k7R6
5797A42j35o6j84M34j45j26K06k88L22r2k95K19J8O3j11j8J73N3jj28KN4p9J33
$$ plain form
5821 151 -115 155 -269 47 -83 -276 -69 -91 -262 -38 250 122 216 -210 -329 82 29 -199 148 -195 -44
5842 -44 -281 14 97 36 -38 -170 34 -56 -173 -64 -119 -171 149 -36 -141 179 -38 -142 -47 -255 -29 -2 -42
5865 -42 89 210 209 -40 243 -10 169 21 383 252 62 251 81 -73 93 36 76 48 163 132 -189 -99 -298
5888 -298 -138 -166 -97 139 -256 -89 -38 -316 141 -320 -6 -147 -139 -261 10 -300 -47 -30 -129 -194 -21 -328 -151
5911 -151 -345 -36 -45 -90 204 -33 -135 -230 303 75 219 -236 -196 78 13 -64 37 277 303 -172 111 119 358
5934 358 226 76 -34 38 18 25 -477 50 79 -13 -30 -111 217 -292 163 -40 -411 127 -281 -22 8 5 -262 -164
5958 -164 140 -474 -74 141 -149 -30 115 3 31 -184 214 10 -236 136 -139 332 317 -61 31 -29 171
5979 171 44 128 99 167 97 49 -49 100 82 338 122 -22 -157 -226 77 -52 -38 -188 -143 -181 423 62 -106 106
$$ packed form
5821A51k66K70m24L16j30j93K07k2j71K24K88j28R4m26j19M11n3k28L47l43J51
5842d4k37K95Q3o1p4j32K04r0j17J09n5n2L20j85j05L20k17j04R5k08K26K7m0
5865d2J31J21jk49K83k53J79j48L62j31j90J89j70j54J66n7M0k8J15l1l21R0j99
5888b98J60k8O9K36l95J67N1k78M57m61L14j41Qj22K71l10K53J7r9o5J73l07J77
5911a51j94L09rm5K94k37j02r5N33k28J44m55M0K74o5p7J01K40K6m75K83QK39
5934C58j32j50j10P2k0Pn02N27K9r2j7q1L28n09M55k03l71N38m08K59L0lk67R8
5958a64L04o14M00K15k90J19J45j12K8k15L98k04k46L72k75M71j5l78R2o0K00
5979A71j27Q4k9O8p0m8r8J49j8K56k16j44j35o9L03j29J4j50M5l8O04l61j68K12
$$ plain form
6003 106 201 84 -259 91 -82 -177 -197 222 -297 -137 184 -136 -202 -56 -28 -7 127 -354 -116 248 89 219
6025 219 -109 -79 -252 162 -67 -118 203 72 306 -6 58 192 125 141 163 -5 3 241 -157 -60 102 -33 13
6048 13 -232 361 65 60 90 -75 -26 -84 203 98 64 99 -116 -44 99 -25 -112 45 -236 -108 -52 -142 169 12
6072 12 -37 -342 287 -83 45 24 -363 -116 -57 -206 407 26 -215 -173 -169 -309 36 -37 28 81 -255 118 49 75
6096 75 344 20 -311 -207 100 -92 230 230 84 -134 -11 281 136 -281 -207 43 220 68 -250 -74 -136 -149
6118 -149 -304 31 142 121 98 -40 17 -24 -127 -218 -169 -283 -81 72 68 77 101 -136 124 334 29 -47 -65 216
6142 216 -88 19 -173 -45 181 34 346 130 105 55 344 -198 166 -197 162 -94 144 -137 -30 103 19
6163 19 250 44 31 157 172 70 -36 -88 186 111 -87 -96 -29 354 -49 2 15 138 -71 -316 -60 174 -9
$$ packed form
6003A06R5j17l43L50j73r5k0M19n19J60L21l20o6J46K8K1J34m81K38L64j59J30
6025B19l28L0j73M14k29n1L21j31K34l12O4J34o7J6K2j68QK38l98R7J62j35M6
6048A3k45N93k96nL0j65M9n8K87j05l4L5k15P2J43j24q7J57k81J28N6r0L11j57
6072A2m9l05O29l70J28k1l87K47N9j49O13l81k41M2Mj40L45p3O5N3l36L73o9K6
6096G5K69l24l31J04L07j92L22%j46k18J23K92j45m17P4K50J77j52l18J76o2j3
6118a49j55L35J11k1k3j38N7m1j03r1M9j14K02J53mRK4k37K60K10l05p6j8K81
6142B16l04J07j92J28K26j47L12k16k5n0K89n42L64l63L59k56K38k81J07J33q4
6163A9K31k06j3J26J5j02j06n2K74p5j98rO7L83m03N1J3J23k09k45K56K34j83
$$ plain form
6186 -9 -97 157 65 -94 -232 -135 -265 38 109 61 -57 186 -176 -333 31 17 131 39 -9 34 89 9 -146 36
6210 36 12 -135 -1 -25 241 103 66 339 -19 125 56 141 -168 253 151 47 -239 1 115 38 216 -184
6232 -184 -139 -108 213 -129 24 -148 -184 -227 -16 -207 -48 -188 -226 -76 -77 -90 219 -126 -97 -34 -78 46 249 -91
6256 -91 -172 202 -16 -43 -137 -96 129 -65 -29 133 214 78 14 189 -99 -43 77 75 232 -8 5 128 -169 -216
6280 -216 34 212 -105 -140 172 128 45 -50 80 140 -221 -279 61 -30 86 -195 -173 160 3 -174 -78 -268 -136
6303 -136 147 -11 319 -140 -11 -24 -135 114 -36 -39 75 -210 -204 -85 -5 -64 193 -198 56 -23 266 -98 -297
6326 -297 -45 15 29 52 -48 178 36 155 -180 360 122 66 238 -68 80 58 -273 -446 195 131 15 -133
6348 -133 -28 -47 -180 -209 -8 61 -138 -15 82 -189 169 43 -113 23 169 -152 22 249 136 108 195 -231
$$ packed form
6186iq8K54r2j59j38R7j30L03P1m8j18K43l62j57L64j4J14r2m8M3N5q0j55J82
6210C6k4j47J34k4K66j38l7K73l58J44o9Q5l09M21j02j04k86K40J14p7J78m00
6232a84M5L1L21l42J53j72l6m3K11j91J59j40l8J50jj3L09l45K9O3m4J24K03l40
6256i1q1L74k18k7r4M1K25j94L6J62Q1j36o4J75k88N6J20kJ57k40J3J23k97m7
6280b16K50J78l17l5L12m4q3r5J30O0l61n8L40r1J16k81K2L33j57j77R6j90J32
6303a36K83j58L30m59J29j3j11K49j50lJ14k85OJ19Q0n9K57l91K54p9K89l64j99
6326b97K52O0J4K3j00K26j42J19l35N40k38n6J72l06J48k2l31j73O41o4j16j48
6348a33J05j9j33k9K01O9j99J23R7k71L58j26j56J36J46l21J74K27j13k8Q7m26
$$ plain form
6370 -231 -20 361 -28 24 26 129 -36 220 205 -79 -260 53 115 224 368 343 -114 58 246 -9 351 -49
6392 -49 249 244 -85 34 -193 -78 110 65 -124 247 82 -177 140 -27 -172 -106 -266 -43 -276 -139 -249 -209
6414 -209 -33 -252 -43 -70 269 -179 -36 -249 -142 84 162 4 -103 52 -59 83 14 218 187 334 -97
6435 -97 160 -53 317 81 -22 54 -52 154 53 214 64 -162 118 324 56 -22 74 257 -229 -158 -170 -273
6457 -273 -91 307 20 -97 89 66 -392 -242 108 142 -236 -185 34 -109 239 80 -206 -64 5 -160 29
6478 29 16 -100 -128 -227 -89 -88 316 -130 136 34 -60 -100 -5 9 -100 -86 -242 63 207 -24 -155 153 -93 -181
6502 -181 317 -302 -115 -90 72 142 111 -11 136 231 -40 -125 190 -89 134 -129 -67 -36 -190 -144 -16 -168 -239
6525 -239 -307 -296 -134 -142 -74 -113 47 -74 -59 62 184 -184 23 263 274 -137 -60 150 142 59 166 183 58 137 173
$$ packed form
6370b31K11L81l89N2KJ03j65K56j5k84j81L13O2J09J44k5m57J72J88k55L60m00
6392d9K98nl29J19k27J15J88m5j89L71j65k59L17j67j45O6j60K23k33J37j10M0
6414b09J76k19K09k7L39m48J43k13J07K26P8j58j07J55j11J42o9K04l1J47m31
6435i7K57k13L70k36j03P6j06K06j01J61j50k26K80K06k68p8R6J83m86P1j2j03
6457b73J82L98k87j17J86k3m58J50L50L4l78N1K19j43L48j59k86J42O9j65J89
6478B9j3j16k8r9J38JM04m46K66j02r4m0R5J4j09J4j56L05J44k31j31L08k46q8
6502a81M98o19J87K5J62P0l1j22J47R5k71q5L15k79K23k63O2L1j54M6J28j52p1
6525b39o8J1J62qO8l9J60j21J5J21J22l68K07K40J1m11P7K10qq3J07J7j25P9L6
$$ plain form
6550 173 83 72 -210 21 50 -16 171 -2 58 -60 86 44 203 -13 215 -48 3 182 -165 -154 -16 -191 -254
6573 -254 -15 -114 -72 -240 -153 -266 9 -536 -260 -173 -16 -42 -298 -143 -360 -365 75 -103 -103 -178 202 -18 -39 158
6597 158 234 -153 -66 -111 315 176 22 189 148 -58 -43 229 160 -170 97 -16 -206 270 152 -14 110 168
6619 168 -3 -72 5 -144 -18 63 -1 -143 -30 -55 -197 -369 -166 -129 26 -4 -49 -187 57 -161 194 109 -109
6642 -109 -114 -112 -136 -131 -175 -114 -104 -107 -198 -267 -105 184 82 193 -102 -120 101 59 61 -237 61 26 18 178 -49 108 -49
6669 -49 335 -77 196 63 53 -146 69 -8 -86 -53 -70 85 -229 53 23 -240 63 32 -201 -169 448 -365 -207
6692 -207 -89 99 144 -38 -76 103 -49 -229 -147 -30 -73 -20 53 -208 -175 -112 169 -15 246 -66 76 60 -6
6715 -6 -106 -23 -151 134 -221 -10 -53 -171 23 302 -12 19 108 -15 108 -162 -96 -233 -144 -25 544 105 -203
$$ packed form
6550A73r0j1k82K31K9o6J87j73O0j18J46m2J59k16K28k63N1J79l47J1J38j75o3
6573b54K39r9M2j68Q7j13K75n45K76Q7J57k6k56J55k17nM40j78%p5L80k20k1J97
6597A58P6l87Q7m5M26j39j54J67m1k06J5K72o9l30K67j13j90M76j18j66J24N8
6619A68j71o9P7j49J26Q1o4j42J13k5j42j72K03L7J55l0m5j38K44k18L55q5k18
6642a09nKk4Nm4O1J0lr1o9J62K89j02J11k95j8K21m2Kk98K98l5qJ60k27J57j57
6669d9L84m12K73j33j0j99K15p7p8L3j7J55l14K82l0k63L03l1k33L2O17q13J58
6692b07J18J88M5j82l8J79j52j80Q2J17m3N3P3k61L3O3K81j84K61l12J42j6o6
6715fj00Q3j28K85l55K11m3j18J94K79l14L1Q9j23J23k70O6j37Q9J19N69m39l08
$$ plain form
6738 -203 201 165 -91 -43 -35 140 45 -230 -229 -209 120 -77 -191 22 -43 -267 153 258 15 2 22 -194 -197 177
6762 177 122 193 -501 75 180 59 131 -14 -19 106 307 230 140 182 -156 555 250 42 210 -224 -117 -56 315
6785 315 36 71 -21 177 -77 -239 -118 139 29 125 8 -150 46 -237 -383 -97 -11 207 -303 -178 -85 -109
6807 -109 -99 24 -4 -78 -10 -105 47 -15 -335 73 155 56 -25 313 327 227 228 451 -37 134 -252 26 31 13 43
6832 43 58 259 -94 128 -126 15 -150 -21 167 238 15 49 183 -69 -262 -190 -109 299 -3 7 43 -254 95
6855 95 -235 -84 -179 51 -99 -27 62 -70 29 194 -161 121 21 -409 81 -9 26 -375 197 -145 190 66
6877 66 -99 234 -140 52 143 121 -104 -125 -215 253 36 -3 -181 -153 66 280 169 54 -84 -115 -47 212 -26
6900 -26 106 60 208 60 249 7 -10 -221 38 -226 -81 -207 -37 51 -169 43 -94 231 -76 -108 154 -228
$$ packed form
6738b03M04l6k56M8QJ75r5k75JK0L29j97j14K13o5k24M20J05k43j3K0k16lL74
6762A77n5P1o94N76J05j21P2j45nJ25K01p7r0M2l38P11l05k08J68m34J07O1L71
6785C15k79L5r2J98k54j62J21K57j10R6j17j58J96k83j46K86Q6K18n10J25R3k4
6807a09J0J23k8p4O8r5J52o2l20M08Q2r9q1L38J4j00JK23m88J71l86K78Nj8L0
6832D3J5K01l53K22k54J41j65J29J88P1k23L4J34k52j93P2Q1M08l02J0L6k97L49
6855I5l30J51r5K30j50P2Q9j32R9J65l55K82j00m30M90r0L5m01N72l42L35j24
6877F6j65L33l74J92R1k2k25k1r0M68k17l9j78K8K19K14j11j15j38l1O8K59k38
6900b6J32m6J48j48J89k42j7k11K59k64J45j26J70Q8k20K12j37L25l07l2K62l82
$$ plain form
6922 -228 -263 -142 -124 -77 -24 87 -218 329 47 15 -84 -295 1 -29 286 -35 -18 157 364 -98 305 -325 118
6945 118 -93 -116 5 -104 172 -37 25 18 280 -252 16 119 -106 121 -233 56 29 233 12 -136 350 26
6967 26 -171 9 -159 -132 -132 -142 -154 -3 3 -154 -155 -219 -5 84 108 -275 -239 41 131 -125 153 -167 -318 -38 5
6992 5 366 -115 185 -121 99 151 -245 25 -130 -183 19 -35 178 -56 -163 242 -95 -159 5 30 -217 -175 -84
7015 -84 51 75 285 -207 7 153 -48 -186 49 -83 -88 154 -287 -165 66 -159 -4 305 -32 2 33 -16
7037 -16 -39 -40 -80 -45 -23 -66 -90 -221 -177 -20 -344 212 90 -58 -78 -68 137 168 298 183 -89 -84 1 17 148 189
7063 189 34 -10 -128 -273 289 20 88 90 208 0 -131 -245 -79 170 -77 206 -211 -194 -66 -24 164 171 -356
7086 -356 110 375 -294 -77 174 320 -18 -92 67 -80 -302 -107 41 181 -12 423 72 -181 -182 -131 292
$$ packed form
6922b28l5J21J8M7N3J11l05N47k82l2r9k11K96l0L15l21J7J75K07m62M03o30M43
6945A18k11k3J21j09K76k09O2pK62n32K68J03k25K27l54K89k7K04k21j48M86l24
6967B6j97J80j68K7%j0j2J51Oj57jo4K14Q9K4l83L6K80R0k56K78l20j51K80M3
6992EL61m81L00l06K20N2l96K70j55n3K02n4K13k34j07M05l37o4J64K5k47M2R1
7015h4J35K4K10m92K14J46k01j38K35j32nK42m41J22K31k25J55L09l37L4L1m9
7037a6k3jm0L5K2m3k4j31M4J57l24N56j22j48k0J0K05L1J30j15k72NQ5J6J31M1
7063A89j55m4j18j45N62k69O8KJ18k08j31j14J66K49k47K83m17J7J28M2J88Pn27
7086c56M66K65o69K17K51J46l38p4J59j47k22J95J48J40j93M35l51k53jN1M23
$$ plain form
7107 292 106 -12 190 77 222 -94 -93 39 -51 56 -72 136 79 93 387 276 -123 -223 192 76 169 -77
7129 -77 321 -72 -23 -9 220 44 22 86 58 -239 9 -271 115 43 -122 -506 60 -463 -35 59 71 -33 -177
7152 -177 -204 21 68 -229 419 -40 143 -202 362 -89 16 138 45 -121 154 50 241 -119 146 -47 373
7173 373 -179 -102 86 389 375 48 237 122 -75 171 148 129 -151 97 186 -78 85 -12 154 263 -55 -244
7195 -244 -161 -142 -30 -336 -174 4 -65 -68 -140 -285 -123 6 -81 -37 19 -118 -107 -26 85 -190 -94 30 -200 -54
7219 -54 77 -127 161 121 37 -44 138 182 127 -199 -122 252 -159 320 176 86 -96 -96 -257 59 -64 -142 150 -119
7243 -119 148 -44 0 -234 350 -254 -53 52 181 -221 -124 -195 -171 -114 134 26 -26 55 -3 73 -11 -11 -8 -126 7
7268 7 -156 44 192 -196 -29 -75 189 133 7 -121 144 312 -326 -87 341 102 366 142 195 292 5 151
$$ packed form
7107B92j86j18K02j13J45l16JJ32r0J07j28K08n7J4K94j11l99j00M15j16R3k46
7129g7L98l93M9J4K29j76k2O4k8k97K48k80L86p2j65l84N66n23M28R4J2j04j44
7152a77k7K25M7k97O48m59J83l45N64m51J05J22r3j66K75j04J91l60K65j93M20
7173C73n52P7J88L03j4l27J89j15j97K46k3j9k80K48Q9k64J63r7J66J09l18j89
7195b44Q3J9J12l06J62J78o9lp2j45J62J29q7M4N6j37J1Q1J11k75R6J24k30J46
7219e4J31k04K88m0q4q1J82M4n5l26P7L74m11M79j44r0j82%j61L16j23p8K92k69
7243a19K67j92M4k34N84o04K01J05J29m02R7p1K4N7K48j08n2Q1n8P6q4%Lj18J33
7268Gj63K00J48l88J67m6K64n6j26j28K65J68o38K39M28k39K64k24N3R7k87J46
$$ plain form
7290 151 33 261 112 45 -56 167 127 213 93 155 -286 -170 207 219 -297 -284 118 -242 204 15 -195 -47
7312 -47 180 -46 -2 105 11 -150 -136 308 -238 113 -123 -76 -4 128 99 -68 -166 72 36 178 246 12 -66 325
7336 325 -97 419 -115 -399 -72 101 93 -170 239 284 -13 -36 -153 92 255 -10 -66 147 32 -151 -234 108
7358 108 -182 -114 -151 8 -109 -423 -27 68 -18 239 127 -273 10 -128 -167 110 -257 -15 -314 208 227 -139
7380 -139 -117 223 -103 -64 434 -12 -63 254 -37 412 -299 254 -129 185 -35 145 -152 33 -58 -123 -50 -4
7402 -4 -142 -209 -110 59 117 38 -246 -113 68 67 58 -167 -152 430 -210 -320 -30 -312 -106 -168 -304 193 90 -73
7426 -73 52 178 -314 -130 -102 4 -137 74 235 -13 107 162 -134 -62 -126 -308 31 100 -29 37 -95 -103 -298
7449 -298 -38 0 -320 38 38 157 -56 -117 191 -109 -103 -336 126 -97 -392 -101 11 67 -59 586 -133 92
$$ packed form
7290A51j18K28j49o7j01K23m0Q6j20O2m41J16L77J2n16J3M02l60M46j89k10J48
7312d7K27k26M4J07r4j61J4M44n46L51k36M7P2J32k9j67r8K38l6J42O8k34p8L91
7336C25m22N16n34k84L27J73qk63M09M5k97k3j17K45J63k65n6K13j15j83q3L42
7358A08k90O8l7J59j17l14L96R5q6K57j12m00K83j38l9K77l67K42k99N22J9l66
7380a39K2L40l26L9M98m46n1L17k91M49p11N53l83L14k20J80k97J85r1o5P3M6
7402dj38o7R9J69N8p9k84J33J81jrk25J5N82o40j10K90k82K06o2j36M97j03j63
7426g3J25J26m92J84K8J06j41K11J61k48J20N5k96P2o4j82L39O9j29O6j32qj95
7449b98K60L8l20L58%J19k13o1L08l00Ok33M62k23k95K91J12N6j26O45p19K25
$$ plain form
7471 92 -92 26 9 202 49 -285 -149 81 39 -136 -53 -96 -120 -103 -252 -206 47 -443 305 -255 12 -54 -62 -77
7495 -77 -53 22 220 250 150 38 316 199 114 45 160 90 -59 -6 74 165 6 314 318 86 -58 75 10 232
7519 232 -305 -85 -143 99 -6 25 -103 -16 185 -157 171 159 241 323 19 -185 74 11 -5 -491 28 -15 -153
7542 -153 -184 173 -267 2 -132 11 251 -130 -155 103 246 -121 -16 80 44 120 393 -273 134 131 -66 -42 311
7565 311 -136 -23 -16 91 177 61 298 44 52 244 258 170 62 182 -14 265 253 64 154 -79 -2 -26 -214 36
7589 36 -23 49 96 177 -12 150 73 -54 -317 50 218 28 -31 44 -59 -93 33 -44 134 -158 216 107 -62
7612 -62 28 289 150 96 -42 -102 -164 -10 51 -189 35 121 98 121 244 89 -309 173 -23 -171 80 18 -100
7635 -100 279 60 183 -84 -335 -90 79 3 -106 88 3 -222 10 -166 -178 -400 -292 -11 -174 -214 60
$$ packed form
7471I2j84J18j7J93j53l34J36K30m2j75Q3m3k4J7j49M6K53m90P48n60K67o6qj5
7495g7K4P5J98L0j00j12K78j17q5o9J15p0j49N3Q0R1j59L08Mk32j44J33o5K22
7519B32n37K20n8K42j05L1j28Q7K01l42L28j2Q2Q2l04k04K59o3j6m86N19m3j38
7542a53l1L57m40K69j34J43K40l81k5K58J43l67J05R6l6P6K73o66M07lj97K4L53
7565C11m47J13PJ07Q6j16K37k54QJ92J4q8j08J20j96K79j2j89R0k33P7k4j88K50
7589C6n9P2M7Q1j89J62p7j27k63L67J68j90n9P5j03l4J26p7J78k92L74j09j69
7612f2R0K61j39n4j38o0o2J54O1k40K24Q6k3K3J23j55l98M82j96j48K51o2j18
7635a00L79k19J23k67k51K45J69p6j09J94q5k25K32j76j2k22J08K81j63m0K74
$$ plain form
7656 60 -50 -84 32 -89 -190 -86 120 15 -14 -273 -5 91 479 52 308 -208 27 88 -216 9 24 -49
7678 -49 248 265 207 9 -187 126 -170 -6 122 267 170 86 127 203 -166 -58 116 49 234 -109 -169 13 -140
7701 -140 81 -136 61 125 -94 205 -66 229 220 38 83 -18 218 -139 -91 94 -39 74 86 -235 196 450
7723 450 61 126 -151 -146 -21 195 279 -24 173 55 98 367 230 19 40 -151 384 416 161 307 211 210 -294
7746 -294 -82 167 209 -227 79 102 48 -22 101 -46 155 171 -150 59 -136 321 241 132 -101 44 -11 -52 -165
7769 -165 -130 43 -313 -46 -92 -231 -2 -61 -438 -223 -55 28 256 -19 -59 162 18 -153 364 217 -166 -10
7791 -10 181 25 -128 -245 45 106 -52 -43 174 -186 10 -27 -4 -31 -111 -82 -97 28 11 395 266 -2 -294 293
7815 293 29 -51 -197 -60 53 62 18 17 -74 -159 25 -34 123 27 -12 -135 -118 -80 -44 157 179 -213 179 -106 20
$$ packed form
7656F0j10l4J16j21j01J04K06j05k9k59K68R6L88m27K56n16K35O1l04K25J5p3
7678d9K97J7n8j98j96L13k96J64J28J45r7q4M1P6l69J08J74o7J85l43o0J82j53
7701a40K21k17J97O4k19K99k71K95rj82M5j01K36l57M8J85j33J13J2l21M31K54
7723D50l89O5k77NJ25K16Q4l03J97j18M3K69j37k11K1j91N35L2k55J46r6jn04
7746b94K12K49M2m36L06K3n4p0J23j47K01J6l21K09j95M57q0j09k33J45n5m1j13
7769a65L5J73l56K67m6j39K29n9l77K15J68Q3K28k75m0K21j44j71N17j47l83J56
7791a0J91j56j53j17K90O1j58RK17l60J96l7K3k7q0K9j5J25j7L84j29k68k92N87
7815B93k64q0j46J37J13Rm4jr1q5J84n9J57r6l9j23J7L8L6K01K2l92L92k85J26
$$ plain form
7840 20 58 18 -143 -26 -67 180 -47 21 -101 69 100 259 78 103 -201 26 68 -243 -202 -97 -154 52 -33 -8
7864 -8 199 -195 -204 21 214 -122 32 -149 -128 42 43 -56 203 -70 -200 82 -187 -67 132 -119 -436 -108 -46
7887 -46 -177 -108 68 -25 -161 27 -91 -77 86 228 -307 135 214 212 -299 50 87 -151 -106 33 137 328 112
7910 112 -261 43 13 -6 103 -67 -89 121 15 133 107 -32 68 135 -138 -72 -67 213 249 103 -271 23 -180
7933 -180 -253 21 -112 -247 55 -220 -8 -165 228 -58 83 -10 -233 -56 144 -71 35 108 19 -17 144 84
7955 84 -213 119 -133 -34 -41 -43 208 114 -110 25 -67 86 146 -36 42 80 -72 275 -141 -192 -25 -25 26 -150 69
7980 69 245 -7 76 76 -228 86 -175 -85 -343 -10 -55 -12 302 -92 181 -59 379 225 78 -28 103 -35
8002 -35 -77 105 102 140 128 -134 41 37 -253 20 227 -127 -293 -91 5 128 60 -240 129 204 268 -23 -28 -78 210
$$ packed form
7840B0L8m0j61J17m1K47k27O8j22J70L1J59j81K5l04K27M2l11M1J05n7K06q5K5
7864hK07l94rK25J93l36J54j81K1J70Jr9K59k73j30K82k69J20J99k51l17L28O2
7887d6j31O9J76r3j36J88j18J4J63J42n35M42P9kn11L49L7k38M5J39J04J91k16
7910A12l73L04l0j9J09j70k2K10j06J18k6j39J00O7k73O6NK80L6j46l74K94k03
7933a80p3K74j33j35L02k75K12j57L93k86J41r3k23J77K00k15J06P3q9l6J61o0
7955H4k97L32k52R9pkK51r4k24J35r2J53O0j82P8L8j52L47m16n1J67%N1j76K19
7980F9J76k52Q3%l04L14k61R0k58L33m5M3L14l94K73k40M38j54j47j06J31j38
8002c5m2J82lL8j2k62J75mk90K73K07l54j66K02R6J23o8l00L69P5O4k91nn0K88
$$ plain form
8027 210 274 118 -63 -66 148 -169 38 62 -131 -76 107 -56 -128 136 -60 -44 435 -136 -139 -120 -13 138 -134
8050 -134 -342 -109 364 -28 -97 145 338 -87 21 78 207 187 -304 -18 117 -1 -168 19 74 -179 142
8071 142 -173 -104 56 21 -74 -85 -70 -149 -501 55 138 250 259 244 -507 96 12 123 -186 51 255 -197 183 77
8095 77 82 -295 -35 -111 199 5 -69 -37 -311 7 -204 30 100 -6 -172 -204 312 240 192 -117 309 -48 -127 -228
8119 -228 152 47 -116 -130 -190 -49 -3 -183 156 165 60 -115 163 205 -9 -38 -110 -104 115 234 24 169 15
8142 15 101 -336 -118 -254 -278 -65 233 -69 1 9 149 -125 -70 -177 90 -495 -9 -156 -136 -393 -358 -51 56
8165 56 249 -119 0 143 118 99 39 -111 95 44 -35 -314 51 239 -3 38 188 120 174 54 -35 -64 -137 94
8189 94 153 -64
$$ packed form
8027B10O4j56j81lK14l17K07K4j93N5J83j63p2K64j96J6M79n71lJ9J07J51k72
8050a34k08K33M73l92o9K42J93m25J08N7J29k0m91K86J35j18j67J87N5k53L21
8071A42l15O9J60l5r5j1J5p9l52N56Q3J12Rj5p51O03q4J11l09K37K04m52L80j06
8095G7Nl77K60p6L10j94p4L2k74L18k11K34P0j06j66l2N16p2m8l09M26l57p9j01
8119b28L80j05j63j4o0J41M6j80L39Rj05j75K78M2k14k9p2OK19J19k10J45j54
8142A5Q6m37K18j36k4K13K98l02P0QJ40k74N5j07K67n85M86j47K0k57L5L07J07
8165E6J93l68J19J43k5j9o0j50K06n1p9k79L65J88k42M1J50o8N4j20q9k9p3K31
8189I4N9k17
8191f4
$$ Imaginary data points
##PAGE= N=2
##DATA TABLE= (X++(I..I)), XYDATA
$$ plain form
0 0 0 0 0 0 0 0 0 0 -4 3 -8 8 -8 8 -13 16 -16 24 -24 32 -36 40 -48 56 -64 72 -82 92 -106 118 -132 149 -167
33 -167 187 -206 230 -259 285 -317 351 -389 430 -475 527 -584 648 -722 805 -901 1016 -1150
51 -1150 1314 -1516 1776 -2122 2609 -3339 4560 -6969 13496 -66412 -186929 17130 86689
64 86689 -70088 -107988 61371 81162 -56665 -49934 87718 56377 -81438 -61545 51016
75 51016 14512 -75915 -23887 58729 -800 -61681 16171 78996 -1071 -65118 -1415 48384
87 48384 -12544 -54721 235 37684 -10195 -32990 23902 48822 -6687 -28591 18692 29739
99 29739 -14586 -12239 25944 6947 -30966 644 40564 5379 -31776 2478 30661 -9598
111 -9598 -34982 4053 19459 -25583 -35869 8920 14394 -23923 -17386 14169 -5369 -28960 3902
$$ packed form
0@%%%%%%%%mPj1J6j6J6k1K9l2M0m8N6o8P6q8J04j20J36j54J74j98K24k50K81l16
33a67L54l93M36m89N44o02O68p40Q19r05J002j111J232j370J527j706J917k166
51a150K464k830L292l898M731n948P899j1529K0465p9908j20517K04059O9559
64H6689j56777l7900J69359J9791j37827O731J37652l1341j37815J9893J12561
75E1016l6504r0427N2028Q2616n9529o0881P7852O2825q0067o4047O3703M9799
87D8384o0928m2177N4956L7449m7879k2795N6892K4920n5509k1904M7283J1047
99B9739m4325K347L8183j8997l7913L1610L9920l5185l7155L4254K8183m0259
111i598k5384L9035J5406m5042j0286M4789N474l8317O537L1555j9538k3591L2862
$$ plain form
124 3902 22572 -17550 -29043 16422 25497 -17346 -18907 25698 26888 -14920 -16122 22358 24136
137 24136 -9422 -10369 16059 12335 -8918 -1141 16010 3323 -11975 659 11178 -1245 -8710
150 -8710 3370 6748 -8381 -12756 8065 15476 -6729 -17131 6670 18026 -3341 -10539 9283
163 9283 10576 -7580 -1861 14686 6750 -7457 1106 9890 657 -2624 8357 6836 -10387 -8589
177 -8589 12626 12486 -10584 -12194 7327 6801 -8067 -2660 8647 -916 -9425 1127 6853 134
191 134 -1260 2407 -789 -3263 2687 6862 1873 -5361 -4578 3540 5953 -1561 -6284 -1013 3233 -865
207 -865 -4902 -2599 2681 772 -6697 -5757 5541 5459 -5869 -5494 5266 4978 -1892 999 5168 2392
223 2392 1726 4772 3673 2129 3142 4229 2500 452 254 3462 3891 -3201 -7306 -881 2050 -5899
$$ packed form
124C902J8670m0122j1493M5465R075m2843j561M4605J190m1808j202L8480J778
137B4136l3558r47K6428l724k1253P777J7151j2687j5298J2634J0519j2423p465
150h710J2080L378j5129m375K0821P411k2205j0402K3801J1356k1367p198J9822
163I283J293j8156N719J6547p936j4207Q563Q784r233l281J0981j521j7223J798
177h589K1215j40k3070j610J9521n26j4868N407J1307r563q509J0552N726o719
191A34j394L667l196k474N950M175m989p234P83Q118K413p514m723N271M246m098
207h65m037K303N280j909p469R40J1298q2j1328L75J0760k88o870K891M169k776
223B392o66L046j099j544J013J087j729k048j98L208M29p092m105O425K931p949
$$ plain form
239 -5899 -9450 -3697 -2334 -8337 -10795 -5308 -2506 -8423 -11917 -6310 -1961 -6237 -6879 -269 -2375
254 -2375 -9205 -944 9107 365 -6860 3463 9931 660 -1745 8502 9233 -872 -1170 8846
268 8846 10139 401 -1379 5521 4434 -2570 2174 8536 -1136 -8162 2367 7919 -2618 -6934 2369
283 2369 3360 -5311 -4879 4109 3191 -6288 -7527 2394 4953 -4733 -6599 2037 1481 -7764 -4013 4124
299 4124 -2706 -10109 -1667 4821 -3344 -7353 721 3400 -4330 -5241 4809 7011 -3181 -4036 8229
314 8229 9178 -1591 534 12537 7444 -2083 5679 14943 4664 -2048 7772 11636 1090 -1168
328 -1168 7131 7932 -2382 -4397 4687 4425 -6623 -6303 4039 444 -10983 -5785 3815 -3768 -11056
343 -11056 -1733 3708 -5605 -8432 686 3728 -4190 -5909 3158 5448 -2674 -3713 6260 6095 -3957
$$ packed form
239e899l551N753J363o003k458N487K802n917l494N607M349m276o42O610k106
254b375o830Q261J0051q742p225J0323O468r271k405J0247P31j0105k98J0016
268H846J293r738j780O900j087p004M744O362r672p026J0529N552j0537m316R303
283B369R91q671M32Q988r18r479j239R921K559r686j866Q636n56r245L751Q137
299D124o830p403Q442O488q165m009Q074K679p730r11J0050K202j0192q55J2265
314H229R49j0769K125J2003n093r527P762R264j0279o712R820L864j0546k258
328a168Q299Q01j0314k015R084k62j1048L20J0342l595j1427N198R600p583p288
343a1056R323N441r313k827R118L042p918j719R067K290q122j039R973j65j0052
$$ plain form
358 -3957 -2363 8650 4505 -5768 -169 7958 987 -5251 1300 4633 -2633 -5057 2395 3671 -3929
373 -3929 -5958 1837 3198 -4440 -4334 4223 2010 -6521 -1560 7315 1164 -6715 873 5931 -991
388 -991 -4103 2417 3780 -2731 -4281 2144 3663 -3973 -5769 1664 2162 -5560 -4379 2972 -1000 -7240
404 -7240 -1244 3814 -2354 -6043 754 3119 -2946 -3571 2053 2931 -2750 -3011 3530 3253 -3850 -3220
420 -3220 4515 1277 -6037 -1816 4441 -1414 -6659 -36 2832 -3751 -5633 914 1402 -3352 -3470 1771
436 1771 1799 -2942 -1597 4364 3218 -2342 1577 7242 2808 -1828 4932 8106 1267 58 6494 6432
452 6432 267 612 5441 4089 -910 -647 3204 1477 -3529 -2369 1921 -1131 -6442 -2509 1351 -3771
468 -3771 -6348 -1175 -536 -5221 -3974 427 -708 -3371 -1678 1444 891 -1117 -64 2650 2153 -601
$$ packed form
358c957J594J1013m145j0273N599Q127o971o238O551L333p266k424P452J276p600
373c929k029P795J361p638J06Q557k213q531M961Q875o151p879P588N058o922
388i91l112O520J363o511j550O425J519p636j796P433M98p722J181P351l972o240
404g240N996N058o168l689O797K365o065o25N624Q78n681k61O541k77p103O30
420c220P735l238p314M221O257n855n245O623K868o583j882O547M88m754j18N241
436A771K8m741J345N961j146n560L919N665m434m636O760L174o839j209O436o2
452F432o165L45M829j352m999K63L851j727n006J160M290l052n311L933L860n122
468c771k577N173O39m685J247M401j135k663J693L122n53k008J053K714m97k754
$$ plain form
484 -601 2152 5541 1753 -588 4162 5780 997 416 4785 3748 184 1486 3371 2820 562 1050
500 1050 2591 2464 182 679 2638 900 -665 2237 2924 -1838 -2121 2834 1255 -3682 -1636 1701
516 1701 -1121 -4868 -2524 -44 -2428 -5299 -3745 -1702 -3628 -5579 -3119 -1473 -5099 -4666 -99
531 -99 -1001 -4799 -1541 2753 -710 -2865 2574 4573 650 -253 3454 5125 2284 1104 3351 4788
547 4788 2258 801 3659 3345 -1061 -42 3262 491 -3190 -165 1850 -2990 -4482 -929 -303 -3401
563 -3401 -4460 -2269 -924 -2460 -3640 -1057 -257 -2744 -2354 739 -504 -2456 424 1998 -2050 -2559
579 -2559 2499 2101 -2679 -1860 1829 1489 -1564 -1460 871 984 -1467 -972 1536 820 -1635 -64 1568
596 1568 -704 -620 2824 2060 -2176 464 4539 1841 -1455 798 3362 1971 -156 883 3136 2218
$$ packed form
484f01K753L389l788k341M750J618m783n81M369j037l564J302J885n51k258M88
500A050J541j27k282M97J959j738j565K902O87m762k83M955j579m937K046L337
516A701k822l747K344K480k384k871J554K043j926j951K460J646l626M33M567
531i9r02l798L258M294l463k155N439J999l923r03L707J671k841j180K247J437
547D788k530j457K858l14m406J019L304k771l681L025K015m840j492L553O26l098
563c401j059K191J345j536j180K583Q00k487L90L093j243j952K880J574m048n09
579b559N058l98m780Q19L689l40l053J04K331J13k451M95K508p16k455J571J632
596A568k272Q4L444p64m236K640M075k698l296K253K564j391k127J039K253r18
$$ plain form
612 2218 -1074 -321 2127 1164 -986 575 1205 -1304 -865 2172 286 -3266 -993 2067 184 -2216
628 -2216 -326 1870 491 -1854 -159 3621 1709 -1584 7 2906 138 -756 2655 1251 -2924
643 -2924 -601 3413 -44 -3426 -417 1814 -1638 -3995 -702 1894 -1240 -4531 -1291 1848 -974
658 -974 -3075 535 1496 -1455 -252 2994 1273 -1311 2205 3857 1086 616 3705 4023 921 -304
674 -304 2838 5069 1669 -2224 272 3170 541 -2158 83 417 -2761 -2533 -492 -1925 -3351 -2215
690 -2215 -2081 -3477 -3241 -962 -486 -3354 -4816 -1090 1311 -1815 -4397 -199 1247 -2385 -1693 1924
706 1924 649 -2537 -488 1489 -310 -772 2190 1297 -1780 -1143 2864 3050 -742 -1893 2305 3552
722 3552 -692 -357 3587 2893 -814 896 3766 1877 683 1887 974 142 984 2145 131 -1550
$$ packed form
612B218l292P53K448r63k150J561O30k509M39L037j886l552K273L060j883k400
628b216J890K196j379k345J695L780j912l293J591K899k768q94L411j404m175
643b924K323M014l457l382L009K231l452k357L293K596l134l291L240L139k822
658i74k101L610R61k951J203L246j721k584L516J652k771m70L089L18l102j225
674c04L142K231l400l893K496K898k629k699K241L34l178K28K041j433j426J136
690b215J34j396K36K279M76k868j462L726K401l126k582M198J446l632O92L617
706A924j275l186K049J977j799m62K962q93l077O37M007J86l792j151M198J247
722C552m244L35L944o94l707J710K870j889j194J204r13q32Q42J161k014j681
$$ plain form
738 -1550 -1578 548 136 -2603 -3506 -959 -904 -4335 -3879 -549 -1293 -4396 -3807 -1790 -1552 -1577 -1662 -1852 -1383
757 -1383 -440 406 690 319 342 1939 2412 465 1722 4678 2773 -598 1919 4743 2648 756 1650
774 1650 1993 803 1743 2336 368 -351 100 923 197 -676 19 723 -882 -2277 561 2391 -540 -2420
792 -2420 -308 967 -332 5 491 -1068 -838 483 -186 -697 -267 -372 -473 -1012 -1184 31 603 -1842
810 -1842 -2934 324 2068 -1375 -2045 -94 630 -561 -162 497 481 358 182 1201 1397 965 993 1818
828 1818 420 -403 2430 2756 -773 -1056 1893 1884 -1462 -498 1341 15 -1852 -372 439 -426 -1354 -1139
846 -1139 -401 -888 -1024 317 316 -1718 -1485 1544 1384 -1647 -732 1463 55 -1399 439 1153 -182 -1018
864 -1018 -589 -228 -58 -860 -789 -1329 -1943 -2234 -564 -641 -2752 -2577 29 -536 -2815 -1024 765 -865
$$ packed form
738a550k8K126m12k739r03K547N5l431M56L330p44l103N89K017K38k5q5j90M69
757a383R43Q46K84l71K3J597M73j947J257K956j905l371K517K824k095j892Q94
774A650L43j190R40N93j968p19M51Q23p26q73O95P04j605j395K838J830k931j880
792b420K112J275j299L37M86j559K30J321o69n11M30j05j01n39j72J215N72k445
810a842j092L258J744l443o70J951P24j191L99O59j6j23j76J019J96m32K8Q25
828A818j398q23K833L26l529k83K949rl346R64J839j326j867J480Q11q65r28K15
846a139P38m87j36J341jk034K33L029j60l031R15K195j408j454J838P14j335q36
864a018M29L61J70q02P1n40o14k91J670p7k111J75K606n65k279J791J789j630
$$ plain form
882 -865 -1861 269 1490 642 -482 221 1874 1431 493 2136 2749 729 154 3327 2827 -109 1000
899 1000 2857 345 -1133 1884 2418 -808 -1836 213 833 -641 -1255 -248 -334 -1738 -2128 95 48
916 48 -2344 -1785 584 -977 -2302 -146 693 -1566 -1934 523 237 -1332 -948 -381 -36 -236 -702 21
934 21 223 -882 -729 1427 964 -818 618 2181 261 48 2558 2883 410 663 2238 2540 1941 1131
952 1131 2140 2774 1440 414 2289 2135 -239 -192 1827 81 -1265 129 561 -2197 -2609 -261 -977
969 -977 -2604 -2664 -988 -1127 -2549 -2589 -788 -705 -2635 -1969 487 -278 -2171 -384 1431 -346 -802 1236
987 1236 1468 -119 358 1480 979 464 804 1296 1171 529 288 1516 788 -419 187 1347 163 -961
1005 -961 988 972 -546 -527 1126 583 -351 -29 565 451 115 -163 443 491 -883 -759 309 -295 -1533
$$ packed form
882h65r96K130J221q48j124P03J653m43r38J643O13k020n75L173n00k936J109
899A000J857k512j478L017N34l226j028K049O20j474o14J007q6j404l90K223m7
916D8k392N59K369j561j325K156Q39k259l68K457k86j569L84N67L45k00m66P23
934B1K02j105J53K156m63j782J436J563j920k13K510L25k473K53J575L02n99q10
952A131J009O34j334j026J875j54k374M7K019j746j346J394M32k758m12K348p16
969i77j627o0J676j39j422m0J801Q3j930O66K456p65j893J787J815j777m56K038
987A236K32j587M77J122n01n15L40M92j25o42k41J228p28j207O06J160j184j124
1005i61J949j6j518J9J653n43r34L22N94j14l36k78O06M8j374J24J068o04j238
$$ plain form
1024 -1533 -369 202 -1863 -1893 68 -1002 -2493 -1221 -280 -1358 -1452 -726 -429 -1130 -1209 -674 556 -142
1042 -142 -1129 228 1096 -103 -436 1545 1530 -165 843 1970 840 296 1210 1053 245 639 1099 519
1060 519 218 272 218 410 -526 -399 983 261 -1037 31 1382 0 -829 533 739 -74 96 1012 566
1079 566 -163 266 497 410 98 -379 104 354 -870 -954 740 -734 -1913 -430 394 -1793 -1995 -61
1097 -61 -603 -1851 -1314 368 -521 -1391 -485 640 238 -283 120 1449 1199 -475 788 2315 601 428
1115 428 2137 1937 413 801 2205 1119 93 667 1361 605 81 483 744 500 -852 -178 1032 -260
1133 -260 -1620 150 785 -1268 -1258 440 -133 -1425 -762 9 -666 -1141 -945 -536 -493 -1541 -1270 -305 -344
1152 -344 -2046 -942 384 -1329 -2122 -71 80 -1489 -639 698 186 -674 506 859 625 -72 829
$$ packed form
1024a533J164N71k065l0J961j070j491J272R41j078r4P26K97p01p9N35J230o98
1042a42r87J357Q68j199l33J981j5j695J008J127j130n44R14j57q08L94M60n80
1060E19l01N4n4J92r36J27J382p22j298J068J351j382q29J362K06q13J70R16m46
1079E66p29M29K31q7l12m77M83K50j224q4J694j474j179J483Q24k187k02J934
1097f1n42j248N37J682q89q70R06J125m02n21M03J329k50j674J263J527j714j73
1115D28J709k00j524L88J404j086j026N74O94p56n24M02K61k44j352O74J210j292
1133b60j360J770O35k053J0J698n73j292O63P71o75m75J96M09M3j048K71R65l9
1152c44j702J104J326j713p93K051J51j569Q50J337n12q60J180L53k34o97R01
$$ plain form
1169 829 1546 1532 533 1034 2492 1203 354 1839 2484 460 343 1984 903 -339 457 797 -71 -672
1187 -672 -272 -145 -637 -1153 -930 -821 -1392 -2231 -885 -182 -1669 -1960 -210 -470 -2022 -774 114 -505
1205 -505 -1322 -101 73 -452 -613 3 211 64 -505 360 1140 117 -635 745 1180 -641 123 1234
1223 1234 803 -357 597 1247 514 181 1024 1224 788 475 802 1474 692 98 1427 1273 -206 -147 1479
1242 1479 361 -928 64 309 -690 -919 46 -444 -773 -875 -565 -810 -1213 -1363 -1006 -475 -1440 -1053 -7
1261 -7 -170 -1382 -626 462 -674 -732 379 749 -232 9 845 429 492 231 243 903 470 -146 580 1247
1281 1247 -35 224 1060 282 -593 618 1229 -40 -194 610 584 40 303 681 579 128 43 441 856
1300 856 -28 -411 685 615 -713 -324 422 -603 -970 -62 -622 -1047 -718 -231 -1109 -1393 -1023 -1122 -911 -999
$$ packed form
1169H29P17j4r99N01J458j289q49J485O45k024j17J641j081j242P96L40q68o01
1187f72M00J27m92n16K23J09n71q39J346P03j487k91J750k60j552J248Q88o19
1205e05q17J221J74n25j61O16K08j47n69Q65P80j023p52J380M35j821P64J111
1223A234m31j160R54O50p33l33Q43K00m36l13L27O72p82n94J329j54j479N9J626
1242A479j118j289R92K45r99k29R65m90l29j02L10k45m03j50L57N31r65L87J046
1261gj63j212P56J088j136n8J111L70r81K41Q36m16O3k61J2O60m33o16P26O67
1281A247j282K59Q36p78q75J211O11j269j54Q04k6n44K63L78j02m51q5L98M15
1300H56q84l83J096p0j328L89P46j025l67R08n60m25L29M87q78k84L70r9K11q8
$$ plain form
1320 -999 -1360 -497 -239 -1120 -989 1 -583 -613 354 474 -37 -298 1054 383 347 608 795 759 1008 709 1049
1341 1049 1344 666 565 1585 1214 5 257 1277 184 -145 819 646 -278 98 248 136 -153 215
1359 215 221 148 -229 -264 634 -83 -1112 -680 344 -820 -1455 -330 -28 -1477 -1163 -331 -1017 -1743 -468
1378 -468 -598 -931 -852 -477 -545 -744 -792 -111 479 331 -360 505 934 295 833 1477 965 452 1235 1861 835
1399 835 1128 1393 1136 702 892 1012 936 874 -250 348 742 -178 -812 595 270 -1133 -445 -100 -520 -1093
1419 -1093 -606 -620 -815 -688 -462 -521 -973 -828 -507 56 -839 -1178 -1 155 -1068 -785 301 -314 -1388
1438 -1388 -47 -86 -219 79 232 -164 -282 433 384 435 400 446 776 1157 45 312 1525 1027 91 702
1458 702 1817 411 138 875 789 397 559 755 -134 -11 112 -222 236 -256 -983 197 -199 -1248 -737
$$ packed form
1320i99l61Q63K58q81J31R90n84l0R67J20n11k61J352o71l6K61J87l6K49k99L40
1341A049K95o78j01J020l71j209K52J020j093l29R64j73r24L76J50j12k89L68
1359B15Op3l77l5Q98p17j029M32J024j164o35J125L02j449L14Q32o86p26J275
1378d68j30l33P9L75o8j99m8O81N90j48o91Q65M29o39N38O44n12n13P83O26j026
1399H35K93K65k57m34J90J20p6o2j124N98L94r20o34J407l25j403O88L45m20n73
1419a093M87j4j95J27K26n9m52J45L21N63q95l39J177J56j223K83J086o15j074
1438a388J341l9j33K98J53l96j18P15m9N1l5M6L30L81j112K67J213m98r36O11
1458G02J115j406k73P37q6l92J62J96q89J23J23l34M58m92p27J180l96j049N11
$$ plain form
1477 -737 115 -754 -1601 -620 -199 -634 -1389 -503 -553 -510 -431 -523 -365 -369 -629 130 239 -426 -159 914 115 -627
1499 -627 401 1275 -154 -658 487 275 72 279 242 386 471 315 436 924 560 432 877 855 293 866
1519 866 1532 367 -242 1143 1170 -129 -115 507 358 187 -198 -193 -259 -413 -856 -213 -250 -830 -919 -378 -889
1540 -889 -1139 -275 32 -1270 -1119 -106 -447 -947 -439 150 -371 -506 -379 -135 354 -354 198 565 483 -151
1560 -151 620 819 -267 -55 1266 1070 157 89 865 454 296 548 631 264 275 -74 330 1039 185 299
1580 299 481 317 143 521 375 -383 -699 320 273 -554 -102 -155 -668 -1073 -869 -498 -546 -951 -1309 -525 -301
1601 -301 -1436 -1025 -355 -699 -1239 -109 -417 -791 -399 241 -326 -81 804 235 253 309 438 680 540 513
1621 513 792 1253 511 238 1337 910 100 523 1085 196 132 606 497 -36 -206 465 40 84 -296 -529
$$ packed form
1477g37Q52q69q47R81M21m35p55Q86n0M3P9r2J58mk60P59J09o65K67J073p99p42
1499f27J028Q74j429n04J145k12k03K07l7J44Q5j56J21M88l64j28M45k2n62N73
1519H66O66j165o09J385K7j299J4O22j49j71l85No6j54m43O43l7n80q9N41n11
1540h89k50Q64L07j302J51J013l41n00N08N89n21j35J27K44M89p08N52L67q2o34
1560a51P71J99j086K12J321j96r13o8P76m11j58K52Q3l67J1l49M04P09q54J14
1580B99J82j64j74L78j46p58l16J019m7q27M52n3n13m05K04L71m8m05l58P84K24
1601c01j135M11O70l44n40J130l08l74L92O40n67K45Q85n69J8N6J29K42j40k7
1621E13K79M61p42k73J099m27q10M23N62q89o4M74j09n33j70O71m25M4l80k33
$$ plain form
1641 -529 -208 82 -675 -39 -9 -874 -764 94 130 -1146 -172 -422 -718 -761 -387 -608 -710 -759 -456 -526 -460 -637
1663 -637 -430 -133 -289 -815 302 302 -524 -47 593 202 -2 864 576 20 638 1123 913 275 1032 972 675
1684 675 625 857 938 947 62 241 611 312 -126 450 390 -481 -453 426 -212 -401 -158 -427 -512 -175 -471 -779
1706 -779 -555 -475 -566 -188 -261 -1084 -511 73 -573 -703 237 60 -635 -136 70 -337 -307 -81 -94 78 -250 -283
1728 -283 281 519 -82 290 687 536 -153 972 990 55 481 1205 130 192 734 592 745 636 829 579
1748 579 77 404 155 293 216 -322 -191 -7 -655 -651 289 -206 -1339 -539 -37 -679 -944 -621 -806 -687 -445
1769 -445 -660 -446 -141 -517 -486 281 -373 -541 381 -37 -490 319 613 -90 -9 226 486 230 308 364 149
1790 149 728 275 502 1090 512 52 585 866 383 343 871 243 248 696 523 376 121 560 21 -57 24 -129
$$ packed form
1641e29L21K90p57O36L0q65J10Q58L6j276R74k50k96m3L74k21j02m9L03p0O6j77
1663f37K07K97j56n26J117%q26M77O40l91k04Q66k88n56O18M85k10o38P57o0k97
1684F75n0K32Q1Rq85J79L70k99m38N76o0q71K8Q79o38j89K43k69q5L37k96l08
1706g79K24Q0r1L78p3q23N73N84o46j30R40j77o95M99K06m07L0K26j3J72l28l3
1728b83N64K38o01L72L97j51o89J125J8r35M26P24j075O2N42j42J53j09J93k50
1748E79n02L27k49J38p7n38J31J84o48MR40m95j133Q00N02o42k65L23j85J19K42
1769d45k15K14L05l76L1P67o54j68R22m18m53Q09K94p03Q1K35K60k56P8N6k15
1790A49N79m53K27N88n78m60N33K81m83m0N28o28NM48j73j47k55M39n39p8Q1j53
$$ plain form
1812 -129 -128 -161 -485 -368 -30 -577 -893 -371 -772 -847 -531 -314 -633 -1052 -522 -574 -606 -233 -486 -652 -261 -229
1834 -229 28 160 -123 -243 95 303 62 214 585 96 188 753 388 250 457 672 223 440 524 365 333
1855 333 717 160 433 726 -198 27 326 92 -269 -22 253 -256 -142 62 -148 -284 86 -265 -574 -393
1875 -393 -215 -678 -462 -333 -609 -324 -369 -1083 -520 -195 -646 -746 -214 -76 -630 -382 -229 91 -341 172
1895 172 -15 84 620 37 450 466 375 206 689 542 441 792 1144 194 105 744 639 338 362 209 371 269
1917 269 238 -54 461 281 -79 -85 -8 -434 -107 -101 -627 -422 -53 -168 -644 -394 -331 -526 -500 -257 -501 -612 -97
1940 -97 -586 -697 -462 -286 -334 -119 -340 -438 -113 191 -377 -302 460 30 -166 274 471 325 240 123 377 658
1962 658 883 538 605 901 574 666 689 321 560 782 504 -136 346 447 -248 -88 -147 50 -444 -71 -202
$$ packed form
1812a29Jl3l24J17L38n47l16N22m01p5L16K17l19m19N30n2l2L73k53j66L91L2
1834b29K57J32k83j20L38K08k41J52L71m89R2N65l65j38K07K15m49K17Q4j59l2
1855C33L84n57K73K93r24K25K99k34l61K47K75n09J14K04k10j36L70l51l09J81
1875c93J78m63K16J29k76K85m5p14N63L25m51j00N32J38n54K48J53L20m32N13
1895A72j87R9N36n83M13J6r1j69M83j47j01L51L52r50q9O39j05l01K4j53J62j02
1917B69l1k92N15j80l60oP7m26L27On26K05L69j15m76K50O3j95K6K43k44j11N15
1940i7m89j11K35J76m8K15k21r8L25L04n68P5P62m30j96M40J97j46q5j17K54K81
1962F58K25l45O7K96l27R2K3l68K39K22k78o40M82J01o95J60n9J97m94L73j31
$$ plain form
1983 -202 -157 -19 -709 -290 -420 -410 -938 -121 -485 -460 -316 2 -630 -785 193 -170 -425 -276 -155 -136 -243
2004 -243 -5 -215 174 84 -78 -95 129 33 118 549 338 112 424 807 271 82 951 701 310 318 598 733
2026 733 390 187 63 434 551 36 114 322 -140 -240 317 45 -402 407 -241 -613 -513 -4 -498 -916
2046 -916 -404 -490 -433 -578 -709 -298 -106 -638 -625 52 -194 -501 78 197 -512 33 210 -394 -128 224 89
2067 89 317 191 222 111 533 115 172 491 672 186 192 881 638 245 967 859 387 550 562 420 -18 410
2089 410 256 -38 175 151 -48 271 -590 -293 234 -379 -672 -338 -40 -737 -504 -488 -599 -700 -157 -498 -652
2110 -652 -725 -305 -425 -341 -262 -579 -17 -24 -301 142 313 -120 3 459 423 80 269 425 339 417 819 546 473
2133 473 388 332 444 586 1 318 492 175 313 519 163 -29 443 505 62 -22 83 -444 -296 60 33 -263
$$ packed form
1983b02M5J38o90M19j30J0n28Q17l64K5J44L18o32j55R78l63k55J49J21J9j07
2004b43K38k10L89r0j62j7K24r6Q5M31k11k26L12L83n36j89Q69k50l91QK80J35
2026G33l43k03j24L71J17n15P8K08m62j00N57k72m47Q09o48l72J00N09m94m18
2046i16N12q6N7j45j31M11J92n32J3O77k46l07N79J19p09N45J77o04K66L52j35
2067H9K28j26L1j11M22m18N7L19J81m86OO89k43l93P22j08m72J63J2j42m38M28
2089D10j54k94K13k4j99L19q61K97N27o13k93L34K98o97K33J6j11j01N43l41j54
2110f52p3M20j20Q4P9l17N62pk77M43J71m33J23M56l6l43J89J56q6P8M02k73p3
2133D73q5n6J12J42n85L17J74l17J38K06l56j92M72O2m43q4J05n27J48L56k7k96
$$ plain form
2155 -263 -492 -362 -355 -307 -210 -838 -136 -413 -757 -489 86 -448 -616 -399 -278 -140 -266 -123 -192 -291 -76 -73 10
2178 10 260 -3 333 327 58 260 949 560 90 381 519 375 582 463 449 6 760 617 330 377 -1 437
2200 437 444 146 -66 234 116 -82 -136 102 -169 -756 -156 -188 -494 -138 -440 -582 -464 -240 -150 -564 -290 -372
2222 -372 -558 -192 -375 -684 -239 -467 -448 54 -58 80 -159 161 53 -12 378 249 22 154 331 229 748
2243 748 321 287 452 485 -35 288 809 478 176 751 676 106 358 530 212 -39 462 -73 216 -40 -132
2264 -132 -395 -478 -191 -276 -334 -288 -623 -196 -385 -477 -518 -92 -497 -574 -370 -222 -378 -321 -24 -346 -313 -233 -280 -26
2288 -26 -164 -94 128 115 -139 -124 639 513 193 178 525 -31 295 635 410 487 151 327 440 718 366 571
2310 571 595 437 117 59 441 72 196 490 -93 -287 273 -91 -225 -251 -506 -523 -412 -257 -497 -292 -311 -361
$$ packed form
2155b63k29J30PM8R7o28P02k77l44K68N75n34j68K17J21J38j26J43o9r9K15LQ3
2178A0K50k63L36ok69K02O89l89m70K91J38j44K07j19j4m43P54j43k87M7l78M38
2200D37Pk98k12L00j18j98n4K38k71n87O00l2l06L56l02j42J18K24R0m14K74q2
2222c72j86L66j83l09M45k28J9N02j12J38k39L20j08o5L90j29k27J32J77j02N19
2243G48m27l4J65L3n20L23N21l31l02N75p5n70K52J72l18k51N01n35K89k56r2
2264a32k63q3K87q5n8M6l35M27j89r2m1M26m05p7K04J48j56N7K97l22L3Q0m7K54
2288b6j38P0K22j3k54J5P63j26l20j5L47n56L26L40k25P7l36J76J13K78l52K05
2310E71K4j58l20n8L82l69J24K94n83j94N60l64j34k6k55j7J11J55k40K05j9n0
$$ plain form
2332 -361 -694 -459 -551 -365 81 -97 -496 -353 13 -94 -353 9 129 -396 99 100 59 473 110 -94 648
2353 648 191 44 364 454 373 463 941 415 108 513 684 140 441 334 424 172 49 -73 -9 214 -160 275
2375 275 255 -202 -241 297 -28 -466 -336 -434 -787 -538 -187 -414 -773 -638 -597 -445 -239 -258 -450 -356 -507 -140
2397 -140 17 -598 -165 110 309 -203 -23 430 70 -311 175 444 365 492 222 300 427 458 147 393 350
2418 350 295 -137 521 457 -20 362 507 -14 311 315 -21 35 -1 41 -91 -68 -154 -148 -21 -390 -510 111 -509 -636
2442 -636 -164 -372 -809 -379 -345 -505 -677 -360 -450 -481 -452 -437 -422 -184 149 -30 -77 454 68 -62 178 270 -116
2465 -116 448 167 -49 292 815 239 84 730 678 411 394 107 303 583 149 -125 389 83 99 -35 379
2486 379 -44 -234 149 53 -456 -40 183 -215 -149 -388 -618 -353 -72 -535 -244 -459 -551 -284 -219 -636 -482
$$ packed form
2332c61l33K35r2J86M46j78l99J43L66j07k59L62J20n25M95Jm1M14l63k04P42
2353F48m57j47L20R0q1R0M78n26l07M05J71n44L01j07R0k52j23j22O4K23l74M35
2375B75k0m57l9N38l25m38J30r8l53K49L51k27l59J35M1J52K06j9j92R4j51L67
2397a40J57o15M33K75J99n12J80M53l60l81M86K69p9J27k70P8J27L1l11K46m3
2418C50n5m32O58o4m77L82J45n21L25Ml36N6l6M2j32K3q6OJ27l69j20O21o20j27
2442f36M72k08m37M30L4j60j72L17r0l1K9J5J5K38L33j79m7N31l86j30K40R2l86
2465a16N64k81k16L41N23n76j55O46n2k67j7k87J96K80m34k74N14l06J6j34M14
2486C79m23j90L83r6n09M16K23l98O6k39k30K65K81m63K91k15r2K67O5m17J54
$$ plain form
2507 -482 -420 -227 -438 -151 -108 -142 -151 44 -186 -101 -118 -55 -40 298 306 348 237 464 558 516 486 207 615 417 376
2532 376 34 389 335 196 232 5 278 298 215 286 70 275 -215 -145 152 -308 -209 -52 -449 -729 -365 -298 -670
2555 -670 -342 -265 -271 -675 -257 -478 -598 -654 -552 -136 -292 -325 -439 -157 0 -374 96 322 6 -197 41 99
2577 99 90 271 564 132 283 573 282 274 529 134 307 812 335 217 550 -24 -132 366 631 373 210 356
2599 356 -137 143 -43 -14 20 -16 -333 -176 -136 -553 -296 161 -209 -332 -335 -93 -404 -1011 -26 -468 -401 -371 7
2622 7 -149 -44 25 -6 -85 -27 183 497 267 187 -102 558 180 286 779 281 213 214 544 330 473 400 186 289
2646 289 467 347 120 445 213 18 410 366 -64 -131 176 -40 -135 201 -360 -294 -227 63 -291 -337 -362 -112
2668 -112 -32 -246 -429 -402 -372 -236 -567 -344 -395 -391 -188 -162 -486 -126 -32 -109 119 86 151 163 178 300 270 232 388
$$ packed form
2507d82O2J93k11K87M3l4rJ95k30Q5j7O3J5L38QM2j11K27R4m2l0k79M08j98m1
2532C76l42L55n4j39L6k27K73K0q3P1k16K05m90P0K97m60R9J57l97k80L64O7l72
2555f70L28P7om04M18k21j20n6J02M16j56l3j14K82J57l74M70K26l16k03K38N8
2577I9rJ81K93m32J51K90k91qK55l95J73N05m77j18L33n74j08M98K65k58j63J46
2599C56m93K80j86K9L4l6l17J57M0m17K57M57l70j23lK42l11o07R85m42O7L0L78
2622Gj56J05O9l1p9N8K10L14k30q0k89O60l78J06M93m98o8JL30k14J43p3k14J03
2646B89J78j20k27L25k32j95L92m4m30o7L07k16r5L36n61O6O7K90l54m6k5K50
2668a12Q0k14j83K7L0J36l31K23n1MK03K6l24L60R4p7K28l3O5J2J5J22l0l8J56
$$ plain form
2693 388 164 249 284 310 473 593 540 374 532 265 49 240 378 122 259 506 104 -4 59 6 -160 425
2715 425 -219 -182 34 -236 -291 -240 34 -681 -397 -108 -452 -450 -133 -291 -790 -184 -117 -351 -216 -359 -347 -576
2737 -576 -270 -178 -196 168 91 -5 238 154 80 425 236 47 130 489 303 481 316 313 240 429 582 186 379
2760 379 476 15 388 484 305 198 223 146 -103 177 -22 -148 -275 -47 -340 -329 -178 32 -219 -232 -283 -512
2782 -512 -422 -432 -466 -261 -354 -434 -278 -254 -289 -83 172 -84 -346 -250 -136 -169 106 -56 -164 119 224 -18 687
2805 687 192 446 220 339 205 262 400 292 -86 307 567 188 360 468 271 313 96 -329 -130 298 84
2826 84 165 -156 89 -174 190 -11 -497 -49 -109 -41 -398 -312 -413 -249 -391 -153 -227 -364 -354 -138 -151 -150 -562
2849 -562 -131 10 -332 -265 -9 -366 -10 59 146 269 171 212 108 218 491 290 595 425 37 241 435 326
$$ packed form
2693C88k24Q5L5K6J63J20n3j66J58k67k16J91J38k56J37K47m02j08O3n3j66N85
2715D25o44L7K16k70n5N1K74p15K84K89l44KL17j58m99O06O7k34J35j43J2k29
2737e76L06R2j8L64p7r6K43q4p4L45j89j89Q3L59j86J78j65lp3J89J53l96J93
2760C79R7m61L73R6j79j07K5p7k49K80j99j26j27K28k93J1J51K10k51j3n1k29
2782e12R0j0l4K05r3q0J56K4l5K06K55k56k62R6J14l3K75j62j08K83J05k42P05
2805F87m95K54k26J19j34N7J38j08l78L93K60l79J72J08j97M2k17m25J99M28k14
2826H4Q1l21K45k63L64k01m86M48o0O8l57Q6j01J64j42K38p4j37J0K16j3Jm12
2849e62M31J41l42O7K56l57L56O9Q7J23r8M1j04J10K73k01L05j70l88K04J94j09
$$ plain form
2871 326 324 322 293 165 256 389 401 51 196 154 -219 315 183 -213 252 -14 -299 5 -44 -337 -249 -157 -394 -433
2895 -433 -132 -421 -433 -317 -244 -283 -200 -291 52 -284 -126 -268 -47 262 -164 -278 -1 -10 105 10 151 -147 249
2918 249 520 257 276 497 168 446 274 556 579 543 447 -38 526 184 -41 56 352 -84 179 219 345 -343
2940 -343 111 262 -29 -244 8 -496 7 -228 -172 -344 -321 -126 -554 -536 -408 -405 -280 -270 -562 -54 -1 -273
2962 -273 -125 -82 -58 -349 -98 58 130 55 1 82 -114 300 74 404 284 203 61 370 250 -21 549 296
2984 296 52 275 370 73 317 423 217 -26 91 -60 90 91 -283 -2 35 186 -550 -342 72 -458 -86
3005 -86 -105 -323 -338 -214 -592 -506 -417 -285 -208 -245 -475 -276 -432 -328 -245 -178 -161 1 -120 392 369 -14 -157 410
3029 410 263 -1 395 420 153 235 31 166 226 374 206 57 583 354 240 713 350 113 88 309 168
$$ packed form
2871C26kkk9j28R1J33J2l50J45m2l73N34j32l96M65k66k85L04m9k93Q8R2k37l9
2895d33L01k89j2J16P3l9Q3r1L43l36J58j42K21L09m26j14K77rJ15r5J41k98L96
2918B49K71k63J9K21l29K78j72K82K3l6r6m85N64l42k25R7K96m36K63M0J26o88
2940c43M54J51k91k15K52n04N03k35N6j72K3J95m28J8J28LJ25J0k92N08N3k72
2962b73J48M3K4k91K51J56P2p5n4Q1j96M14k26L30j20q1j42L09j20k71N70k53
2984B96k44K23R5k97K44J06k06k43J17j51J50Jl74K81L7J51p36K08M14n30L72
3005h6j9k18j5J24l78Q6Q9J32P7l7k30J99j56J04Q3O7J7J62j21N12k3l83j43N67
3029D10j47k64L96K5k67Q2k04J35O0J48j68j49N26k29j14M73l63k37k5K21j41
$$ plain form
3050 168 443 110 -336 -50 59 -163 -68 -304 -204 -109 -136 -562 -375 -213 -414 -377 -231 289 -334 -148 -296
3071 -296 -297 -407 -291 -222 -134 29 -263 -216 213 -290 -15 112 72 122 356 157 -227 -73 446 156 277 127
3093 127 348 700 -59 599 406 348 363 81 238 262 205 180 202 136 -387 319 -21 -30 115 -123 -62 -63 -488 -145
3117 -145 -474 -63 -71 -40 26 -338 -72 -365 -410 -301 -204 1 -554 -195 109 -91 -295 -164 -26 -590 198 -35
3139 -35 47 79 270 -230 143 447 129 156 419 -170 313 239 191 274 298 240 8 81 472 -89 257 -85 63
3162 63 123 73 -144 -69 -67 -201 115 -181 -399 -79 -211 -559 -113 -304 -25 -325 -308 -343 -92 -470 -372 -203 -117
3185 -117 -223 -252 -259 -237 139 -291 -290 -81 11 -398 259 186 -48 392 173 -44 159 403 337 232 144 350 136
3208 136 230 250 330 206 362 -43 170 505 149 -31 33 -64 -101 149 208 -88 -246 -149 -295 -311 -253 -494 -199
$$ packed form
3050A68K75l33m46K86J09k22R5k36J00R5k7m26J87J62k01L7J46N20o23J86j48
3071b96jj10J16O9Q8J63k92M7M29n03K75J27m0N0K34j99l84J54N19k90J21j50
3093A27K21L52p59O58j93n8J5k82J57K4n7k5K2o6n23P06l40rJ45k38O1jm25L43
3117a45l29M11qL1O6l64K66k93m5J09R7K05n55L59L04k00k04J31J38n64P88k33
3139c5Q2L2J91n00L73L04l18K7K63n89M83p4m8Q3K4n8k32P3L91n61L46l42J48
3162F3O0n0k17P5Kj34L16k96k18L20j32l48M46j91K79l00J7l5K51l78R8J69Q6
3185a17j06k9pK2L76m30JK09R2m09O57p3k34M40k19k17K03K44o6j05q8K06k14
3208A36R4K0Q0j24J56m05K13L35l56j80O4r7l7K50N9k96j58R7j46j6N8k41K95
$$ plain form
3231 -199 -14 -247 -324 -292 -171 -277 -258 -428 -219 -307 -309 -48 -430 -314 -144 -504 195 -138 -283 -52 50 389
3253 389 355 369 -37 0 190 -130 105 275 214 207 261 126 245 296 277 311 187 28 367 309 218 167 89 63 162
3278 162 -185 -7 -178 -76 -43 179 -214 -67 -14 -18 -295 -132 -202 -389 -307 -22 -411 -346 103 -542 -497 -271 -310
3301 -310 -247 -88 75 34 -259 196 88 237 134 -127 -153 165 -126 -223 413 116 -1 366 532 298 519
3322 519 211 81 390 331 269 -130 358 216 -8 342 210 -210 42 -91 -119 -36 286 -366 -179 -51 -387
3343 -387 -157 -238 -120 -39 69 -99 -137 209 101 -622 -210 -22 -343 -195 -92 -213 -202 -65 43 148 -90
3364 -90 161 57 150 215 40 81 277 96 257 495 259 296 358 214 142 437 310 381 275 211 95 -10 -107
3387 -107 40 -306 180 92 -20 104 -334 -44 240 -146 -212 -64 -299 -29 -176 -199 -147 -476 -372 -159 -247 -133
$$ packed form
3231a99J85k33p7L2J21j06J9j70K09q8kK61l82J16J70l60O99l33j45K31J02L39
3253C89l4J4m06L7J90l20K35J70o1pN4j35J19N1j9L4j24j59L39n8r1n1p8k6R9
3278A62l47J78j71J02L3K22l93J47N3mk77J63p0j87Q2K85l89O5M49o45M5K26l9
3301c10O3J59J63m1k93M55j08J49j03k61k6L18k91r7O36k97j17L67J66k34K21
3322E19l08j30L09n9o2l99M88j42k24L50j32m20K52j33k8Q3L22o52J87J28l36
3343c87K30q1J18Q1J08j68l8L46j08p23M12J88l21J48J03j21J1J37J08J05k38
3364i0K51j04R3O5j75M1J96j81J61K38k36L7O2j44p2K95j27P1j06o4j16j05r7
3387a07J47l46M86q8j12J24m38K90K84l86o6J48k35K70j47k3N2l29J04K13q8J14
$$ plain form
3409 -133 -36 -376 12 -202 -274 -125 92 -167 -319 -49 245 17 19 -112 -61 52 278 56 252 173 -194 217
3431 217 288 267 42 198 394 167 115 450 36 -67 -112 398 -95 198 240 -84 8 -196 -92 -89 -32 -268 -334
3454 -334 -7 -73 -260 -465 -413 -426 -275 -295 -279 -60 -98 -448 -18 -340 110 -225 -144 -235 -135 -152 -170 -60 72
3477 72 230 -155 286 97 -29 161 346 212 215 293 393 391 208 -32 -110 -21 358 197 371 -9 80 -20 -16 29
3501 29 -161 103 -30 -329 -188 -86 233 -106 -131 -357 -239 -190 -304 -332 -287 -199 -201 -106 -272 -241 -334 -188 -2 -408
3525 -408 -193 -109 -486 -9 112 12 -106 -240 24 -13 177 93 222 243 36 22 392 405 167 37 476 134
3547 134 64 555 164 120 190 308 255 303 278 -301 180 -221 -145 106 69 100 340 367 -91 -487 83 -296 -367 -128
3571 -128 -130 -94 -124 -382 -309 -326 -291 -202 -397 -307 -167 -271 -79 -93 -120 5 -64 -176 58 4 54 -74 346 -37 -14
$$ packed form
3409a33R7l40L88k14p2J49K17k59j52K70K94k28Kj31N1J13K26k22J96p9l67M11
3431B17P1k1k25J56J96k27n2L35m14j03m5N10m93K93M2l24R2k04J04LN7k36o6
3454c34L27o6j87k05N2j3J51k0J6K19l8l50M30l22M50l35Q1r1J00j7j8J10J32
3477G2J58l85M41j89j26J90J85j34LP8J00kj83k40p8Q9L79j61J74l80Q9j00MM5
3501B9j90K64j33k99J41J02L19l39k5k26J18M9j14k8M5Q8kR5j66L1r3J46J86m06
3525d08K15Q4l77M77J21j00j18j34K64l7J90q4J29K1k07j4L70J3k38j30M39l42
3547A34p0M91l91m4P0J18n3M8k5n79M81m01P6K51l7L1K40K7m58l96N70l79p1K39
3571a28kL6l0k58P3j7L5Q9j95R0J40j04J92j4k7J25o9j12K34n4N0j28M20l83K3
$$ plain form
3596 -14 315 277 411 241 148 305 175 267 5 182 478 85 195 295 207 8 148 -135 228 -31 129 22
3618 22 36 6 128 -94 75 -164 -267 -95 -354 -433 -183 -297 -440 -306 -226 -381 -83 -128 -285 -45 162 -295
3640 -295 -80 88 -98 -114 -201 -90 -141 335 208 -313 208 144 -6 -126 310 391 339 585 273 118 351 545
3662 545 312 155 301 -12 80 363 180 -168 181 -125 -271 427 36 -98 -328 -130 -94 -201 -69 -129 -169
3683 -169 -435 -425 -273 -223 -273 -566 -351 -135 -366 -108 -125 -180 -373 -222 -113 -104 131 -3 -4 60 -235 -76 85
3706 85 -110 44 152 83 217 12 -8 204 488 291 334 29 398 98 302 209 475 313 16 152 211 256
3728 256 169 -51 -95 -179 137 -143 -397 -79 -239 -275 18 -113 -89 -223 -138 -404 -116 -124 -278 -73 -300 -130 -126
3751 -126 -412 -539 -189 58 -128 130 -190 -50 358 91 -56 235 221 161 396 57 105 131 124 79 323 -58
$$ packed form
3596a4L29l8J34j70r3J57j30R2k62J77K96l93J10J00q8j99J40k83L63k59J60j07
3618B2J4l0J22k22J69k39j03J72k59p9K50j14j43J34Q0j55K98m5j57K40K07m57
3640b95K15J68j86j6q7J11n1M76j27n21N21o4j50j20M36Q1n2K46l12j55K33J94
3662E45k33j57J46l13R2K83j83l48L49l06j46O98l91j34k30J98L6j07J32o0m0
3683a69k66J0J52N0n0k93K15K16k31K58j7n5j93J51J09RK35j34jO4k95J59J61
3706H5j95J54J08o9J34k05k0K12K84j97M3l05L69l00K04r3K66j62k97J36N9M5
3728B56q7k20m4q4L16k80k54L18j60l6K93j31K4j34Q5k66K88qj54K05k27J70M
3751a26k86j27L50K47j86K58l20J40M08k67j47K91j4o0K35l39M8K6pm5K44l81
$$ plain form
3773 -58 346 297 134 -97 96 180 58 189 -153 -87 271 139 -196 69 -200 -222 -60 -254 -72 -106 -101 -230 -70
3796 -70 -235 -256 -334 -217 101 -28 -85 -60 56 -344 -102 -226 -290 -58 -349 -115 -137 139 -39 -86 -3 -53 32 -5
3820 -5 339 -9 220 91 183 402 266 106 330 39 172 118 301 356 -46 -244 333 267 -25 216 -96 382
3842 382 388 -138 161 136 -95 -102 -46 172 -399 -66 -424 -457 -262 -13 -182 -456 -95 -500 -225 10 -373 -276 33
3865 33 -171 -253 -127 -6 -29 -163 -3 154 -118 -152 132 -82 -137 -464 342 340 101 299 517 411 132 43 193
3888 193 138 177 339 216 130 267 313 -45 155 223 153 198 144 -80 61 -64 -240 -213 283 -176 -213 131 -212
3911 -212 -92 -48 -410 -200 -269 -51 -116 -286 -176 138 -217 -216 -187 -263 -99 -78 57 -51 -45 -116 94 39 58 71 246
3936 246 100 173 5 -21 92 209 -18 315 88 448 -108 -126 252 68 39 2 27 -293 194 64 -155 -102
$$ packed form
3773e8M04m9j63k31J93Q4j22J31l42O6L58j32l35K65k69k2J62j94J82l4Nj29J60
3796g0j65k1p8J17L18j29n7K5J16m00K42j24o4K32k91K34k2K76j78m7Q3n0Q5l7
3820eL44l48K29j29R2K19j36j60K24k91J33n4J83N5m02j98N77o6k92K41l12M78
3842C82On26K99k5k31pN6K18n71L33l58l3J95K49j69k74L61m05K75K35l83R7L09
3865C3k04q2J26J21k3j34J60J57k72l4K84k14n5l27Q06kk39J98K18j06k79q9J50
3888A93n5L9J62j23q6J37M6l58K00O8p0M5n4k24J41j25j76K7M96m59l7L44l43
3911b12J20M4l62K10o9K18o5j70J10L14l55JK9p6J64K1J35j08Op1K10n5J9J3J75
3936B46j46P3j68k6J13J17k27L33k27L60n56j8L78j84k9l7K5l20M87j30k19N3
$$ plain form
3958 -102 424 -381 -181 20 -441 -135 10 -84 -103 50 -297 -283 -92 41 -471 -241 -279 43 -384 -195 -81
3979 -81 -11 -25 -228 -212 25 145 -257 248 292 -75 -101 202 187 -26 120 246 133 336 300 149 171 115 402
4002 402 240 102 -242 223 319 -194 253 422 151 -126 205 -157 13 -162 78 -256 37 -174 -351 -59
4022 -59 14 7 -159 -267 -132 -382 -323 -22 -207 45 32 -114 198 174 -30 -256 127 11 -144 -112 -74 -178 152
4045 152 15 338 -158 113 18 76 137 193 62 127 300 240 284 12 371 96 415 36 -33 95 -140 145 -45
4068 -45 -59 -25 49 104 -97 57 -6 64 -110 113 -154 -571 -186 74 -115 -128 9 -501 -305 -469 -281 -300 -165
4091 -165 6 120 270 59 -160 -77 122 -279 0 277 222 44 118 73 156 344 111 -29 234 427 212 227
4113 227 134 231 156 357 -225 -94 45 27 -213 62 68 -288 -50 78 194 -109 -167 -182 163 -246 -273 -364 -220
$$ packed form
3958a02N26q05K00K01m61L06J45r4j9J53l47J4J91J33n12K30l8L22m27J89J14
3979h1P0j4k03J6K37J20m02N05M4l67k6L03j5k13J46J26j13K03l6j51K2n6K87
4002D02j62j38l44M65R6n13M47J69k71k77L31l62J70j75K40l34K93k11j77K92
4022e9P3pj66j08J35k50N9L01j85K52j3j46L12k4k04k26L83j16j55L2L8j04L30
4045A52j37L23m96K71r5N8O1N6j31O5J73o0M4k72L59k75L19l79o9J28k35K85j90
4068d5j4L4P4N5k01J54o3P0j74K23k67m17L85K60j89j3J37n10J96j64J88j9J35
4091a65J71J14J50k11k19Q3J99m01K79K77n5j78P4m5Q3J88k33j40K63J93k15J5
4113B27r3R7p5K01n82J31J39j8k40K75Ol56K38J28J16l03n8j5L45m09k7r1J44
$$ plain form
4136 -220 108 3 9 -369 -92 121 -311 -244 83 128 31 -73 30 83 145 117 175 324 -30 158 71 99 209 9
4160 9 164 319 121 201 456 240 278 142 -81 324 160 162 64 105 -1 187 -38 -33 214 150 -129 -61 87 -257
4184 -257 -3 -190 -222 -152 51 -14 -224 -258 -192 -62 3 -553 -102 -195 -397 -487 -120 23 11 -49 -212 167 -182
4207 -182 221 -52 216 181 50 222 410 83 178 -41 -14 118 418 162 72 214 335 260 95 463 16 36
4229 36 251 86 248 -34 186 164 87 382 -127 -115 -61 -278 -277 -182 -177 22 -223 -254 -315 138 -101 101 -259 -157
4253 -157 -129 -348 138 -225 82 -265 -60 -190 -92 -192 102 71 185 32 247 147 -158 -6 392 320 123
4274 123 254 157 5 379 17 344 236 -3 -116 369 280 393 372 15 -85 -140 430 -92 4 139 -302 -229
4296 -229 -146 205 46 -225 -288 -9 230 -102 -102 57 -112 -301 -440 -175 -192 -221 -329 -204 -456 -28 -53 -158
$$ packed form
4136b20L28j05Ol78K77K13m32O7L27M5r7j04J03N3O2k8N8J49l54J88q7K8J10k00
4160IJ55J55j98Q0K55k16L8j36k23M05j64Kr8M1j06J88k25NK47o4k79O8J48l44
4184b57K54j87l2P0K03o5k10l4O6J30O5n56M51r3k02r0L67J43j2o0j63L79l49
4207a82M03k73K68l5j31J72J88l27R5k19K7J32L00k56r0J42J21p5j65L68m47K0
4229C6K15j65J62k82K20k2p7K95n09J2N4k17JR5NJ99k45l1o1M53k39K02l60J02
4253a57K8k19M86l63L07l47K05j30R8j00K94l1J14j53K15j00l05J52L98p2j97
4274A23J31r7j52L74l62L27j08k39j13M85q9J13k1l57j00n5N70n22R6J35m41P3
4296b29Q3L51j59k71o3K79K39l32%J59j69j89j39K65j7k9j08J25k52M28k5j05
$$ plain form
4318 -158 -31 -217 47 75 21 180 279 -21 -43 -202 -40 392 -215 71 200 311 -107 318 211 289 387 204
4340 204 405 17 255 158 227 122 -120 15 207 219 -19 50 -15 -69 44 27 47 -122 -348 -414 123 -147 -298
4363 -298 -314 -248 -56 137 170 -10 -467 -556 -281 61 -73 295 287 -321 -128 169 152 251 -154 -119 76 66 277
4386 277 177 104 192 164 8 115 208 -21 90 232 128 241 32 98 251 28 108 -56 -233 -63 84 104
4408 104 -38 158 245 -181 -512 -171 -12 -270 -348 -187 -232 47 -406 -110 63 15 -139 -268 -213 46 -112 -17
4430 -17 -197 -24 77 264 -130 -91 244 -90 499 173 56 291 163 171 54 119 450 158 162 295 46 -56
4452 -56 195 131 9 -85 96 330 252 -378 -35 55 -181 -204 -40 -115 -8 24 131 211 100 -37 -327 -379 19
4475 19 163 -169 265 -1 -524 94 -211 -242 -131 17 -49 -159 -23 -20 -200 358 59 17 112 -11 -65 258 168
$$ packed form
4318a58J27j86K64K8n4J59R9l00k2j59J62M32o07K86J29J11m18M25j07P8R8j83
4340B04K01l88K38r7O9j05k42J35J92J2k38O9o5n4J13j7K0j69k26o6N37k70j51
4363b98j6O6J92J93L3j80m57q9K75L42j34L68qo08J93K97j7R9m05L5J95j0K11
4386B77j00p3Q8k8j56J07R3k29J11J42j04J13k09O6J53k23Q0j64j77J70J47K0
4408A04j42J96Q7m26l31L41J59k58p8J61m5K79m53K96J73m8j54j29N5K59j58R5
4430a7j80J73J01J87l94L9L35l34N89l26j17K35j28Qj17O5L31k92MJ33k49j02
4452e6K51o4j22r4J81K34p8o30L43R0k36k3J64p5J07L2J07Q0j11j37k90n2L98
4475A9J44l32M34k66n23O18l05l1J11J48o6j10J36Lj80N58k99m2R5j23n4L23r0
$$ plain form
4498 168 -96 105 454 -22 311 50 42 205 -266 237 -154 59 295 14 207 281 261 -3 199 -3 39 -133
4520 -133 504 110 50 -153 -111 231 74 -60 -113 -61 -98 -250 8 -197 -231 -121 -140 -365 214 -189 -251 -33 -71
4543 -71 -107 -242 72 -19 87 -14 -252 161 110 53 2 48 185 346 151 87 13 24 165 343 11 40 350 -65
4567 -65 230 185 108 27 39 132 -301 192 -28 379 -39 -295 55 2 49 -18 -414 -326 -37 -50 91 -644 -154 -42
4591 -42 -172 -67 -90 -140 -393 -158 -155 -284 -37 119 44 126 35 -195 141 14 252 -25 79 177 165 273 232 380
4615 380 -49 279 194 6 433 179 -205 143 145 126 182 219 76 60 189 408 -381 -21 159 67 -4 24 71 165
4639 165 -91 30 -86 -51 -99 -49 -298 29 -308 -249 -135 -171 -70 -139 -26 33 -266 -145 -278 -65 -6 -68 120
4662 120 151 -65 -151 120 217 164 -139 -130 -107 303 114 -193 282 180 519 342 257 218 119 247 148 162 35 149
$$ packed form
4498A68k64K01L49m76L33k61qJ63m71N03l91K13K36k81J93P4k0k64K02k02M2j72
4520a33O37l94o0k03M2L42j57j34n3N2l7j52K58k05l4J10j9k25N79m03o2K18l8
4543g1l6j35L14r1J06j01k38M13n1n7n1M6J37J61j95o4p4J1J41J78l32K9L10m15
4567f5K95m5p7q1J2R3m33M93k20M07m18k56L50n3M7o7l96Q8K89j3J41p35M90J12
4591d2j30J05k3n0k53K35Lj29K47J56p5Q2r1k30L36j27K38k77J04R8j2J08m1J48
4615C80m29L28q5j88M27k54l84L48Kj9N6L7j43j6J29K19p89L60J80r2p1K8M7R4
4639A65k56J21j16L5m8N0k49L27l37N9J14l6J01o9J13N9k99J21j33K13N9o2J88
4662A20L1k16q6K71R7n3l03RK3M10j89l07M75j02L39j77q5l9r9J28r9J4j27J14
$$ plain form
4686 149 -185 83 19 3 -113 145 -139 -342 -166 85 -185 188 -390 72 -109 -133 -33 -90 -72 -328 -313 -255
4708 -255 -256 -10 -21 -281 -127 -229 -122 46 1 -197 230 -104 3 147 46 319 305 105 -56 68 -33 7
4730 7 286 246 11 264 110 81 73 198 -24 60 491 68 211 89 285 94 156 -155 36 -97 39 298 226
4753 226 66 -210 91 -314 -137 -288 10 -380 -67 100 -268 -16 -114 -124 13 -147 -333 -13 -293 -57 88
4774 88 247 -137 -35 110 -112 -24 74 382 69 232 174 76 -155 191 14 9 181 -83 42 98 -111 109 51
4797 51 327 -77 170 -84 40 -264 -43 92 -238 -155 -22 -127 -352 -257 -458 -40 -78 5 -396 -336 -140 -122
4819 -122 84 -289 81 39 -15 91 -238 -14 67 51 -174 -261 -217 231 -48 242 41 106 -119 78 66 -48 91
4842 91 311 328 170 211 -168 190 516 151 65 -24 42 -52 312 106 76 24 -105 25 -169 -99 -75 10 -148 -136
$$ packed form
4686A49l34K68o4j6j16K58k84k03J76K51k70L73n78M62j81k4J00n7J8k56J5N8
4708b55jK46j1k60J54j02J07J68m5j98M27l34J07J44j01K73j4k00j61J24j01M0
4730GK79m0k35K53j54k9qJ25k22Q4M31m23J43j22J96j91O2l11J91j33J36K59p2
4753B26j60k76L01m05J77j51K98l90L13J67l68K52r8j0J37j60j86L20k80K36J45
4774H8J59l84J02J45k22Q8R8L08l13J63n8r8k31L46j77nJ72k64J25N6k09K20n8
4797E1K76m04K47k54J24l04K21J35l30Q3J33j05k25R5k01M18l8Q3m01O0J96J8
4819a22K06l73L70m2n4J06l29K24Q1j6k25q7M4M48k79K90k01O5k25J97j2j14J39
4842I1K20J7j58M1l79L58L26l65q6q9O6r4L64k06l0n2j29J30j94P0K4Q5j58J2
$$ plain form
4866 -136 134 -156 -352 -290 -366 -210 -274 -254 -313 -70 -82 65 30 49 -237 -43 209 -41 -296 -247 -296 131 -187
4889 -187 27 0 124 204 -116 110 203 17 32 282 156 151 324 -226 188 127 32 189 118 49 90 47 -231 -128
4913 -128 -59 162 -82 264 -12 -28 -183 138 -216 85 -71 -40 -31 -143 -68 -188 -47 -66 127 -144 43 -161
4935 -161 -34 -234 5 -80 94 -252 -102 -154 181 125 -99 203 -15 105 281 33 120 48 220 -109 -90 251
4957 251 224 248 -36 279 199 276 -60 147 519 221 117 196 -13 -191 -219 -32 86 128 -28 113 -125 -80 -94
4980 -94 -61 19 -71 -249 -185 -372 -310 -386 98 -236 -280 271 -187 -126 -125 -146 -93 40 63 -362 29 367 0 114 44
5005 44 211 111 -5 248 -61 -6 329 191 61 160 107 -79 33 435 -23 46 318 72 44 -79 -61 231
5027 231 -62 -77 168 34 365 -87 -41 -82 -108 48 -231 -216 -87 322 -121 -81 267 -117 -149 -156 -104 -7 -207 -96
$$ packed form
4866a36K70k90j96O2p6J56o4K0n9K43j2J47l5J9k86J94K52k50k55M9m9M27l18
4889a87K14k7J24Q0l20K26R3j86J5K50j26nJ73n50M14o1r5J57p1o9M1m3k78J03
4913a28O9K21k44L46k76j6j55L21l54L01j56L1Rj12P5j20J41j9J93k71J87k04
4935a61J27k00K39q5J74l46J50n2L35n6k24L02k18J20J76k48Q7p2J72l29J9L41
4957B51k7K4k84L15q0P7l36K07L72k98j04P9k09j78k8J87J18M2j56J41k38M5j4
4980i4L3Q0r0j78O4j87O2p6M84l34m4N51m58O1Jk1N3J33K3m25L91L38l67J14p0
5005D4J67j00j16K53l09N5L35j38j30R9n3j86J12M02m58O9K72k46k8j23J8K92
5027B31k93j5K45j34L31m52M6m1k6J56k79J5J29M09m43M0L48l84l2pN2R7k00J11
$$ plain form
5051 -96 -49 245 3 -34 166 -70 113 15 249 112 298 199 184 18 232 230 57 49 268 109 -8 -80 293 423
5075 423 226 -109 -93 132 19 269 -48 -8 -96 31 52 -86 -122 -250 -75 112 79 -331 -53 -265 18 -121
5097 -121 -180 -68 -237 -413 -181 -360 -347 -75 122 -327 -30 62 -189 -49 64 -67 -8 17 -131 105 -102 216
5119 216 127 87 217 70 90 305 73 136 -99 144 155 377 268 268 262 182 221 -124 232 -280 197 81 86 -139
5143 -139 53 -184 26 -368 63 220 -501 -381 -98 -41 -56 -1 -40 -115 -145 -243 -235 41 219 -19 -166 -144 -49 -105
5167 -105 96 0 140 70 463 228 89 220 162 105 -168 107 43 -81 108 -21 40 65 -32 165 188 -116 279
5190 279 -175 164 -33 -55 108 -130 -71 -133 124 28 -72 -187 -114 101 -162 62 -289 -124 -158 -250 -148 -398
5212 -398 -368 -163 149 -128 -312 98 51 -207 -152 -183 -22 196 153 -132 122 218 -406 184 -20 21 120 114 -58
$$ packed form
5051i6M7K94k42l7K00k36J83r8K34j37J86r9j5j66K14kj73qK19j59j17p2L73J30
5075D23j97l35J6K25j13K50l17M0q8J27K1j38l6j28J75J87l3m10K78k12K83j39
5097a21n9J12j69j76K32j79J3K72J97m49K97R2k51J40J13j31N9K5j48K36k07L18
5119B16q9m0J30j47K0K15k32O3k35K43J1K22j09%oq0L9l45L56n12M77j16Nk25
5143a39J92k37K10l94M31J57p21J20K83N7j5N5l9p5l0r8QK76J78k38j47K2R5n6
5167a05K01r6J40p0L93k35j39J31n8n7k73K75o4j24J89j29O1K5r7J97K3l04L95
5190B79m54L39j97k2J63k38N9o2K57r6j00j15P3K15k63K24l51J65l4r2J02k50
5212c98L0K05L12k77j84M10m7k58N5l1J61K18m3k85K54R6o24N90k04M1R9oj72
$$ plain form
5235 -58 -49 -68 495 -21 -93 371 20 -89 224 137 -235 -254 188 62 -21 91 -62 -205 -94 -158 156 -37 105
5258 105 -434 -331 14 -422 -75 -79 -245 6 86 -458 26 -146 144 -250 -249 -217 294 -218 -458 34 306 -49
5280 -49 8 78 24 66 -16 58 3 397 70 -14 -77 -150 325 -106 322 307 -152 457 -61 184 -140 74 -43 -191
5304 -191 66 71 -22 341 41 4 -12 -189 -4 -5 -53 -99 1 -33 -254 -259 -224 -308 -272 -18 -40 6 -282 -94 -207 -213
5330 -213 -440 -289 -58 37 -45 -302 -34 -131 -213 -5 65 -58 194 281 184 87 -80 148 289 128 377 233 268
5353 268 79 115 121 101 120 -155 24 -292 -182 60 431 338 167 24 -487 -52 203 -145 -287 -78 274 101
5375 101 42 -16 -63 85 122 78 -257 -370 -447 174 -197 -38 142 88 141 202 122 -70 -117 17 263 332 4 140
5399 140 19 111 268 -248 -55 217 259 119 -180 34 148 -43 320 205 275 108 208 68 -137 -3 138
$$ packed form
5235e8Rj9N63n16p2M64l51j09L13q7l72j9M42j26q3J12j53j43J11o4L14j93J42
5258A05n39J03L45m36L47mj66K51Q0n44M84j72K90l94JL2N11n12k40M92K72l55
5280d9N7P0n4M2q2P4n5L94l27q4o3p3M75m31M28j5m59O09n18K45l24K14j17j48
5304a91K57Nr3L63l00l7j6j77J85jm8m6J00l4k21nL5q4L6K54k2M6k88J88j13o
5330b13k27J51K31R5q2k57K68r7q2K08P0j23K52Q7r7r7j67K28J41j61K49j44L5
5353B68j89L6Ok0J9k75J79l16J10K42L71r3j71j43n11M35K55l48j42K09L52j73
5375A01n9n8m7J48L7m4l35j13p7O21l71J59J80n4N3O1q0j92m7J34K46O9l28J36
5399A40j21R2J57n16J93K72M2j40k99K14J14j91L63j15P0j67J00j40k05J34J41
$$ plain form
5420 138 -64 37 37 0 -103 127 124 48 -181 21 186 -32 -241 -164 67 49 -169 38 -159 -228 -66 -163 98
5443 98 -135 108 -299 -380 88 -27 -93 162 -170 -54 133 113 119 167 187 190 96 179 2 2 132 141 158 121 -8 350
5469 350 111 -99 167 -155 210 -46 63 194 -166 200 129 -75 -154 -22 377 -57 -38 -94 -76 -243 -31 -145
5491 -145 -71 326 1 -346 143 122 -51 159 83 -189 -63 -148 -337 21 116 136 69 75 404 -318 211 -90 92
5514 92 -34 122 -29 70 105 -71 145 298 206 -74 119 175 1 -130 -202 24 156 46 309 -20 66 -60
5536 -60 -415 -68 -16 30 -59 92 166 182 30 -89 -305 315 -226 -242 -62 -200 -319 -169 43 -319 -134 -319
5558 -319 -160 -394 43 114 -6 -10 -71 16 210 -114 204 -33 -154 -314 274 -108 -249 142 -124 176 11 5
5580 5 -106 102 124 -173 436 51 236 41 199 -20 -43 -111 10 213 -12 -22 -181 28 104 192 56 217 32
$$ packed form
5420A38k02J01%l7j03K30lp6k29K02J65k18k09P7K31j8k18K07j97o9J62r7K61
5443I8k33K43m07q1M68j15o6K55l32J16J87k0OM8K0Lr4Q3j77%J30RJ7l7j29L58
5469C50k39k10K66l22L65k56J09J31l60L66p1k04p9J32L99m34J9n6J8j67K12j14
5491a45P4L97l25l47M89k1j73K10p6k72J26q5j89L58R5K0o7OL29p22N29l01J82
5514I2j26J56j51R9L5j76K16J53r2k80J93N6j74j31p2K26J32j10K63l29Q6j26
5536f0l55L47N2M6q9J51P4J6j52j19k16O20n41j6J80j38j19J50K12l62J85j85
5558c19J59k34M37P1j20mo1Q7J94l24L18k37j21j60N88l82j41L91k66L00j65o
5580Ej11K08K2k97O09l85J85j95J58k19k3o8J21K03k25j0j59K09P6Q8j36J61j85
$$ plain form
5603 32 -36 -97 -119 -143 77 88 -11 -49 -109 154 -106 65 -16 71 154 -181 36 -9 217 122 -176 -306 25 117 114 -51
5629 -51 273 107 -39 22 271 -62 -168 -123 -96 -49 55 -117 54 313 234 223 -114 256 120 -110 67 -13 -122
5652 -122 -285 25 50 33 62 -74 -65 -332 -151 70 -304 56 -47 -220 155 -110 -102 -97 18 -152 -230 -105 73
5675 73 -160 -110 154 -11 169 -167 153 230 26 -132 39 -99 87 154 36 447 -123 108 181 -45 -86 189
5697 189 199 9 5 9 182 -73 127 97 -27 31 65 -208 -157 22 -46 73 151 -156 -234 -108 -306 39 181 115
5721 115 105 -140 -305 131 -71 98 188 137 -142 133 -67 50 42 93 340 336 -174 173 326 106 215 115 113
5744 113 75 204 247 165 65 256 2 -96 82 -37 -136 196 74 -340 -84 -99 -320 276 -260 156 -44 -88
5766 -88 -86 -43 -56 -177 -70 -329 -57 -244 -129 -242 -117 182 -196 -97 -148 114 54 7 -81 -22 -173 -19 59 1
$$ packed form
5603C2o8o1k2k4K20J1r9l8o0K63k60J71q1Q7Q3l35K17m5K26r5k98j30L31R2lj65
5629e1L24j66j46O1K49l33j06M5K7M7J04j72J71K59p9j1l37L70j36k30J77q0j09
5652a22j63L10K5j7K9j36Rk67J81K21l74L60j03j73L75k65QNJ15j70p8J25J78
5675G3k33N0K64j65J80l36L20P7k04j58J71j38J86O7j18M11n70K31P3k26m1K75
5697A89J0j90mMJ73k55K00l0j24N8L4k73N1J79o8J19P8l07p8J26j98L45J42o6
5721A15j0k45j65M36k02J69R0n1k79K75k00J17qN1K47mn10L47J53k20J09j00k
5744A13l8J29M3q2j00J91k54r8J78j19r9L32j22m14K56j5k21N96n36M16k00m4
5766h8KM3j3j21J07k59K72j87J15j13J25K99l78R9n1K62o0m7q8N9j51J54P8n8
$$ plain form
5790 1 199 185 119 82 -134 -177 377 90 239 15 -116 269 162 157 139 28 67 -140 -89 141 123 206 233 135 -35
5815 -35 15 177 78 273 -6 -56 -271 -48 246 -230 84 -39 -130 -199 -112 -222 98 -393 -219 -201 220 80 166
5838 166 252 -224 350 193 -83 131 90 221 -197 -135 259 123 -202 7 -35 360 -81 189 160 273 -75 -200
5860 -200 86 295 158 -324 179 130 107 122 191 -221 -259 -140 -132 117 124 45 135 -260 -108 322 -69 -35 271 4
$$ packed form
5790AJ98j4o6l7k16m3N54k87J49k24j31L85j07nj8j11L9k07N1K30j8Q3K7r8j70
5815c5N0J62r9J95k79n0k15K23K94m76L14j23r1o9Q7j10L20m91J74J8M21j40Q6
5838A66Q6m76N74j57k76K14m1J31m18O2L94j36l25K09m2L95m41K70k9J13l48j25
5860b00K86K09j37m82N03m9k3J5O9m12l8J19QK49Pp9R0l95J52M30l91L4L06k67
$$ [...]
8191g8
##END NTUPLES=NMR FID
##END=
