##TITLE=1H_lae-B11M-3-17-3-8-5
 CDCl3+Py-d5, 8 sc, 
 27.6.2019
##JCAMPDX= 6.0         $$ Bruker NMR JCAMP-DX V2.0
##DATA TYPE= NMR FID
##DATA CLASS= NTUPLES
##ORIGIN= UXNMR, Bruker Analytische Messtechnik GmbH
##OWNER= root
$$ XWIN-NMR		Version 3.5
$$ Thu Jun 27 14:20:04 2019 Russian Standard Time (UT+4h)  she@DPX200
##.OBSERVE FREQUENCY= 200.13155
##.OBSERVE NUCLEUS= ^1H
##.DELAY= (6, 6)
##.ACQUISITION MODE= SIMULTANEOUS
##.ACQUISITION SCHEME= undefined
##.AVERAGES= 8
##.DIGITISER RES= 18
##SPECTROMETER/DATA SYSTEM= spect
##.PULSE SEQUENCE= zg30
##.SOLVENT NAME= CDCl3
##.SHIFT REFERENCE= (INTERNAL, CDCl3, 0, 15.7039)
##AUDIT TRAIL= $$ (NUMBER, WHEN, WHO, WHERE, WHAT)
$$ ##TITLE= Audit trail, XWIN-NMR		Version 3.5
$$ ##JCAMPDX= 5.01
$$ ##ORIGIN= Bruker BioSpin GmbH
$$ ##OWNER= she
$$ F:/spectra/data/she/nmr/H-F/1/audita.txt
$$ ##AUDIT TRAIL=  $$ (NUMBER, WHEN, WHO, WHERE, WHAT)
(   1,<2019-06-27 14:19:04.40 +0400>,<she>,<DPX200>,
      <created by zg, POWCHK disabled, PULCHK disabled
       configuration hash MD5:
       00 E9 B6 7A A2 85 ED C7 34 08 36 98 17 FE 4E 26
       data hash MD5: 16K
       57 D4 77 57 17 4C 9E 00 95 A7 22 C8 63 76 CC 5A>)
$$ ##END=
$$ 
$$ hash MD5
$$ FD EE 9B 4D 27 24 DE BF D7 B6 CB 57 00 78 6C 3B
##$RELAX= 
##$RELAX= 
##$RELAX= 
##$RELAX= 
##$RELAX= 
##$RELAX= 
$$ Bruker specific parameters
$$ --------------------------
##$DU= <F:/spectra>
##$EXPNO= 1
##$NAME= <H-F>
##$PROCNO= 1
##$TYPE= <nmr>
##$USER= <she>
##$AMP= (0..31)
100 100 100 100 100 100 100 100 100 100 100 100 100 100 100 100 100 100 
100 100 100 100 100 100 100 100 100 100 100 100 100 100 
##$AQSEQ= 0
##$AQ_mod= 1
##$AUNM= <au_zg>
##$AUTOPOS= <>
##$BF1= 200.13
##$BF2= 200.13
##$BF3= 200.13
##$BF4= 200.13
##$BF5= 200.13
##$BF6= 200.13
##$BF7= 200.13
##$BF8= 200.13
##$BYTORDA= 1
##$CFDGTYP= 0
##$CFRGTYP= 5
##$CHEMSTR= <none>
##$CNST= (0..31)
1 1 145 1 1 1 1 1 1 1 1 1 1 1 1 1 1 1 1 1 1 1 1 1 1 1 1 1 1 1 1 1 
##$CPDPRG= <>
##$CPDPRG1= <>
##$CPDPRG2= <>
##$CPDPRG3= <>
##$CPDPRG4= <mlev>
##$CPDPRG5= <mlev>
##$CPDPRG6= <mlev>
##$CPDPRG7= <mlev>
##$CPDPRG8= <mlev>
##$CPDPRGB= <>
##$CPDPRGT= <>
##$D= (0..31)
0 1.2 0 0 0 0 0 0 0 0 0 0.03 0 0 0 0 0 0 0 0 0 0 0 0 0 0 0 0 0 0 0 0 
##$DATE= 1561630743
##$DBL= (0..7)
120 120 120 120 120 120 120 120 
##$DBP= (0..7)
150 150 150 150 150 150 150 150 
##$DBP07= 0
##$DBPNAM0= <>
##$DBPNAM1= <>
##$DBPNAM2= <>
##$DBPNAM3= <>
##$DBPNAM4= <>
##$DBPNAM5= <>
##$DBPNAM6= <>
##$DBPNAM7= <>
##$DBPOAL= (0..7)
0.5 0.5 0.5 0.5 0.5 0.5 0.5 0.5 
##$DBPOFFS= (0..7)
0 0 0 0 0 0 0 0 
##$DE= 6
##$DECBNUC= <off>
##$DECIM= 24
##$DECNUC= <off>
##$DECSTAT= 4
##$DIGMOD= 1
##$DIGTYP= 9
##$DL= (0..7)
0 120 120 120 120 120 120 120 
##$DP= (0..7)
150 150 150 150 150 150 150 150 
##$DP07= 0
##$DPNAME0= <>
##$DPNAME1= <>
##$DPNAME2= <>
##$DPNAME3= <>
##$DPNAME4= <>
##$DPNAME5= <>
##$DPNAME6= <>
##$DPNAME7= <>
##$DPOAL= (0..7)
0.5 0.5 0.5 0.5 0.5 0.5 0.5 0.5 
##$DPOFFS= (0..7)
0 0 0 0 0 0 0 0 
##$DQDMODE= 0
##$DR= 18
##$DS= 0
##$DSLIST= <SSSSSSSSSSSSSSS>
$$ [...]
##$SUBNAM2= <"">
##$SUBNAM3= <"">
##$SUBNAM4= <"">
##$SUBNAM5= <"">
##$SUBNAM6= <"">
##$SUBNAM7= <"">
##$SUBNAM8= <"">
##$SUBNAM9= <"">
##$SW= 24.9336996594482
##$SWIBOX= (0..15)
0 0 2 0 0 0 0 0 0 0 0 0 0 0 0 0 
##$SW_h= 4990.01996007984
##$TD= 16384
##$TD0= 1
##$TE= 0
##$TE2= 300
##$TE3= 300
##$TEG= 300
##$TL= (0..7)
0 120 120 120 120 120 120 120 
##$TP= (0..7)
150 150 150 150 150 150 150 150 
##$TP07= 0
##$TPNAME0= <>
##$TPNAME1= <>
##$TPNAME2= <>
##$TPNAME3= <>
##$TPNAME4= <>
##$TPNAME5= <>
##$TPNAME6= <>
##$TPNAME7= <>
##$TPOAL= (0..7)
0.5 0.5 0.5 0.5 0.5 0.5 0.5 0.5 
##$TPOFFS= (0..7)
0 0 0 0 0 0 0 0 
##$TUNHIN= 0
##$TUNHOUT= 0
##$TUNXOUT= 0
##$USERA1= <user>
##$USERA2= <user>
##$USERA3= <user>
##$USERA4= <user>
##$USERA5= <user>
##$V9= 5
##$VALIST= <valist>
##$VCLIST= <CCCCCCCCCCCCCCC>
##$VD= 0
##$VDLIST= <DDDDDDDDDDDDDDD>
##$VPLIST= <PPPPPPPPPPPPPPP>
##$VTLIST= <TTTTTTTTTTTTTTT>
##$WBST= 1024
##$WBSW= 4
##$XGAIN= (0..3)
0 0 0 0 
##$XL= 0
##$YL= 0
##$YMAX_a= 150983
##$YMIN_a= -219700
##$ZGOPTNS= <>
##$ZL1= 120
##$ZL2= 120
##$ZL3= 120
##$ZL4= 120
##$ABSF1= 10
##$ABSF2= 0
##$ABSG= 5
##$ABSL= 3
##$ALPHA= 0
##$AQORDER= 0
##$ASSFAC= 0
##$ASSFACI= 0
##$ASSFACX= 0
##$ASSWID= 0
##$AUNMP= <proc_1d>
##$AZFE= 0.1
##$AZFW= 0.1
##$BCFW= 1
##$BC_mod= 2
##$BYTORDP= 1
##$COROFFS= 0
##$CY= 11.3945322036743
##$DATMOD= 1
##$DC= 2
##$DFILT= <>
##$DTYPP= 0
##$F1P= 18.9103706918063
##$F2P= -1.10871071338519
##$FCOR= 0.5
##$FTSIZE= 0
##$FT_mod= 4
##$GAMMA= 1
##$GB= 0.15
##$INTBC= 1
##$INTSCL= 1
##$ISEN= 128
##$LB= 0.24
##$LEV0= 0
##$LPBIN= 0
##$MAXI= 10000
##$MC2= 0
##$MEAN= 0
##$ME_mod= 0
##$MI= 1.114404
##$NCOEF= 0
##$NC_proc= 0
##$NLEV= 6
##$NOISF1= 3.799351
##$NOISF2= 2.8
##$NSP= 1
##$NTH_PI= 0
##$NZP= 0
##$OFFSET= 15.70392
##$PC= 1
##$PHC0= -8502.529
##$PHC1= 20.20098
##$PH_mod= 1
##$PKNL= yes
##$PPARMOD= 0
##$PSCAL= 0
##$PSIGN= 0
##$REVERSE= no
##$SF= 200.130013532006
##$SI= 16384
##$SIGF1= 3
##$SIGF2= 2
##$SINO= 400
##$SIOLD= 16384
##$SREGLST= <1H.CDCl3>
##$SSB= 0
##$STSI= 0
##$STSR= 0
##$SW_p= 3612.71676300578
##$SYMM= 0
##$S_DEV= 0
##$TDeff= 0
##$TDoff= 0
##$TI= <>
##$TILT= no
##$TM1= 0
##$TM2= 0
##$TOPLEV= 0
##$USERP1= <user>
##$USERP2= <user>
##$USERP3= <user>
##$USERP4= <user>
##$USERP5= <user>
##$WDW= 1
##$XDIM= 8192
##$YMAX_p= 0
##$YMIN_p= 0
$$ End of Bruker specific parameters
$$ ---------------------------------
##NTUPLES= NMR FID
##VAR_NAME=  TIME,          FID/REAL,        FID/IMAG
##SYMBOL=    X,             R,               I
##VAR_TYPE=  INDEPENDENT,   DEPENDENT,       DEPENDENT
##VAR_FORM=  AFFN,          ASDF,            ASDF
##VAR_DIM=   8192,          8192,            8192
##UNITS=     SECONDS,       ARBITRARY UNITS, ARBITRARY UNITS
##FACTOR=    0.0002004,     1,               1
##FIRST=     0,             0,               0
##LAST=      1.6414764,     0,               0
##MIN=       0,             -219700,         0
##MAX=       1.6414764,     150983,          0
$$ Real data points
##PAGE= N=1
##DATA TABLE= (X++(R..R)), XYDATA
$$ [...]
1960a88J22o53M00R16L4j019j31R68K18m30q7K28L05o08m05O90J74k7m82k11K26
1981D0L85k20o39M45O97j41m80j47N11j04q55J71R18O5j141j72J023j86q30j2
2001f72O86L41l09l56m9K72P2k29O8J82L18m38l96O7L61L7l04m48J140N2q32m
2023d41L65O80n63k30O29K52m29k05P91J66n68kO1O68o51j50n88L94N30j52k19
2044C38o74Q35j69n32m55P36K68l80m56P70J8l44k86L10p1L97j79n47j11L62m49
2065f19k4K49O82n74n33K25R71j5j292N48P67J08j93j53L01K5k44J58j01K58m04
2086A40J50l39L1R1k39j75M90P98n41q81K57R03m6r02j1R28o5r59J58P92oj083
2108e09N0N69J31n92l04J61L42L4j28l42j67L68O2l98K0P58l40m19J30R58k29
$$ y = [-188, -66, -719, -319, 597, 631, -388, -519, 449, 667, 237, 150, 378, 683, 75, -330, 360, 534, 507, 25, -186, 40, 425, 205, -434, 11, 708, 567, 87, -60, 451, 347, -508, -337, 581, 646, -495, -667, 356, 170, -660, -672, 14, 355, 46, -310, -359, -87, -15, -244, -176, 6, 324, -114, -510, -443, -82, -45, -349, -797, 343, 395, -437, -441, -76, 604, 41, -189, 440, 692, 263, 58, 849, 1015, 447, 445, 506, 1174, 523, 373, -215, 179, 709, 557, 338, -336, 499, 330, -202, -657, 79, 347, -33, -489, 281, 299, -45, -331, -21, -92, 305, 126, -421, -532, -170, -619, -643, -394, 288, -286, -819, -594, 377, 362, -930, -382, 385, 493, 300, 147, 448, 473, 229, 387, 286, 544, 140, 290, -49, -18, 73, -166, -341, 149, 947, 406, -475, -218, 685, 639, -263, -274, 654, 589, -370, -212, 580, 574, -509, -459, 110, 241, -351, -655, -494, -152, -118, -246, -588, -755, -387, -325, -723, -703, 55, -285, -704, -574, 384, 155]
2129A55j031q4J115L28p51j91RL76J59n5K95l6nk37J31j56N85n52j24J69J199
2150A299p24r87J40R69j7j048K40N97l46k28K81J68l56l17L29J81m3L53p61m01
2170f71O17J21r3p41L90P42k71p74J81Q49m35j063P50R85j49j232M00P32K07n41
2190DJ00k47M67k7m1q2M7K52k80m28K70O34n02o37M47J066l12j351L65J446n19
2211F72n61p3R25l44n97J37L22k70l13K1L55j95j42k13l29L63M19k27o98K03Q08
2232B63k61p13K61O23l15q49O13Q05k60o75J64L12J53k0k65ML39K38j57l02j14
2253a56N13P4o67O87J9l70n52O81R84o20o98J78O71o02n5k5M08n22M7J53l29L29
2275A48j14j39joJ99n7p75K81Q54l08q93l2J259l98q75L53O67n49m26M78O07m47
$$ y = [155, -876, -960, 155, 483, -268, -459, -450, -74, 85, 30, 325, 289, 284, 47, 178, 22, 607, 55, -69, 100, 1299, 575, -412, -272, 697, 680, -368, -128, 469, 123, -105, 176, 344, -12, -329, 0, 181, 138, 491, -270, -671, -54, 67, -26, -767, -377, 365, 94, -680, -499, 350, -85, -1148, -398, 587, 438, -794, -394, 338, 545, 4, 104, -143, 324, 297, 256, 174, 221, 473, 193, -235, 35, 669, 167, -470, -23, 1043, 731, -620, -255, 1191, 672, 111, 38, 963, 619, 22, 159, 481, 211, -102, -81, 274, 79, -63, -276, -605, -242, 177, -50, -748, -545, 263, 2, -711, -450, 173, -142, -991, -378, 427, 167, -508, -344, -32, 121, 101, -164, -160, 179, 417, 260, -42, -156, 357, 431, -236, 451, 470, 100, -452, 229, 1213, 593, -105, 73, 744, 142, 87, 62, 470, -52, -5, 148, -181, 148, 34, -105, -106, -112, 87, 30, -745, -464, 390, 82, -811, -843, 416, 18, -857, -504, 163, -386, -812, -334, 273, -174]
2297a74m55L35K08O5r0J73j31j92L24Jj52R7N41m41n37J10O49rp18M10O14J90
2319H18j294O93L60K48n44k20RL62l84M5k72K41k43k72M4N24N1J0p83L35L18k69
2341b23m57N2O29r7k82l2L30J21m81J42N19k96j40m11N79K74m32K7l83L34L50
2362A23l5l14J44L94j07o59R25K25k09l40j27L79J21l91l6L60j86j18Pj2P3P5
2384B92k36m3L04K54n90k60L54L12m97m48M88M67k32q87N51K35j57m43K55J89
2404i2m6J21k00p6J25k37k02J88K62P4k85k61Q06O5k30l00J4N12j95l98N45n3
2426A37J69j15k16M27J78n57j43Q04l63M8n38L79K80k23n67J88K59J43p44J43
2446c11N21j52k67k36P09j09l44j84L11k0M14p78m2M64N8j62m60N66J00m4m49
$$ y = [-174, -629, -294, -86, -21, -111, 62, -69, -261, 63, 64, -88, 9, 550, 109, -428, -318, 331, 322, -396, 14, 628, 818, -476, 217, 577, 825, 281, 61, 70, 432, 48, 93, -179, 62, -181, -453, -409, 115, 166, 176, -607, -272, 46, -223, -680, -628, 1, -96, -378, -410, -80, 41, -440, -298, 221, -75, -215, -626, -47, 227, -205, -178, -561, -227, 123, 88, -226, -82, 312, 205, -454, 471, 696, 487, 147, 20, 399, 520, 129, 93, 453, 267, 149, 156, 144, 217, 292, 56, 13, 317, 571, -19, -279, 75, 387, -110, -558, -70, 397, 165, -722, -171, 64, -93, -536, -281, -92, -138, -17, -217, -293, -168, -405, -607, -419, -157, -83, -368, -629, 177, 242, 12, -288, -274, 238, 43, -355, 190, 137, 306, 191, -25, 402, 580, 23, -120, 684, 321, 369, -169, 210, 490, 267, -300, -112, 147, 290, -454, -311, 210, 58, -209, -445, 264, 155, -189, -373, -62, -82, 332, -446, -488, -24, 34, -128, -588, -22, 78, 34, -415]
2467d15L47N49o65l12p7O13N90n48j97N18j63j11l86K89N09k89m27M03N36k57
2487E07o03K49J83M7k10j30K84J09k64lk07M59j13l22PJ48J87m12k53L52J00O8
2509A83p72M68K51m44j14J0M64j89j75k39K57K56R7l05j22N03L76r15j20O69J50
2530B89k90k19M43J75m38j39j12P10j01l60K93k8L02k03j89L56j7j5m69K14O49
2551H51n26n14K74L50kl85k37K02J01k14j06l9N84j18k90k34J29K04j63l37J81
2572b89L35j91l32Q3L27L2j80l85M35K97k01m81N82J38p9m29L12K13J24l85k40
2593c14O47L3l83%L46J47m67L38r3M6J80n64L02j08n8ml11L77L28l51j76N6K93
2616B64m4q64M24J82P2j81l12M14q4R1n16N5M92j58n26M67L95o4q07M23J17K11
$$ y = [-415, -68, 481, -184, -496, -573, 40, 630, 82, -115, 403, 240, 129, -257, 32, 541, 252, -175, 228, 764, 507, -96, 153, 336, 383, 173, 43, 327, 436, 172, 169, -38, 421, 308, -14, -7, 141, 328, -84, -337, 15, 115, 183, -589, -121, 130, -314, -428, -418, 46, -143, -318, -557, -300, -44, 53, -252, -374, 129, 505, -410, -530, 139, 289, -1, -220, 223, 398, -40, -179, -291, 419, 318, -42, 251, 223, 525, 322, 133, 489, 472, 457, -12, 202, 851, 325, -189, 85, 435, 433, 48, -189, 13, 114, -100, -206, -245, 339, 221, -69, -303, -174, 30, -133, -470, -289, 46, -145, -477, -394, -67, -35, -215, -600, -165, 132, -69, -550, 32, 170, 91, -338, -26, 187, 311, -74, -314, 333, 366, -17, -17, 329, 476, 9, 347, 254, 300, 480, -84, 218, 110, 52, 48, -263, 114, 442, 91, -85, -29, 264, 220, -644, -220, -38, 34, -147, -459, -45, -129, -38, -554, -499, -7, -165, -691, -224, 171, 107, -700, -277, -160, 51]
2638E1l72j13M64K52k78l80L43K82l01k12J75M62J06k19r5k5M73k96m02J78K80
2659C73p3m08J38N37q1m04k40N08k42j52kj56J55K39l16Q5M1J90m64k39L71k3
2681a63J84m02m6M91j7n61J2P88j0o07j8M15j04j80l05M04L30l83K7J85P4K01
2703C15l15O4O9M93k07m89K14K28L2k11p4J30J73m15MM33P3o45K41j79L36M6j21
2726A95j15%k2n6n4N6p1K93m62L23O7j5p50M9O78J73n01j91M18j11l39j66N62
2749c9J52l20k01L59M32j96m59L56K54l95j60J02L3J12K34k35j28O20j96m84J52
2770gP08j78p99J72O32J65p58M0L80J1l75j3j93J98O54n47j53Q0K03j54m19P3
2792b80K20N8m02j30M98N39j025j86O07K49l57n15K63M38r7k50J64K21j25k24
$$ y = [51, -321, -434, 30, 282, 4, -376, -33, 249, -52, -264, -89, 373, 479, 260, 165, 140, 613, 317, -85, 93, 373, 300, -108, 30, 567, 486, 82, -158, 350, 108, -44, -46, -202, -47, 192, -124, -39, 2, 192, -272, -511, -140, -163, 21, -381, -427, 64, 47, -514, -502, 286, 276, -331, -349, 66, -38, -218, -523, -119, 211, -172, -145, 40, 114, 315, 0, 64, 133, 626, 419, -70, 144, 372, 404, 193, 119, 249, 422, 7, 11, 444, 517, -128, 113, -66, 270, 316, 195, 80, 80, 58, 2, -52, 4, -67, 226, -236, 87, 154, 139, -611, -562, 116, 289, -212, -403, 15, -96, -435, -601, -39, 113, -207, -408, -49, 383, 187, -272, 84, 338, -57, -217, -115, -82, 30, 264, 29, -99, 521, 325, -159, -7, 701, 523, -276, -104, 528, 693, -65, -25, 355, 366, -9, -22, -215, -17, 637, 90, -63, 17, 220, 66, -353, -280, -60, -2, -404, -534, -36, 503, -522, -708, -101, 148, -209, -724, -461, -23, -120, -370, -206, 15, -110, -334]
2812c34J78J18L16k80l75k7P98Q6p98N09K58k04l21l18R32m74k20J07L68J68n83
2833i6k25K04N25l39j63r3L5M21j66k28J24N2m6n76K19Q64n42m75J78O07j17o91
2855e28j0L94J56m33M52pl04K70j81K82N0q1O4l52P6M01j33l95n1O00P3l96l25
2878c78P37q6m86N12J30l30j79K77J08o1l14o6L65qP8l06l8j98K35L12m42k8K46
2901H0k03l02K77M34q7q26J18Q90k86l01q7O27l57O8m5p5n9j22K49k80O55j56
2923B12n00J97J60M98l11n59L02O80j13p26K51L03R7o03N43j35L8m82L08K14K
2944C76l1l28Q6NK24R0q80L35L73P1n49j5N27k50m04K79L41q8m36k16M93p8l01
2967c76j18O19j69R5J12l58O2p6J06k00N7L27j62j47J45J99K00o97J61M85L8m52
$$ y = [-334, -156, -38, 278, -2, -377, -404, 394, 480, -318, 191, 449, 245, -76, -394, 538, 64, -156, -49, 319, 487, -96, -321, -117, 408, 69, -94, -187, -152, 269, 103, -125, -1, 51, 5, -571, -352, 512, -30, -505, -327, 280, 163, -528, -538, -144, 12, -421, 31, 24, -280, -10, -191, 91, 141, 60, 124, -228, -152, 249, 116, -279, -330, 270, 343, -53, -378, 359, 273, -213, 299, 429, 99, -80, 197, 305, 244, -70, -136, 229, 221, 299, -7, -45, -243, -8, 304, -138, -166, 80, -123, -425, -148, 286, 199, -627, -509, 381, 95, -206, -293, 334, -23, 45, 0, -75, -134, -256, -7, -287, 368, 212, -288, -91, 69, 567, 256, -303, -1, 679, 566, -160, 91, 394, 491, -112, 431, 296, 334, -148, 160, 374, 376, 345, 17, 103, 108, 332, 422, -458, -123, 250, 321, -228, -243, 284, 34, -370, -91, 250, 162, -274, -490, 3, -75, -376, -494, 125, -44, 51, 163, -195, -133, -209, -103, -303, -246, 81, -81, -228, -83, 116, 316, -381, -220, 265, 303, -149]
2989a49K87K04kn68J38M64m7n94M16j63K84k4k68k45J69L17j02l51j7M23m5n57
3011d30K26N03j29m73K04lL3k56l27M14K15l40q6K63N3K15k99J07nN44q31N2K29
3034a21P93q22q9j55P89k55l84Q3N52m0o11K28M49r7j80P4r4k0P6k42l8M67j64
3057A99j17o62R17J45j89o10J07L79j08k95O36l74K17n29J95N10j13m77k85M44
3077a0O3j1n34J6J00L92m03L7J35O35n84r4L05L52m02l28J19N72l12k40L72K33
3099D13r5m00J89j18L48Jk76p8J08K79m94K63M4N01n23m29K66O04n04j34J7L96
3121C78Q1l95l64N14k78j02j51L15J04k41N8K2O2j9k88j54N04K21l42k74L85o7
3143c1j29j78K70J70l9k79J72L58l07J49Q7m5J03n27K08L91Qj31k08J18P5j82
$$ y = [-149, 138, 342, 340, -228, -90, 374, 327, -267, 149, -14, 270, 246, -22, -267, -98, 219, 117, -234, -251, 172, 127, -430, -204, 299, 170, -303, -99, -102, -69, -325, -652, -238, -23, -363, -449, -186, -133, 82, -217, -110, -115, 429, -402, -350, -121, 672, -150, -239, -394, 395, 140, -244, -161, 391, 351, -260, -32, 417, 320, 140, 214, 120, 100, 176, -66, -104, 363, 199, 82, -580, 337, 482, 293, -317, -210, 169, 61, -234, 402, 28, 245, -284, -89, 421, 308, -169, -454, -10, 53, 42, -492, -476, -376, 16, -387, -350, -215, 420, -164, -258, 47, 399, -3, -331, -212, 360, 48, -192, 180, 413, 318, -82, 107, -11, 337, 338, 62, -16, 92, 371, -123, 140, 184, 685, 162, -267, -1, 603, 99, -35, -18, 378, 459, 64, -300, 214, -64, -166, -317, -2, 102, -139, -81, -59, 3, -16, -304, -458, 46, 267, -75, -349, 36, -31, -160, -338, -68, 102, 63, -216, -44, 314, 7, 156, 243, 198, 301, -226, -18, 373, 381, 250, 42, 160, 235, 53]
3165E3m33N86L11J0o47j41M28J93k56k50k10Q65l49l86R4J82m27L28j86M76l18
3186g7j11k6J78j02J38l24k3M40j37j28k42M02J48k90O2j94L21J26n19N9M33K8
3208A62m26m9M79r3j01r2K68L47j45n61K00p7K68l4p6L86J88n09O1n01P38q7l41
3231EL35L8k60L4l47L48R7o93j49L22L18m1l14J13P8J10r2l62L29PK58k91R9J55
3255I7j37k59M1L94j33J44l17M38l30J03l25L13J66j02j22j11M68L6k61N7J71
3276C31J11p67L39J69J1j03KJ82j9k49l59M39J49k49J46l53J09K67m28L76j03
3297AL0J08k60L8l16K34j55K21J08Q4l12K28m57L07j85j48K73J10L2r4J71R8j07
3320IN5j15J32L9k00K06l15K32K22k66j49K33k2K12k64K73j78j24NP0L75k03k19
$$ y = [53, -380, 206, 517, 527, -120, -261, 167, 360, 104, -146, -356, 509, 160, -226, -132, 50, -377, -49, -235, 241, -77, -188, -214, -36, -138, 0, -324, -347, 93, -44, -172, -414, -12, 136, -154, -92, -286, 35, 161, -358, -299, 134, 162, -264, -313, 166, 73, -28, -120, 148, 495, 350, -211, -11, -88, 180, 146, 70, 456, 644, 135, 196, -305, 433, 346, 5, 340, 378, 118, 152, -195, 153, 250, -443, -592, -270, 48, 7, -307, -194, -116, -6, -98, -460, -131, -124, 134, -157, -58, 97, -40, -299, -258, 136, 3, 147, -170, 268, -62, 41, -284, 29, 195, 93, -29, -140, 328, 364, 103, 160, 331, 442, -325, 14, 183, 194, 91, 93, 275, 256, 7, -352, 87, 236, -13, 133, -220, -111, 156, -272, 104, 1, 31, 139, -121, -83, -399, -165, -320, -99, 9, 93, -219, 9, -448, -141, -326, -474, -201, -91, -59, -153, 18, 116, 9, 64, -51, 81, 120, -80, 126, -189, 43, 265, -1, -150, 83, 61, 273, 9, 282, 104, -20, -15, 55, 430, 227, 8]
3343Hk1J76R0l36J20k66K26k4o2j61K32k83L58n42N33j47j76j00N52p0k38k41
3365c72N1O97m68m64L88K80j36j8k34L10j11L50k16j89M91l38J0k7L90j80k36
3386b2j38M43R6k47n56L53N76l44l29L61N34m8q48J6K28j47J42j54J20J1J05j56
3408dk61O68m59L5l09O07n1m82o7K35J22k44l9K51n7j24j45J26L01l3j65Q9k6
3431c2J25J19l22M0L14m46R7J16k11M99o13QK11L09J64m97L70R4r5j96k38R4K66
3454A76k80J80J61o0j2n13J97O43m63j96O1K22r0l03J62J86N9k07l69M32N5l84
3476c43j39M21K7J44k21k34L55J1j53l14K19M36j51j56j57M48J74o36N9M54K4
3497B68m53j18N38K80l52j39j94L27O5k5k26J31o1J20P2j05K4j79r0K39J99k61
$$ y = [8, -13, 163, 253, -83, 37, -229, -3, -27, -89, -250, -18, -301, 57, -485, 48, -99, -275, -375, 177, 107, -131, -372, -321, 376, -92, -556, -168, 112, -24, -42, -276, 34, -77, 273, 57, -132, 359, 21, 31, 4, 394, 214, -22, -160, 283, 379, 132, -424, -71, 505, 161, -168, 193, 727, 679, -169, -153, 75, -72, 70, -84, 36, 47, 152, -4, -265, 403, -56, -21, -330, 277, 226, -256, -323, -88, 34, -210, -249, 2, -55, -179, -324, -198, 103, 70, -95, -6, -32, 93, 212, -110, -70, 244, -202, -105, 11, -200, 299, -314, -306, -95, 214, 378, -119, 251, 345, 250, 54, -184, -90, 176, -104, 76, 237, 177, 165, -348, -151, 492, 29, -167, -106, 116, 26, -277, -115, 71, 130, -77, -446, -14, 41, -343, -482, -61, -34, 110, -111, -345, 10, 21, -132, -446, -227, 209, 58, -98, -255, 193, 367, -269, -210, 244, 268, -185, -303, 235, 515, 163, 24, -170, 157, 222, 197, -29, 102, 41, 161, 233, 128, 152, -27, -117, 122, 321, 60]
3519F0m12N6L40o9j8R3n6J96n14J82K92j88l18K1K21j7%k91K07j51N84l19j83
3542b84J67K46P2m50J90L07k30k91j52N47J30k44k11L48L7Q9l62L39j50J43j4
3563B27J98o4n6m3l59nN13l26m00J59M42pl38r4K13o2j87pL01j01k83j02K41M72
3587C32n07j68L50m54M34q8j61m2N00j36j95J1L18N4j48p3K22q6n56K97M92k03
3609A93k41J04%K60j31j3j29J49%K16l82j38M69p5k50K49KJ60k33m22M69l5m86
3632b64L16m1J21l99K16M4Jj28J92j82n4K50l32p7K38R7k0k35m2O21J33q83K88
3655a40L69ol84j15N57j71l64M6L62l43J00m6L16n7o9l9j3k23M93j1l28P4K69
3678B77j7m71J75N75k91k97m9N00l10l37Q5J91R7k06J87j11k72n7J91l9J15K04
$$ y = [60, -352, -296, 44, -25, -43, 50, -6, 190, -324, -142, 150, -38, -356, -335, -114, -131, -131, -422, -215, -366, 218, -101, -284, -117, 129, 201, -249, -59, 248, 18, -273, -425, 122, 252, 8, -203, 145, 182, 271, -91, 248, 98, 241, 227, 425, 361, 305, 262, -97, -102, 411, 85, -315, -156, 286, 279, -59, -153, 60, -2, -189, -196, 105, 4, -279, -381, -140, 332, -175, -343, 7, -447, -13, -101, -262, -304, 196, 60, -135, -124, 194, 248, 100, 27, 249, 163, -393, -96, 396, 193, -48, 56, 56, 316, 185, 172, 43, 192, 192, 408, 26, -112, 357, 282, 32, 281, 283, 443, 210, -212, 257, 222, -264, 52, 11, 132, -267, -51, -7, -6, -134, 58, -124, -178, 72, -260, -337, -99, -2, -22, -257, -299, 322, 455, -428, -140, 229, 223, -161, -276, 281, 110, -254, -208, 154, -189, -89, -135, 181, 124, 55, 16, 3, -220, 273, 262, -66, 8, 277, 260, -211, -36, 539, 248, -49, -98, 402, 92, -245, -160, 31, 128, -78, 109, -2, -274, -331, -140, -179, -64, 140]
3700A40k08j72M8J79n4k34K5J45L07m32j43P13l74k0n6J24J75k40q1L00qQ6j36
3723H4L7j03K39m30k51J23O82k05k04R4L0L82p44N7O16k71m19q6P10j55k61k82
3745c57O22j67k8j95l6J62r1Mj51J79K32m27Q5J0M59m59k42L8M86K24m97J94j32
3768h7Q3n8n4J60L8k63K71j46L95k00k8L3O5j27L4j00m0M92m26J40k13L67k58
3791G8m48O73o0k58p4J38J78m3r1o7j88L10j61j13P4J91j21j08j1J6M92l77K6
3814E6n3L7P2n66K51J73J41l16j77P56m13k10k29P39j60J27l54l0L80j7k62j29
3836a84J43J23q1j93M12K7k1m02k7L97P5m92L44K5o3k09K73j03N1k9KOK3J24m22
3861b01R6p2J19j69J64k48L89k93l77L60J32K35j24l11K73J91l36j76M19kP0j80
$$ y = [140, -68, -240, -192, -13, -67, -301, -276, -131, 176, -256, -399, 314, -60, -80, -136, -12, 163, -77, -158, 142, 134, 220, 84, 121, 18, 257, -173, -424, -301, 381, 176, -28, 66, 96, 478, -266, -209, 407, 136, -283, -369, 341, 186, -75, -357, 265, 98, 70, -125, -161, 1, -90, -86, -237, -58, 174, -253, -168, -158, 301, -158, -400, -362, 124, 348, -149, 45, -87, -4, -62, -116, 44, 82, -181, 90, -56, 339, 139, 111, 144, 209, 82, 116, 16, -24, 468, 42, 182, -31, 336, 78, -370, 303, 243, -15, -89, 49, 227, 184, 93, 26, -162, 148, -13, -126, -52, 139, 18, -90, -101, -85, 407, 30, 56, 3, 40, 112, -454, -203, -30, 111, -205, -382, 374, -39, -249, -478, 261, 101, 228, -126, -156, 224, 207, -55, -184, -41, 82, 1, -192, 220, 247, 226, -176, -203, 194, 269, -223, 121, 146, 83, -126, 147, 44, 95, 66, 68, 74, 97, 221, -201, -105, -177, -58, -227, -63, -311, 78, -215, -592, -232, -100, 135, 11, -300, -27, 164, -172, -348, 71, 69, 139, -41]
3883d1j32M38j22k65L42j12k54K72k76J67lM8j2k71L22J65m91L00NJ08j21J45
3905B12j41J86m10o2N56l16L8k35K79l66N12l95P1K50%m04n2K98J72j17J4m15
3927c25K22j37j21K80J3P0k78J72N3K07j7l14j0M66r4j82m1M2K79j74J48k31K27
3950B55k56j37J34J16J05j34J14J90j95p3j40K30p9m3j36L5N0O7n65O50J9k64
3972e7o9m31L80L2j71m6J55L38j12m36N08l84KJ71k83O58o8m51q2L49O0k53k5
3995b15Q1J61n6k51J49L12j81j9M4O8j15k20Q2J7L53j18l19L44K95j34l37K69
4017B10k04J61k11pJ63r9L8L48n63L83j65l66J47J54L71m95m4L9o9N04m13OL27
4040B15k84k98M07j00k41M62p0m88L70K5j92R6O7J2j18J65J73q0L2l11K61K05
$$ y = [-41, -173, 265, 143, -122, 220, 108, -146, 126, -150, 17, 14, 62, 50, -221, 101, 266, -225, 75, 80, 188, 67, 212, 71, 257, -153, -215, 341, 25, 63, -172, 107, -259, 253, -142, -71, 179, 179, -225, -277, 21, 193, 76, 90, -325, -103, -240, -361, -81, -68, 2, -276, -104, -51, 156, 139, -175, -185, 281, 187, 5, -36, 6, 285, 111, 259, 28, 255, -1, -138, -4, 112, 217, 83, 197, 387, 192, 119, -21, 209, 130, 87, -49, -14, 36, 103, -462, 188, 207, -57, -126, -557, -177, -145, -316, -362, -207, 131, 19, -417, 91, -293, -291, -120, -403, 255, 187, -264, -346, 3, 63, -190, -215, -134, 27, -29, -280, -131, 181, 0, -19, 25, 93, -22, -242, -160, -143, 210, 92, -227, 117, 412, 278, -59, 210, 6, 167, -44, -51, 112, 13, 51, 399, -164, 219, 54, -312, -165, -11, 360, -135, -179, -140, -209, 295, -118, -112, 215, -69, -367, 40, -60, -301, 161, 91, -397, -27, -2, -194, -98, -31, -19, -137, 28, 201, 121, 153, -158, 103, 308]
4062C08l43J53j94K21J30j24l92M42J48l47k30L85q9J69k73o4L39l69J39L5j11
4083f7L17k54k06K01m6J71l43l02N11k12J01K1J34j02o3K29k33J23m7r4J38J76
4105A53k72J0J44M5k1n1j86L70n8k2J03l43J54k4K29N4l97M75l62K52j7j00O6
4128B02j12j38K31M3j84M3j78J62k77L71j44J82j21K8l49M42m65j89K42J66Jk42
4150b86J3M58m1k60q0p3L6r0N55l96K87K32q81J66L05K72n73L59m6l8n6K3L11
4173A97l31L87k34%P0l0k31J42J88l00L65q7j11l9J79l15J36P5K68l50l03M06
4195H2qk0k05K97j57k05J11l44L99j37k4P0J40R4q1k0j31O7p1k27K90O3K02n13
4219c28J04K08N2l03n4M68K22j41l38J71L19k93l7M0J36j52M2j67J27J72l23M3
$$ y = [308, -35, 118, -76, 145, 275, 151, -241, 201, 349, 2, -228, 157, 68, 237, -36, -100, 239, -130, 9, 44, -67, 250, -4, -210, -9, -55, 116, -227, -529, -18, -230, -129, -108, 26, -76, -139, 90, -143, -20, -67, -161, -23, 153, -119, -109, 35, 80, 59, 8, -178, 192, 134, 112, 215, -128, 26, 2, 231, 285, -112, 363, 1, 253, 236, 136, 202, 90, -48, 183, 226, 42, 85, -93, 69, -208, 163, 19, 201, 80, 108, -241, 201, -264, -453, -211, -45, -44, -286, -273, 185, 144, -116, -196, -269, -233, -323, 232, -164, 123, 355, -526, -360, -55, 217, -356, 3, -43, -81, -137, -114, 197, -134, 253, 19, 19, 89, 59, -172, -30, 158, -142, 223, 136, 25, -14, 165, -150, -14, 61, 329, -21, -324, 82, 74, 54, -151, 146, -11, -216, -105, -449, -50, -187, -211, -141, -1, 93, 12, -8, -139, -72, -143, -370, -80, -17, 185, -328, -224, -16, 36, -267, -321, 147, 369, 228, -110, 61, 380, 87, 50, 90, 226, 74, 116, -51, 76, 248, -75, -32]
4241c2J53K02j76j10J19N9J36k15k56K17j67p5o0M23j85Q7m9M34m79M8q1j25j94
4264c26K87Jl08k39N22k00J8L5J42K98l08j71J71K82l62j6k84N78n6M5k26L61
4286B44J6m8k74K36K6l26j90M61K40l79K24k30Q9J98K36n39P6L97n78j56L43j77
4308a11O2J5J25j9J81n39J34m1J93J77m10J29p6J20l22O4P8J91l13J59K02J39
4330A38m07n1K78J42k45J04k11L08nqM5L1K04n29L79k9J56q8m79J53O14o5m03
4353C2j17K61J82n30K55J1l8M3j25K03l26L39j40q4L22l91J87N9k09j35L98l53
4375a56K6K49j60m5%l0K06k73M0l4N05m02o1J9J37j23m6%J44K53l63O9n9j45M39
4400A90k32Q2J8K35o44L41J60L6m75K71L52j2l3l00J55k37K8J70r1O8J82j86R
$$ y = [-32, 121, 323, 147, 37, 156, 215, 351, 136, -120, 97, -70, -145, -205, 218, 33, 120, 71, 505, 26, 74, -7, -132, -326, -39, -38, -346, -585, -63, -263, -245, -210, -68, 230, -78, -249, -78, 204, -158, -174, -458, 120, 64, 109, -117, 244, 260, 212, -62, 174, 200, -126, -316, 145, 385, 6, 230, 0, 89, 287, 523, -16, 60, 457, -121, -277, 66, -111, -49, -34, 91, 72, 253, -286, -152, -193, 0, 177, -233, -104, -180, -60, -382, -318, -240, -49, -362, -203, -1, 138, -269, -320, -42, 100, -145, -41, -252, 56, 51, 43, 88, 119, 323, -206, 173, 144, 300, 212, -267, -114, 500, 435, 32, -85, 176, 358, -172, 83, 94, 56, 99, -26, 177, -149, 190, 50, -34, 288, -103, 84, 143, -66, -201, 197, -156, -130, 119, -41, -86, -86, -116, 90, -183, -143, -177, 328, -74, -135, -116, 21, -102, -148, -148, -4, 249, -114, -45, -104, -249, 190, -42, 40, 58, 293, -351, -10, 150, 186, -289, -18, 334, 322, 289, -11, 144, -93, -65, 105, 14, 82, 264, 78, 87]
4423H7l86L73j86k73J40K04k5p5k9n5L48k97o3N29l52j86L61j99K76l31k49r3
4445d81N05j45J74q0P4k34K52j19K66j88j00K10n4J00j05Kk29N28m92j73L03o4
4467e0J02L03m06K84l4Qnq4j25K41k47J24k11J7K34l40j6J03K87K7l72J09M0%
4491a1m4L05j14k10L82j18J88n3k82j91QK38K90n78L48j98J80k64K86n4O9k9M0
4514A88j18J4j02j35N50o00N3j9J3K28q1J83j11R6r3k1l4m8Kl5J43j13K42j38
4538F4k1j10L09k98O8J03k89K22j54j55L06j72o1j35Q8N2L71q7J25j83p2j43L88
4561B16J03j90k9N6k37O7j61K92q1o4K68j91P1J01q3j57R7J03K34j89M3k48Q8
4584A09J04l66L46J08k79o4J34l37L99j66j34k9M28j00l17K07K32k09j96J84j84
$$ y = [87, -299, 74, -112, -385, -245, -41, -66, -141, -170, -225, 123, -174, -237, 292, -60, -246, 115, -84, 192, -139, -388, -481, 24, -121, 53, -27, 47, -187, 65, -54, 212, 24, -76, 134, 80, 180, 75, 77, -152, 376, -116, -289, 14, -50, 52, 355, -51, 233, 199, 207, 202, 118, -7, 234, -13, 111, -100, -83, 151, -189, -205, -102, 185, 212, -160, -51, -11, -11, -55, 250, 136, -74, 308, 190, 378, 325, 43, -148, -140, 98, 388, -190, 158, -40, 140, -124, 162, 108, 177, 148, 188, 70, 84, -18, -153, 397, -203, -150, -169, -156, 72, -9, 174, 63, 159, 66, 45, 11, -37, -35, -70, 73, -40, 202, 64, 43, -67, 242, -56, 12, 115, -174, 48, -106, -261, 45, -127, -188, -323, -235, -183, 188, 101, 226, 43, -29, -172, 216, 319, 129, 100, 156, -81, -14, -175, 117, 36, -28, 240, 49, 120, 221, 138, -19, 78, 181, 415, 226, 269, 21, 109, 213, -153, 193, 301, 22, -42, 92, -245, 154, -12, -146, -175, 253, 153, -164, 43, 275, 66, -130, 54, -130]
4605a30l6j5KK51k27L46k69j72N19j47p2l32N46m42R5J64R4r9k1JO3k48J81l1
4629B1j95K91j65J45MK09L4j29j95n9LN7J18j11O7L16m78k23M57j08L3j71j13
4652a92M10k20m30J54M24k81P0j6j96M21p8k54k82P30J27m40r2j35M74p7m51M03
4674F9m3p3R9p7J20O15m46j20N1k35J18n2j84K87J42n57K47K15J5k23L81k58j42
4697e1K63k77R9N6J15j08j40Q1j2l65J97J70n1j19j4P1l3k4r3Q5R7j92N5j76M84
4722A18k75j67K32j52J90n4j49L87nl41k48L31P1L48l47j15J98M8j4l6N4J45k73
4745e4L77k45J48o6l42K43PJ00m48J69J11J9O0Lq4p2L49l03k69L71m6j50j1J30
4769cQ5p6q6J20j25J84j44l76O19k95J56n8k86L82J63l70j23L65m33M33Q4j05
$$ y = [-130, -166, -181, -179, 72, -155, 191, -78, -250, 269, 122, 50, -282, 264, -178, -83, 81, 175, 76, 55, 56, 119, -129, 52, 21, -174, 117, -48, 97, 101, 310, 344, 215, 20, -39, -36, 21, 139, 28, 95, 411, -67, -290, 167, 59, 92, -79, -192, 218, -2, -432, -278, 146, -135, -65, -81, -277, 144, 66, -188, -470, 260, 387, -53, -145, -280, 194, 117, -334, 69, 26, -47, 52, -25, 95, 710, 264, 144, 195, -40, 78, 26, -158, 129, 271, -286, -39, 176, 191, -32, 349, 91, -51, 212, -65, 34, 90, 205, 97, -43, 38, 26, -339, -142, 28, -23, -142, -156, -85, -118, -142, -235, -150, -53, -245, -190, -366, 118, -157, -324, -92, -244, -54, -108, -257, 130, 125, -216, -464, -133, -62, 286, -61, -176, 22, 70, 56, 20, 74, 219, -54, 323, 78, 226, 160, -182, 61, 68, 168, -280, -111, 0, 19, 79, 82, -2, -74, 275, -28, -297, 74, 28, -122, -133, -3, 82, 6, -80, 40, -85, 99, -45, -421, 198, -97, 59, 1, -285, 97, 260, -110, -233, 132, -301, 132, 216, 111]
4791A11k33K64q6r8j03K69r8J14m9n8j39K50j3N1l97N9L94L3k73Pn4r1L58l67
4815a49N4L8P0n9K55j82j7j57j12K34L2k1j34J56r0k9Oj21L56k36r2n0M18l4l88
4840b52M20k61K51p3j76k88K12K19j22J84k8j32j9N5j22L8M15j18K6j40J74l01
4862c8K12k7l09L02j43r1J53l5k21J39K46j15k08p2K77Q4j13l18O8J97M8P8j90
4885g6J08kk11m04M45k0l8k9N27k88l35L93k98O11j71k67k1K14j97j60L84j43
4907B2PK64m34J98J33j01j36P1m5J49m13J49K59N3j89k10L30l5K69k89K7j5J8
4930H2n8pO3j08K11l41J35O4O5l99Q6j76N46j30l70M50k55O3J8K20k0K03j70m08
4954b36J23l7J11j42l9J68k3J4J62K38j36m37m1M12k25k31L85j51K87k58k94L98
$$ y = [111, -122, 142, 56, -42, -145, 124, 26, 140, 91, 33, -106, 144, 131, 182, -215, -156, 238, 271, -2, 5, -49, -140, 218, -149, -95, -57, 13, -46, 209, 27, 10, -147, -259, -25, 7, -14, -148, 8, -82, -111, -105, -226, 130, -106, -198, -248, 170, 136, -252, 168, -93, 158, 85, -91, -379, -167, 52, -70, 114, 86, -46, -65, -10, -132, -94, 321, 203, 229, 89, 263, -38, 174, 147, -162, 140, -3, -94, 59, 24, -197, -58, 188, 73, -135, -207, 70, 154, 41, -277, -209, -12, 36, 114, -76, 32, 30, -181, -585, -140, -160, -198, -227, 300, 12, -323, 70, -228, 383, 212, -55, -76, 138, -59, -219, 165, 22, 29, 293, -141, 57, 190, 89, -47, 24, -21, 128, -285, -136, 123, 176, -13, -223, 107, 72, 341, 52, 79, 64, 82, 24, 17, 80, -28, 183, -158, -23, 41, 106, -293, -207, -383, 163, 33, -337, 113, -142, -79, -61, 159, 139, 342, 172, -236, -113, -150, -39, -181, -220, -52, -75, -61, 101, 339, 203, -234, -275, 137, -88, -319, 66, -85, 202, -56, -350, 48]
4976D8J99O8m89k63N58j34o5Jj69K44k74J90RR5k22N6rR7L89k34l24J57M2j24
5000a54K4jJ5J97j40M1R3j06j20m3Q8R4K21k28k3K64l40j33J92pJ07p5L9Q2N4
5025A41L2m01J93L06n80J03J50M64m02l1k1L25P6j96m48K19J49l16K96j91L24
5046A92j66m32J50K18K85l59J2K26j53j7l30O4L13j28J46J7N0m6k58K96k12o7
5068a99N42l76r9K08k57M9m6L32J3j99n9l44L24J82k8J50J74l31j65K27J81l88
5090a09qJ13J47L7m18J17M7R4J94j41k24K94J88l83r7L27k40R9l25J81K11J43
5112B47q09N74Q9o7p3l3k62M48j86k24J41qJ40p9Q1K86k63J00l43K33K20l87K0
5135a55J26J68k29J21j00mM27j78k45Q4K85m24J48J09M2Q6k43j28L59r0l1j60
$$ y = [48, 247, 315, -174, -437, 121, -13, -78, -77, -246, -2, -276, -86, -77, 18, -204, -148, -157, -60, 329, 95, -229, -72, -30, -154, -130, -131, -116, 81, -59, -18, 75, -31, -151, -194, -106, -12, 209, -19, -42, 222, -118, -251, -59, -66, 41, -34, 5, 87, 141, 173, -228, -35, 271, -309, -206, -56, 408, 6, -25, -46, 279, 355, 159, -289, -70, 79, -237, 59, -132, 192, 26, -406, -256, -38, 247, -112, -100, 126, -27, -44, -374, -310, 3, -125, 21, 38, 88, 42, -216, 80, -132, -199, 343, -33, -132, 76, -181, -132, -178, 154, 167, -32, -91, -435, -111, 71, 43, 193, 367, 36, -129, 98, 279, -109, -117, -4, 143, 180, -238, -121, -74, 20, 214, 73, -151, 143, 331, -52, -149, 178, -62, 37, -288, -107, 104, 247, -562, 12, 101, 34, -39, -72, -334, 114, -72, -296, -155, -163, -23, -102, -21, 265, 2, 102, -241, -8, 212, -175, -155, -29, 139, -90, 31, -69, -73, 354, 176, -69, 15, 300, -124, 24, 133, 175, 261, 18, -110, 249, 159, 128, -32]
5157c2K8j2k35L75P9o4m6n08M55K46m02k46M87j79%j83M38k57L74m78J34j12L63
5180B25k54j49M7L02k9l31J00K22l03J19j74rO66m43J57k96K15J86k12j73K15
5201H1m31L11J68j73K59l53K14l83K73K78l84J18j18L59k19j55J02O1p5j71k4
5222b62L79N1m35L14R2p9Kj71J00Nk85J22J58j56M84n34Q3K67J24j00o0J6J88
5245C03k70j59J4L94j22P0j42r2j87K13K05L4m57K32qn74L05K35q3N2K05o4op5
5269B3m8q7P4j2K15n43L38Q9O0j7r9K55m50L24j91j04K00j06J91k43J06j57Q4
5292i8K08l56n3J43k2J7K51l5n4m0P4Q8n4j32K10l10K85p9J10k6j55J71k63N3
5316f7p4J46Q7J5P8j53M5J9j76j16K23N6j90R1L7J76k68M1j86j5J37q7J07O1M9
$$ y = [-32, -4, -16, -251, 124, 203, 139, 93, -415, 40, 286, -116, -362, 125, -54, -54, -237, 201, -56, 318, -160, -26, -138, 225, -29, -178, -131, 171, 142, -189, -89, 133, -170, -51, -225, -234, 432, -11, 146, -150, 65, 251, 39, -134, 81, -350, -39, 129, -44, 215, -138, 76, -307, -34, 244, -140, -22, -140, 219, 0, -155, -53, 8, -67, -238, -262, 117, 168, -267, 47, 139, 60, 62, -109, -9, -4, -289, -167, -9, -165, 319, -215, -132, 135, 259, 159, 99, 115, 303, 33, -126, -112, 282, 160, 230, 88, -4, -191, 22, 227, 261, -196, 36, 28, -546, -241, -6, -89, -37, 168, 104, 98, 23, -25, -112, -38, -50, 165, -378, -40, 49, 109, 92, -7, 248, -202, 122, -69, -173, 27, -79, 112, -131, -25, -182, -98, 110, -246, -299, -156, -178, -161, 90, 55, 1, -39, 35, 123, 69, -63, 147, -163, 122, 43, 153, 127, -28, 143, -120, -67, -141, 5, 92, 107, 185, 32, 77, 96, -80, -196, 27, 83, -107, -16, 21, 197, -71, -30, -216, -231, -94, -181, -74, -13, 36]
5341C6Q6l40K38q2J65n05K56K64k50L67k36N4j27J0J48N7k09m2J18K7o3jp30P60
5365AL42n65K43J76m7k76O4PK37j06J76k81J32k78J88K66j57K7k88K17j07q4K71
5388A58l20J25N3j04k05K95p9J96j97l2j77M11m48L72j0m5Q1J30j02m8p5k4L18
5411B73k76k96M63k16p3K63kk99L23m0K42o34k2O28k69RJ08l37L75l57j08J49
5433i6k7L48k29k3LJ46k58J28J7k08K07N9j81K0Q0j35J27o8N3Qj4L27k32Q5j78
5458d1j42K96l12L38n7l39K24r4M7j57M10j24l03L36j76K02k12J88Q0q7Q9k65
5480i9O6K17l02K23j26J08r8J34K04m47M71k19j65R9j80p9M77J38l50l39J42L17
5502A92L6m7k78j09J45L29l0o15L21k5L39k39P8k20j28J12j25N3J93jK28m64L74
$$ y = [36, 122, -218, 20, -62, 103, -402, -146, 118, -132, 235, -1, 53, -74, -64, 84, 141, -68, -110, 8, 35, -28, -29, -759, 1, 343, -222, 21, 197, 150, -126, -62, -55, 182, 76, 252, -29, 103, -175, 13, 279, 122, 149, -139, 78, -29, -113, 158, -162, -37, 16, -88, -293, 2, -77, 119, -78, -110, -287, 124, -324, 48, 38, -7, 74, 204, 102, 54, -21, -45, 273, -3, -299, 164, -52, -125, 138, 136, -163, 160, 120, 362, -272, -294, 334, 65, 74, 182, -155, 220, -137, -245, -96, -123, 225, -4, -27, -24, 122, -136, -8, 9, -199, 8, 67, -114, -94, -14, -149, -22, -90, -37, -29, -43, 284, 52, 137, -41, -183, 113, -199, 139, 82, -257, -33, -127, -80, -237, 173, 49, -254, 82, -94, 108, -104, 84, 164, 77, 166, -99, -33, 184, -118, 105, -21, 87, -11, 123, 327, -120, 351, 132, -33, 66, -114, -193, 284, 422, 72, -267, -125, 192, 228, 181, -97, -206, -61, 268, 238, -377, -56, -81, 258, 19, 97, -123, -251, -139, -264, -211, -18, -19, 209, -255, 119]
5525A19N4j88k21K88J30j27J88n47M51q5j37L25j04j67k44L22K36j57l03K11j31
5546h7K57q2O4k74J92n3j10R6J34l61L7R9J61j91N4K48j15L1q1l45M57P4j19j36
5570e0O3rL71l49k37L75j40j16k8K15L45l57j33J49l2l22J82R1K77j89m4r7j04
5593a39J82J9j58J60J40o1j27J23j9k8m8P3k63J39Qj64n4M33l8k23k2K45k0k06
5617d8lp0Q0n9O5R8j27j60L49k34Oj0K47N8l93J55J4O8N7k9J11j26k38J38L13
5642B62l24j67L20M7l14K94J10j13j41P6k68J49K12j93L68m12p9j8L7K7M4J98
5664A15j77%jJ16k12M56l28K48l56o9J39K71R4m68R3o5J58j31N4j44N00j77k57
5687a41j63K98P9O7k44j03J76Nl09O14l85J09k66K21J36L6m11N61k77j67K32q5
$$ y = [119, 173, -15, -236, 52, 182, 55, 243, -304, 147, 62, -75, 250, 146, -21, -265, 57, 293, 136, -167, 44, -87, 170, 88, 152, -122, 70, 17, -93, 3, 137, -224, -187, -88, 73, -118, -64, 184, 69, 100, 19, -326, 131, 205, 86, -50, 13, 4, 375, 26, -211, 164, 24, -92, -120, 95, 440, 83, -50, 99, 67, -255, -73, 18, 295, 106, 62, -35, -139, 43, 62, -96, 64, 204, 143, 16, 139, 120, 92, 44, 117, -146, -7, 1, -163, -217, 216, 178, -45, -67, 178, 158, -48, -51, -121, -41, -100, -35, 63, -64, -224, 125, -109, -103, -113, 134, 192, -201, -46, -32, 36, 93, 64, 175, 49, -189, -51, 262, -62, -229, 91, 138, -176, 118, 228, 115, -26, 50, -218, -69, 143, -50, 318, -94, -173, -191, -154, -127, -83, 115, -62, -62, -63, 53, -159, 297, -31, 217, -139, -208, -69, 202, 296, -172, -79, -144, 14, -117, -63, -207, 293, 116, -141, -304, -6, 73, 140, -104, -207, -31, -26, -335, 279, -106, 3, -263, -42, 94, 130, -281, 280, 3, -164, 68, -17]
5709a7K52l45KJ68k2j61L33k18oK0L3j19J3K53l6k41j30R6M5J67k1J2k74j13M64
5734A55j11L32j73m02K40j55N32m75k00K33L3K38j45j86M2J86r8J3n7N2j32P1
5756gl6k11J94L60J08l81K27l12J16j45L05j44j70N12l69J15k90J41K22J54k35
5777A54k38J09J54k00J69l8l35N89m82J53J30n0k1J85m09L64o3k08j30K13K5j98
5799a27K66o1NK14m55O2J85m26K94l21M60k21j91K58j78M09k7j98l0J83m6k32
5821a77K50L08l61K9l7k15L03O2J36l05J95j69n6p9K26j57j6J40j62L04j75j11
5843f7K98l24L8j44J36L70k7m44q6j70K04L3K41j09K77l47M42k70K33l97r4J92
5865a5o3o3J96M3n3J00j78O0k83M50q3j32j52J1L29k03j78L49k63j31K18L89k09
$$ y = [-17, 235, -110, -108, 60, 38, -123, 210, -8, -14, 6, 39, -80, -67, 186, 150, -91, -221, -125, -80, 87, 66, 78, -196, -309, 155, 44, 376, 203, -199, 41, -114, 418, -57, -257, -24, 9, 247, 102, -84, -42, 144, 46, 59, 2, 54, -78, -7, -43, -254, -60, 300, 408, 27, 254, -58, 58, -87, 218, 74, -96, 416, 47, 162, -128, 13, 235, 389, 154, -84, 25, 179, -21, 148, 110, -225, 364, -118, 35, 165, 115, 94, 279, -130, 234, 171, -37, -167, 46, 71, -127, 139, 78, 83, 297, -158, -96, 89, -337, -43, -364, 96, -125, -316, -58, -236, 173, 146, -52, -82, 101, 55, -177, 73, 381, 20, 49, 12, -203, 100, 162, 298, -7, 188, 19, -37, -116, 110, -47, -63, 77, -85, 219, 44, -67, 231, -93, -55, -199, -63, 307, 280, -164, -250, -420, -216, -183, 58, -51, 226, -121, 321, 51, 284, -113, -207, -15, -78, -141, 55, 98, 45, 145, -33, 27, -256, 194, 111, -21, -173, -162, 167, -36, -214, 135, -128, -259, -41, 348, 139]
5888A39j42J77m87L06K44n00n8N56p5L50o94J49Q7M5p1j74M53k78n6j90J95K30
5910B06l75J38k2K01J91k55J4Lnj67k26N33o0l00K10K34j98J2j25j65J9J59P1
5933I3q4R1M5k13P5q0J69J54l05q4K59k30K90k44J84j69Kr4K61l37N50j07k01
5956B5l05N7K14N3j51j5l17L88O6N0J00k53J01j06J75j06o8M4P4j01j39J86L02
5979B74k56n9KOJ99l03lL65r9r9P5p8j64L31l01J81l3j32M68n43J08L17m16J89
6003B9J53K7j41j72J63K47k80j35O2Lr9mJ12%j18L15r4m5L7k65J15k8K70m59L72
6028F5l48L18j42J70o6j90k5Q1K43m35M90Rj10k49J56P8J06J59n40K16M57l41
6050A02l4Q4j44o7j84J60Q8j36n8n5J28J49J8j34j74M42l20m3K56j51j35L74l55
$$ y = [139, -3, 174, -313, -7, 237, -263, -321, 235, 160, 510, -184, -35, 52, 97, 26, -148, 305, 27, -29, -219, -24, 206, -169, -31, -53, 148, 339, 84, 98, 101, 96, -71, -297, 236, 176, -124, 86, 320, 122, 134, 9, -156, -137, 22, 93, 9, 100, 145, -68, 7, -73, 96, 250, -55, -139, 120, -110, 180, -64, 120, -49, -47, -141, 120, -217, 333, 226, 25, -280, -223, -9, 44, -107, -122, -439, -51, 15, 65, 165, -88, 13, -93, 82, -24, -92, -48, 26, -75, -214, -28, 274, 18, -41, -39, -33, 166, -137, -140, 225, 126, 27, 102, 24, -140, 191, -110, 71, 38, -94, 374, -169, -61, 256, -160, 29, 182, 209, 68, -104, 59, 306, 26, -109, -47, -44, -143, -147, -35, -35, -153, 162, 68, 23, 60, -205, -90, -118, 152, -307, 65, -283, 35, -107, 63, -3, -193, -218, -137, 106, -329, 161, 170, 60, -189, -33, 45, 151, 310, -230, -14, 443, 102, 68, 152, 8, -59, -243, -83, 5, -131, -189, -244, -116, 33, 51, -83, -257, 185, -135, -178, 78, -73, -208, 166, -189]
6073a89L62Pm93M48k2m8j11l9L31k5m54K17O7J5K9j77J68k46K92l22J90k2L0J05
6097A13l7l39L12lJ58m25L94J77k90l0P4j84J13pk32N7N5J51J89k41k63K21j15
6120a52L43j56l65M54k15R0p8l6K30k50L70l07q3n7K91j04m04L46k54L45j60J93
6142D1K9J99n11L82k19R8j87K98n5p0p5l06K89R4K16l64K99j25j10K49J4p7l11
6165b02Q1K09l83M9K47j21J47j58K30j34J19k17L78k56K83k22n3J24m02L01M73
6186D93n40q0k3J74J22l97M15j58n8J34K2k01J63j30J07K57k71j56P8R4M4j07
6208a8j10J51R1J06l72J13k0P5N3J38M1k81J34k1j68K92j01k19J26l04K38J48
6230I2k11K77l85jJ47j02K81j68p0J75J03q7n4J17K1P4j35k38L64j92J67j73L9
$$ y = [-189, 173, 180, -313, 135, 113, 65, -46, -85, 246, 221, -233, -16, 51, 66, 95, -82, 86, -160, 132, -190, 0, -22, 8, 113, 76, -263, 49, 46, 204, -221, 173, 350, 60, 30, 104, -80, 33, 26, -206, -149, -94, 57, 246, 5, -258, -37, -152, 191, 35, -330, 124, -91, -1, -79, -115, 115, -135, 235, -72, -155, -212, 79, -25, -429, -83, -337, 8, -152, 41, 70, 269, -242, 140, -79, 19, -168, 130, 75, 5, -70, -376, -87, 7, 223, -141, 158, 33, -77, 172, 186, 109, -202, -121, 88, -295, -246, 1, -120, 27, -131, 99, -35, 84, -133, 245, -11, 272, 50, -3, 121, -281, 20, 493, -47, -127, -150, 24, 146, -251, 164, 6, -52, 82, 104, -97, 66, -64, 43, 300, 29, -127, -49, 45, 89, -18, -128, 23, 114, 220, -152, -39, -59, 16, 69, 207, 248, -33, 101, 80, -88, 204, 103, -116, 10, -294, -56, 92, -119, 158, -227, -228, -81, -183, 98, -70, -140, 35, 138, 51, -3, 114, 135, 209, 74, -164, 200, 8, 175, 2, 41]
6253D1q9K03r6ok06K47J30j68p1KJ10j77J66k8k2k65L01k07J88J9r5J12M0k10
6277h1J58j55L72k64j12J2J88L12k90k6j35J29j03n6KP9k0M0K48m73M26j53q3
6300A5N7J50m21j09M79m0l2K36l73k2j98L83m05K41L20o39J72qJ31n6P7J00n5
6323CO8K22j26P2l06k37N77l4k81K42k04K3L3m8o2k30N17l07R0N7M6j33R2j20
6347d6N6J56j97r0k3J97j70O6J03j75J16J78m22N0K11l0J10m7j75O1P3j64J14
6370d8J54lo9j11J44j19J59N5j1j79J33k4l3j54L4p4K28m5n2J68p6n6J75l49N
6395a48J31R3k27N3R6R7J05k13K90l41J51j07j97O4M51p4J08m44N1J65m12M08
6417A00%r0j32j2P9j00K23j40K47m8m94M42n2J02L3j2j35L53l26n3K61l08M7M64
$$ y = [41, -48, 155, 59, 53, -153, 94, 224, 56, -15, -13, 97, -80, 86, 58, 36, -229, 72, -135, 53, 72, -23, 89, 129, -81, 77, -78, 294, 30, -82, -70, 118, 430, 140, 114, -21, 108, 5, -51, -49, 30, 10, 50, 298, -175, 251, 98, 15, 72, 222, -199, -308, 171, 131, 99, 335, -38, -60, -258, 125, -280, -39, 281, -358, -186, -194, -63, -119, -42, 58, 3, 71, 293, 167, 239, -67, -304, 273, 239, -42, 200, -4, 19, 52, 4, -58, -288, 229, -78, 12, 69, 115, -18, 74, -46, 10, 166, -31, -121, -144, 53, -117, -51, 52, -123, -7, 171, -251, -201, 10, -20, 90, 43, -132, -71, 2, -162, -48, 106, 103, 34, -77, 67, -52, 107, 162, 151, -28, 105, 81, 48, -106, -72, -146, 82, 37, -15, 153, 77, 21, 196, -153, -148, -17, 76, -151, -98, -2, 95, 200, -13, 277, -64, 87, -20, -217, -153, 298, 224, 332, -112, -61, 104, -308, 100, 100, 10, -122, -134, -55, -155, 68, -72, 175, 127, -367, 75, 23, 125, 158, 146, 11, 364, 38, -15, 246, -62, -15, 449]
6441D49n98M13l52J01J59k76j62K42j0J70l29L62j66k3J9q4J73j02k06j9L38j62
6463f3j78K40j9J78j91k42N6K40J26q9k02p8J18k30l4L39j07j68L69J60j64L6
6485I7k7l04L64j07k4P6nj34J9j32Q1K51j27J37p4l44Q9Q2J71j4k99L79j89k98
6509c32O14j41k30j1P2Q1J66l67L86j61P8j7j59j45j28K48Q2K70o2j85p5j42J05
6532e3j92Q9QJ50j35l7Q2Q2k96L82k83L60R5m57K80o2J36j14l11K43M94m16p9
6555c4L3P0j86K96k57K93L8m16K43K5O2k10J56pk54J63j95O4M15l62k9k05N34
6578B37l4m83M31k06M27l13j8j93J07J71l19K6K15q3k14L15k85J48k81L87N7R6
6600A88J7j39R4r0j70K04k09K06j64J88j2l51o7M14j85N0j12L90j79m99N38r7
$$ y = [449, -149, 264, -88, 13, 172, -104, -266, -24, -34, 136, -193, 169, 3, -20, -1, -85, 88, -14, -220, -239, 99, -63, -241, -1, -20, 158, -33, -275, -219, 21, 147, 58, -144, -222, -104, -334, -368, -29, -136, -304, 65, 225, 61, 97, 70, -234, 130, 23, -1, 75, 70, -64, -45, -177, -96, 155, 28, 165, 91, -253, -164, -82, 89, 75, -224, 155, -34, -332, 282, 141, -89, -100, -28, 53, 219, -148, 238, 77, 155, 138, -21, -166, -294, -46, 36, 306, 244, 59, -16, -158, -53, -245, -156, -148, 2, -133, -170, -88, -6, -302, 80, -203, 157, 252, -205, 75, 13, 149, 35, -276, -33, 461, 45, -34, -1, 69, -117, 179, -78, 215, 253, -163, 80, 105, 167, -43, 113, 106, -148, 15, -180, -116, 299, -63, -92, -297, 237, 203, -280, 151, -55, 372, 59, 41, -152, -45, 126, -193, -167, 48, -35, -249, 66, -219, -71, -352, 35, 92, 188, 205, 66, 160, 70, -100, 104, -105, 101, -63, 125, 113, -238, -305, 109, -76, -26, -138, 252, 73, -426, 112, 15]
6622A5o5j65K98M5j54J13k19K87j58M8j53J76N9k77Q4L31J59m52K20M9k01j57
6644a17M2q2J82j82K28j20j0K16j32r0L3M09l52K8j45p6L02j54J2J9J11r8J24
6667A48m9P6K33m16R6p8k03J88n7K82r9m4j27R5L2n7k25L22j87k03M14Q3l87L4
6691a29J5j26K60j1J33j17J08J86l89J76k06O7Q9J81m47j71L91k29K60r7l9K1
6713g4J10J12o9r8o2J78j21k7J9k38J72K19j51j80J93j80L50J32l10N7Q6M8j10
6736E6k86n7L67q7R4m3L0k03K84l57J12k38L03l6J18j24k32J83j68L54k6K33l60
6759h3Q3J57k62L8L79k29j94P0J64n4k31m3J00K84j36k0k19J90k89M61j00P1J8
6782A55j66p2J48M5l87K41j56l2L81j79prj06J31J56j44J42j54k81J09L38k49
$$ y = [15, -50, -215, 83, 128, -26, 87, -132, 155, -3, 45, -108, 68, 127, -150, -66, 265, 424, -28, 192, 241, 40, -117, -75, -157, 25, -157, 71, -49, -59, 157, 25, -65, -32, 377, 25, 53, -92, -168, 134, -20, -8, 11, 122, 24, 148, 99, 175, 408, -8, 88, 10, -193, -5, -62, 220, 121, 77, -50, 45, 77, 20, -205, 117, -70, -273, 141, 224, -163, -129, -114, -240, 20, 9, 142, 25, 133, 319, -70, 106, -100, -33, 56, 237, -210, -381, 10, -219, 41, -56, -95, -74, 36, 148, 79, -19, -81, 97, -24, -51, -32, -270, -98, 121, -30, -210, -17, -197, 153, 285, -25, 32, 118, 166, 56, -230, -287, 80, -7, 87, 44, 74, -129, 155, -202, -90, -328, -25, -61, 57, -67, -299, -116, -284, 70, 44, 277, -83, 0, 157, -105, -67, 312, 83, -111, -41, 123, 69, -162, -205, -105, 179, 43, 23, -196, -6, -295, 166, 66, 137, 155, -11, -83, 65, 110, -277, -36, -192, -224, 157, -22, -29, -38, -144, -13, 143, -1, 141, -13, -294, -185, 153, -96]
6804i6J74k68j34K68lrk34J88K73m54M46k1j80K20k56JK43l21K51k15K61j02j76
6827a44K66M1j48l3k36K42J98M5l77K77p3O6R0l81J14Q6L83n39K05M8K7k40N5
6850b8j57N7Q8j02J75m1mJ43J5k08L3J42m25K3K21J23j62J12Q4l90K03J82K33
6873C17k67o0j43L76k42K22q4Pj7o0j66J1K36j26LmJ28k60R1J0k4K91l7m48J47
6898i9j95K93L0j27L65k30R3m51L88j28J41J7j92M31l72r3L34l62K03r4K01l04
6920a51P2L8J0p5K13L5j89J05P1L4k58J97l16K80k40K26j3k69K91o8k13K30j37
6943a27L35L8j80J9r7n7K1K17N5l9k05J12k79N6K88p7l87M86k5J21k47K3J2j1
6967E2j17J62P1r2j79K22k21j71M81k47J72r6L9n2p3J4L2J04p2O9p2P7j52L6J91
$$ y = [-96, 78, -190, -324, -56, -59, -68, -302, -114, 159, -295, 151, 130, -50, 170, -86, -85, 158, -163, 88, -127, 134, 32, -144, 122, 163, 15, -18, -254, -12, 186, 231, -146, 131, 58, 124, 214, -167, -53, 33, 416, -123, 82, 130, 157, -83, -28, -185, -128, -40, -142, 33, -8, -12, 131, 146, -62, -29, 113, -312, -289, -68, 55, -107, 5, 89, -301, -98, 84, 317, 50, -10, -153, 223, -19, 203, 119, 126, 109, 49, -117, -106, 130, 4, 7, 3, 131, -129, -38, -28, -52, 239, 202, -246, -99, -294, -1, 29, -98, 267, 37, 130, -321, 67, -61, 80, 97, -95, 336, -36, -129, 205, -157, 46, -48, 153, -151, -79, -41, -31, -106, 107, 142, -47, 58, 129, 163, -95, 102, -214, 66, -174, 52, 39, -230, 61, -7, -220, 10, -127, 208, 246, 66, 85, -12, -69, -48, 169, 224, 185, -20, 92, -187, -131, 157, 80, -307, 179, 154, 275, 28, 51, 63, 52, -65, 97, 168, 76, -103, 119, -102, -273, 208, -39, 133, 37, 76, 24, -49, -35, -3, 101, 29, 98, 26, 103, -49, -13, 178]
6992A78j7P1l75N7K7J78l21J13M11l07K44o1j80NN8J0k41M48l49J14Ml18K94k68
7016b25K73O1o9J64q4l04P4K33k60K6j43K18K88m53K15J21J09k14n1K7k7o3N0
7039c4Q1J48l34K08p9m12L64K05k09J34M8m8m20O29k78j46R2N54n46jl7K04R4
7062B17k65k6M6M5k40K75l8kl65L14J45k40j47K67r9K21j8m1J5j00j01J75j03
7085f5R5J24k94l9K15k69J97j56Q4J3L04n27J25L45rOl03j8N19m90J08n0J93q9
7109A9K81J66k76j22j84L1J86l19M15K4l99J56j18J12J55j91n3J84j45n5K88k19
7131f4j7K39K1j91M8k40K15J44P2r8r2K88k24Nk24K7R7J30l08K34p8p1L41l5q4
7156A35j92N1p2j48J88j08M0k22M27k00J59q9p2L47j94k7j03K22M4l83L18J7j21
$$ y = [178, 161, 232, -143, -86, -59, 119, -202, -89, 322, 15, 259, 198, 18, 23, 81, 91, -150, 298, -51, 63, 67, -251, 43, -225, 48, 109, 40, 204, 120, -184, -110, 123, -137, -111, -254, -36, 252, -201, 14, 135, 244, 30, -21, 6, -21, -84, -34, 47, 195, -139, 69, -10, -422, -58, 147, -62, 72, 120, 72, -348, 281, 3, -143, -51, 503, -43, -44, -81, 123, 217, -48, -74, -28, 17, -223, 52, 14, 12, -353, -39, 106, -134, -281, -14, -113, 108, 90, 49, 64, -36, -137, 38, -65, 30, 154, -140, -179, 36, -233, -36, -192, -108, -95, 209, -318, -193, 152, 143, 149, -154, -172, 347, -143, -35, -85, 108, 19, 300, 466, 190, 68, -116, -85, 101, -218, 197, 221, -178, -22, -140, -28, 127, -64, -117, 67, -78, -133, 155, -64, -81, 158, 179, -12, 36, -204, 11, 155, 227, 129, 37, 325, 101, 106, -118, -91, 6, 136, -172, 62, -16, -87, 254, 219, 135, -57, -6, -78, -226, -38, -146, -106, -328, 99, -101, 58, -31, -103, 244, 50, 23, -80, 142, 186, -197, 121, 138, 17]
7179A7mQ8M7M3j01r2K9k10J57j05M2J73J6l4j1R5J36j84k16J47j52L30k74k60
7203c23L47J2m40N21m47M38j62R0q7j24J60l1j17L7k6K88q9R9k65M6k5J65k57
7226a90J93J87k78K85j60r5N9J36J53k93K06m12M19m10K10j55K56K6k42M0J79
7247A14k78L31r9j56P3j83J77Q1K8J55k95q0J37J25j69M9j70L55J6j38K27l95
7269i5L17p1n78N2L97J8K44l96J27M2k48O6QJ90k78M82l31M56j35n66J68J79Q7
7292A35n0N2k62N20o68O06m84J69n2N2J47R9l49J88k03L20k34j0J78L24n66K35
7314A47m10J59N9n1l87M05R5j21J76n0j86L59k04j10L58m10J07K21p7K25m28Q0
7336d3k2NJ80l09L19O9k91J28j21j1J96Q2r7r0n7M3Q2O7M2Q3M0k73O0J03j21k12
$$ y = [17, 13, 101, 148, 191, 90, -2, 27, -183, -26, -131, -89, 84, 100, 66, 55, 150, 286, 102, -114, 33, -119, 211, -63, -323, 24, 36, -404, 117, -330, 108, -54, 36, -51, -175, -15, -46, -163, -126, -152, 136, 47, 146, -119, -73, -98, 67, -190, 3, 190, -88, 197, 37, -58, 1, 137, 290, -3, 203, -209, 210, -200, 10, -145, 111, 137, -105, -65, 114, -164, 167, 68, -88, -15, -198, -21, 60, 88, 243, -52, -132, 5, 130, -39, 10, -160, 195, 211, 73, 300, -95, 222, 151, -427, -375, 22, 40, 284, -112, 15, 57, -191, -125, -117, 73, -205, 277, -54, 402, 267, -299, -131, 48, 135, 85, 137, -125, 395, -273, 333, -151, 18, -34, 18, 165, 264, -85, 103, -100, 220, -14, -24, 154, 478, -88, 147, -263, -104, -45, -96, -483, -78, 17, -104, 72, 22, -164, 195, -9, -119, 239, -171, -64, 157, 80, 305, -123, -43, -65, -60, 120, -189, 130, 199, -92, 36, -85, -96, 100, 182, 85, -5, -62, -19, 63, 130, 172, 255, 295, 22, 82, 185, 64, -148]
7362a48J93k00pj3J76o8M9J46k41K28l2k08L3j72J46O42m83j47J33M1R7o1k70
7385a66L81k90K62l17K73j61m5j13j01L20l9J77k53N5L64l18k78L11J5O7k89J04
7407d1O8r0J42j52K33J15l62m6M0K60k88k1J64K03m16M8J88K89k64K4j28P9Q4
7430A29j29J12l68J65J51J25m82L48o4j31L3J36J94o5l04L27j99K04l39K41J72
7451B56k74O8k46J65J94j72K51m19J47k0J14l7J57j4j07P3k33J64J58l46J31j33
7473a23J74P2Q5j80p5O6J82l77P2N8R1j0O1R1j43m2r9j58K79j0J32ol01J00J6
7498d5j40J93ljl9P1m23K81J24k55O1Q9lj3j63J88L63n96O11m03J11q4q3J29L
7523b7P3O7K6n3k19L9P4K5K88m52J47J64N4k11p7K92M7k23N0J10l73k12L61J60
$$ y = [-148, 45, -155, -162, -175, 1, -67, -18, 128, -113, 115, 83, -125, -92, -264, -118, 524, 41, -106, 27, 68, 165, 104, -166, 215, -75, 187, -130, 143, -18, -63, -176, -277, 43, 4, 181, -72, -17, 347, 29, -249, 62, 77, 144, -145, -41, 27, -63, 79, -73, 160, 275, -87, -133, -93, 167, -121, -142, 22, 225, -191, -143, 45, 334, 70, 94, -34, 45, 129, 0, 112, -256, -91, 60, 185, -297, 51, -13, -144, -111, 25, 219, 154, -150, 177, -22, 182, -157, 84, 256, -18, 50, -196, -31, 163, -9, 242, -177, -30, -50, 64, 27, 184, 170, 63, 136, -97, 67, 225, -121, 10, -123, 51, 123, 208, 28, -47, 19, 201, -176, -104, -46, 45, 35, 96, 187, 44, 2, -97, -255, 24, 14, 146, 140, -161, -61, -45, -185, 8, 5, 4, -35, 36, -387, -106, 18, -237, -176, -87, -90, -103, -266, -78, 285, -311, 300, -103, 8, -76, -159, -30, -27, 46, 113, 139, 86, -133, -94, -20, 5, 293, -159, -12, 152, 206, -5, -82, 210, 257, 34, 84, 194, -179, -391, -30, 130]
7547A30K88m67K29l33n6M42k29J77k1n4m84L28O3J0j14R4jp1L6k30J83L30l68
7570a18M1K35j23m26K34M88k40j81J82J40j02m14J84J55K2P1j21J69j76k78L76
7591A18k35j10K80K1k64K29m9L17o07M97n4O8M1j49q7o8M28n13J47L06k81j05
7613g0J16l4p5Q0K12m90L77m9j49L15m97O48k20j69R4j87J80k3j03j30L17k44
7635a01j5K96j07l32J59N6J08L6j17j83K92K40m24K04r8J38M1j29j02J57j47O3
7657C5R9j84pK23l3q3J20o30N87k02J49j49M00l01j51M09l54L01o1l88L2j04K55
7680c7K49k52K5P2R8k86J75Q3J26m38o5J65K44jl43j54K98O4q0r1L58N2p2K0J45
7705C55k48j40K61m13M4J40l00L15p1J16k5l0m97O36j99Q2l5j41L52j56J06k33
$$ y = [130, 418, -49, 180, -153, -209, 233, 4, 181, 160, 106, -378, -50, 13, 23, -91, 3, 2, -69, -33, -263, -80, 250, -118, -77, 158, 35, -391, -157, 331, 91, -90, 92, 232, 130, -284, -100, 55, 77, 148, 27, 196, 20, -258, 118, -117, -227, 53, 74, -190, 39, -10, 307, -300, 197, 143, 211, 252, 103, 16, -52, 376, -137, 10, 316, 35, -70, 46, 12, -63, 17, 229, -261, 116, 67, -82, 233, -264, 384, 164, -5, 89, -98, 82, 59, -44, -174, 143, -101, -116, 180, 73, -259, -100, -44, 64, 100, -17, -200, 92, 332, -92, 112, 14, 152, 193, 64, -38, 119, -28, 35, 134, -50, -57, 166, 133, 50, 170, -460, 127, -75, 74, -75, 325, 24, -127, 282, -72, 229, 168, -220, -188, -292, -37, 212, -40, -15, 57, 155, -131, 44, 127, 253, -185, -250, -85, 159, 158, -185, -339, -41, 23, -57, -148, 210, 262, 190, 210, 355, 107, -33, 228, -185, -141, -1, -301, 14, -57, 59, 34, 4, -493, 143, -56, 26, -9, -150, 202, 46, 152, -81]
7727h1j71K91o9o5N8O4j24Q4N8q7Q7k9mp2j01J56k4qJ32q7R8k23K27l4O5k42j64
7754b65K7K75J01j65l74L54k16O54j89l09q5J58O6k30K85j89L32r5J3k00j25K51
7776G4P3J15j62k68r6o2N45k14k27J27M8K19l92j80M37K56m38r5K33J68m38J79
7798i8k09L83J7l75L63J44p2k75k69O13Q5k25m4j17j4M7k64K94R9J06k69l5K43
7821A28K66n88J23J10l68K31K22KP3J03n08K63l47K24j0q9R2p1K20j2l70J77J23
7844fj85N6K42P5m24J67N5P3j51J81l53L29j86J29m8K2k6l0OJ61k61J08j09J66
7868iQ1K14l62Q1K14k77l2q4p1J89M1Q6N0K19m05j5r3M3K3J19RQ6P4l69L01j33
7894b0rL8Q1j55M1P1j74M2K85L9k77k5J97k93K98N7k12j84M95j61N3P2o2k86j39
$$ y = [-81, -252, 39, -30, -95, -37, 27, -97, -13, 45, -42, 45, 16, 12, -60, -161, -5, -29, -37, 95, 8, 106, -117, 110, 76, 141, -101, -265, -238, 37, 138, -27, -401, -47, -263, 391, 202, -107, -192, -34, 32, -198, 87, -102, 230, 135, 148, -52, -177, 74, 147, 262, 100, -168, -264, -326, 219, 5, -222, -95, -47, 172, -220, -400, 37, 293, -145, -240, -7, 161, -277, -98, -307, 76, 93, -282, 81, 225, 153, -122, -391, 222, 307, 82, 38, -79, -93, -46, -310, -16, 83, 189, -80, -115, 128, 394, -194, -71, 39, -329, -98, 124, 126, 199, 302, -206, 57, -290, -66, -76, -165, -73, -144, 76, 64, -306, -129, -6, -191, -135, 107, 182, -242, -75, -20, 53, -98, 83, -270, 59, -127, 2, -46, -24, -50, -80, -74, 87, -174, -66, -175, -9, 72, 286, -76, 5, 219, -58, -90, -174, -245, -56, -15, 71, 121, 340, -65, -80, -173, -130, -107, 12, 21, 107, 181, -188, 113, -20, -29, 9, 90, -65, -24, 47, -127, -85, 200, 239, -38, -63, 134, -159, 139, 196, -16, -200, 295, 134, 187, 259, 197, -89, -228]
7919b28K71P0Q3K6j86J07j13r6O4o6k9J48K46m03L19l75J64R7j21p0nMK27j45
7943a1l13K54j05K08M8K2m88L03QP9P6P9l45J45nJ34J26j22M6J2j15j35K68k19
7967e0k6j15J90Mj70K25j23r1K56j28j16q8J77k77L36q8P1N5j00r4J42J5mJ29
7991A30l85P2J43j21K2j6q6K15L7j23l8J17Q3K5j24K7p5j7J15J91k93m7Q2j62
8015b28O9L99k01j72KJ31q7N1K78q8j67K50l52j31K44j84J97Q4K34m01k50J44
8037a78L97j26o4j95K70L8j19k20K86l29J17J39K46l00J92m76M24k4k76O4L35
8058B01k03k28K76J07j62j10j63K87J30j81J70n5k69K77O0J10l10K74k44P0O7
8079A04j38K17j57Rk17Pr3K23L10l79J85n6k30M55k42O9j4j81L06j68J30k94K15
$$ y = [-228, 43, 113, 196, 222, 36, 143, 30, -66, -2, -68, -97, 51, 297, -106, 213, -162, 2, 99, -22, -92, -97, -93, 134, -11, -324, -70, -175, 33, 81, 103, -385, -82, -74, 5, 81, 160, -185, -40, -45, 89, 215, 93, 139, 151, 36, -99, 169, -50, -76, -191, -1, 3, -167, 58, -65, -156, 100, -28, -144, -232, -55, -332, 4, -84, -13, 42, -58, -152, -10, 5, 1, 130, -255, -183, -40, -161, -139, -155, -241, -26, 11, -112, -150, -33, 50, 75, -49, -22, -97, -114, 1, 192, -101, -148, -66, -228, -159, 240, 39, -133, -131, 0, -87, -36, 242, 154, -13, 237, -115, -246, -2, -186, 11, 95, 329, -72, -322, -178, 219, 93, 29, -166, 104, 142, 23, -197, 89, -240, -123, 16, 262, -38, 154, -322, 102, 78, -198, -134, 201, -2, -230, 46, 153, -9, -119, -282, 5, 135, -46, 124, 69, -200, 77, 137, 247, -63, 211, -33, 37, 104, -34, 183, 26, 35, -182, -175, -268, -45, 265, -114, 71, 15, -215, 240, -2, 67, 53, -128, 178, 10, 140, -154, 61]
8102F1m9l00R4K52lJ21k01Mlj58M36l14J48j10k20mM13j93o9p8O8J79o6O4m07
8127c35L78R2J15l33j27M41l8m14J21K82k15P4l87N99n5k85N9m1K80j65M75l87
8149A34m07M45k44J45k79R9R6j67J67j47L14l56J87q8L56j67k50J57qR7M8j44
8171a2k38M05j33k52j2L54j11r7O3r3K40k66J06L36l41n1O1J61j72r
$$ y = [61, 12, -288, -194, 58, 55, 176, -25, -21, -24, -182, 254, -60, 88, -22, -242, -246, 167, -26, -95, -173, -105, 74, 8, 72, -335, 43, 135, 250, -83, -210, 231, 193, -221, -100, 182, -33, 41, -346, 253, 198, -87, -28, -69, 211, 46, 521, 134, -273, 172, -72, 73, -206, -107, -11, -178, -11, -158, 156, -200, -13, -101, 255, 88, -162, -5, -13, 84, 132, -12, -250, 155, 22, -230, -242, 112, 1, -96, -33, -126, 114, -152, -46, 290, -51, -102, -41, 120, -52, -61]
8191f1
$$ Imaginary data points
##PAGE= N=2
##DATA TABLE= (X++(I..I)), XYDATA
0@%%%%%%%%qJ6j6J6j6K1k9L2m0M8n6O7p5Q8j04J20j38J59j79K03k33K64k97L32
32A75l70M13m63N15n71O37p06P80q64R57j062J177j302J444j606J790j999K245
50A190k536K883l312L852m556N523o938R203j3407K3751r2888j42465K22619J02824
64A05743j44538p4864J36304L4062j10183j1252J04111k274o9770K0700N6689
75D4728k9493k9898L6403J5279l9812j471L2037j0867k6252K4365J9007l4791
87g65k0461L2975J4198k7997m865L0341J749l0343o907K2912J3787l510o584q458
101F072o612Q470J0926o040j2026L929P899o090r649N776O958p787n010J1896
115H712O294j2943o946J4359M869j5799k414K0086J195k3305j980K1356l32j8819
$$ y = [0, 0, 0, 0, 0, 0, 0, 0, 0, -8, 8, -8, 8, -8, 13, -16, 16, -24, 24, -32, 35, -40, 48, -56, 64, -74, 85, -94, 109, -124, 140, -157, 175, -195, 218, -245, 270, -301, 336, -370, 410, -454, 503, -559, 618, -684, 760, -846, 944, -1055, 1190, -1346, 1537, -1775, 2077, -2479, 3044, -3894, 5309, -8098, 15653, -77235, -219700, 2919, 105743, -38795, -113659, 22645, 56707, -53476, -64728, 39383, 37109, -32661, -11961, 44728, 15235, -14663, 21740, 37019, -2793, -4264, 27773, 16906, -9346, 15019, 34026, -765, -21226, 11749, 25947, -2050, -6915, 23426, 25175, -5168, -12075, 10837, 24624, 21114, 14530, 6072, -540, 7930, 18856, 12816, 790, 4719, 12618, 6528, -3121, 2655, 9613, 1826, -3184, 8712, 15006, 2063, -4883, 9476, 14345, -1454, -3868, 16218, 17413, -5892, -7872, 13484, 13152, -5667]
129e667L785J6018q206j3839J1526J0366j4030p754J3632O160p480L213L887j5234
143c623o597J7959O907j7427m06J9428m691k4360j59J5292M95j500R825n111j9164
158a3132P536K2712q324k1063J2641J8942j4798j4265J6710P033k1415m335J9894
171H136k029k0199P357J8576j2968j9780J1835J4103j2282o436J4788J628j6960
184a4231J113J4151n686j0770J1313Q990j6909r520J5646P782j2723k828J2531
197a141j154j0075O977J0907p029n881J3147P245j0342k865J2613o90j2327M075
211C460J3441n697j3803L947P262r806q515R540M070j0746k753J0307m339j4967
225a8599L510J6508r64j0889N368R300p804q075Q111N944n157J105Q682l132q785
$$ y = [-5667, -1882, 14136, 5930, -7909, 3617, 13983, -47, -7801, 5831, 11991, 4511, 7724, 11611, -3623, -10220, 7739, 14646, -2781, -3187, 16241, 11550, -12810, -12969, 2323, 2818, 1318, 11143, 6032, -13132, -5596, 17116, 8792, -12271, 370, 19312, 4514, -9751, 6959, 13992, -7423, -11758, 8136, 6107, -14092, -6735, 11841, -1127, -20907, -9072, 5031, -7251, -13687, 1101, 2729, -14231, -13118, 1033, -4653, -15423, -4110, 4880, -12029, -21549, -5903, 1879, -10844, -13672, -1141, -2295, -12370, -5393, 5514, -1515, -7396, 5751, 12996, 2654, -211, 12402, 11712, -615, 3460, 16901, 11204, -2599, 1348, 8610, -1196, -9711, -171, 3899, -6847, -9600, 707, -3632, -18599, -15089, 1419, 455, -10434, -5066, 4234, -3570, -11645, -3534, 2410, -2747, -1642, 7040, 3908, -4877]
240d877M571N300r251k934J5040M782j4874l192J2637k185j3841N312J4951o457
254D982j4279O492R556j0177r993R643N870q511k840Q045k747p298N801O854p548
269f150l336J2961N933j2054l663J3415K688r717J139J1617j846j0549K180Q195
283A0813l620p005L303M216m527l590J001j310k447L767J722p635l935P148L093
298I94r440l346R673L693q717j996P322L43p025L258J0330N6m821L758N677m767
314D992l574O594N621j684M64K807m967n088M622L840q610l818Q997R05j3347
329b246m462J0199J08j1481M81R430k923p021M319N192p398l416Q773L233n103
344b315K008N181o655n785R613N451j1053k019J4196O57j7255o95J7512J132j4887
$$ y = [-4877, -306, 4994, -4257, -7191, 7849, 12631, -2243, -5435, 7202, 5017, -8824, -3512, 11439, 4982, -9297, -2805, 6751, -3426, -13419, -3776, 2094, -6417, -9257, -1212, -3959, -11257, -5456, 1398, -6150, -9486, 3475, 9408, -2646, -6309, 7106, 9794, 77, 1216, 12833, 10987, 438, 2618, 10813, 7193, 188, 3491, 7707, 3180, -410, 591, -719, -3166, 601, 2323, -5312, -9247, -2099, 994, -8446, -11792, -2119, 1574, -7143, -9139, -1817, -1474, -8499, -5241, 5089, 5145, 324, 4082, 9759, 4992, 1418, 8012, 13633, 11949, 12413, 15220, 10253, 5165, 9787, 13627, 5017, 1199, 10196, 11101, -2246, -6708, 3491, 3599, -7882, -7401, 2029, -894, -7915, -3596, 1596, -5802, -9218, -445, 2788, -2315, -307, 4874, -1781, -7566, 2047, 7498, -3555, -5574, 8622, 9279, -7976, -8671, 8841, 9973, -4914]
359d914K10J1928l037r891N210O362o864n650N240J374n932R4M117m277l773N491
375d312J461o808R22R764k360j1339N010J4545j001j1266K781J0535l273p267
389b608N547R073m749o746L321K316n898k561M598J614l759k10O61m101k892L578
405b816O14m456J479P114k392j0340Q14J0007k94p671J961Q483j662p224L215
420c168O145k047m086M588M154k765n20L763L8l878O58K441q1J210L459m069r313
437c471Q29Q870j110p724J630N202o090p111O734O248n435m060N552K70o140K383
453c423Q249k404q575J940O855k974l640N455K685p691k407P404J525o039J012
468b028N442l017n892L917N864j321k831K81k452k727M991N136l835m740M487
$$ y = [-4914, -4704, 7224, 4187, -5704, -494, 5868, -996, -6646, -1406, -32, -5964, -5870, -1753, -6030, -9803, -4312, -2851, -9659, -8737, 1027, -1333, -12672, -7662, 6883, 5882, -5384, -2603, 7932, 4659, -2608, 2939, 12012, 7263, 517, 3838, 6154, 256, -2305, 2293, 3907, 148, -62, 599, -3502, -6394, -2816, -2202, -6658, -5179, 1935, -457, -10797, -9983, 24, -270, -7941, -5980, 2503, 841, -6383, -3168, 2977, 930, -3156, 1432, 5586, 2821, 2301, 6064, 6102, 2224, 2882, 5323, 5242, 6452, 9911, 5842, -3471, -2642, 6228, 5118, -2606, -976, 4226, -1864, -8975, -2241, 4007, -1428, -5488, 64, 334, -5806, -3423, 4826, 2422, -6153, -4213, 2642, -332, -3972, 1483, 4168, -3523, -5930, 1474, 2999, -3040, -2028, 3414, 397, -5495, -1578, 4286, 2965, 134, 415, -2037, -4764, 227, 5363, 1528, -3212, 1275]
483A275J350p720j767Q850J752p099l31P141j147o455L034P102j574n162K208
498A457M116j272j054Q44k049k154M010K585n552l127N374P15p268r09P037m1
514B712o701J727O934l224q686K490R124j423o175J965M290k909l839K028K780
529A093j069k79r0l294l38N023J102n834p33O495K62o784J231P802j028o998J645
546a794O213l026n045M933N722o028o646M944N773l129l384J528P72k566J492
561b41K063k337r80M555r79q538q03R323K012q021j228N251k094n839L059O250
577A453l247n727L721M064l292j881M827J361l883q8L738p11N9L447j020o257
593c436J105Q582o78p063J374O241k997o976L567O318k243l556K718J33m731P19
$$ y = [1275, 2625, -5095, -6862, 1988, 3740, -3359, -3690, 3451, 2304, -4151, -1117, 5985, 4411, -751, 1457, 5573, 4301, 3247, 4091, 2042, -112, 3898, 6483, 931, -2196, 3178, 3893, -3375, -4284, 2753, 2712, -3989, -2262, 4672, 1448, -7238, -4748, 4376, 2953, -3222, -1257, 3033, 124, -3715, -1687, 1093, 24, -255, -345, -3639, -3977, 1046, 2148, -3686, -4419, 2076, 2338, -4446, -3215, 4587, 3559, -3439, -1794, 4419, 1393, -3652, 1281, 7003, 975, -5671, -727, 5046, 1917, -1467, 61, 833, -1733, -241, 1822, -515, -1495, 3060, 2081, -6457, -7260, 2063, 4075, -3946, -5174, 77, -2017, -7856, -4797, 1453, -1794, -7521, -3800, 264, -3028, -4909, -82, 1279, -2604, -2692, 1046, 335, 394, 3841, 2821, -3436, -2331, 6251, 5573, -1490, -116, 6125, 3128, -3848, -281, 6037, 3794, 238, 2956, 3089, -1642, -923]
609i23N335j022m753K080K046m484j347O372L13p547k40P603m83n869K275N785
625E141l994m810M957N669m511m444M736K748m215j027L464j368l610J802K498
640C036m176k862M469J404n561o36M909j754o454L164P206j782o844K928O688
655C735k704n942L319N703k012k614L321J234l631K2L161N1j869J737M29l777
671A63J47M520l03n922N44M791k062n634K319M741m910n851M175N016l825l801
687e892J988J647k836j9L224r03j195K746J758m214J68N469N25m450J965M849
703D830k727m410M119M892m568l890M114K978m797j402M161p24n265J081M668
718C060j956l767J346J841l451J50M217k044n277K457N880l471n173M004N875
$$ y = [-923, 4412, 3390, -1363, 717, 2763, -1721, -3068, 3304, 3617, -3930, -4170, 3433, 2950, -2919, -644, 5141, 1147, -3663, 1294, 6963, 2452, -1992, 2744, 5492, 1277, 250, 3714, 2346, -1264, 538, 3036, -1140, -4002, 467, 1871, -3690, -4326, 583, -1171, -7625, -4461, 2745, 963, -5881, -2953, 3735, 1031, -4911, -1592, 4111, 2099, -515, 2806, 4040, 409, 431, 3592, 3643, 1774, 3511, 3940, 163, 310, 4830, 4527, -1395, -851, 3940, 1878, -3756, -1437, 3304, -1606, -7457, -3282, 1734, -2091, -5892, -3904, -2257, -5093, -5112, -1888, -2791, -3986, -1240, 518, -3696, -3528, 1941, 2466, -1984, -19, 4830, 2103, -2307, 1812, 6704, 2136, -1754, 2360, 5338, 541, -861, 3300, 2576, -2689, -1608, 3060, 1104, -2663, -1317, 524, -2927, -2777, 1440, -604, -5881, -3424, 2456, -1015, -6188, -2184, 3691]
733C691l953m069M402L547n362j762O136K423n224j665M480J41l657M56J992k592
749a016j578K980M30m348r20L385j241l398K785L876m306l750M400M311l558l639
765e587M290L544k603j293K965K67k893J931L097j015j756J926N17k055O06K994
781D935j657l739K425M033k967m026K255K075k502j825K669j5l745r97L496Q6
797E01l293Q1J421j132J64K168m15k521J338L776j056l187K296L478k397k681
813a459L789K983l710k125L481J534l442p23K507nj914P53R81k591j016L237L33
830B613l358j18L478k092l855L452M789m034n892M369N675l640m535L323L174
845C349l338k068L895J714l569q61K885r41k639J763J960k130j320K042q08l102
$$ y = [3691, -262, -4331, 71, 3618, -1744, -3506, 2630, 5053, -171, -1836, 2644, 2785, -872, -416, 1576, -1016, -2594, 386, 816, -3532, -4452, -1067, -2308, -5706, -2921, 955, -3351, -7101, -2701, 1610, -1948, -5587, -1297, 2247, -356, -1649, 1316, 1583, -1310, 621, 3718, 2703, 947, 2873, 3390, 1335, 1941, 4935, 3278, -461, 1964, 5997, 3030, -996, 1259, 3334, 832, -993, 1676, 1661, -2084, -3081, 415, 501, -2792, -2711, -1290, -2422, -2258, -90, -505, -3026, -1688, 2088, 1032, -2155, 141, 3619, 1222, -1459, 2330, 5313, 1603, -522, 2959, 4493, 1051, 328, 2835, 2830, 916, 1669, 2650, 59, -957, 2280, 2613, -745, -863, 2615, 523, -3332, 120, 4909, 875, -5017, -648, 5027, 1387, -3148, 175, 3349, 11, -2057, 1838, 3552, -17, -878, 2007, 1066, -1573, 190, 2150, 20, -1300, 742, -66, -3168]
861c168J386L678k128l806J598L101l273j700L891K326m173k530L624K597k001
876e78j022J462n83r12J861J700k073p13K303J24k448L55L078j029j953J601J004
893B177k734j559M353J189l559k203K877M89k663O79K872j467l217Q44J789r62
909a095l50O25m26j630J134K143j602j932K522J755l283q19K936J142l037q56
925b773K966M96l124K81K874j0k378M59J350j445m37K177N71j738j25J837m99
942D82k052J537K611j836k600K562K370l178k258L660K331l113l303K578K102
957A893j930j072J837J1k116m0J049k45k41J850j319l414J642L873j284l033J773
974g66K830k822k862L451L688k715l377K680J728j984j118L092J272k900o39M63
$$ y = [-3168, -1782, 1896, -232, -4038, -2440, 661, -2612, -4312, -421, 1905, -2268, -4798, -1174, 1423, -578, -1600, -138, -721, -1633, 228, 1928, -145, -858, 1445, 1569, -879, -524, 2554, 1525, -428, 1173, 2177, -557, -2116, 2237, 3426, -133, -2336, 541, 1030, -1633, -954, 1918, 451, -2766, -1922, -133, -1095, -1445, -820, -1246, -2876, -1742, 401, -1201, -3133, -611, 1144, -2139, -2958, -22, 1120, -1917, -2773, 193, 689, -2435, -2154, 720, 710, -1668, -1209, 141, -1304, -1741, 436, 1007, -731, -856, 981, 482, -1570, -33, 2578, 742, -1858, 704, 3074, -104, -2362, 1298, 3629, 516, -2787, -209, 1893, -37, -1109, 728, 739, -1377, -1417, -368, -613, -854, 996, -323, -3737, -2095, 1778, 494, -2539, -766, 2064, -758, -3620, -169, 3519, 804, -2573, 107, 1835, -149, -1267, 1825, 3097, 197, -442, 21]
990B1R10J003Q44j542k676J773K628j553k312K636J528l694k237M088K543k884
1006A076k177K225J082j733o41J808P88j101o86k4R3J029R75j477k049K115R93
1023B296k405j027K735R26l552j575L482J172l728j215K741J238l001p68K480
1038b01J15j658n4J161N94r74N03L73n32Q00J620j216j433J655J658j602j365
1055e56K849J551k826j993K286J749k042j691J694O17k017n76K020M36k044j018
1071a561K84j0L6R30m01j772Q6J277l6j075J051P63j130j459J751K157j255j181
1089a545J471P64j476o61J575Q20o80o11k0J61k6L23j99p00k29J075o05j031J059
1108e35J107j385j587J524J525j508o50J684M55j815j51J751R47j033j72K73j17
$$ y = [21, 931, 1934, 2778, 1236, -1440, 333, 2961, 1408, -904, 1732, 3260, -434, -2671, 1417, 3960, 1076, -1101, 1124, 2206, 473, -168, 1640, 2428, 1327, 641, 617, 710, 1739, 2714, 1237, -812, 1303, 2296, -109, -1136, 1599, 2525, -1027, -2602, 880, 2052, -1676, -2891, -150, 1088, -1913, -2681, -201, -86, -1744, -1798, -637, -43, -1017, -514, -141, -673, 127, 1747, 531, -902, 753, 2411, 809, -556, 2293, 3844, 1018, -975, 1311, 3060, 1018, -673, 1021, 1638, -379, -955, 1065, 1501, -543, -1561, -1277, -1287, -1251, -321, -722, -2494, -2408, -1131, -1167, -2242, -1191, -428, -1558, -3017, -1266, 891, -364, -1545, -74, 690, -786, -1447, 128, 948, 268, -343, -363, -202, -228, 95, -104, -804, -1033, 42, -563, -1594, -535, 572, -813, -2400, -876, 649, -859, -1509, 175, 630, -1185, -1336, 415, 1362, 329, 157, 430, 313]
1125C13K12R45m65j032Q05J228j571j612J960J413k359j658J716J549k200j397
1141b153J416M78j659l07J220J69j351J42J157m71k01Q33k25p65J755J097j502
1158c67r55K212J841k605j057K337J606j927j257J983Q88j400r27J665M1j357
1174G21J25M63M6k57j63n42l08R09k46j377l68J760K99k361p71K402L78j495p34
1193a519J839O05j083n77J040O31o44l77J10Q34J12k50l69k5O15o82n57L79R36
1212A018l80k066K22K273j86k070J18J611R02k211p73J805J083r97o50R22N35
1229A156n66j29L10k32j90M42r5q3O83j23p91p60J151P59k023n41K244K60k082
1248f10j281K245N28j925p77R25K79j286N9P99m00J06M73o63o15J061J082p33
$$ y = [313, 525, 1470, 1005, -27, 778, 2006, 435, -1177, 783, 2196, -163, -1821, -105, 1444, -756, -2153, -737, -259, -1918, -2225, -1005, -836, -2187, -2045, -888, -1359, -1560, -727, -952, -1717, 38, 1135, -367, -1322, 890, 2731, 126, -931, 1406, 3012, 1085, -172, 1811, 2699, 1299, 372, 2037, 2078, 721, 846, 1309, 1355, 1098, 935, 393, 85, 994, 748, -629, -997, 763, 1062, -1299, -2070, 332, 710, -785, -1519, 320, 925, -158, -735, 305, 936, 292, -85, 25, 859, 971, 721, 352, 327, 942, 260, -297, 82, 1018, 638, -1428, -1206, 1067, 881, -1189, -1071, 540, 1442, -769, -1542, 263, 1346, 349, -301, 621, 1156, 590, 461, 771, 539, 349, 791, 696, 613, 1296, 1173, 382, -378, 773, 1532, -491, -1032, 1212, 1472, -610, -1891, 354, 882, -1043, -1820, -895, -616, -1902, -1843, -1044, -1444, -1338, -865, -1528, -2143, -1082, 0, -733]
1266g33p67J685O44k295K11K319J81k264n3K436J2j925j85J557k63j243O47P45
1284G09m35L99K91r67q56J386O15j467l85J780J49k416mK196k7k366J73K091n62
1303C04j881P97J268n04n83J00N66l36K53O0j247K98J585j44k341M7K243j89k194
1322a898N47J580k56j864P71K358j111k106J182K213m04j441K74J085K72o43l7
1339E22K50K78N47n77p13m86J055Q0p62J33J060j144j458Q17J817j22j788l97
1357h88J382K97j422L44R73j83j434L04Q05N2j52r22n47L73J147j5j085N75J208
1376H12O2k344j8K334L04r13N1M97m91j151N59J615j016r80M79K28k25M92O01
1395H96j132n51J341M35j032P76J240q59k290Q12K874r25k646Q42K106j025j577
$$ y = [-733, -1500, 185, 829, -1466, -1255, 1064, 1245, -1019, -1072, 1364, 1376, -549, -734, 823, 560, -683, -36, 709, 274, 673, 964, -3, -859, 527, 1142, -325, -710, 1070, 1219, -1197, -1201, 995, 968, -1398, -1225, 866, 304, -1577, -780, 488, -16, -599, -499, 67, -269, -16, 44, -1203, -905, 680, 536, -1805, -1758, 485, 296, -1898, -1351, 229, -27, -1891, -1120, 1238, 127, -1979, -797, 1416, 1012, -429, -155, 930, 1202, 559, 522, 772, 1050, 1597, 1020, 307, -179, 876, 956, 194, 327, 1387, 243, -1215, -398, 1419, 1297, -491, -888, 494, 791, -631, -287, 686, 503, -931, -627, 178, 230, 78, -844, -1391, -1018, 129, 114, -971, -396, 812, 874, -1470, -1488, 846, 1150, 237, 288, 785, 294, -857, -298, 1317, 301, -679, -200, 28, -197, 295, 896, -236, -787, 554, 989, -43, 733, 1973, 1114, -1176, -364, 2510, 1585, -1061, -219, 1887, 862, -715]
1412g15N84J197j012k01N97q85j075J129P95j125n71J204k01j931L75K388j4k551
1430b012l67K920o55j755M34J641r13l26Q80P98p55n44Q89N13j1K10k9j041P44
1449F21J609q66k202M63J927l5j825K24Q17q39j166O60J582j8j607Q4M28N82o24
1468a85j64o2R38K74q79q85O68M82O4q81p4J061o66j159P69J982j422j814M36
1487a517K323oj272J00O82n34l52L17N24k25l85n28O7N43O89l00j017Q35J288
1506A232p79j712O73K872m30j816M23J423n68j542J094J684j330j485J070O35
1522A444j079l91O74k94q59N13O03q46q42Q94l15j221J107J589j201j788Q87K406
1540A281j580k148J260K246k68j956M60N71k87m33J040Q00p99j40M96j28j78N70
$$ y = [-715, -131, 1066, 54, -147, 450, -435, -1510, -381, 414, -711, -1282, -78, -279, -2210, -1835, 553, 539, -2012, -2379, 541, -114, -1869, -1435, 206, -707, -1033, -153, 645, -110, -654, 235, 748, 737, 947, 918, -123, 621, 2230, 1364, -838, -375, 1552, 1517, -308, -84, 733, -106, -1272, -612, 970, 952, -655, -571, -143, 439, -185, -349, -411, 527, 801, -78, -963, -295, 187, 251, -630, -704, 357, -309, -1468, -699, 1283, -139, -1953, -1517, 806, 800, -472, -372, 310, -224, -576, -259, 265, 40, -345, -873, -806, -263, 426, 126, -891, -56, 1232, 453, -1259, -586, 2286, 1856, 40, 463, 1886, 1318, -224, 870, 2554, 1224, -261, 809, 1444, 365, -26, 648, 354, -505, 8, 611, -235, -1077, -183, -498, -1719, -612, 977, -224, -2012, -1125, 1281, -299, -2447, -1187, 1059, 791, -1165, -705, -134, -421, -854, 186, 986, 187, 47, 543, 415, 237, 807]
1558H07l01m73M65J143r84j055K27J302o61j088Q25Q68j132p19O00J211r33q63
1576g61K04Q18L48m1o21k13K37R07o42q56M40P64n58j371J498N67j017j256J303
1595b50Q53j065j271R77R43o6m59j24j56m64N69J67j98L49j68j08o92O74R03j001
1615e87r55J126J795o15j840J223R46m06j023J366Q32n21j285O60K10j55o07q0
1633H4M09k9J81q69q27O5J141j00q13N6J182n96j419Q45J300o65j051P07J378
1652I79q40r34k00J196j82p55k08R14k59k54k47L80N92j17j95k16N46J044r02
1671C42n95N03J159n03j035K69O35j99r60M32R52L7r53k86O25Q0k51j46K61P06
1691A073K2q03o98P57Q72p63o52O62O10n16j575Q61P91p62r71R24M74n35o86q
$$ y = [807, 506, 33, 498, 1641, 657, -398, -171, 1131, 470, -618, 207, 1075, -57, -776, -176, 1035, 102, -761, -557, 261, 609, 568, -53, -266, -29, 878, 236, -620, -180, 584, 26, -1345, 153, 720, -297, -1553, -250, 603, -462, -1733, -756, 187, 121, -338, -462, -618, -1082, -513, -346, -544, -195, -363, -471, -1163, -489, 414, -587, -1542, -416, 1379, 764, -1076, 147, 1093, 687, -336, 1030, 1862, 1341, 56, 716, 926, 771, 164, 84, 493, 464, 645, -224, -1051, -986, 155, 55, -758, -702, 480, -116, -1535, -690, 610, -55, -1106, -399, 979, 139, -795, -995, 201, 19, -736, -944, -30, -289, -543, -790, -410, 182, 65, -130, -346, 200, 1244, 342, -253, 250, 1409, 906, -129, 140, 775, 576, -384, 48, 1000, 1037, 84, -202, 423, 503, 252, 106, 367, 1073, 1095, 292, -406, 351, 1223, 460, -192, 470, 1080, 564, -1011, -150, 641, -121, -1092, -168, 306, -229, -915, -923]
1711i23M90j47K46q7k87O78K98m35p15O76P42q16n94R11Q33r00p46Q69R31j46
1731H78r51M76P83m49p76M77M47j12k99j10J18J25P8j012j60M42P03o86o23N26
1751a25M77m29r12Q37Q91m40q46j21J170l55p69K83N63K74j133m25O21O3L7r34
1771a273K74Q32J60p17m01Q01J98l61j51M76Q91n90p01K3R95j37p40L53O83k17
1791C98r22k53J190K18n84k70N37K18m15k25l35J164L64j005m37P50M57n82j257
1810i89Q30N41m69r92K07R41n44o61p4R46l13k94J72K64M69m20k05n63J012O89
1830E47m21p03L58P85n79r82N87J219o40r30N32Q14n17m49N99O92K8o32j38M00
1850E70J31n42K47J75j11M8k55j45K42N22q84r6M43M41o46p54M44R40k99p88L29
$$ y = [-923, -433, -580, -334, -421, -708, -30, 268, -167, -882, -206, 536, -280, -874, 37, 870, -30, -776, 93, 1024, 878, -73, 403, 1186, 737, -39, 438, 885, 773, 474, 364, 482, 607, 685, -327, -487, -45, 658, -28, -651, -125, 352, -77, -989, -152, 739, 299, -547, -668, 502, 147, -622, -339, 224, 498, -635, -1060, -439, -376, -339, -1273, -999, -167, -7, -724, -1125, -324, -126, -487, -638, -162, 729, 139, -562, -539, 456, 319, -421, -68, 615, 398, -524, -777, 413, 631, 47, -223, 314, 532, 117, -108, -443, 721, 1085, 80, -357, 393, 850, 268, -989, -159, 382, -87, -1079, -872, 69, -475, -1136, -1210, -264, -577, -871, -699, -435, 34, -386, -591, -1154, -142, 547, 126, -577, -219, 566, -13, -995, -408, 811, 171, -759, -227, 587, 70, -379, 220, 912, 940, 308, 170, 570, 701, 159, 406, 581, 470, 518, 263, 118, 360, 882, -2, -98, 345, 786, 140, -614, -170, 770, 471, -317, 12]
1871A2N58r2n68n26M67J43J27n52L19Q0q6o30k5O07L72k62n24M28M83l41l05M55
1893A40O84l53n99K46M35jm40mJ85M61l27m34O49L02n32k29j19N51P00o27m57
1914B31M24K71j73p36J73O53m98o90k77Q73n15k65j11P65n74k94j73L10N46k25
1934b85n31M62O1M67l76k23M36N40p69n30O39O03m89q79M30M21r1j85l11N70O
1955c4J03l61K79K47M43n86J8L21p2n39m5J141J8p19l58K05J06n34o1N87N18j16
1977E61p26k86M04K30j03p12M12R22n90o32k01R8L99p68K16O02K82q29j58L40
1997e39K44m62j18O74M79m67n59N61J25K43j66m7K65Ol21M9K1L52J48o05J64N92
2019F39J04o68k24P03Q8k00l56N00M86r31l95O76n2k53o20K67L43j05j96o67K64
$$ y = [12, 570, 478, -90, -616, -149, -6, 121, -431, -112, -32, -118, -748, -773, -166, 206, -56, -580, -152, 331, -10, -315, 140, 824, 471, -128, 118, 553, 552, 112, 108, 293, 754, 427, -7, 642, 944, 412, 183, 64, 615, 1315, 688, 231, 655, 926, 753, 17, 190, 843, 345, -345, -622, 251, -264, -529, -640, 125, -449, -743, -916, -606, -60, -285, -816, -354, -293, 174, -202, -425, 11, 551, -218, -748, -109, 494, 5, -874, -444, -23, -114, -299, -610, -40, -34, 69, -292, -13, 234, 677, 91, 109, 430, 358, -181, -226, 915, 933, 214, -144, 61, 167, -367, -428, 159, 677, 561, -165, -451, -47, 183, 80, -632, -220, 702, 112, -520, -721, -623, -224, -992, -776, -174, 108, -721, -879, -539, -295, -757, -875, -201, 278, -189, -748, -187, -62, 181, 15, -32, 233, 239, -82, -33, -12, 340, 488, -117, 47, 639, 743, 75, -149, 554, 642, 442, 86, 586, 1072, 141, -254, 422, 370, 117, -503, -236, 107, 2, -194, -861, -597]
2040e97Q57O4q36j37O25L03p18j72J019K00r61n8M03K95o54qK32L44P5l49n88
2061f61J58L25M12p25N11L67l4n42P7Q57r9p65L23J108l04p52j54M13K86n29P8
2082C50k88N41n18L8O5m54N49j30o5j40P52n07q59K59J002m48n00K7L22J93r99
2103h10M96N45n40p54J38R95K2n56j12L1J75P34m45R8k16K28L59n03N5N49R9q28
2125b40L38M98k59n39j33R60J84j049K38MN79m52J53J3L18l81n8l16J81K89l17
2146A1l84N17K21n46q05K86J219m39m60j51J212n45n50K38K19k53k74J65L80o7
2166fL9n77l36M83Q03o37q32M29P96k5r29N98P50j19p27O23R28q31r82L46J374
2187A168q0j091J95j9j77Q6n2j36q2K42K23n14L50K58j20r92Q26P64p83j023O03
$$ y = [-597, 260, 324, -512, -649, -24, 279, -439, -611, 408, 608, -353, -411, -8, 287, -367, -375, -143, 201, 276, -73, -661, -503, -178, 234, -491, 20, 387, 353, -189, -112, 745, 646, -119, 204, 1312, 1008, 256, 102, 515, 801, 272, 350, 62, 603, 85, 123, 188, -266, 283, 153, 88, -52, 700, 193, -666, -407, 595, 147, -353, -326, -4, 189, -810, -314, 231, -309, -1063, -925, 70, 92, -464, -576, -545, -370, 364, -81, 17, -199, 29, 388, -115, -60, 489, 588, -240, 98, 596, 337, -202, -335, 625, 809, -240, -2, 2, 581, 129, 282, 295, 613, 232, 174, -142, 39, 328, 11, -373, 144, 365, -181, -986, -700, 519, 80, -380, -531, 681, 136, -414, -176, 43, -210, -484, -319, 61, -6, 33, -544, -880, -397, 406, -231, -1063, -634, 162, 137, -792, -194, 556, 437, -290, 333, 1261, 430, -552, -206, 1168, 1088, -3, 192, 173, -4, 82, 30, -106, -188, 54, 277, -237, 113, 371, 251, -741, 85, 849, 66, -957, -354]
2208c54J094m25q58J85O82k39p85K17K71m89k62L49M93K90n49R0m65N57M46k0
2228B28p39K37P38k33p42J28R73k35o97M19R14o53r30K01R09L14j006K15J47Q8
2248B76L18j29m20J26L83k19l86N54K23p16n36Q07N39n48r70M12P76k42m71j23
2268c46Q59o98q6rM3k42L36J84o61M34J40l72l73N78Q39o88p74P03M54n5n06l9
2290b79N92j32n31O62L78n01j02j08L57M15n82N1k17N08r7l08k89J92O42l94m94
2311b37M11N27n94p87P17P43j45j195K75M91R9m24m44Q9N52m49q6P4L58k41m60
2332g26N92l2M47n73m31N63P38o63l82K56N27k09o29L83O05l74k32j91Q87j46
2352D10o05K0L7Q79o38k16L40M53j53l46M3J42L88o48m82O17M84m19o23L67L02
$$ y = [-354, 740, 315, -543, -358, 324, 85, -700, -483, -212, -701, -963, -614, -121, 169, -380, -290, -755, -198, 248, 228, -511, -274, 464, 231, -511, -383, 590, 355, -342, 77, 991, 338, -592, -391, 518, 832, -174, 41, 188, 276, 594, 465, 45, 171, 554, 335, -51, 503, 726, 10, -526, 281, 820, 272, -698, -286, 490, 248, -223, -346, 513, -185, -271, -280, -237, -479, -143, 41, -620, -186, -46, -418, -791, -213, 626, -62, -836, -133, 321, 266, -240, -279, 313, 181, -350, 312, 690, 189, 87, -21, 336, 751, 169, 220, 3, 511, 414, 106, -183, 9, 651, 257, -237, 174, 701, 107, -680, 37, 780, 635, -560, -285, 206, 305, -119, -563, -474, 78, -371, -457, -383, -25, -266, -726, -134, -166, 281, -292, -723, -160, 578, -85, -467, -211, 316, 107, -522, -139, 466, 92, -140, -331, 556, 410, -195, -175, -138, 741, 103, -113, 227, 680, 527, 181, 224, 366, 754, 106, -376, 241, 725, 306, -317, 50, 352]
2373C52l08l32l83P51L0k55k46P0K15o8K3l09M05K90n02j72P34k55l25k74K70
2394b89O59o64k51L62N32l60m31J96N86K3q69M45N83M8m86o8j62L10M93o71q1
2415i5N55K47n47k32J41L53j1o34P11Lj84m27M8J48K4l79K72J75j2j53l40p8N79
2438A64k42m39L90M74n21m41n8L17J56l56J55M53J37n64j57J57N10K66p21J24
2458a96L98J23k70k24J34N96n90j48K19M50j20m99j4P30J88l85j65K67R4m01k44
2479e7K5J95K56r26M48N24J1q66OM51K50o53k2J51K59%n60J46L36J54l91l02L11
2502b54O23o13o28P95J33o4n50N06M6j47J35k23M72k34P9j39O4L70J0n27L32L18
2524E04j71m3k39J67o0K10j90j69K51K09o29J21M55o5l10j3Q7J54k54l26M26j05
$$ y = [352, 44, -288, -671, 80, 110, -145, -391, -321, -106, -174, -151, -460, -55, 235, -267, -439, 295, 40, -285, -559, -289, 370, -294, -545, -183, 349, -11, -442, -246, 340, 363, -506, -61, 522, 570, 84, 16, -146, 164, 657, -14, -95, 460, 707, 160, -72, 69, 422, 411, -223, 488, 491, 307, -120, -72, 76, 100, -279, -7, 168, 156, 3, -337, -415, 164, -78, -517, -127, 347, -174, -615, -673, -356, -200, -556, -401, 52, 189, -375, -532, -375, 135, 401, -320, -196, 202, 325, 55, -169, -35, 561, -29, -177, 42, 492, 372, -127, -141, 589, 777, 392, 227, 494, 588, 187, -57, -32, 163, 419, -507, -59, 465, 476, -390, -384, 67, 317, -336, -358, -207, 52, 52, -508, -362, -26, 128, -263, -565, -254, 369, -244, -872, -77, 56, -8, -558, -52, -6, -153, -18, -241, 231, -3, 76, -63, 1, 371, 381, -146, 186, 504, 333, 290, 51, 218, 158, 368, 178, 9, 260, 469, -160, -39, 416, 351, 41, 28, 115, 269, 15, -311, 115, 10]
2546A0J14n99L96J20l0j45l32L89J87l69m86M88J8j50K4K52J19K26o23j78N72
2567CO3J12n63M71Q3j5n60M24J37J08l95J10L36J53n62o0M03L23n55j05M50K93
2589F54l03m47o7N74k1n33L01J18L02l77l42L95j00Nl66j6M26O7m69k21L15K09
2611A04n6n66K69K78nm57j47N19J03m86k13Q66jk20k38L3L74k34P5J0K40Rn09
2634b52q4O56l11O4l24N47K43m90j42Q4P34n97k99K10L43P3l82m04L93J35Jk11
2656a3jK09J87n67L8R7K08o74r9P02j80j66p9M1M34m81l48K74pM30j29l51J34
2679c41N45l12j46m76Q87j91n72M55M55l5o00K61K85L58n49l86L32K35p1k39M4
2700f1M00M54o41j6j21M76k86k62k06M70r1m20J51M11M3o60J17M53j01l28m20
$$ y = [10, 124, -475, -79, 41, 11, -134, -466, -77, 110, -259, -745, -257, -239, -389, -365, -113, 6, 232, -391, -569, 3, 66, 178, -385, 86, 169, 154, -406, 18, 155, 263, -132, -22, 314, 467, -95, -155, 248, 571, 16, -89, 361, 654, 351, -96, -163, 411, 390, -143, 158, 276, 578, 201, -141, 254, 154, 159, -207, -223, 203, 270, -199, -420, -105, 104, 48, -518, -249, 29, 24, -433, -580, -61, 42, -444, -657, 209, 208, -12, -250, -217, 157, -77, -2, 8, 248, 257, -252, -336, 320, 9, 73, -251, 296, 539, 49, -93, -9, 725, 128, -171, 39, 382, 455, 73, -331, 62, 197, 198, -13, -14, 195, 382, -185, -147, -50, 158, -516, -615, 87, -93, -259, -338, -297, 137, -344, -692, -418, -425, 5, -124, -475, -341, 204, -108, -254, -730, 157, -34, -606, -151, 304, 269, -331, -70, 215, 573, 24, -362, -30, 205, 134, -105, -61, 339, 793, 152, 136, 15, 491, 205, -57, -263, 207, 116, -304, -153, 258, 301, -359, -242, 211, 110, -218, -638]
2721f38N30K36k37r2Q5m5J4l03j29J46J11J09J00r7M00k30q5J23N4M10n00l16
2743c54P06o8n36J04N14r1j92J80J46k94op3K54k01N38m11k26M35m0j34k34m85
2765d68Q26N56j178J53L35n8l94k62O63K87q25k13M53M84n14k35N1M1K68p2j64
2786b66jL48K77r66L91L37o0m13j09R08R4r19J1M89K99l87n2J73J39l41q9M59
2808C22j7j00j11K87k58L18j06m98J16N15k9m96j53P27l90k5j69J96k6o19L41
2829a75L87l99j90q6M24q2L9j00j60J09L43k44k45j38N06l69L60j76L05m81k58
2850f30K14P35R8q00k52K74N33l02K7N6J43n8P0K08k64L80l59j40K18mQ8n50L12
2873cO30k45p34J74M65rM2n52O62k35o30L43J38K20p74k8N09n6k46J16k1mK43
$$ y = [-638, -108, 128, -109, -201, -116, -161, -147, -450, -579, -433, -322, -213, -113, -210, 190, -40, -125, -2, 52, 462, -38, -354, 352, 284, -252, -148, 366, 275, 83, 263, 409, 115, 109, 36, 290, 89, 627, 216, -10, 425, 385, 251, 17, -468, 358, 914, -264, -111, 224, 166, -228, -490, 173, 460, -365, -578, -125, 359, -155, -390, -339, -298, -30, -102, -266, -267, 81, 358, -608, -217, 120, 60, -353, -462, 446, 540, -379, -368, 121, 420, 33, -19, 154, 293, -48, -137, 322, 305, 205, 94, 381, 123, 441, 335, -163, -47, 468, 439, -57, -210, 517, 127, 102, -67, 129, 103, -516, -175, 212, -187, -377, -463, -39, -121, -82, -182, -342, -233, 110, -134, -379, -517, -11, -380, -20, -196, 109, -372, -630, -416, 319, 417, -383, -635, -361, 172, -130, -103, -47, 96, 38, 108, 316, 52, 432, 73, -67, 151, 147, 235, -315, -3, 627, 382, -352, -178, 287, 278, 320, -232, 430, 195, -435, -92, 46, 266, -508, -536, -27, -83, -329, -213, -234, -238, 5]
2896El1n67M8L04K28l38J3M32l8l74j54N42L72r00M15K69j28j52K73j23K38j32
2918B02m8j66J80q8J51j75L24L28n86n06L07P51l41n95J80N22q8l55K52l0m20
2939b01jL12J37k20k70J36j86O0N82l28n28K32L33K8k83j51O79n38m63L05P35
2960C70l44o26K64L43K20p39L73K77J25m2j79o1K98K12o44J85k9N77l70n24L43
2981B9P90n65m98L55R25p13l81m38P02L7j10j86K35K92o98P1L87m81K95j84j01
3002b37N37p3rp23Q6M18j2n44K47M86l16k53J07O15n61k96n1O70Q9o09L08R2J43
3025A14o4m64K11M35P0j00l41L87R6k64m85P14J83k15l36%N17j4n12k07K95M25
3047D45o42m1J72k1K34m10j37M64K66l70j86L63P4l01m51P1P82l9q25L56M37l19
$$ y = [5, -26, -593, -545, -241, -13, -351, -338, 94, 56, -318, -472, 70, 442, -458, -43, 226, 98, -54, 219, 96, 334, 202, 154, -12, 168, 80, 231, 56, 380, 708, 122, -384, -77, 674, 333, -262, -82, 440, 352, -3, 249, 219, -201, -202, 110, 247, 27, -243, -107, -293, -233, 349, 21, -507, -275, 58, 86, -197, -348, 331, -207, -670, -365, 370, 26, -600, -336, 7, 227, -512, -139, 138, 263, 221, 42, -19, 279, 491, -153, 32, 3, 580, 210, -314, 29, 819, 254, -244, 111, 1036, 323, -58, -496, 206, 243, 133, -53, 182, 474, -224, -153, 234, -247, 48, -136, -237, 300, 227, 218, -505, -419, -1, -13, -557, -310, 176, -140, -393, -286, 329, -232, -528, -579, 91, 180, -429, -121, -29, 114, 50, -414, -203, 232, 302, 202, -139, 248, 344, 80, -405, 309, 492, 277, -59, -59, 458, 444, -68, -275, 20, 445, -197, -238, -66, -87, 147, -263, -400, 64, 330, -40, -226, 137, 211, -90, -541, -470, 312, 273, -552, -196, 241, -78]
3069g8k60q7O51m04k46L09J4J83k34QJ56J09K41n76j46O90n6j36j64L79J7k55
3091A15o56O20K10O3l87J81L06l82k4k52O35l63l05L66q2L54k48j76j22J82K18
3112B53k22l95O4M56k86m00J45O16m37k74K14N0K52k26q2L43O6n40j31N15L25
3133C06j72l89l1M20J03n32J82P3K66r6n77Q37j57j95Q9j11N98m52l66K56L39
3154C91J06m52M1n3K34j81J3K54k41O1k6k3o6Q2l54m01N99O50q92l54M74L31k6
3177A67m20j04L78l00l8k29M97J82q0l69K54J09k70J50k03K78l7L0k41N69k26
3198I7j28RK14J88l2k85o8N95l85m37J24L78j15k2l18N98k92R9j95l75P41k50
3220A41m06J09K24K31l77n51O22K30k78k30j32M99k65n28N74J15p2l11K43J39
$$ y = [-78, -338, -425, 226, -178, -424, -115, -101, 82, -152, -144, 12, 121, 362, -214, -360, 330, 274, 138, -26, 353, 370, 115, -541, 79, 289, 352, -35, 146, 452, 70, 46, -206, 429, 66, -239, 127, 45, 399, 151, -25, -147, 35, 253, 31, -364, -300, 156, -130, -530, -385, 231, -206, -480, -266, -216, 36, -190, -272, 71, 137, -403, -534, -19, 306, 134, -255, -286, 134, 237, -295, -113, -40, 226, 130, -447, 390, 233, 38, 127, 16, 614, 162, -204, 52, 391, 497, 45, 86, 33, 267, 86, 99, 353, 112, 173, 147, 124, 58, 140, -214, -615, -16, 634, -258, -612, -138, 193, 167, -253, -357, 21, -279, -317, -546, -49, 133, 53, -316, -62, 47, -223, -73, -276, 2, -35, -5, -246, 323, 97, -31, -22, 192, 380, 348, 63, -5, 590, 205, -232, -108, 270, 155, 133, -185, 413, 121, 220, 25, -350, 391, 141, -265, -156, 68, 299, -78, -629, -7, 223, -55, -285, -417, 82, -183, -711, -137, -22, -94, -405, -162, -23]
3240b3R8l28o3p7N55P9m55L2K43J69r7l43J39q7K92l03P5M82j24l12n1L52r1p1
3264I1M32k54J60j36k69k6L04Q8m87J77N3l1j03l40K90L13Jm32P6l6K6k61JM74
3288A11K2j27l44M14j34Ml79J91N92n39j32l0J88K20m01j5M87R6k38J30j12J91
3310A95n0j20L20j33J36p36M65J95j36Q9k57K37k74J89k17J80L24J32n78j9J79
3331A21K1j09k50L76k6o4l72L45P6k33k06M12k81n6L73m73R5N15l57j03j91M95
3353A08j81j81r7Q46n81K3n54N32M90n79L7K01K68o0l43R4L19m61j31N33j48L5
3375A70j49p9R7m2K73k93K98k41K71m23k5Q7M03l32l79L56J60P2l16rN01k06l69
3398a75L23l77J81r2R2l5J77j31L8n30L51J78r3p9l6O10n46m91P81%j29o4K5L93
$$ y = [-23, 75, -253, -316, -393, 162, 241, -214, -182, 61, 230, 133, -210, -71, -158, 134, -169, -94, 388, 264, -48, -99, 253, 162, 91, 523, 269, 429, 293, 24, -2, 302, 390, -97, 80, 133, 102, -1, -341, -51, 262, 263, -169, -93, -129, -103, -364, -363, 111, 133, 6, -338, 76, -58, -54, -433, -242, 350, -189, -321, -351, -163, 57, -344, -359, 128, 224, -14, 116, 4, 195, 145, 25, 345, 212, 348, -388, 77, 272, 136, 225, -32, 205, -69, 120, -97, 83, 407, 539, -39, -58, 121, 142, 33, -217, 159, 133, 69, -303, 42, 118, -115, -321, 91, -190, -246, 127, -346, -251, 264, -93, -196, -387, 108, -73, -254, -351, 495, -86, -63, -617, -85, 405, -174, -137, 64, 332, 272, -71, 23, 342, -119, -250, 283, 135, 170, 21, -58, 39, -3, 270, -23, 275, 34, 305, -118, -143, -56, 347, 15, -364, -8, 152, 224, -92, -101, 400, 194, -175, 148, -229, -48, -140, -48, -83, 94, -37, 1, -529, -178, 0, -93, -172, -208, 402, -144, -635, 146, 146, 17, -47, -22, 371]
3422C71m98J56J87J77l51RJ09p8J82j57l10K83J39j80J22K6j4J10j32j70K48K80
3444E09n65j71L00oj08l02M12K8p8J58j90k3KL2j86l67O52P7n87J46J74Q7l0j52
3468a88K5J61j36n6J16J52l0j08j07qN04o60N22j74L82j16k16j62O27l55O7n2
3490A88r5K99l83j30O16j31j33n91M74k3q9q5J8L45k15o6J02m7j91R9P0j32L65
3513B65m89l6n5L88P9n33K44J48J18l92k42O08J14m32J36K15P0o4J6NO4p1J36
3536B92m60L86n2j20k85K70P9J59n05K44J50J98m63n2N15j31j29j67L2L56K68
3557E85o33j30K8M9K01q9p9L07m91NK32K78k79l16M18N6J02n79j7N29k76l17J26
3580b90K69q9J12r6J36L4m4k41J7K29J97p7l75J79M40k5l38k77L72N73o74oL76
$$ y = [371, -127, 29, 216, 393, 42, 51, 160, 82, 264, 107, -203, 80, 219, 39, 161, 187, 173, 283, 151, -19, 229, 509, -56, -227, 73, 67, -41, -343, 69, 97, 19, 177, -13, -36, -34, -2, -188, -555, 97, 174, -413, -267, -93, -6, -36, -188, -163, -2, -138, -194, -78, 74, 44, -64, -171, -179, 325, -335, 187, 13, 395, 279, 63, -99, 528, 173, 240, 188, 93, 392, 9, -121, 495, 364, 231, -360, 114, 91, 2, -83, -65, 280, 65, -1, 101, 54, -137, -38, 32, -100, 265, -224, -260, -315, 73, 152, -381, -137, 11, 129, -263, -505, 103, 217, -215, -79, 136, 206, 142, 158, 163, 227, 156, 292, -168, 218, 166, 46, -239, 31, 110, 269, -236, 8, 158, 356, -107, -159, 356, 225, 96, -71, -39, 317, 585, -48, -178, -150, -101, 100, 11, -68, 239, -252, -247, -15, 263, -16, -332, 86, 142, 244, -335, -352, 177, -99, -416, -290, -21, -110, 2, -94, 42, 76, 32, -209, -192, 37, 234, 157, -218, -39, 401, 376, 38, -239, 133, 706, 32, 26, 402]
3603D02N7o90L39N2Mj59j36K46K95o05L88l15J12L37k64k12j74N23j65k28j3L42
3625A36J3n65M25L50k92n85L22L17J23l75J74m9P4l25L17j27k10L50m81N86j9
3646A59j47K60n56K13L40L8m14j54K33J96q7k62K80n6j91L08Q0l03Np9K24L20
3668D07l19o1QP3J92l19m01M0M62R3l81R1N21j08l12m40O56n20K54l30M13J97
3690B16l88k27M02P8K66l53o1J23k9j13J76j36j04L28k54j61O94j49m97Q4j8L09
3712A86j74j75O04m03j66R0J18j66O8K6M0N30n62k53M74k45L23j16k44P1R4k03
3734h3R3j90K82m25p8J19K44o5K31l06L11J09j61k51K25q6o9j17k54N80J8j06
3756B1j13J54Q1O2m32J29L12O2n60J02L32M0j69J13K10j36l12PJ18N74l74l43
$$ y = [402, 459, -231, 108, 160, 164, 5, -131, 115, 410, -195, 193, -122, -10, 327, 63, -149, -323, 200, 35, -193, -206, 136, 149, -416, 9, 359, 67, -518, -196, 121, 244, -131, 43, -6, 68, -257, 60, -67, -277, 73, -408, 178, 159, 12, 272, -284, -71, 269, 307, -107, -261, -28, 168, 81, -181, 99, 43, -148, 160, 240, -63, -58, -137, 87, 407, 88, 27, 35, 108, 300, -19, -420, -380, 82, 175, -206, -115, 406, 298, -14, -454, 202, -318, -64, -394, 19, 216, -172, -399, 3, 81, 347, -6, -67, 56, 27, -86, 90, -46, -150, 178, -76, -237, 457, 308, -189, -105, -123, 186, 12, -163, 441, 38, -128, -38, 80, -86, -18, 8, 48, 578, 16, -237, 237, -8, 315, 199, -45, 26, 120, -83, 10, -180, 102, -323, -401, -282, -38, -103, 128, -178, 133, 242, 81, -170, 55, -31, -100, -217, -471, 109, 127, 21, -92, 62, 143, 205, -227, -98, 214, 276, -284, -182, 150, 190, 21, 134, 344, 208, -104, -97, 21, 595, 221, -122]
3778a22pL25J09k44l7j34L61q5l64L31k68Nj03r6L32J99m30l20K97K00J30k78
3800a99K9K13k21K15k42K24k73J42J74K69m9k84k06J55K68j12j42l17O58m23m7
3821a68K12L06j08J18l73K42L20l90K33j94Jo3R4j0k92J24M7k25J61O3k18j64
3843b84O51k28k13l96K26L68J81k15m67J92L91n65j18L70K20j10k45J14J79K43
3863B94j05l25L4K35l38L62k09L66n03K09J35K11k95m1r5K60K94n90P3P4K44k36
3885E4M9m5J35j20k86J3M98J51k43k22J46J62k8o22K99J99Nm67j93M41l38L38
3907g4j34K83mk05l15K28J91J59k37k9L37K5m16J4L12k95P6j07J84L14l30j46
3929a69M45n26M26k99j6L72K6j89J67J2l07J46N0j72P4J11k86p3K37J02l2k74
$$ y = [-122, -129, 196, 305, 61, 24, -110, 251, 166, -198, 133, -135, -130, -233, -329, 3, 202, -228, -548, -251, -51, 79, -199, -170, 43, -178, 37, -205, 19, -254, -112, 62, 331, 282, -2, -208, -53, 215, 103, -39, -356, 302, -121, -168, 44, 350, 242, 360, -13, 229, 549, 159, 392, 198, 199, 136, 230, 220, -72, 52, 99, -126, 35, 98, -120, -284, 367, 139, -74, -470, -244, 124, 305, 90, -377, -185, 206, -359, -477, -107, 113, 3, -242, -128, 51, 294, 189, -136, -102, 133, -205, 157, -52, 314, -189, 20, 155, 366, 71, 30, -65, 195, 489, -101, -28, 46, 290, 54, 103, 58, 193, 73, -213, -200, 298, 449, 206, -16, 130, 292, 264, -358, -59, 140, 145, -322, -515, -74, -412, -74, -208, 75, 71, -134, -449, -221, -30, 129, -108, -137, 200, 225, -191, -177, 135, -160, -84, -191, -7, 307, -23, -169, 276, -250, 176, -123, -139, 233, 259, 70, 237, 249, -58, 88, 138, -34, 40, 151, -135, -208, 29, 131, 99, -175]
3951a75K75O3k59J14k09J88j83Q2K72j29K2m4l39M42n8k35L91n08K04o0o4O2K97
3974A49j32K65m54K50k11K90m16r9L43o9J67k16L16J98m44J81l91L88j20n1K32
3995A76JM6L09o64J62j3J82j8N0J58m35m3J74l5q9j47J25K24j18k8J49k5%O8k69
4020f0j03L55J11m66O9M9J74k75l2k46N28p0l58O3L70k82j73Q0K43j00J14k40
4042b49L99J36k13r7J13J48J5l39o8jN23k22p2n2Q1J09k22j3K57L6k32J17r6J63
4066B21j22Mm7m5o3l6N4l5J25J40k53k3m3J0l28M08M08l11n56N25Mo6m98K37L46
4091E6N2m47M77Q1k82J91k50n1K40J82n96N09k7L3j70j68K26K37l37Q7m1N76m46
4114A32l99K27J51J79K9k99K27k06Lj27L27L09n27k69J62l4j0J48k13Q5J9k15
$$ y = [-175, 100, 163, -96, 18, -191, -3, -186, -104, 168, 39, 61, 17, -322, 120, 62, -173, 218, -290, -86, -146, -210, -148, 149, 17, 282, -172, 78, -133, 157, -259, -358, -15, -84, 83, -133, 183, 381, -63, 118, -273, 115, -5, -56, 176, 177, 223, 532, -132, 30, 17, 199, 181, 231, 389, -46, -89, 85, 50, -39, -186, -61, 163, 45, 17, 166, 141, 141, 209, -60, -163, 192, 303, -163, -94, -45, 129, -146, -178, -424, 104, 34, -324, -261, 109, -173, -346, -266, -23, -123, -9, -249, 150, 286, 73, -24, 89, 237, 252, -87, -155, -156, 367, 145, 73, 21, 102, 211, -11, -24, 233, 269, 37, 154, 58, 221, 99, 103, 56, 11, -52, -88, -34, -69, 56, 196, -57, -80, -123, -113, -441, -33, 375, 64, -492, 33, 37, -29, -527, -290, 56, 108, -339, 138, 219, -63, 128, -122, -173, 67, 249, -347, 162, 135, 168, -2, -170, 56, 293, -44, 43, 2, 578, 132, -267, -40, 111, 290, 319, 20, 247, 41, 44, -83, 244, 553, 26, -243, -81, -115, -125, 23, -190, -105, -86, -301]
4136c01K50R9p4k71l21O60L3J39m38J57l3K8j66L46j37p5l5P6J2P2J31l03K03
4159E2j40K52j72K43p8J09p2l87K86L13j70k63k25K60L54l42r8Q5j51J83j00j34
4181a95J28M8J69q7P8p9Pl44K40Oj41n2Q5K12l28k2L79L7j61kL8k20N5j45k8M15
4207I3k20j0J0k22N23k29j52J03L01o4j8j8l9L71l10Mp9OJ01K6n9M8K9Nj36k83
4233b19R6L51l05j69O63m77K49l00K34j33j33L4J48J83l23J36J39K4n71K80PK57
4255A71k29j33N9o3K47j21J82k14N2L5j67J14O9J60j42J18k49L48k66q4J29L21
4277C37k78l00J89J70k29n4K72j65J48J16j13j47L13k44k0o4M10j59j38j08L43
4298B79j78l48p9K3M09k49k18K32k97K87K37j48R2j7m9k20L25j51l5j7j42L05
$$ y = [-301, -51, 48, -26, -297, -618, 42, 75, 214, -224, -67, -100, -72, -238, 108, -29, -104, -139, -63, -51, 21, 152, -151, 52, -88, 164, -8, 235, 157, 266, 194, -193, 93, 406, 236, -27, -252, 8, 362, 20, -78, 7, -144, 39, -61, -195, -67, -19, 150, 63, 141, 62, 69, -275, -35, -29, -170, -222, -137, 75, -253, -275, 104, 141, -20, -22, 16, -204, -149, -294, -322, 93, -127, -137, -127, -349, 174, -55, -207, -104, 197, 133, 115, 97, 58, 429, 119, 123, 44, 50, 151, 177, 118, 166, 195, 200, 64, -219, -123, 228, -77, -246, 417, -60, 189, -111, 123, -10, -143, -109, 39, 222, -101, 35, 174, 198, -373, -93, -86, 171, -58, -191, -132, -195, 52, -69, 113, -101, -49, -14, -181, -67, 2, 162, 20, 138, -111, 237, -29, -113, 16, 337, 59, -241, -52, 118, -111, -165, 107, -58, 90, 206, 93, -54, 259, 15, -5, -69, 341, 182, 44, -64, 279, 101, -247, -326, -303, 106, -143, -361, -129, -426, -139, 98, -50, 42, 25, -24, -244, 81, -70, -105, -122, -264, 41]
4320D1n9k47J11L41k11jN8J73P4n21M3N33j84q2j24j24N06k10k77J2K32k08J25
4343Al2l9M17k12k58M67q8j09l13K7N0j35K48j6m4K24l94O9L16n27K85P0mM8J90
4368B41n22L04k36L51j63r0J45L3k46L0J37J83j7l5m01K81o2Q8j02K05K78k30
4390A72j02j5K39k18n4k78J45N74n64N15m40K34k92p8rL73Oo01L58K00k66J78
4412G7k14K05K94j38rj19j07Jj61K06j87K39j84k94M15j2m8L2M7r4K10l83k38
4435d62N09K17k76k23K85J65k82j01J92L64j72l90J2J12J49j08J23P1O1j94k35
4456a83R5L7K74l61j74M72k00N5o2K1J90l45J5K04r7l47K22J88J65l33k1K6K97
4479A38J03j91n26N26j20K57o73M20L1Q1j08l7J27qnk4J31j7kk32K22j80K16r8
$$ y = [41, -18, -265, -154, 187, -24, -25, 33, 206, 280, -241, -198, 335, 151, 69, -55, -179, 327, 117, -160, -148, 84, -124, 1, -31, -70, 347, 135, -123, 344, 256, 147, -166, -139, -89, -224, 24, 8, -36, 188, -206, -137, 179, -348, -63, 7, 3, 51, 241, -281, 23, -213, 138, -25, -115, 30, 63, -183, -153, -16, 167, 150, 115, -286, -5, -67, 21, -81, 124, 402, 172, 70, 55, 294, 76, 22, -256, -111, 463, -101, 414, -26, 208, -84, -162, -171, 202, 208, -393, -35, 165, -101, 77, -137, 68, 362, 224, 215, 96, -11, -10, -171, 35, -152, 87, -97, -391, 24, 12, -36, -4, 43, -51, 159, -224, -462, 47, 264, -12, -235, 50, 215, -67, -168, 24, 388, 216, -174, -162, -50, 99, -9, 114, 185, 246, 52, -183, -88, -51, 223, -138, -312, 160, -40, 15, -47, -26, 164, -181, -166, 38, -59, -406, -184, 4, 169, -164, -185, -159, 138, 241, 50, -476, 50, -70, 187, -486, -66, -35, 46, -62, -99, 28, 20, 15, -9, 122, 105, 103, -129, 93, -87, 129, 31]
4503C1M8K42l01J4j48L42j16j5j69j81O11m87L58m14L80R7k10j59L73K05o87J80
4525frJ1J24k65j63L53P3n64K09k7K27O7k38L13q3N5l04P9K67J07k45j98J20M70
4549C73k37j74J19N3k86O9K90P5k3j26j38L85l66M3m0k38M17P1n12M25j53P0P8
4572A75k58M3J47n6j19m7M7K39k65K38j0k10kp6J15o7q1o5N1M61m29N2J63J27
4596A73k81mJ09j17J55k28K04J29j56K09o14P18k60R1j02j62M04M6Mo96P06m0
4618B88p9l28R7N16m21l07K12nO4j82J91P9l0n4j11M47l03K1j93k61M23J13k1
4641A56m66L43L3r8N9%P2k66J72k28J67K45m73J33J27J0k18p5N4O30n94O8O5K3
4665f1K35m1k6J4R7k55j15J85M12m57j71Q5J83l24N23m75N60l49M51n14K01k8
$$ y = [31, 79, 321, 20, 34, -114, 228, 112, 97, -72, -253, 358, -129, 229, -185, 195, 292, 82, -77, 296, 501, -186, -6, -15, -4, 120, -145, -308, 45, 118, -446, -237, -264, -37, 30, -208, 105, 22, 77, -227, -148, 119, 226, -19, -217, -97, 373, 136, -38, 81, 134, -152, -83, 207, 282, 259, 133, -5, 380, 14, 57, 17, -221, 196, 267, -245, 180, 27, 97, 175, -83, -40, 107, 51, -68, -115, -68, 171, -94, 144, 134, -76, -78, -154, -39, -106, -187, -252, -201, 260, -169, -117, 46, 173, -108, -112, -3, -120, 35, -193, 11, 140, -16, 193, -421, 297, 37, 128, 26, -136, 268, 314, 318, -378, 328, 288, 209, -119, -22, 494, 73, -234, -22, -27, 37, -145, 46, 125, 95, 41, -70, 377, 74, 95, -98, -359, 64, 177, 156, -310, 33, 66, -32, 27, 27, 99, -167, 5, -223, -56, 189, -284, -151, -24, -14, -232, -307, -253, 377, -217, -149, -84, -61, 174, 133, 107, 121, 218, -37, -152, 33, 445, -12, -183, -98, 85, -239, 284, -191, 369, 20, 471, -43, 158, 130]
4687A30j17k61M31R5m70J48J43L7p8j17L0P5n8j1m0m8N42n70r6O9J92k72K11j5
4711e0J41K44k64l04Q9j0L70j54k59M39P0j68k80L32j73L3j60l8M87k96l05M36
4733A80p5K9m61L05J12J24m83K44L32j15k62k90M78k34L29N6k18kp2O0k13J65
4755a1o0M6j94O3J40j05m00L77L27n1j60j72K39l5j00r9K56m3q0Q0j46K89m80
4778c19N22n12L05L63k06j61L7J91J8j5j78J90m2k50m9K48j53j61L19k02J97J2
4800A54R4j42J24k66J34r8rp4j19Q8K4q0O5%o1R6L42k65k78M28l38l5q4K50j3
4825f3kK6O3J47J40l09l91N57l8j40k71K68k27K71N5n0K77Rk66j82K99k36K75
4848B12R0k48oJ06k21J54j80J74n2j12j8K99k40o6J98J7j46p5j48K59K2J28k09
$$ y = [130, 13, -248, 183, 278, -192, -44, 99, 136, 58, -59, -29, 46, -12, -23, -63, -111, 431, -139, -235, -166, 26, -246, -35, -50, 91, 335, 71, -233, -144, -154, 216, 62, -197, 242, 312, 144, -136, 196, 23, 56, -104, -142, 345, 49, -256, 180, 105, 134, -327, -22, 90, 214, -269, -25, 307, 192, -70, -360, 118, -116, 213, 269, 51, 49, -23, 37, -176, -11, -71, -25, -219, -156, -16, -121, -521, -144, 183, 132, -28, -200, 39, 4, -96, -195, 61, 18, -62, 18, -128, 161, -319, 203, -309, -4, 359, 153, -8, 29, 220, 238, 223, 45, 235, 193, -57, -106, 142, -11, -172, 147, -55, 142, 154, 248, 106, 230, -36, 98, 0, -9, -83, -202, -114, -90, -170, -105, -105, -166, -70, 272, 7, -271, 157, -181, -216, -300, -50, -63, -65, -39, 24, 171, 311, 2, -389, 168, 130, -10, -281, -13, -240, 31, 86, 36, 313, 322, 56, -126, 173, -63, 212, 302, 54, 48, 154, -67, 87, -93, 81, 29, -83, -101, 198, -42, -108, 90, 107, -39, -114, -262, -3, 19, 147, -62]
4871f2J10Q4m50J30N8n5Q3n1O3k5N57n66J60J16k47j63L38P1K48r4k16J7J26k03
4895B9L12k73J73J64l90J84j11O7J98m59m0j1J52L48k55l61P42l29j19J2j14K6
4917e5Q5j14l2ok26L97m8J23l06J36K58l51J77J24j10l1J76m25J9J27L43k32k68
4940b39Q7L96m32j54K30K97k91K12j20k21L17L9N6kk44K97k52j1M92k79N3m0j44
4963D7J57m32K50m6K2m9M2kJ87j80j8j82L70l65j62K07J52j50P8j82R1k5K03j45
4987a32k47L22j5j68K14N1J92j56j58J65J78m35j43L32O0K73k25j51K31l75K52
5008F5J18m06M02j28j64L00K5j98r9Q3L72l03j3j65Q6j01p0OK68k6j27K12K42
5031C79l81l6M3l0k71M11j18lj48K5J32j19J86J35l17J31j94L06k12k17K31J11
$$ y = [-62, 48, 132, -318, -188, -130, -185, -102, -153, -90, -115, 442, -124, 36, 152, -95, -258, 80, 151, 399, 305, 89, 106, 232, 29, 341, 68, 241, 405, 15, 199, 88, 155, 353, -106, -146, -157, -5, 343, 88, -273, 469, 140, 21, 33, -81, -55, 30, -84, -116, -122, -348, 49, 1, 124, -182, -46, 212, -139, 38, 162, 52, 21, 197, -228, -209, -82, 261, 29, -239, -152, 244, -188, -342, -112, 185, -106, 106, -14, -235, 82, 121, 177, 175, -69, 228, -24, -35, 457, 178, 231, 191, 47, 204, -228, 22, -24, -2, -51, -9, -11, 176, -4, -22, -204, 166, -199, -361, -154, -2, -152, -74, -256, -165, -190, 13, -132, -379, -57, -72, -240, -26, 25, 217, 61, -97, 68, 246, -189, -332, 0, 60, 333, 108, -43, 188, -187, 65, 183, -223, 179, 51, -113, 187, 212, 14, -85, -2, 370, 67, 54, -111, -25, -126, -196, -190, 78, 52, -75, 137, 379, -2, -38, 5, -25, -296, 115, -3, -6, -154, -129, 3, -116, 70, 205, -112, 19, -175, 131, -81, -298, -67, 44]
5053D4J71l62K71n7j46Q0j32L30k65N7J30%j8r5M5J81J01l00K40l56k8K33j59
5076c5p7K02l9J21k89L07K5k28L8R1j13O4J1n6K58jk50M5k14K43k32N4j0L18j91
5101D2j40J01j56L46j80Rj42k4J34J8k42R0K51k01K1J85q0l55M17k77K96J84o62
5124c65J49Q5J32J33l62L10k8j15k67L34L7K72m24R0J11k39R7k23J32K62J02m74
5146b51K60j24P3P8n6n0J19Q3k16J64J67j53k5j9l1l3r1L26k30J25j52j13p8J83
5170d4n6R2j78J85K04k55L8r7N04j75k99RL39l12j61J85k1R9p0m3N2R6j74k9L56
5195B45k42J77k68P0K04m2k91P9L52l91L5J7K03j90J9j97QM0N29l04q4N6j16J0
5219h1n8J17j60J89m6J36l02O7o0P6P9l7K2o6k55M67P1m1Qj01j0%J16R0j42k95
$$ y = [44, 215, -147, 124, 67, -79, 1, -131, 199, -66, -9, 121, 121, 103, 8, 53, 234, 335, 35, 275, -81, -109, 124, -35, -112, 90, 51, 172, -117, 190, 215, -13, 25, 116, 3, 67, 78, 22, 280, 279, 29, 74, -140, 103, -129, -75, -85, 233, 42, -98, 3, -153, 193, 13, 22, -120, -144, -10, 8, -234, -144, 107, -94, -73, 112, 32, -323, 94, -183, 113, 297, -365, -216, -131, 1, 134, -228, 82, 54, -61, -328, 6, 43, 315, -109, -19, 92, -147, -50, -273, -141, 121, 223, -251, 9, -115, -42, 36, -20, -70, 49, 132, -84, 80, 247, 94, 69, 50, 19, -14, -105, 221, -9, 116, -36, -149, -227, -44, -100, -8, -186, -1, 203, -52, -14, -111, 393, 218, -81, -72, 267, -45, -206, -21, -42, 57, -13, -56, -4, 92, -82, -111, 245, 3, 180, -88, -18, 186, 144, -147, -68, 284, -107, -72, -55, 148, -42, -23, -220, -212, -172, 357, 53, -31, 25, -91, -81, -139, -22, -182, 7, -39, 97, -205, -138, -198, -122, -43, -80, -58, -124, -379, 88, 159, 118, 126, 25, 15, 15, 131, 221, 79, -216]
5245b16J57J31j44K34k95J14O6j11Q1k85J01R2l2j5J32o8K93j46NJ34l97P6L2
5268f1O0o6l36M62l3o8m7K3j47L14j53J45Q7m79M99k88O8J76r4m7K88m14L21p2
5292A38k0j11j6J68j26J68m4L1j06j51K0K92o3j67J68k99M27l12l6K73M8k03l14
5315b35K25O3k06J23r1j54J12Q5j52K42K03k01j49R0m4k01RJ74J23r9K22l49K14
5338DK15l84J70Q1K33l59M34l90j85M82m72K49l51J79L04k09K58l90N14kl6k77
5360F8J45m8k27j40N27l25j51K80j69J87j6j11k43K75J33p9m1j77k67M81l5L0
5382I7j32J8m3J14K87n37M23j59K7l31M05j34j4p2l57L84l2J5o8l4K27J79m30
5405a67Q0J97m6n5O9K67m50L37l49R6K68l20r1Q3J59q4R1j84k0J97o5l55K74N8
$$ y = [-216, -59, 72, -72, 162, -133, -19, 47, -64, 17, -268, -167, -75, -107, -122, 10, -58, 235, 89, 94, 228, -169, -93, -61, -1, -67, -403, 59, 26, -42, -89, -66, -213, 101, -52, 93, 180, -299, 200, -88, -20, 156, 62, 15, 303, -111, 210, 138, 118, 7, -9, 159, 33, 201, 157, 188, 82, -69, -49, 243, 180, 13, 181, -118, 309, -3, -39, 234, 282, 79, -235, -10, 53, -153, -30, -121, -275, -163, -78, -230, 12, 215, 14, -135, -45, -89, -290, -281, -107, 16, -83, 139, -210, 4, 219, -165, 5, 86, 319, -40, 394, 4, -181, 301, -171, 78, -273, -94, 210, 1, 259, -131, 383, 381, 345, 68, 213, 165, -62, -202, 325, 0, -151, 129, -40, 147, 131, 20, -223, 52, 185, 106, 65, -112, -379, 102, 67, 97, -35, -17, -60, 54, 341, -196, 227, 68, 95, -236, 169, 35, 21, -51, -408, -24, -56, -41, -109, -143, 84, 263, -167, -87, 110, 64, 9, 78, 345, -105, 232, -117, -21, 247, -73, -164, -81, 78, -6, 85, -99, -119, 78, 13, -342, -68, -10]
5429a0l08Q1K98l24M24r6k86K23l4j60L31k64J83M6k31R5L2K64l0l52O7K16k13
5452d8r9R0jN1K9J39l03K46l14J98j98J74O3k60P0K53N6j19L9J14j80M7K27j11
5476A63r3K14l09q8K55N4k72J38k37J62J11n0j61M20m57l8R2J12J48j1m50L1N41
5499B75k72j73J57j81J40k39M24j2j91P4P8M4p1J1n39N41K26l07n4P5J47K59m83
5522g1m8J26J03o4m2l1K80m41L05K9j00j32j20M5j4J78J9J43k67J76j99j58J46
5545a37M6Q1l5K4K04j86L5j83J5j15K12K8J48j24Q6l64K39N17o11J49n2r3J66
5568E0J62l12J26R5o6J16n8k36M07k18j79L25k50n2J83o7L41l43J79k24j01L48
5590B26k10k17K80n4M1k16k5R1K72j18L43l91o1J7K7p3J28J03j01l01K88n0n5
$$ y = [-10, -318, -237, 61, -263, 161, 65, -221, 2, -32, -192, 139, -125, 58, 104, -127, -32, 0, 264, 234, -118, -51, 165, -48, -147, -57, -58, -7, 22, 161, -142, 104, -210, -12, -210, -36, 27, -233, -163, 90, 146, 27, 66, 180, 0, 47, 274, 163, 70, 284, -25, -113, 142, 196, -76, 62, -175, -13, 98, 48, -113, 307, -150, -188, -96, 16, 164, 153, -297, -266, 275, 3, -170, -13, -194, -54, -293, 131, 119, -72, 2, 80, 124, 53, 64, -475, 66, 292, -15, -69, 6, 153, 412, -71, -119, 7, 110, 46, 4, -27, 253, -188, 117, 146, 46, -86, -206, -161, -175, 3, 22, 165, -102, 74, -125, -283, -137, -91, -10, -45, -21, 183, -3, 32, -151, -136, -251, -39, -11, 137, 13, 99, -265, -26, 491, -120, 29, -23, -116, 50, 212, -100, 26, 121, 55, 171, 113, -123, 284, 66, -113, 212, -38, -90, 93, 26, 367, 24, 203, -21, -122, 226, 16, -201, 79, 25, 66, -150, -175, -84, 188, 70, 413, 22, -39, -22, 5, -68, 60, 163, 62, -239, 49, -1, -56]
5613e6N8K73q8l41N1k58K39O2j76L62j11q5RQ1n9K60M3k76J42l3l09K87j56J95
5637A14m4k77J69L22r6k72K8J13n2j63Q9K19j00pk58Q1J58j63J31k02M2J30j30
5660a68K22RL02m31J15k13P3K6r5r7L26k12j99M57j92n7K13k99M10k84J84k4j15
5683d9K15k75J06q0Q8JL36n09Q6K92j28j77J34k66J5L79l41J27J09j89M34k44
5705F4j17kK65k48K01j99N04o11J92J48m13j22L14j72L54k09L6K57m88L44l88
5726b90K91N0l3j16J4Q8j6o5J01k53J01m7j71K27K02k9l60M26j07n1J12j83K10
5749A01P8j34m8O9j31M01j05k69K48k42j23M10k09j71J37P4j25K52n2r6j36j27
$$ y = [-56, 2, 275, 187, -154, -103, -361, -122, -60, -236, 126, 15, -70, -61, 20, -39, 221, 264, -12, 130, 97, -212, 75, -81, 114, 70, -207, -38, 284, 188, -84, -56, 57, 5, -158, -69, 150, 50, 43, -215, -134, 24, -139, -8, -210, -168, -38, -168, 54, 63, 365, -66, 49, -164, -91, -65, -160, -257, 69, -143, -342, 115, -77, -134, 79, -220, 190, -94, 90, 66, -49, 166, -109, -3, -83, 5, 6, 342, -167, -81, 211, 83, -94, 40, -226, -211, 168, -173, -46, 63, -126, 308, 64, -53, -55, 210, -38, 163, -36, 468, -143, 49, 197, -216, -338, -24, -196, 158, -51, -15, 242, -246, 98, -290, 1, 51, 18, -98, -84, 4, -12, -77, 24, -229, -128, -175, -346, -119, 83, 54, -306, 120, 13, -38, 74, -109, 101, 179, 45, -3, 66, -65, 336, 231, -38, 210, -32, -155, 255, 46, -125, 12, 86, -39, 213, 161, 65, -71, -198]
$$ [...]
8191D9
##END NTUPLES=NMR FID
##END=
