##TITLE=1H_lae-B11M-3-17-3-12-8
 CDCl3+Py-d5, 8 sc, 
 27.6.2019
##JCAMPDX= 6.0         $$ Bruker NMR JCAMP-DX V2.0
##DATA TYPE= NMR FID
##DATA CLASS= NTUPLES
##ORIGIN= UXNMR, Bruker Analytische Messtechnik GmbH
##OWNER= root
$$ XWIN-NMR		Version 3.5
$$ Thu Jun 27 14:14:23 2019 Russian Standard Time (UT+4h)  she@DPX200
##.OBSERVE FREQUENCY= 200.13155
##.OBSERVE NUCLEUS= ^1H
##.DELAY= (6, 6)
##.ACQUISITION MODE= SIMULTANEOUS
##.ACQUISITION SCHEME= undefined
##.AVERAGES= 8
##.DIGITISER RES= 18
##SPECTROMETER/DATA SYSTEM= spect
##.PULSE SEQUENCE= zg30
##.SOLVENT NAME= CDCl3
##.SHIFT REFERENCE= (INTERNAL, CDCl3, 0, 15.7039)
##AUDIT TRAIL= $$ (NUMBER, WHEN, WHO, WHERE, WHAT)
$$ ##TITLE= Audit trail, XWIN-NMR		Version 3.5
$$ ##JCAMPDX= 5.01
$$ ##ORIGIN= Bruker BioSpin GmbH
$$ ##OWNER= she
$$ F:/spectra/data/she/nmr/H-F/1/audita.txt
$$ ##AUDIT TRAIL=  $$ (NUMBER, WHEN, WHO, WHERE, WHAT)
(   1,<2019-06-27 14:13:22.37 +0400>,<she>,<DPX200>,
      <created by zg, POWCHK disabled, PULCHK disabled
       configuration hash MD5:
       00 E9 B6 7A A2 85 ED C7 34 08 36 98 17 FE 4E 26
       data hash MD5: 16K
       BA CE B1 F1 A2 EB FB 39 38 E2 5A 1A F2 CB 60 25>)
$$ ##END=
$$ 
$$ hash MD5
$$ 5D BA 10 47 7E FE 51 0C E3 D3 56 8C D0 12 73 44
##$RELAX= 
##$RELAX= 
##$RELAX= 
##$RELAX= 
##$RELAX= 
##$RELAX= 
$$ Bruker specific parameters
$$ --------------------------
##$DU= <F:/spectra>
##$EXPNO= 1
##$NAME= <H-F>
##$PROCNO= 1
##$TYPE= <nmr>
##$USER= <she>
##$AMP= (0..31)
100 100 100 100 100 100 100 100 100 100 100 100 100 100 100 100 100 100 
100 100 100 100 100 100 100 100 100 100 100 100 100 100 
##$AQSEQ= 0
##$AQ_mod= 1
##$AUNM= <au_zg>
##$AUTOPOS= <>
##$BF1= 200.13
##$BF2= 200.13
##$BF3= 200.13
##$BF4= 200.13
##$BF5= 200.13
##$BF6= 200.13
##$BF7= 200.13
##$BF8= 200.13
##$BYTORDA= 1
##$CFDGTYP= 0
##$CFRGTYP= 5
##$CHEMSTR= <none>
##$CNST= (0..31)
1 1 145 1 1 1 1 1 1 1 1 1 1 1 1 1 1 1 1 1 1 1 1 1 1 1 1 1 1 1 1 1 
##$CPDPRG= <>
##$CPDPRG1= <>
##$CPDPRG2= <>
##$CPDPRG3= <>
##$CPDPRG4= <mlev>
##$CPDPRG5= <mlev>
##$CPDPRG6= <mlev>
##$CPDPRG7= <mlev>
##$CPDPRG8= <mlev>
##$CPDPRGB= <>
##$CPDPRGT= <>
##$D= (0..31)
0 1.2 0 0 0 0 0 0 0 0 0 0.03 0 0 0 0 0 0 0 0 0 0 0 0 0 0 0 0 0 0 0 0 
##$DATE= 1561630401
##$DBL= (0..7)
120 120 120 120 120 120 120 120 
##$DBP= (0..7)
150 150 150 150 150 150 150 150 
##$DBP07= 0
##$DBPNAM0= <>
##$DBPNAM1= <>
##$DBPNAM2= <>
##$DBPNAM3= <>
##$DBPNAM4= <>
##$DBPNAM5= <>
##$DBPNAM6= <>
##$DBPNAM7= <>
##$DBPOAL= (0..7)
0.5 0.5 0.5 0.5 0.5 0.5 0.5 0.5 
##$DBPOFFS= (0..7)
0 0 0 0 0 0 0 0 
##$DE= 6
##$DECBNUC= <off>
##$DECIM= 24
##$DECNUC= <off>
##$DECSTAT= 4
##$DIGMOD= 1
##$DIGTYP= 9
##$DL= (0..7)
0 120 120 120 120 120 120 120 
##$DP= (0..7)
150 150 150 150 150 150 150 150 
##$DP07= 0
##$DPNAME0= <>
##$DPNAME1= <>
##$DPNAME2= <>
##$DPNAME3= <>
##$DPNAME4= <>
##$DPNAME5= <>
##$DPNAME6= <>
##$DPNAME7= <>
##$DPOAL= (0..7)
0.5 0.5 0.5 0.5 0.5 0.5 0.5 0.5 
##$DPOFFS= (0..7)
0 0 0 0 0 0 0 0 
##$DQDMODE= 0
##$DR= 18
##$DS= 0
##$DSLIST= <SSSSSSSSSSSSSSS>
$$ [...]
##$SUBNAM2= <"">
##$SUBNAM3= <"">
##$SUBNAM4= <"">
##$SUBNAM5= <"">
##$SUBNAM6= <"">
##$SUBNAM7= <"">
##$SUBNAM8= <"">
##$SUBNAM9= <"">
##$SW= 24.9336996594482
##$SWIBOX= (0..15)
0 0 2 0 0 0 0 0 0 0 0 0 0 0 0 0 
##$SW_h= 4990.01996007984
##$TD= 16384
##$TD0= 1
##$TE= 0
##$TE2= 300
##$TE3= 300
##$TEG= 300
##$TL= (0..7)
0 120 120 120 120 120 120 120 
##$TP= (0..7)
150 150 150 150 150 150 150 150 
##$TP07= 0
##$TPNAME0= <>
##$TPNAME1= <>
##$TPNAME2= <>
##$TPNAME3= <>
##$TPNAME4= <>
##$TPNAME5= <>
##$TPNAME6= <>
##$TPNAME7= <>
##$TPOAL= (0..7)
0.5 0.5 0.5 0.5 0.5 0.5 0.5 0.5 
##$TPOFFS= (0..7)
0 0 0 0 0 0 0 0 
##$TUNHIN= 0
##$TUNHOUT= 0
##$TUNXOUT= 0
##$USERA1= <user>
##$USERA2= <user>
##$USERA3= <user>
##$USERA4= <user>
##$USERA5= <user>
##$V9= 5
##$VALIST= <valist>
##$VCLIST= <CCCCCCCCCCCCCCC>
##$VD= 0
##$VDLIST= <DDDDDDDDDDDDDDD>
##$VPLIST= <PPPPPPPPPPPPPPP>
##$VTLIST= <TTTTTTTTTTTTTTT>
##$WBST= 1024
##$WBSW= 4
##$XGAIN= (0..3)
0 0 0 0 
##$XL= 0
##$YL= 0
##$YMAX_a= 265541
##$YMIN_a= -392437
##$ZGOPTNS= <>
##$ZL1= 120
##$ZL2= 120
##$ZL3= 120
##$ZL4= 120
##$ABSF1= 10
##$ABSF2= 0
##$ABSG= 5
##$ABSL= 3
##$ALPHA= 0
##$AQORDER= 0
##$ASSFAC= 0
##$ASSFACI= 0
##$ASSFACX= 0
##$ASSWID= 0
##$AUNMP= <proc_1d>
##$AZFE= 0.1
##$AZFW= 0.1
##$BCFW= 1
##$BC_mod= 2
##$BYTORDP= 1
##$COROFFS= 0
##$CY= 11.3945322036743
##$DATMOD= 1
##$DC= 2
##$DFILT= <>
##$DTYPP= 0
##$F1P= 18.9103706918063
##$F2P= -1.10871071338519
##$FCOR= 0.5
##$FTSIZE= 0
##$FT_mod= 4
##$GAMMA= 1
##$GB= 0.15
##$INTBC= 1
##$INTSCL= 1
##$ISEN= 128
##$LB= 0.24
##$LEV0= 0
##$LPBIN= 0
##$MAXI= 10000
##$MC2= 0
##$MEAN= 0
##$ME_mod= 0
##$MI= 1.114404
##$NCOEF= 0
##$NC_proc= 0
##$NLEV= 6
##$NOISF1= 3.799351
##$NOISF2= 2.8
##$NSP= 1
##$NTH_PI= 0
##$NZP= 0
##$OFFSET= 15.70392
##$PC= 1
##$PHC0= -8502.518
##$PHC1= 19.60098
##$PH_mod= 1
##$PKNL= yes
##$PPARMOD= 0
##$PSCAL= 0
##$PSIGN= 0
##$REVERSE= no
##$SF= 200.130013532006
##$SI= 16384
##$SIGF1= 3
##$SIGF2= 2
##$SINO= 400
##$SIOLD= 16384
##$SREGLST= <1H.CDCl3>
##$SSB= 0
##$STSI= 0
##$STSR= 0
##$SW_p= 3612.71676300578
##$SYMM= 0
##$S_DEV= 0
##$TDeff= 0
##$TDoff= 0
##$TI= <>
##$TILT= no
##$TM1= 0
##$TM2= 0
##$TOPLEV= 0
##$USERP1= <user>
##$USERP2= <user>
##$USERP3= <user>
##$USERP4= <user>
##$USERP5= <user>
##$WDW= 1
##$XDIM= 8192
##$YMAX_p= 0
##$YMIN_p= 0
$$ End of Bruker specific parameters
$$ ---------------------------------
##NTUPLES= NMR FID
##VAR_NAME=  TIME,          FID/REAL,        FID/IMAG
##SYMBOL=    X,             R,               I
##VAR_TYPE=  INDEPENDENT,   DEPENDENT,       DEPENDENT
##VAR_FORM=  AFFN,          ASDF,            ASDF
##VAR_DIM=   8192,          8192,            8192
##UNITS=     SECONDS,       ARBITRARY UNITS, ARBITRARY UNITS
##FACTOR=    0.0002004,     1,               1
##FIRST=     0,             0,               0
##LAST=      1.6414764,     0,               0
##MIN=       0,             -392437,         0
##MAX=       1.6414764,     265541,          0
$$ Real data points
##PAGE= N=1
##DATA TABLE= (X++(R..R)), XYDATA
$$ [...]
2481h2J969j109k073J340J719j338j583J116J591r36j872J031J320o15j474O38
2497c58J498l01j300k65J740k87j719l31J735R18k465l83K086N12k170m57K088
2514E41M51k312j33J896L74j650n02J920L09j614m90J772L20j303o23J250P04
2531I10j149o46R97J068q36j424J416J160r60j404Q92J819r97j715R98J960j288
2548H01k134J025J905r86k076R97K326j228k351J176K068j018j824P83J599r04
2564A59j649O77J531m61j407Q6J485J85j522j96J532K06j310n30J546J235k074
2581e07q17J747R83j735q14J586J421k059j309K118J042j908j213K025R69j363
2597A66j350J694J313j798j245J806R76j378j198Q47J144m27j760Q37J307p08
$$ plain form
2481 -82 1887 778 -1295 45 1764 426 -1157 -41 1550 614 -1258 -227 1093 478 -996 -358
2497 -358 1140 839 -461 -726 1014 727 -992 -1323 412 1330 -1135 -1518 568 1080 -1090 -1547 541
2514 541 992 -1320 -1453 443 817 -833 -1335 585 894 -720 -1210 562 882 -421 -1044 206 910
2531 910 -239 -885 112 1180 344 -1080 336 1496 536 -868 24 1843 846 -869 129 2089 801
2548 801 -1333 -308 1597 611 -1465 -468 1858 630 -1721 -545 1523 505 -1319 -536 1063 159
2564 159 -1490 -813 718 257 -1150 -1064 421 606 -916 -1112 420 626 -684 -1214 332 1567 -507
2581 -507 -1324 423 1406 -329 -1143 443 1864 -195 -1504 614 1656 -252 -1465 560 1529 166
2597 166 -1184 510 1823 25 -1220 586 1562 184 -1014 -167 977 550 -1210 -373 934 226
2613B26j191K65J573o30j647N14J534n2k071L28K075L3k441O1K290l23j731J82
2631a005J805j06j879K03J911l43j491j06J945m8j233j84J360K12j152l22J017
2648E84Q01j240r08J124J295j750j304J617J465j442j079J216R31j199j409J461
2664A63J505j710j315J492J345j351j545J341J174j108j258J086J008r33j290
2679a396R22J221o11j406O49J313p06j157L61J695n17j609n1K356l11k100L70
2696i77J812L4j863K69K016k95k099K39K172j37j996j29K140L85k060j64J513
2713H60N57j902j28R90Q56j287j122J325J242j432q18J046J105j633q45R05J445
2730A164j062j759J513J168j162j528J322J472j335j282J028J637j428j231J318
$$ plain form
2613 226 -965 -700 873 243 -1404 -890 644 592 -1479 -1151 924 957 -1484 -1423 867 544 -1187 -1005
2631 -1005 800 694 -1185 -982 929 586 -905 -1011 934 886 -347 -531 829 1041 -111 -433 584
2648 584 1385 145 -763 361 1656 -94 -1398 219 1684 242 -837 379 1310 111 -1298 163
2664 163 1668 -42 -1357 135 1480 129 -1416 -75 1099 -9 -1267 -181 827 -106 -1396
2679 -1396 -474 747 136 -1270 -621 692 -14 -1171 -810 885 368 -1241 -1292 1064 753 -1347 -977
2696 -977 835 869 -994 -725 1291 996 -1103 -864 1308 1171 -825 -954 1186 1571 -489 -653 860
2713 860 1417 -485 -613 377 1233 -54 -1176 149 1391 -41 -859 187 1292 -341 -1186 -281 1164
2730 1164 102 -1657 -144 1024 -138 -1666 -344 1128 -207 -1489 -461 1176 -252 -1483 -165
2745a65J292r25j233P19J234k36j545j0J723mj514l4J546M25j658k13J756J13
2763A271k087K6J656M27j498o29J773L84k046k47J937j4j241o61J739K22j586
2780e74n95J810K24j317o53J534K24j145m56J017M24r10r30J063Q47o33j600J725
2798E5J050j404j419J028J996j192j709J349J578j161j434R65J730j136j471Q29
2814c46K060j172j831J247J317q41j275N56J856l76j596k11J484R9j356k33J338
2831G20K65j600q3J367R04k085q69K097O86k113p76J953M73j536j104K144K94
2848G37j471p93K015L75j717l60J171R83j541j029J666R59j247p84O52J337r81
2865b8j073Q81J463m96j893Q76J366p31j349N05J951o09j800L96K007n96j944
$$ plain form
2745 -165 1127 202 -1031 -312 922 686 -859 -869 854 850 -664 -698 848 1273 -385 -598 1158 1271
2763 1271 -816 -790 866 1293 -205 -834 939 1323 -723 -970 967 953 -288 -949 790 1012 -574
2780 -574 -1169 641 865 -452 -1105 429 653 -492 -948 69 493 -417 -1347 -284 563 -70 -1670 55
2798 55 1105 -299 -1718 -690 1306 114 -1595 -246 1332 171 -1263 -298 1432 296 -1175 -346
2814 -346 1714 542 -1289 -42 1275 434 -841 -285 1571 1195 -401 -612 872 971 -385 -618 720
2831 720 985 -615 -698 669 1573 -512 -1381 716 1402 -711 -1487 466 939 -597 -1701 443 737
2848 737 -734 -1527 488 863 -854 -1214 -43 940 -601 -1630 36 995 -252 -1036 -384 953 -28
2865 -28 -1101 -220 1243 747 -1146 -270 1096 365 -984 -479 1472 863 -937 -541 1466 870 -1074
2882a074L95J703J27j643J44J609l29j576J36J422k94j650L51J146J20j317m88
2899a218J455M39j401l53J391N17j580o82J466P09j390r34J339R76j287p62J306
2916iJ359j743p60J417J093j550j211J478J355j625p79J262J102j024j395J465
2932D35R83j134j015R65Q15q87q82O81J305l99j825K01J779l43j398K07J615k69
2950H34j865M9K039m19k012l1K063oj765N4J457J19j721N12J236J87j343n84J349
2969A53N51j638j21J180O77j179q94J198J006j224j005J613R16j055j300J316
2985A94J107j269j110J374J165j251j088R32J263j012j019R42J081o99j434O71
3001a53J362p55j464O21J309l55j490K78J520l33j578L53J464m33j323J06J383
$$ plain form
2882 -1074 -679 1024 1151 -492 -348 1261 932 -644 -508 914 620 -1030 -679 467 587 -730 -1218
2899 -1218 237 676 -725 -1078 313 830 -750 -1432 34 743 -647 -1581 -242 734 -553 -1315 -9
2916 -9 1350 -393 -1153 264 1357 -193 -1404 74 1429 -196 -975 287 1389 365 -1030 435
2932 435 1418 284 -731 234 1049 162 -720 -39 1266 867 -958 -757 1022 679 -719 -512 1103 834
2950 834 -1031 -982 1057 638 -1374 -1405 658 652 -1113 -1059 398 517 -1204 -692 544 731 -612 -1196 153
2969 153 704 -934 -1055 125 802 -377 -1271 -73 933 -291 -1296 317 1233 178 -1122 194
2985 194 1301 32 -1078 296 1461 210 -878 54 1317 305 -714 228 1309 610 -824 -153
3001 -153 1209 454 -1010 -389 920 565 -925 -647 873 540 -1038 -685 779 346 -977 -871 512
3018E12l28j406N71J295l73j047m28J961j19j829L11J298L43j332k07J249J11
3035E82j188o1J195M13j227l66R72P68j143o07R10O01q55p40J127Q79j028j003
3053g71R88J089r33j069M93J390j057j444J169J265j492p50J074R61j011j192
3069a290J223J150j185j249Q15R08k09j291N67J139n80q11j06J432j59r85m38
3086a069J518L55j678K53R26P00j613l70J540O22j842l44J995L20j731l0J110
3103F62M65j846k49J549N64j218o70J569O5j122m13J237N96j307n06N53Q06r70
3121b35n06O04Q85o08j270O83J371r63j510J184J103p90j128O64J087n61j126
3138a116K65J581p68j365R91J203k84j864Q23J326m40j223M99J083j66j328M50
$$ plain form
3018 512 184 -1222 -651 644 271 -776 -1204 757 638 -1191 -880 418 761 -571 -778 471 582
3035 582 -606 -667 528 941 -286 -652 320 1088 -55 -662 248 849 -6 -746 381 1260 232 -771
3053 -771 217 1306 373 -696 -203 1187 130 -1314 -145 1120 -372 -1122 -48 913 -98 -1290
3069 -1290 -67 1083 -102 -1351 -536 372 163 -1128 -561 578 -2 -813 -919 513 354 -631 -1069
3086 -1069 449 804 -874 -621 305 1005 -608 -978 562 1184 -658 -1002 993 1313 -418 -448 662
3103 662 1127 -719 -968 581 1145 -73 -743 826 891 -231 -644 593 1189 -118 -624 -71 735 -235
3121 -235 -741 -137 748 140 -1130 -447 924 -39 -1549 -365 738 -52 -1180 -516 571 10 -1116
3138 -1116 -851 730 -38 -1403 -412 791 507 -1357 -534 792 352 -871 -372 711 545 -783 -333
3155c33J205k50j366m2J713M4j640r9J353M86j547l30J537L09j474o19J603L82
3173I32j229p26J549O25j567r63J951N10j815l06J322Q71j462p15J111Q62j421
3190d71n37J159P08r12j228R48J274j027j573J179J446p45j579P81J827p19j612
3207a081N22J774m53j279J97J266j21j385O3J626n06j466L82J176K44j269l06
3224f16J365M17j295p54J521P8j022o82J355M29j106p22J283P66j331p89J233
3241A30M79j290m77J201N96q20r36J265N44j317m05N98J177j050q70R26J202r27
3259B6j012Q44J058p45j196R01J260o25j248M57J074k87j163K13J401k33j154
3276d29J04J419q6j891K44J565n07j130L50J077N5j643J65J351L1j337m5J075
$$ plain form
3155 -333 872 622 -744 -786 927 971 -669 -768 585 1071 -476 -806 731 1040 -434 -1053 550 932
3173 932 -297 -1023 526 1151 -416 -1379 572 1082 -733 -1039 283 1154 -308 -1023 88 950 -471
3190 -471 -1008 151 859 -53 -1281 -333 941 -86 -1659 -480 966 221 -1358 -577 1250 531 -1081
3207 -1081 -559 1215 762 -517 -320 946 825 -560 -497 1129 623 -843 -461 715 959 -310 -616
3224 -616 749 1166 -129 -883 638 716 -306 -988 367 796 -310 -1032 251 1017 -314 -1103 130
3241 130 609 -681 -1158 43 639 -181 -1117 148 692 -625 -1030 -432 745 -305 -1175 -249 953 26
3259 26 -986 -142 916 171 -1025 -124 1136 511 -737 -280 794 507 -656 -443 958 725 -429
3276 -429 -325 1094 1008 -883 -639 926 419 -711 -361 716 771 -872 -707 644 675 -662 -707 368
3294C68K92j035l14J140L76j400l94J092R26j804k33J305N19j264q01J014J174
3311I61j123r48J184P62j167p10J040Q66o98j250J315Q71o90j216R34Q22o31j042
3329g20N89P94k18j099J33J606p14p07l44J546j96j362k4J135L37j579j56J548
3347E69O5j381k33J281N22j467m25J599J77j757J20J077M64j500Q9J043N18j227
3365d66n9P68K99p69l14O68O57r16m70Q09K53k60r30R72Q88p69j220J121Q34q02
3385B94r97P94J103q45j059P02J086n09j237M48J420p20j131M19J239o52j161
3402h06O09R92m85q60J02P67j67o57l25J227q6r18k29Q16M95q87l93J173Q9q93
3422d36o10J447P6j226k73J440N65j222m26J017Q7j039j19J195P08j352n73J437
$$ plain form
3294 368 660 -375 -689 451 827 -573 -967 125 1051 -753 -986 319 838 -426 -1227 -213 961
3311 961 -162 -1110 74 836 -331 -1041 -1 865 167 -1083 232 1103 413 -803 131 953 322 -720
3329 -720 -131 663 445 -654 -521 1085 371 -336 -680 866 670 -692 -716 419 756 -823 -979 569
3347 569 634 -747 -980 301 823 -644 -1069 530 707 -1050 -930 147 611 -889 -800 243 761 -466
3365 -466 -525 243 542 -227 -541 127 784 -132 -602 207 460 200 -730 242 1130 361 -859 262 1096 294
3385 294 -703 91 1194 349 -710 -8 1078 569 -668 -220 1200 480 -651 -232 1007 355 -806
3402 -806 -197 795 310 -550 -448 319 152 -505 -830 397 311 -607 -836 -20 475 -412 -805 368 457 -436
3422 -436 -1046 401 477 -749 -1022 418 983 -239 -665 352 439 -600 -719 476 1184 -168 -741 696
3440F96K81j085o42J025O59q53p11P35P89p32r22Q26P22q0j456M41J037n10j233
3459a013P88R01l37j166J74J364m02j481M18J554p20p89m8J112n9j000R4J114
3477E04l72o52k20J330k35j045l5O84Q93j024m66J118M04r49k62O33M92q43o11
3496f56J064N12j289l30J240M33j184q5O81O05j115l33P85M73r77p51Q24R14j068
3515b57m79P47N75p54p66O30J100p60p10N22P19l36j369N33J054n10o55O7J115
3534D66M6j464Q0J426m64j077O44R51j82j337L73J066K17j170OJ032L19j161l39
3553e68J309L34j445j68J185L27j011q19J568N23j573n44J198O74j147o96J246
3570C93O68j209n81R07R11j138j204J123P87n96r77N91J026p20j009Q54Q69r42
$$ plain form
3440 696 977 -108 -750 275 934 81 -630 105 894 162 -760 66 788 708 -748 -307 730 220 -1013
3459 -1013 -225 676 339 -827 -653 711 309 -1172 -754 800 80 -709 -757 355 296 -704 -610 504
3477 504 132 -520 -740 590 355 -690 -725 -41 852 -172 -638 480 884 -65 -327 306 798 -45 -656
3496 -656 408 920 -369 -699 541 974 -210 -295 386 991 -124 -457 328 801 -176 -927 -103 811 -257
3515 -257 -736 11 586 -168 -934 -304 796 36 -674 -152 567 231 -1138 -605 449 -61 -716 -649 466
3534 466 512 -952 -872 554 90 -987 -343 608 426 -911 -538 528 745 -425 -419 613 932 -229 -568
3553 -568 741 1075 -370 -538 647 974 -37 -856 712 1235 -338 -882 316 990 -157 -853 393
3570 393 1061 -148 -729 178 1089 -49 -1253 -130 657 61 -916 -325 701 -19 -1028 -174 695 -247
3588b47l72J81J124p11r58N06Q18L7j283Q4J450r6j295M20J076k16q71r5J016
3607E68L45j451L8J338j6j262K00J035o1j047nR49j92j053j52J119J32o02l55
3626d72P63L89j073m35Q58O27q75m80P56O36j145o42Q35R58r40r54Q33Q59p87
3645b89n18O65R77q29q37M85Q90k51j291O91J111p68p02N65R45m44j150M89J008
3664G47k32r20K54R65jj110J40R44k4j132J42J028J2j231P4J121k38j141k13J338
3684E23K96j127l29P00O46q89q21J272L40j132l96P43Q65p48q43P59N77o90p26
3703i80P98Q52n02r67O39P24n76q90R69N64m47r76M74J294o76r19L11J012k11
3722D93r08J08J063m29p72N45P47l20r95J82J129j08j051P4Q37J69j054N1Q86
$$ plain form
3588 -247 -619 -438 686 -25 -983 -477 341 378 -905 -821 629 533 -762 -342 734 518 -353 -448 568
3607 568 913 -538 -500 838 822 -440 -240 795 734 -313 -318 631 439 -614 -766 353 485 -117 -472
3626 -472 291 680 -393 -828 30 657 -218 -698 58 694 -451 -1093 -258 700 -240 -1194 -361 498 -289
3645 -289 -807 -142 835 6 -831 -346 544 293 -998 -307 804 36 -666 -101 844 400 -750 -261 747
3664 747 515 -405 -151 814 813 -297 -157 787 763 -369 -227 801 813 -418 -344 777 539 -602 -815 523
3684 523 819 -308 -637 63 709 -180 -1001 271 611 -521 -917 -174 691 -57 -900 -141 436 -254 -980
3703 -980 -182 670 168 -799 -160 564 -12 -902 67 631 184 -792 -318 976 300 -619 -308 704 493
3722 493 -415 -307 756 327 -445 100 847 527 -468 -286 843 735 -316 -242 595 764 -290 -239 647
3741F47j09q83k76J138j68p42k27J063O9j132n7P47O37j205l32Q22M11n77n14
3760f88J153r1o80o53J289N13j073o01O74J001j134o50J265O60q62p88P46P97
3778H78o22r24Q80P40n59r00M54Q15n42p41L01Q68k67r42M22Q23p51m89j01J013
3798C56j25p48O2N82L05q18j60O73J53j102J91P53K75r60k60J025J33n55q67J281
3818A94N08r88n91J022N80j354oQ08N19o70p05Q64M79o71n74P36P40r56m45O30
3838A20P89o78n86O59O60m41j079L39P63k55r63M37P86m60o55K10J125p34n21
3857d84M15P78o91o83L43N60j08p12o7R21k03q24L98R40m68o20K5O00K5p20j03
3878f78J005J08p20m72J065K16n92n38P13N97r75m92J010L11m47p29R16O17q92
$$ plain form
3741 647 538 -345 -621 517 349 -393 -620 443 512 -620 -677 70 707 -498 -830 -8 403 -174 -688
3760 -688 465 374 -306 -959 330 843 -230 -831 -157 844 -290 -940 325 985 123 -665 81 878
3778 878 256 -668 212 952 393 -507 -53 762 220 -521 -220 648 381 -561 -139 684 -67 -556 -657 356
3798 356 231 -517 -455 127 432 -386 -546 127 280 -822 -631 122 397 -563 -823 202 335 -220 -1087 194
3818 194 702 -286 -877 145 725 -629 -635 173 692 22 -683 181 660 -11 -585 151 891 -65 -510 120
3838 120 909 231 -355 304 964 523 -556 -217 546 291 -672 -235 551 91 -564 -354 771 37 -484
3857 -484 -69 709 18 -665 -322 238 130 -582 -649 272 69 -755 -357 583 115 -505 -480 120 145 -575 -678
3878 -678 327 435 -285 -757 308 524 -68 -606 107 704 -271 -763 247 558 111 -618 298 915 23
3897B3o09M12J084q65o44P87P50q93q59P62P84q28r78J027O49o29o58L24J000
3916F39m85j035N63J200p13r06L21R58k84j031J65J043j28r63J8J017j31r39J65
3935e26R26K1j147L10Q51L85j225j76J172M15j180l22J151K8j045J38M12N15p82
3954g9n28Q68K59p26l11P30K29j78p65O50M48p64l57O71O28o17o78J32Q17n72
3974a43m68K26Q33j98j192O80P24l33o75L12P65r64j28J45O20J06j023J73R86
3993D46l31n28J93Q25j92p93K33Q44o6j107J7J117j01q39j21Q38M56q29n80J121
4013F03J45r72k94J102L10j002l12P32L46r55m03R33M00j007j52L16P30n12p58
4032g50Q61N84p65p26P33M65l52j030P24O00M7j054M92N96l65n00q7J338n14r33
$$ plain form
3897 23 -586 -174 910 45 -599 188 938 45 -814 -52 732 -96 -1074 -47 602 -27 -685 -361 639
3916 639 154 -881 -318 882 169 -737 -416 542 258 -773 -608 435 307 -656 -638 379 248 -691 -526
3935 -526 400 421 -726 -416 435 820 -405 -581 591 1006 -174 -496 655 683 -362 -224 188 703 -79
3954 -79 -607 261 520 -206 -517 213 442 264 -501 149 597 -167 -524 147 775 158 -520 -388 429 -143
3974 -143 -611 -385 448 250 -942 -262 462 129 -546 -234 531 -433 -561 -416 204 310 -713 -540 446
3993 446 115 -413 -220 605 413 -380 -147 697 631 -476 -459 658 557 -282 -403 435 891 62 -518 603
4013 603 748 -224 -518 584 894 -108 -420 312 658 -297 -700 233 633 -374 -526 -210 520 8 -750
4032 -750 111 695 -70 -796 -63 402 50 -980 -256 344 391 -663 -171 425 60 -440 -527 811 297 -636
4052f36L81J046k27r64Q5R38j38r78L9J081k51o94j70R48K24j132K21O60M91j226
4072c02k24J289k38r53L09N36op68m72J413j69q06l67O33Q01p64l45M95Q02j164
4092c00k98Q21L53q05k63N67J80l99o38Q76N00m99n81L31O13r7q11k1J081n30
4112H0l17L42N08k21n07R2J122m43j136M47Q27n19q69K55J036l47o51q7J376n85
4132D03m66m22J077q7r31J88O63k30n29k41P94K98r06K1N98L37j171j60M71R31
4152F38r71n69R34O93r41n90O90P37q10k67K96O31k44p41N40O46m84q99R38M18
4172F45l55o72L25Q92m46p57L09Q10n17o37L77N23L3q70N4P44j89o82J11P20K5
4193D43r02k5P47M03j226j60J007q3p93j34J061Q9q87k08O42M32q39m8N90N24
$$ plain form
4052 -636 -255 791 564 -400 -315 623 485 -493 -454 627 376 -318 -488 460 684 -448 -227 433 924 -302
4072 -302 -526 763 525 -428 -119 417 411 -357 -829 584 415 -391 -758 -125 676 -88 -433 62 864 -300
4092 -300 -598 223 576 -229 -492 75 255 -144 -782 94 594 95 -486 -155 458 361 -450 -471 610 80
4112 80 -237 105 613 392 -115 -23 1099 656 -480 -33 794 275 -594 -339 697 350 -301 -388 988 403
4132 403 -63 -485 592 505 -426 -238 425 195 -334 -575 219 517 -389 -368 230 567 -604 -764 -293 638
4152 638 -333 -902 32 725 -216 -806 -116 621 -189 -456 -160 471 227 -514 26 672 188 -711 227 645
4172 645 290 -382 -57 835 389 -368 -59 751 234 -403 -26 497 530 -340 -286 458 269 -413 -302 418 443
4193 443 -459 -484 263 666 -560 -720 287 204 -589 -723 338 427 -460 -668 -26 406 -433 -481 109 633
4213F33p39l44O20M28o21l23O88M72o79o32N40O77p26m10O55M02m22p22N31N34
4233E62l60n39M79L41m03k74J99Q25m87q41N94P08m67j056M24P02k04o71K48P07
4253D87k62p12L40N36l94n65jJ097l48r50L37M83J78q70M01L71L57j009k90J001
4273A87K49p05n17J127J61q36k19P25M58o68m54O62L05o05n52P59N69k50q77O35
4293A54P08o29o67M65M12m10o25O46P44l98q40K46O21p8o20m2R20n26n33R2P88
4314D28K5j255M80N42n1r26L18O78k06m11k58Q69K28j074K04O65Q8p59j14O85
4334A56N76j151j87J025K61o29m19M97M53n49q23R01N62p00k48O05N48p24o78
4353e24R47M23p87o82P17O01n62n76L32O02l32o02N97M87n72o41N30K96k81n38
$$ plain form
4213 633 -106 -450 170 598 -23 -346 342 814 135 -497 43 720 -6 -416 239 641 219 -503 28 562
4233 562 202 -337 142 483 80 -194 5 830 343 -498 96 804 337 -719 -295 407 203 -468 -220 487
4253 487 225 -487 -147 389 -5 -570 -571 526 178 -772 -435 48 226 -644 -243 128 485 -524 -814 187
4273 187 436 -269 -786 341 502 -334 -553 172 630 -38 -492 170 475 -130 -682 77 646 396 -481 154
4293 154 862 233 -434 31 443 33 -592 54 798 400 -440 -194 427 349 -271 -313 607 81 -452 -360 428
4314 428 453 -802 -322 220 169 -757 -439 239 33 -378 -636 233 461 -613 -409 256 344 -415 -529 156
4334 156 732 -419 -606 419 680 51 -368 129 582 33 -790 111 673 -27 -275 330 878 154 -524
4353 -524 423 846 59 -623 94 695 133 -443 -111 491 159 -443 154 641 69 -572 -42 254 -27 -565
4373e65J77P49j58r18J7J018l95p14M66Q62o52o26O29P98j16j178J59N61L49j155
4393f92N21O19J2r17j40R23M6j90p28Q91M90p56n10P49M72q00o16O66Q22p90n95
4414e23P62L61p25m00P53K78p92j32M38L79k99n25N73k6l36l47M1Q26l91m05L5
4435d55R07l72n30K95M88m25o19O20N02j70q55M63N75r7o66P6Q04j71q66L18O94
4456E16j88m47r3O93j24n81M6P66K70p30l27N09J55k88k38M94Pn89J7J76N11n83
4478b8l44M67M33o89k63M46K99m65m08L09P41r39m30O89P05n00q42P29K69r1m68
4499c80M84M78n57l22p2P78k46n71J06P22m47m07O25M47k81o85L40N26j00p08
4519b70R1P81rj036K19N64R3m39l67N38J76o12j89O22K31p37j64K95P93p73l22
$$ plain form
4373 -565 -388 361 203 -715 -698 320 -75 -789 -323 539 -113 -739 -110 688 572 -606 -447 114 463 -692
4393 -692 -171 448 460 -457 -597 326 372 182 -546 345 835 79 -431 318 790 -10 -626 40 862 72 -523
4414 -523 239 600 -125 -525 228 506 -286 -418 20 399 100 -425 148 122 -214 -561 -520 306 -85 -490 -455
4435 -455 452 80 -450 -155 333 -92 -711 -91 411 241 -614 -151 424 327 -339 -263 541 370 -496 -178 516
4456 516 328 -119 -212 481 357 -224 -178 588 858 128 -199 310 465 177 -61 433 440 -149 -132 44 555 -28
4478 -28 -372 95 528 -161 -424 22 321 -144 -552 -243 498 -441 -871 -182 523 23 -819 -90 179 88 -380
4499 -380 104 582 25 -297 -369 409 163 -408 -302 420 -27 -434 191 638 357 -328 12 538 438 -270
4519 -270 -179 602 593 -443 -224 340 433 -6 -373 165 341 -271 -460 162 393 -344 -508 -213 580 -193 -515
4540e15M59M60q32k36P62J38l93n59M07N29k17p27O09M84q24l36Q68N57l08p20
4560c94J63P21k53n73J68N64j90n54R7P32R3j019L01O52j27o82L72L03k74n32
4580d32K04O69l99o73N52L95l3j005K23J068n38k45j59O20P1n90k14M97J32n39
4600c96l63R53J40n18l53O01K33m43o70N15N93r37O0P67K56n15n61O35O39p56
4620a20m90P82N20n87p35O85M11n07m57L21Q00n33m61L42M50k53p51N17N27j53
4640C08n26k15P82j40m87MO49o0o59R0P79n91l67j55Q56J1r48j9P79J26m07k78
4662d68K88N45n47m08Q84J20p03k53R62N2r21J05J26P03n56n43P03M89m58n10
4682c90M14O39p52k21M36N21n65l03K47P46n41p64L65P11n02k24O8Q61m90r31
$$ plain form
4540 -515 -56 404 -428 -664 98 236 -157 -716 -309 220 3 -724 -115 369 -455 -791 77 634 326 -394
4560 -394 -231 490 237 -336 -168 396 206 -348 -251 481 574 -445 -144 508 381 -301 71 374 100 -432
4580 -432 -228 441 42 -631 -79 316 283 -722 -499 569 31 -214 -373 247 318 -272 -486 11 143 -396
4600 -396 -759 194 334 -184 -537 64 297 -146 -816 -301 292 -645 -585 182 438 -77 -638 -3 636 -120
4620 -120 -610 172 692 105 -630 55 466 -41 -498 -177 623 90 -371 -29 421 168 -583 -66 461 308
4640 308 -218 -433 349 209 -278 -274 375 315 -344 -254 525 -66 -433 -588 268 279 -669 -688 91 217 -190 -468
4662 -468 -180 365 -182 -590 294 414 -289 -542 420 472 -449 -344 -218 485 -71 -614 89 578 120 -390
4682 -390 24 663 -89 -310 126 647 82 -221 26 772 231 -533 -168 543 41 -183 -115 746 256 -675
4702f75L08O62j04n25j57Q80l29p15L12Q67k1j166K42O45J15o26r6N92Q0p65K23
4723b53N12R2n87k03N95L63n27o04O67K69o42j23Q83j73l35n32O48M66n02l74
4743c60N51J31k54m77O83L76n38q53Q81L65j94q16N69M09n80r0N8O00k62p19J50
4764c70O05m6j042M49O22k36m06K7O80k88l31O0N37N5n92M7M72L9p36L0P57M16
4786G49j041KL76M27o54k89P32K89r47L62K04K05n77j32N16K27l36m82N52L32
4806E15m03n51N98K84m70m22L45K93k65k42L71K49l61l70K75M5r3k23L70M27m22
4827e0p26M50N72j74m15J17N65k63n03M99L76l22m43P3P19p8j051M43O46j60k25
4848E0l5K37J77m49l0K52O6l22m50R40J53q64k4K49N08m76m69P18Q8k19m09K13
$$ plain form
4702 -675 -367 295 191 -334 -491 389 60 -655 -343 524 503 -663 -421 224 339 -287 -383 209 289 -476 -253
4723 -253 259 351 -236 -439 156 519 -8 -612 55 324 -318 -441 442 269 -66 -598 50 516 14 -360
4743 -360 191 322 68 -409 274 650 112 -741 140 505 311 -505 64 473 -107 -197 -139 461 199 -520 -370
4764 -370 235 189 -853 -404 218 -18 -424 -397 283 -5 -336 -276 261 316 -276 -229 243 282 -454 -424 333 749
4786 749 -292 -290 86 513 -141 -430 302 591 -356 6 210 415 -162 -294 222 449 113 -369 183 515
4806 515 112 -439 159 443 -27 -449 -104 189 -76 -318 53 302 -59 -429 -154 -109 -202 -425 -55 372 -50
4827 -50 -776 -326 246 72 -343 -226 339 76 -427 72 448 126 -317 -244 475 397 -654 -211 435 275 50
4848 50 15 252 429 -20 -50 202 268 -54 -504 436 589 -275 -299 -50 458 -18 -487 231 319 100 -309 -96
4870i6O12p62n06Q16N22n47n97P11K34n85k00L20N16n47k31P9K07J93n81J85M27
4891A70j66m83K38O01m21o49K98N77m5m91J8M62O2m17kQ58j31n38r9N57K00r57
4913c58L00N82M4r94j01Q07L66o59j45N34J89r77J64J39N84m92l31M15M50r65
4933d48p7O67l5l99k17N29M7m46j08N60L42n18m15O74K68l58o61P48K63k77p09
4954e70P08P3Oq80P94L61m06j79K69M25k72m58l34P24%m59J81M76N2o47j64N55
4976B55o5n28o1Q66k39m80l95J064k73j98k81L06N06q81j85O88K92n80l39P69
4996B41Rl80o47Q18K51k50n36M38L95m45m59O14M99m96n02P67l3m35o52R08O56
5017G61o85k89O2P20o49k41O7O82l58q03K48R91M3o52Q9O54k90q67L78L19K37
$$ plain form
4870 -96 516 -246 -752 64 586 39 -558 153 387 -198 -398 -78 438 -109 -340 -261 -54 139 -442 -257 170
4891 170 4 -479 -241 360 -61 -710 -412 165 120 -371 -353 109 171 -246 -248 610 479 -59 -158 399 599 -358
4913 -358 -58 524 568 -426 -527 280 646 -13 -158 376 565 -412 -248 -109 475 -17 -348 67 517 -448
4933 -448 -525 142 107 -292 -509 20 67 -379 -487 73 415 -103 -518 156 424 66 -595 153 416 139 -570
4954 -570 138 211 217 -663 131 492 86 -93 176 601 329 -129 -463 261 261 -198 -17 459 511 -136 -300 255
4976 255 190 -338 -399 467 228 -252 -647 417 144 -54 -335 -29 477 -404 -589 99 391 -189 -528 241
4996 241 250 -130 -777 41 292 42 -494 -56 339 -106 -565 49 548 52 -450 317 284 -151 -803 105 761
5017 761 76 -213 -151 569 -80 -321 -254 428 70 -733 -485 506 549 -103 -14 640 350 -517 -139 180 417
5038D17p89J56P25l00l14n94Q29N5o01l20J096j6m78j84L88k1j82j96Q2K14k65
5059b98k04M22L05l43l13N73J46l52K3k8N36m51m82L23M06n21k03O20M32m88m23
5080c20K81O52m57m72K07N14j17o12N25L41l82q29J66R61l96p09N06L55m7p79
5100f12O25R4j00m23L29L59j63l88p4J020p29m05J74K35K91l04l79P91j82n19
5120c60L5M42J92o76K15O15l0m80k60P08K0k80m34N28J75j63m83N04K64m54l25
5141b47K92M16n32k03J84Q06n72m43L24K74r0q79N25P91k84p54J11N41k48k72
5161b60K69R2K11q21K78N14r2k14l06K77M88r93K88K77K90m42l12L79K76k83k58
5182c42K84K37k88j13L75K21n10lJ93J97n42R7L73J44n63k90O94O1j40j69L74
$$ plain form
5038 417 -372 -216 509 209 -105 -699 130 185 -416 -736 360 344 -134 -318 70 49 -133 -329 -247 -33 -298
5059 -298 -502 -80 225 -118 -431 142 288 -64 -41 -69 467 16 -466 -143 263 -258 -461 159 591 103 -320
5080 -320 -39 613 156 -316 -109 405 288 -324 201 542 160 -669 -503 458 62 -647 -141 214 167 -612
5100 -612 13 107 7 -416 -87 272 109 -279 -353 667 -62 -467 -293 -58 233 -71 -450 341 159 -360
5120 -360 -325 117 309 -367 -152 463 433 -47 -307 401 421 141 -293 235 410 247 -236 268 532 78 -247
5141 -247 45 461 -71 -274 -90 716 144 -299 25 299 209 -670 -145 646 362 -392 -281 260 12 -260
5161 -260 9 101 312 -509 -231 283 191 -23 -329 -52 436 -557 -269 8 298 -144 -456 -77 199 -84 -342
5182 -342 -58 179 -109 -222 153 374 -136 -139 54 251 -291 -194 179 323 -240 -530 164 225 85 -84 290
5203B90n3m1p90M21M52m03l35J68P74n53m15L46M66o12l13N78L43n2o42K26N64
5224D19q20L5k9N82o4l96J45K95j33j87j05O76kq20J85N00L1l47l14N52K69m65
5246Gl83N03L46o69j24O40k1m00QJ70L32l13m31N67j44j79j56M69K27m17n58P09
5268A83n6l64o7K92K16P9p21K61M74o15k09P98R6o10K3J9M19k56j32J36L5L37
5290C38j46m62M38j03j74j37N60J41n98j88P08j03n36J72O07q8n69k03P27k20
5310A64l80K04M69J4n60k05N95J13l90l58N99J94o32L63P6k2k43m16O50J37m66
5331i4m36M94O90o89k41K49M91p60k54O90K58r34N7L51O21l76m53L50M81m52m58
5352d15J68P88l77l59mO01j47o48K60M43J53o26k6K56J21k15O3O3J05o26P7N22
$$ plain form
5203 290 237 196 -594 -173 279 -124 -459 -291 483 -70 -485 -139 327 -285 -598 -20 323 271 -371 -145 419
5224 419 -401 -366 -395 187 123 -273 -128 167 34 -153 -258 418 416 -404 -219 281 312 -35 -349 203 472 7
5246 7 -376 127 473 -196 -320 320 299 -101 -93 77 409 96 -335 232 88 -91 -247 222 449 32 -526 183
5268 183 127 -237 -304 -12 204 283 -438 -177 297 -318 -527 271 367 -243 -220 -201 218 -38 -170 -34 1 338
5290 338 192 -270 168 65 -109 -246 314 455 -143 -331 377 274 -262 -90 517 429 -140 -343 384 164
5310 164 -216 -12 457 471 -89 -294 301 414 24 -334 265 459 -173 190 266 244 1 -415 235 372 -94
5331 -94 -530 -36 654 -35 -276 -27 464 -296 -550 140 398 -536 -479 -128 493 117 -336 14 495 43 -415
5352 -415 -247 541 164 -195 -199 402 255 -393 -133 310 463 -163 -189 67 188 -27 36 99 204 -422 -345 177
5374A77L87q99J0L62L91p20j51N86J52l39l31N14K54p50L16O6J94o05k8N05K12
5395C03k17o42P92K1n10J5K07M55m53k24K61L20n4m54K19K65po70L37O71m28m26
5417b19K50K06J07m55K3N15n0o78M09L15m71j68J47K77k39j39j80N16J12p28K46
5438b04K08L4L6l13N00K28p15J40J20J01k00m63O99J20m89q1J73J84j28j48J93
5459eN18o58j71L27O94m33n14K13L90k35k91J70P09m90p73K07M28j08j05m8Q71
5480F96l88n75K80L48k21k38K71O2k4m57NM92L9n60L73N58l40m03K60K07m4o95
5502c54j39O45L5m11J56K68Q5n98O1K16L95n14m2M85L31n82m20L81L79m08k44
5523b75M82L04n21k49K93N14n99k99K49P67o29l14O40J7l76j73L39L11n98j27
$$ plain form
5374 177 564 -335 -325 37 428 -292 -443 143 295 -44 -375 139 393 -357 -41 25 219 -386 -414 91 303
5395 303 86 -556 236 257 -253 -238 -31 424 -29 -253 8 328 274 -180 39 304 297 -373 -36 635 207 -219
5417 -219 31 237 344 -111 -88 427 377 -301 108 423 -48 -216 -69 208 -31 -170 -350 166 278 -450 -204
5438 -204 4 38 74 -239 261 489 -226 -86 34 135 -65 -528 171 291 -198 -279 -106 78 -50 -198 -5
5459 -5 513 -145 -316 11 705 272 -242 -29 361 126 -165 5 714 224 -549 -342 86 -22 -127 -175 696
5480 696 308 -267 13 361 140 -98 173 235 211 -246 -241 251 290 -270 103 661 321 -82 178 385 341 -354
5502 -354 -493 152 187 -224 -68 200 285 -313 -252 -36 359 -155 -197 288 619 37 -383 -2 377 -31 -275
5523 -275 207 511 -10 -259 34 548 -51 -350 -101 666 37 -277 363 380 4 -169 170 481 -117 -244
5543b44L11K07j73m86N80J13k31k71J00K15j63l19j13N88K04o29J58K77n5m92
5563d23N32N02n96l36J06J88K05j30l43M37L21o45j88M57L50n23k15P13J30p46
5583b04l27R06L74r89k66J039j10o22l08M62O77m04n45N10M78o45l7Q1L68o14
5603a76R1K19J19m12r4K20M08k72m35K83L45j16q86M91M72p6l44o9M10J63r28
5624e87N27L08k24j52j43O72m33k37L08J65j13n70J67L95L00o30j7N29L13r11
5644c33M29L06j1j85n07M32L08n19l23O05J92m41j13K54K58j66m31L24K88l93
5664b6l40J79O23m28j29j4K27k77l80K84N36j88m04K17L17k59k61K65L46k12l03
5685b27K11M88j14m06J85l1L30n75J7M25j81n50M90J15j0k55j08O81k21l13l13
$$ plain form
5543 -244 67 274 101 -385 195 308 77 -194 -94 121 -42 -361 -474 114 318 -311 -153 124 69 -423
5563 -423 109 611 15 -321 -215 -27 178 48 -295 142 463 -182 -370 87 437 -86 -301 412 542 -204
5583 -204 -531 375 749 -240 -506 533 423 -199 -507 -45 632 228 -317 193 671 26 -11 70 438 -176
5603 -176 -85 134 253 -159 -253 -33 375 103 -332 -49 296 180 -706 -215 257 181 -163 -232 178 341 -587
5624 -587 -60 248 24 -128 -271 401 -32 -269 39 204 91 -479 -312 83 383 -247 -264 265 578 -333
5644 -333 96 402 391 206 -301 131 439 -80 -403 202 394 -47 -160 94 352 186 -245 79 367 -26
5664 -26 -366 -187 436 8 -121 -135 92 -185 -565 -281 255 67 -337 -120 197 -62 -323 -58 288 76 -227
5685 -227 -16 472 358 -48 137 106 436 -139 -122 303 122 -428 62 177 167 -88 -196 485 264 -49 -362
5706c62O91L4l59l92O65j18k38l30N53M25o88j82N09m0j3k50L22J52p52N2L20
5727aK78l92n63P01J50k79n21P51K12l14j77K75J83k05m19J05N91j27n58K45N18
5748D53j74l97J1M15r0m42l0O19l14j68j97M07L56n64j2L42J62m18k11N93Rl22
5770B8k99N86r8l75L1P52p9o25l71M62J32r8m24L12K93l87k38O13J11k13j62L68
5792C19k6l99l18K94M44k03n19M28K27j97l53N12J57l29m67O04L57k11n84J23
5812a41L98o6l79K36M47l88n26M22L36l46p0k34P02Q3l40m08N06P1p43L40M71
5833C71l17j69k37P49j34l38m19O03M1m06j00L86M56o30n95P56M58n78j95K39
5853e9O23p82QR1M17n61J59J1M33l80k50N55l2N4l33K29J35m14l14K66L56l21
$$ plain form
5706 -362 329 363 4 -388 277 159 -79 -409 144 569 -119 -301 208 168 155 -95 227 379 -373 -321 -1
5727 -1 277 -115 -678 23 173 -106 -627 124 336 22 -155 120 303 98 -321 -216 375 248 -310 -65 453
5748 453 279 -118 -107 308 218 -224 -254 365 51 -117 -314 93 449 -115 -127 215 377 -41 -252 341 350 28
5770 28 -271 315 217 -158 -127 625 546 -79 -450 12 144 46 -378 -66 227 -160 -398 215 326 113 -49 319
5792 319 293 -106 -424 -130 314 111 -408 20 247 50 -303 209 366 37 -430 174 531 320 -264 -141
5812 -141 257 191 -188 48 495 107 -419 3 339 -7 -77 -311 391 474 134 -274 232 303 -440 -100 371
5833 371 54 -115 -352 397 263 -75 -494 109 150 -256 -356 30 486 -144 -739 17 475 -103 -298 -59
5853 -59 564 -218 -210 -119 298 -263 -104 -93 340 -40 -290 265 233 287 -46 183 318 -96 -410 -144 212 -109
5875a09j79K07L51Ln54J3N49n4l87k2O95j88o97l4N20Nn06L39K26J38n67L23p9
5898gK27l51j66N21J57n81k43M13K82m38j75M93J82j35o67O14L00n18m05K46P17
5919D66o38j24L84J47j96k26K74J13k55r1J14J33q2l65L96N18l67j4j06L08l13
5940G6l25J32P21q50l77O66M02n25q0n66J070j04m51K46K0l1n01J83M28J40m70
5961a96KK78K33q64L75k8L86m27P6P08j47p72K59L32M28r29M5M34o2j1n84N98
5983A34K87j68p07N77M0j61k09L64K70m63m68N76M36m73l25M26nj42l32M30J74
6004B61l53k34K56J76j58o51M40M47j85l94n0P53l80k59L46L99j91o76N84k48
6024a17J45k32M13l0J56k83Q3K66q4m41k59O41r0m26K0M43J26m98J03M63J50p98
$$ plain form
5875 -109 -288 -81 270 273 -281 -268 281 227 -160 -182 513 325 -372 -406 114 119 -387 -48 178 316 -251 72 -7
5898 -7 220 -131 -297 224 381 -200 -443 -30 252 -186 -361 132 314 179 -488 126 426 -92 -497 -251 466
5919 466 -172 -296 88 235 39 -187 87 200 -55 -146 -32 101 19 -346 50 568 201 187 81 389 76
5940 76 -249 -117 604 -246 -623 43 445 -80 -160 -726 344 240 -211 35 55 24 -477 -294 134 274 -196
5961 -196 -194 84 317 -547 -172 -200 186 -241 -165 543 396 -376 -117 215 643 -286 -241 193 131 120 -464 134
5983 134 421 253 -454 123 163 2 -207 157 427 -36 -504 72 508 35 -290 136 131 -11 -343 87 261
6004 261 -92 -326 -70 106 -52 -703 -263 184 -1 -395 -445 308 -72 -331 15 414 223 -453 131 -117
6024 -117 28 -204 209 179 335 52 135 401 317 -124 -383 258 168 -258 -238 205 331 -167 -64 399 549 -249
6046b49J40J4P15n49m55P09L2k04l35L20J34m45j05L79j60J77k06nK29k63k47
6067c74K35M32k41k51N0r9K04k55J6N23m8m69L38M10l24l58K15N74k54o44M7P28
6089D55j93k96j63O97m00l57p0O43j10l32k39O25mj86k31M62J05q38K46J64J72
6110A50j49k27K95K12n74k67L50L97l59q9N78O6m27k68M41J04m97l22Q69l4N7
6131C06q69k8Q87M0p00K66L85K9n62O8L22j16j54j41L56J45m08N3N92k43j78k41
6153a91L57J78k27k30K84R0k41K91k20j7o6m17M73M35l86l72L75J44j74l12M64
6174B38j79k11n59R33K32n17k40K29J48k51J93P5m9m22K2K94L68m38l2O9L09l53
6196a41k24J60K73K89m54K88J29m27j74J8N32q9l51J15N5K35l29J42j1j10r5j29
$$ plain form
6046 -249 -109 -95 620 71 -384 325 357 153 -182 138 272 -173 -278 101 -59 118 -88 -93 136 -127 -374
6067 -374 -139 293 52 -199 -149 -248 -44 -299 -283 240 192 -277 61 471 147 -211 4 578 324 -320 -273 455
6089 455 262 -34 -197 500 100 -257 -327 316 206 -126 -365 260 256 70 -161 301 406 -432 -186 -22 150
6110 150 1 -226 69 281 -293 -560 -210 187 -172 -261 317 383 -44 -312 129 233 -264 -586 283 249 306
6131 306 -563 -591 296 336 -364 -98 287 316 -246 -178 144 28 -126 -267 89 234 -174 -121 471 228 50 -191
6153 -191 166 344 117 -113 171 261 20 311 91 74 8 -409 64 499 113 -259 116 260 86 -226 238
6174 238 59 -152 -711 222 454 -63 -303 -74 74 -177 16 91 42 -380 -358 -64 304 -134 -166 -97 212 -141
6196 -141 -365 -205 68 357 -97 191 320 -107 -281 -263 269 180 -171 -56 -1 234 -95 47 36 -74 -169 -298
6218b98L89K58n48j75N40L28q88J37M35M3n17M06K06l49k07m1L84R9l40j4L21
6239A69m1N8k98L74k91K44j54j04J28k9k89K49K23j52l30J34N96p16R2J75K38
6260B76j5o43N73M8m5m43J89M84k74l74n8N56k93l46J69L64j87k20K24M06j96
6281A95l51j76M38j77m09K63N17k74j64l8L89k86j93L5L06J79k48j97L12P1m39
6302b47J20J15L27k53l06L50L44o58j29N37J96m60j83L36J79k79k48L80q6J97
6322B32l19Q0J47j10k07L08J59K21q11K13L17j25k20J63J18q9l65K9P70p7p80
6343c46L65k3Q0l12k21N26M75r19M2L92m9n7j31L19l96J36m91O76K89p29J11J10
6365a53L56l59r2L23K02k27q4K25L08m97k70N41j32l79l7M90K46m40m1j9L84n80
$$ plain form
6218 -298 91 349 -199 -374 166 494 -394 -257 178 221 -296 110 316 -33 -240 -281 103 202 -138 -152 169
6239 169 128 186 -112 262 -29 215 61 -43 85 56 -233 16 239 87 -243 -109 487 -229 -137 38 276
6260 276 261 -382 191 239 194 -249 -60 424 150 -224 -282 274 -19 -365 -196 168 -19 -239 -15 391 195
6281 195 -156 -332 106 -71 -480 -217 300 26 -138 -176 213 -73 -266 -231 75 254 6 -191 121 192 -247
6302 -247 -127 -12 315 62 -244 106 450 -208 -337 200 396 -64 -247 89 268 -11 -259 121 35 232
6322 232 -87 -7 140 30 -177 131 290 511 -300 -87 230 105 -115 48 166 77 -288 -259 511 434 -346
6343 -346 19 -4 76 -236 -457 69 544 -375 -333 59 10 -47 -178 141 -255 -119 -610 66 355 -374 -263 -153
6365 -153 203 -156 -248 75 277 50 -34 191 499 2 -268 273 141 -238 -275 215 461 21 -20 -39 345 -235
6387b35QN11k3j97m68k5R19n57k15Q0N11l77k45m3O26l48k82K75L50k69L1p7K19
6410A69j00l12j15M63L0m33J94L22J46o12j32N46P0n59L87J05M7m45o6M39J63
6431C07l14k46O03J44l88k32M90o0j67n62O54k18J20o68P32r7k65l3K73P2j54
6452ik72k7N03l70O8k6L95m72l0J72M47l24l78K60K61m1o87L03N14j35k61K4L55
6475B70m75Q4j94N66P7o72R4N22n6n71R4N64l96J09r5J71L5l15k32M03K79k38
6497B4k15K36J97p1o88L17O45l32m23L32J71j35j35j51O05n42m3p0Q40m50k02
6518i0L2K94l31k36M35Ml67q0J34K96j90M8J2J67J12o53L0P66j08o22K36K39L6
6541A64l63J59O01l41q0j92n5N8l6n9J64J67k46o8M40K73p10k1jN49o90J37K84
$$ plain form
6387 -235 -227 284 261 64 -404 -429 490 -67 -282 -202 309 -68 -313 -356 270 -78 -360 -85 265 -4 27 -50 169
6410 169 69 -243 -358 105 135 -298 -104 218 364 -248 -380 166 236 -323 64 169 216 -229 -295 144 307
6431 307 -7 -253 350 494 106 -126 364 304 137 -425 229 11 131 -537 195 98 -167 -200 73 145 -9
6452 -9 -281 -308 195 -175 -107 -133 262 -210 -240 -68 379 55 -323 -63 198 157 -530 -227 287 152 -109 -85 270
6475 270 -205 -121 -315 251 328 -344 -250 272 216 -355 -261 303 -93 16 -79 92 127 -188 -420 -17 262 24
6497 24 -191 45 242 171 -517 -200 445 113 -310 22 193 58 -77 -228 377 -165 -208 -278 562 112 -90
6518 -90 -58 236 -95 -331 104 108 -259 -339 -205 91 -99 -51 -39 128 240 -413 -383 383 275 -347 -111 128 164
6541 164 -199 -40 561 220 140 -52 -107 -49 -85 -144 20 187 -59 -127 313 586 -124 -145 -146 403 -287 -150 134
6564A34m3j58Q9k1J91n27k00M19L77j8o18L34L67o43j57L70M80l23m77J65L30
6585G1l2n32O17L06m61k59J68K11j74j20J63R1K77m68l7N62l89j37j19N11L9o06
6607c18J1L54r1j39K21J11J36n08k6J17K02l94K48QK65k45m79N02K80l37k19M84
6629A83R9m34j21L16l5j26k53K82M00m15p1J1J7j95M0K75L03l04j14K88L76o33
6651a11J54j4L12j31m92L09K89j36j90j70O33l88k60J06L90P6n17P4P3L49o36
6672b80K2L47q1r7o7K13J60l03l52M37r0k18R2L14P9k93k40N76o4n18L40j82P51
6695E46p05l44N91K90n33j15M34K10n89j81M15K76k65o60P41J38N6n75N39J47
6715D16l02k94M2L31k99j69J42P02n19l7l22N13l40k16J59K90j07l23K88J45P3
$$ plain form
6564 134 91 -67 22 1 192 -335 -535 -116 261 243 -375 -41 326 -317 -474 -104 376 53 -424 -259 71
6585 71 39 -493 124 430 -31 -290 -122 89 -85 -205 -42 49 326 -142 -179 383 -6 -143 -262 249 288 -318
6607 -318 -307 47 -44 -183 38 149 285 -223 -249 -132 70 -324 -76 -68 197 -48 -527 -25 255 -82 -301 183
6629 183 282 -152 -273 43 8 -118 -371 -89 311 -104 -175 -164 -147 -342 -302 -27 276 -28 -142 146 522 -111
6651 -111 43 29 341 210 -282 27 316 180 -10 -180 453 65 -195 -89 301 377 -140 -66 7 356 -280
6672 -280 -258 89 8 -89 -156 57 217 -86 -438 -1 -91 -309 -217 97 176 -117 -357 219 155 -363 -23 -205 546
6695 546 -159 -503 88 378 -155 -270 164 374 -215 -396 19 295 30 -630 111 249 305 -270 269 416
6715 416 114 -180 -138 193 -106 -275 -133 569 50 13 -309 204 -136 -352 -193 97 -10 -333 -45 100 173
6736A73j32j48L50K9n03k12O78J59r13L96L60k1o55J14N52J93p31j3K89K02m77
6757c10j78N70K16j33k27J22K52m56pq4N34n95l7N1L84l29J56j72P64n33j59N
6779a66O96p78L64k00L98o6n75O01j35J42n30L17J86P1n81M63j27J04n95n5M23
6800d3M40p98K14L94k26q0l98N74r3k60nJ56K27k70p7K61N7j87j21J20J88m02
6822c29K02L0M48l97l25N16K46l78j42J29Q1j55k49M59n3k32R1k79M67l69j19
6843c58L03J51j23j73J49L03L5m63nL15m54K90l9K68k36k04K76L11j01n45p1O42
6865B71l3l30o0J52K92o51L40r5J64r8k67K82K09m24j17O30j08k36j92M50J68
6886C47l65k7n5q1J23k82L62M88o60K43N7r2j6l62K11L64k33n64Q56k09j72l81
$$ plain form
6736 173 41 -107 243 272 -231 -443 235 394 -519 -123 237 216 -439 -325 227 420 -311 -324 -35 167 -310
6757 -310 -488 82 298 165 -62 60 312 -144 -151 -235 299 -296 -333 -282 102 -227 -71 -243 521 -12 -171 -166
6779 -166 530 -248 116 -84 314 248 -327 274 139 281 -249 68 254 325 -256 207 80 184 -411 -466 -43
6800 -43 397 -401 -187 207 -19 -99 -497 77 -16 -276 -281 -125 102 -168 -245 16 73 -114 -235 -115 73 -329
6822 -329 -127 -97 351 -46 -371 145 391 13 -129 0 81 -74 -323 136 83 -149 -58 -337 130 -239 -358
6843 -358 -55 96 -27 -200 -51 252 287 -176 -181 134 -320 -30 -69 199 -37 -241 35 346 245 -300 -371 271
6865 271 238 -92 -152 0 292 -359 -19 -114 50 -48 -315 -33 176 -248 -365 265 157 -79 -271 179 347
6886 347 -18 -45 -100 -181 -58 -340 22 510 -150 93 150 58 42 -320 -109 255 22 -542 314 105 -67 -448
6908d48N47L54m54j55M13M0k25m80J93L93l45Ol84R10l15j33r8M16j26l71K61
6929aK19k80n9l35N20P9j02M0j8O4n1m22J53O85n75m2J20K69m00j71N56k38P6
6952H7K8l8J83k19J5n5K62l43l38L78L55n57J13K77J03l15j68K59J51k1o22L8
6974d27L77J99m72J50L23k61k26K22L19j88j58m4J05K44l10K64J54J50n64J44
6994AJ67L32o82N0J25R7j14N3K17K07k80l72M74j20k76j64M66%j90M8N8j33k42
7017b78j65O31k87k2k13L54N6k82j05M65J59l85J17j11L17n34j68L95K92j32k17
7038a13J57n1j09l62P08K14k87n28K24J09L5j57O0L94j40k24P3K12q7l10K22M0
7060H0m4l25J09K19%K00l14K41J0J22k54J09N6l46j21N97nk84k37K4M11m52j14
$$ plain form
6908 -448 99 453 -1 -156 257 297 72 -408 -215 178 -167 -161 -545 365 50 -83 -181 235 109 -262 -1
6929 -1 218 -62 -121 -456 64 143 41 81 63 127 76 -346 -193 492 -83 -125 -5 264 -136 -307 249 11 87
6952 87 115 77 260 41 56 1 263 -80 -418 -40 315 -242 -129 148 251 -64 -232 27 178 157 -465 -427
6974 -427 -50 149 -323 -173 150 -111 -337 -115 204 16 -142 -186 -81 163 -147 117 271 421 -143 1
6994 1 168 500 -182 -132 -7 90 -24 29 246 453 173 -199 275 155 -121 -285 181 181 -9 39 97 -36 -278
7017 -278 -443 188 -99 -121 -334 20 76 -206 -311 154 313 -72 45 -66 251 -283 -451 -56 236 104 -113
7038 -113 44 -7 -116 -478 230 444 157 -371 -147 -38 -3 -160 -100 294 154 -70 3 215 128 -182 40 80
7060 80 36 -289 -180 39 39 239 -75 166 176 298 44 153 209 -137 -258 339 334 50 -187 -163 248 -204 -318
7083c18N13pm12k29O19k05J40o41O33J73j57l82J57P8K6m3k9J73J59n73K20J93
7105H8j67j23p7K35J59k16lL38j65k61J61K04q8k22L3M76n14J21j59o8K01n6j35
7128b38P04m18m23J38L05L40o00j03M1J75n4oJ93K02m42k51P92k20k86K06jj29
7150g5j68K25K62J74n14nR0J61j97k11J2M88j56k12J73P1L3l85L53L5J53l51R2
7173D8L74k51n06M04j89J61j57j32K43L93m79L2J62n6m17L43L22k55j98L1J08
7194a9J02J60p35M33K21j85k11L80N4n72K6M15J15l92r7O53k98j49kL06j93j34
7216a22k69N33j6m5j42K7K18k86K94N2K2m49K1L53j08j76k31K85K31j67l7J4P6
7239G8k0k54L07o5j32l71M52K7J76l26N1J9KK73m60N20r0l50J49L64k14l94K98
$$ plain form
7083 -318 195 188 -224 -453 166 -39 101 -540 93 266 109 -273 -116 -38 -12 -55 -84 89 248 -325 -105 88
7105 88 -79 -202 -279 -44 115 -101 -104 234 69 -192 -31 173 85 -137 -104 372 -142 -21 -180 -248 -47 -103 -238
7128 -238 466 48 -375 -237 68 408 -192 -295 -254 -79 -133 -139 54 256 -186 -437 355 135 -151 55 54 -75
7150 -75 -243 -18 244 418 -96 -101 -11 150 -47 -258 -246 242 86 -126 47 118 151 -234 119 154 307 -44 48
7173 48 422 171 -335 69 -120 41 -116 -248 -5 388 -91 -59 103 47 -370 -27 295 40 -158 -127 -19
7194 -19 83 243 -492 -59 162 -23 -234 146 200 -372 -346 69 184 -208 -305 348 50 -99 -101 205 12 -122
7216 -122 -391 142 126 81 -61 -34 184 -102 192 244 266 -183 -162 191 83 -93 -324 -39 192 25 -12 2 78
7239 78 58 -196 111 46 -86 -457 -5 22 198 -128 -77 -58 -56 217 -243 277 187 -163 -14 350 136 -258 40
7262D0K3M22n76r6J70J27k71RR8K15k88R2K74j18j45l18L00K49l75K27j4J24j80
7285a1k83N60j52j07k64L82M35m35m84M74K0m20RL13K91l08l37M36J60o9m17K24
7307A7K76l06k46J45N8L23k32j42M34k01k88p4O41j46n50O3N44j76m78j16M87
7328C3L51o11j61P51k68l16L8L11J20j90k32L90m8r5j55Q9O6k62L66L2K09p09
7350b91J65j44K66k10j89O35J61n48K0K67j48L07m01K16o7n5k07K52N4j45o5l2
7372a59K88k32r4K60J41k32k72P9K76k35K97q1J32k17j79M9N77k27r7l32R5K55
7394I2j06R8Q6l3k83j70L81J9k38l06O67K01o64j2M17R1k05o3J64L94m29k57J47
7417iO5r0n38M41L35j6m76M49J71n99P8M57P0j23m39J11M53m35p0Q9J64L1k77
$$ plain form
7262 40 63 485 -91 -187 -17 110 -161 -152 -54 161 -127 -35 239 121 -24 -342 -42 207 -168 59 45 169 -11
7285 -11 -294 266 114 7 -257 125 560 125 -359 115 135 -285 -276 37 328 20 -317 119 279 210 -207 17
7307 17 293 -13 -259 -114 -56 267 35 -107 327 126 -162 -236 405 259 -291 -228 316 140 -338 -454 33
7328 33 384 -227 -388 363 95 -221 -183 128 248 58 -174 216 168 73 -82 7 73 -189 177 209 418 -291
7350 -291 -126 -270 -4 -214 -403 232 393 -155 -135 132 -16 291 -110 106 39 -16 -223 29 83 -62 -127 -159
7372 -159 129 -103 -197 63 204 -28 -300 -221 55 -180 117 36 168 -49 -228 -179 398 171 74 -258 -163 92
7394 92 -14 84 170 137 -146 -316 65 84 -154 -460 207 408 -256 -268 149 240 35 -28 136 530 101 -156 -9
7417 -9 56 -34 -572 -131 204 188 -288 161 332 -267 -189 268 338 215 -224 -113 340 -95 -165 -76 88 119 -158
7440a58k8O14k32k96K64J58k34J13k87L37l4l94K07J24J53j79m48N51lj92k34
7461a98K42O2k51K9L01j72j50j02K40J20k14j80J88L14l50j69R6M52m76L15pJ78
7483B68k16k96K67k9r6k43J83K90Jn24O12N2k73n1J2J79j70l15L73L3j41j12M76
7506B80k72j39K45k7J39K7j0m78L70L9j68j16K53J12o40N00L25k05o7l02J90m
7528E2k34j09M65j44m45N53j11j96j73L32j46M62k04k08J36J31k88NP8K38j62
7549C2l65N12q5j66P4o4K85J62m38K20K09n6m96J98K37j65k44O7j1L33k78j62
7571b01K79O5m27M33J82o49K50J67J52l00j76J27K80j33p6R7m5Q1q1r3J20j5j44
7594a07P3j41K26k10K4M43m66j43J61q7P63m64n2n0L66m88J26J92N65n66l33L58
$$ plain form
7440 -158 -186 428 196 -100 164 322 88 201 -86 251 217 -177 30 154 307 128 -320 231 228 36 -198
7461 -198 44 106 -145 -116 185 13 -137 -239 1 121 -93 -273 -85 229 -121 -290 -194 258 -218 97 90 268
7483 268 52 -244 23 -6 -102 -345 -162 128 129 -395 217 269 -4 -55 -43 136 -34 -349 24 57 -84 -196 280
7506 280 8 -131 114 87 226 253 243 -235 135 174 6 -110 143 255 -385 115 440 235 168 -134 56 52
7528 52 -182 -291 174 30 -415 138 27 -169 -342 -10 -156 306 102 -106 30 161 -127 -122 -44 194 32
7549 32 -333 179 94 -72 2 -62 223 385 -53 167 376 320 -176 22 259 94 -150 -83 -94 239 -39 -201
7571 -201 78 143 -284 149 331 -318 -68 99 251 -49 -225 -98 182 49 -27 70 25 106 25 -68 52 37 -107
7594 -107 -34 -175 51 -159 -135 308 -158 -301 -140 -227 536 72 20 -30 336 -152 -26 166 731 165 -168 190
7616A90k36J10j82N6L00m70K32l2P8k68K76j61K88j14m77P39k14Q9P8k59K20K4
7638B67l63J82n1K28j93l48K90J77m43J91N28j83l06j66J69K44o65P3M90J9l54
7659b14M8K38m0m7MJ40J0j97J7P1L06j16k59O5J29l68M3L21j15j92LRL16rl14
7684a51J85K78l05l56P51m51K24j78o4M85n22Q9q4l2J26K1k49M90k27ml30J99
7706a05K83l69L46j41O6l50K29Q4O0o9J92K3r5l09j10L11K7r4O3n5M01m61k94
7729c67M43j73NK45J30q1j7m64L67L68q77L19J02jk38M4L07J51l46j72L19On0
7752B0j92L45K9l04m71Q39j34M5k66j08N20l07m2q3M64j05k00l5P3L6o23K45L21
7775F7O1j82j06K27j8k36J66K81l65P9jP2K83n32J29L69k90k15L22j94M65n26
$$ plain form
7616 190 -46 64 -118 -62 238 -232 0 -32 46 -222 54 -107 181 67 -410 329 115 204 282 23 243 267
7638 267 -96 86 35 263 70 -278 12 189 -254 -63 465 282 -24 -190 -21 223 -442 -369 121 140 -214
7659 -214 -166 72 32 -15 -11 129 139 -58 -41 30 336 220 -39 26 155 -213 -170 151 36 -156 -153 -144 172 163 -151
7684 -151 34 312 7 -349 402 -49 175 -3 -67 418 -104 -15 -99 -131 -5 16 -233 257 30 26 -304 -105
7706 -105 178 -191 155 14 80 -270 -41 43 103 34 226 249 154 -155 -265 46 73 -21 42 -13 388 -73 -367
7729 -367 76 -97 -92 153 283 202 185 -279 88 456 -421 -102 0 -1 -239 -195 112 263 -83 -255 64 70 20
7752 20 -172 173 202 -102 -573 266 132 177 -89 -197 323 16 -26 -109 355 250 50 15 88 124 -499 -254 67
7775 67 128 -54 -160 67 49 -187 -21 260 -105 -26 -27 45 328 -204 -75 294 4 -211 111 -83 382 -144
7797a44n8J80K58k74j26J83N2j21q9L34p9l16j40M35J41l13l43K06L64K4l46M16
7819B44J72l83M7j59J36qk95K95L42m68r1L44J04m03m0J11K80k29m4m8J72k9k56
7842b06L58Rn2l35J00J02M2l50M89L3j62J52k51J56K92l86l18P53q4m80j44L14
7864C2L5k82K27l17N74n53k8L83p9J5j4j93L70J41m10j22L60L2m19L59J94n51
7886b46O4R1K09j81n2r7L09m03N26o4o5r4l52N27k7j65q6n4M07P7m64K13Kj04
7910b9k88J81J61Q7j63m1MK39l42J10M03m77J15l57M45Q0j71l0L25Q3l78m4J96
7933A09L2n9k79k0N10k47k56K31j29j52L9K71L0j59lK58o7l33M3K16K57m43K6
7956a25J11K54k34K0k7M7j46k28J14L75j60l96J90N92l33l12K34O6q5jn1K37j95
$$ plain form
7797 -144 -202 -22 236 -38 -164 19 71 -50 -139 195 116 -200 -340 95 236 -77 -420 -214 150 174 -172 244
7819 244 416 33 80 -79 57 49 -246 49 391 -77 -168 176 280 -123 -163 -52 228 -1 -45 -93 79 50 -206
7842 -206 152 161 109 -226 -126 -24 18 -332 157 190 28 180 -71 85 377 -9 -327 426 342 -138 -282 32
7864 32 67 -215 12 -305 269 -284 -312 71 -8 7 -7 -200 170 311 -99 -221 139 171 -248 111 305 -246
7886 -246 -182 -91 118 -63 -115 -212 97 -306 220 156 91 -3 -355 172 145 -20 -106 -160 247 324 -140 73 75 -29
7910 -29 -317 -136 25 112 -51 -92 -88 151 -191 -81 322 -155 -40 -397 48 128 -43 -73 252 335 -43 -87 109
7933 109 141 82 -197 -217 293 46 -210 21 -108 -260 -221 50 80 -79 -82 176 109 -224 -181 35 292 -151 -125
7956 -125 -14 240 6 26 -1 46 -100 -328 -214 161 1 -395 -205 387 54 -258 -24 42 -43 -44 -95 142 -53
7979e3J11j55j8Mj27Q6J27J39l42l4L31K95o54Q1k8J17P3j49K60J26R1n58K70
8002gJ68l71j50N49k9l27L2p3L89o6l07J24N65l50l49M55n4l19o3L25m4J56m42
8025a88L59K0J29o31K77l3K64j61k97K02K71n08OM75m1l48P1P7K10l12j6L53p8
8048A01Q5l13R9L63m28j08J98K48k47l07K87L15N5o40K41O4Kj19P24o46l1P9j1
8071A1M27m43L20j83j2o8j46R6K69j41m84N47j70K69q02K93M20k88k11K78m7K22
8093A57j86k51L35J31o43M31J88j42k29k3O39j65l32J85j34j06j8J57K0O3M0k45
8115a28J42J15m61M7L41j20j94K54j90N23J2o72O42j85m8m16J24L62j86k19J43
8136a14K20J12m07J86J30O0n31K39M93l84j67R1M52m28J17j42N7J68j57k56K58
$$ plain form
7979 -53 58 -97 -115 -111 -238 -152 -25 114 -228 -262 69 364 -290 -209 -237 -120 -47 -196 64 190 281 -277 -7
8002 -7 161 -210 -360 189 160 -167 -135 -208 181 115 -192 -68 497 147 -202 253 199 -120 -183 142 98 254 -188
8025 -188 171 191 320 -311 -34 -67 197 36 -261 -59 212 -296 -290 185 144 -204 -133 -56 154 -158 -174 179 101
8048 101 186 -127 -28 335 -93 -201 -3 245 -2 -309 -22 293 348 -292 -51 13 15 -104 620 -26 -57 22 11
8071 11 438 -5 315 132 120 52 -94 2 271 130 -354 193 23 292 -510 -217 203 -85 -296 -18 -65 157
8093 157 -29 -280 55 186 -457 -26 162 20 -209 -232 407 242 -90 95 -39 -145 -163 -6 14 77 117 -128
8115 -128 14 129 -332 -285 56 -64 -258 -4 -194 329 341 -331 311 126 78 -338 -214 148 -38 -257 -114
8136 -114 106 218 -189 -3 127 187 -344 -105 388 4 -163 -72 380 -48 69 -73 -16 152 -5 -261 -3
8157cN8k86kM10l29R4Q8K02k47q1k1J38L66n80l38Q02O5m64M3K93J22n34l0M74
8181B40L9l10O0J73l82o1M58l94L46j05
$$ plain form
8157 -3 55 -231 -233 177 -152 -58 30 232 -15 -96 -117 21 387 -193 -531 271 336 -128 -85 208 330 -204 -234 240
8181 240 279 -31 29 202 -180 -241 217 -177 169 64
8191F4
$$ Imaginary data points
##PAGE= N=2
##DATA TABLE= (X++(I..I)), XYDATA
0@%%%%%%%Qj6J6j6K4l2M0m8N6p2Q8j04J20j36J60j87K12k44K81l21L65m13M65
30B46n24N89o59P38q24R18j021J135j260J395j545J711j894K097k324K577k863
47a508L191l567M004m522N146n912O878q145R886j2432J6521k4131M2890j68694
61a40395k52042M50866J92514l05408j15018K93085K1923k57270J9064K34790
71A42109o4857j85372P7078J30557j12235q2991J15753M2277j21479n876J12244
82D7208p567p9246M0465N0978o6593l9541P5274K3468o3416J06N4256l2168o4589
95f1365L2817O0130k2235l4619J6869K694k6146K0188M0178k2697l9629K6498
107g317L9484j9375k2735K3855J4022k3104m406K4924K080j8006j062k5j4530
$$ plain form
0 0 0 0 0 0 0 0 0 8 -8 8 -8 16 -16 24 -24 32 -40 48 -56 64 -72 88 -99 113 -131 150 -171 194 -219 246
30 246 -278 311 -348 390 -434 484 -537 598 -662 733 -812 899 -995 1102 -1222 1355 -1508
47 -1508 1683 -1884 2120 -2402 2744 -3168 3710 -4435 5451 -6981 9540 -14591 28299 -140395
61 -140395 -392437 58429 250943 -54465 -169483 123602 145525 -111745 -92681 142109
71 142109 77252 -108120 -31042 99515 -12720 -95711 20042 62319 -59160 -65036 47208
82 47208 39641 -39605 860 51838 -14755 -54296 20978 44446 -18970 -18864 35392 3224 -61365
95 -61365 -28548 31582 9347 -25272 -8403 -5709 -31855 -11667 28511 5814 -33815 -7317
107 -7317 32167 12792 -9943 13912 27934 4830 424 25348 27428 9422 8360 8335 -6195
120f195O457K3117j5751l7125J0420L3489j7954l7009J9136L2812k2598k8608
132c9809K7356K2459l5519k1364M3729L1983l2617k9895K0837K0462j1840l245
144g463J5917k952j5813J1138J9759j7253k5942J8721L6246j0430l6509K796L1836
157B0051l350l1111J387K8060j399k4508M826K3543r950k5847J0450K7968m881
170A5239j7269R814J1969j5110j1322J4136Q778j0593m259L206p860o627M469
183e429o596j3624J0170J7385j5783k1411J4431J6484j4814l479K4432k97k3041
196b1572J4395L0010j9319k5688L2197K7928l6798k0477M3207J3720m8771q984
208b0152M9861M231m6538j44L6403r153l0252J4864K2188j6631j3075J3939l179
$$ plain form
120 -6195 262 23379 7628 -29497 -19077 14412 -3542 -40551 -21415 11397 -11201 -39809
132 -39809 -12453 10006 -25513 -46877 -3148 28835 -3782 -33677 -12840 7622 -4218 -7463
144 -7463 8454 5502 -10311 827 20586 3333 -22609 -3888 32358 21928 -14581 -11785 20051
157 20051 16701 -14410 -13023 15037 13638 -10870 -6044 17499 7549 -18298 -7848 20120 15239
170 15239 -2030 7784 19753 4643 -6679 7457 16235 5642 1383 4589 -3271 -9898 -5429
183 -5429 -12025 -25649 -15479 1906 -13877 -35288 -20857 -4373 -19187 -22666 1766 1469 -21572
196 -21572 -7177 22833 3514 -22174 10023 37951 1153 -19324 23883 37603 -11168 -20152
208 -20152 29709 33940 -12598 -12742 23661 14508 -15744 -880 21308 4677 -8398 5541 2362
221B362j8230Q645J5915j4152j0224J7229k003k7126N368L1744m524k3713J3716
234d993K2008j8394j6168K4405J5028k2468l785K8676J427l0264m130K1935k616
247A0661j8614P282J5737j2600j8514O156R041r706o091J3110R542o064q341J10
261h291L712L988K071J106K366M292m334j0339J634J1934j208j1434M284J4029
275A3810n297j7259K386J2806m638r609Q667J1258r393j1947N421Q758m159m338
289c534O877N850l368n647K32L219K925K10P41M118j51r651m010J1615N681j4308
305G99q681J2227M915j8109r049J5531M589j6779l790J4709n5j5158K302J4365
319b184j317q197N557Q825l904n213N359N425P58J478R74r30K167J316o825k037
$$ plain form
221 2362 -15868 -7223 8692 -5460 -15684 1545 -458 -27584 -22216 9528 5004 -18709 -4993
234 -4993 17015 -1379 -17547 6858 21886 -582 -4367 24309 25736 -4528 -8658 13277 10661
247 10661 -7953 -671 15066 2466 -16048 -9892 -851 -10557 -16648 -3538 6004 -60 -8401 -8291
261 -8291 -4579 -591 1480 2586 4952 9244 4910 -5429 -3795 8139 6931 -4503 -219 13810
275 13810 8513 -8746 -6360 6446 1808 -7801 866 12124 2731 -9216 -3795 4963 804 -3534
289 -3534 3343 9193 5825 178 410 3629 6554 6764 7505 11623 11472 1821 -2189 9426 15107 799
305 799 -7882 4345 9260 -8849 -17898 -2367 2222 -14557 -18347 -3638 -3693 -18851 -16549 -2184
319 -2184 -3501 -11698 -6141 2684 -1220 -6433 -1074 4351 5109 6587 7561 6631 8798 10114 3289 1252
335A252J2804N869j3296o190J1006N00j4860R79J4817n317j7179O173J3765j2696
349b373j8760J0523J6399j0020j2364J1497J0212j2056q340J1619R047n303r60
362h79P161P78n697r73L918J801L47j328k308R32K256o289q872O263J1506o781
378A835j2741Q123J2505r462j2867J1742J3805r944q955J2056N664j4767l607
391f613J8589K937j9248l710J7181K805j6119j626J2510j773j2181Q60R543o23
405B532q453k658L948L543K73k629k466K825J623l458J990J0165L20j2387o42
420e474J4144K607j1488L800J4948l088j6888J668J4943j621j3045J371P937o564
434C250q821L948N302o514q586K445P237J036m655n304J80M529P12l194L595Q114
$$ plain form
335 1252 14056 19925 6629 439 11445 11945 -2915 -1936 12881 7564 -9615 -3442 10323 -2373
349 -2373 -21133 -10610 5789 -4231 -16595 -5098 5114 -6942 -15282 -3663 5384 81 -879
362 -879 6282 7060 1363 390 4308 6109 6456 5128 2820 3752 6008 -281 -9153 -2890 8616 1835
378 1835 -10906 -2783 9722 260 -12607 -865 12940 2996 -5959 6097 11761 -3006 -6613
391 -6613 11976 14913 -4335 -8045 9136 11941 -4178 -5804 6706 4933 -7248 -6388 3155 2532
405 2532 -5921 -8579 -4631 -1088 -815 -3444 -5910 -3085 -1462 -4920 -2930 7235 7555 -4832 -5474
420 -5474 8670 11277 -211 3589 18537 15449 -1439 229 15172 13551 506 1877 9814 3250
434 3250 -5571 -1623 3679 -2835 -11421 -8976 -1739 -703 -5358 -10662 -10482 -5953 -5241 -8435 -4840 3274
450C274j806r173O46R267J923l518N019M965p194o350P578P662o339n833O060
465F181N928o231o651L515M559l634n597N47L241n07l924j802J951P67k828N76
481c909N576J910n856j630O788K045o038k69Q762L98r598j987Q546K95q094O17
497b444P711k930j0332R49R482r94p269K578N877l945o963N557R468j424p011
512a690q9O714J991l819k513K529L057l087l970M295M991n524q661M305Q104n904
528G29q397R119Q998j3657j4650J1066J4858p539j0382P411N409r204l858J0925
542H28N616o599o70N737o78m315M961O250k869m277R78K986K625O25o769o194
558a765N091O249q036p144Q144N068j3615q681J1997O190j1579k349J1314j593
$$ plain form
450 3274 1468 -7705 -7059 2208 4131 613 5632 10597 3403 -2947 4631 12293 5954 121 6181
465 6181 12109 5878 -773 2742 7301 3667 -1930 -1383 1858 1351 -2573 -4375 -2424 -1657 -4485 -3909
481 -3909 1667 3577 -2279 -3909 2879 4924 -1114 -1383 7379 7777 -1821 -3808 4738 5033 -3061 -2444
497 -2444 5267 2337 -7995 -7046 2436 1442 -5827 -3249 2628 -1317 -8280 -2723 6745 5321 -1690
512 -1690 -1779 4935 6926 3107 594 3123 6180 3093 -877 3418 8409 2885 -5776 -1471 6633 729
528 729 -7668 1451 10449 -3208 -17858 -6792 8066 527 -9855 -2444 2965 -6239 -10097 828
542 828 6444 -155 -825 4912 4234 -81 4880 11130 8261 3984 4962 7948 10573 11198 4429 -1765
558 -1765 3326 9575 1539 -5605 2539 7607 -6008 -14689 -2692 3498 -8081 -10430 884 -709
572g09j4266K986J5134k300j1692M618J0381m592p583O131Q014m002m009L386
586A497K558k99Kr73r64K487K764m694k785N345N91p965L92Q941k441j0594L990
603b148J0500n889j1634P565J2114o710j0287P507P967q901o783R637N881p875
617I44n221M519J298n925j457M659K071l373m385j794L453M209k493m427L644
632d278O547l470o487O553P098o304n247Q854O162q284l851J0754J579j2246j142
647c762J4345K250j2559j988Q872j053r294J682Q077j281q495j641L292J312k034
662b277k451J23L163lm988l04Q314J155r104l11J2172K339j2321O29J3690j366
678H460j3954L204J4437k667j3772J747R335k541q184L046M271m155m172K289
$$ plain form
572 -709 -14975 -11989 3145 845 -10847 -6229 4152 -440 -8023 -1892 6122 2120 -1889 1497
586 1497 4055 3756 3758 2785 1821 4308 7072 2378 -407 4938 5529 -2436 -2044 6897 4456 -6138 -2148
603 -2148 8352 2463 -9171 -1606 10508 3798 -6489 1018 8985 84 -6699 2938 8819 944
617 944 -4277 242 1540 -4385 -5842 -1183 888 -2485 -6870 -8664 -5211 -1002 -3495 -7922 -4278
632 -4278 2269 -1201 -7688 -1135 5963 -341 -5588 3266 9428 1144 -2707 8047 9626 -2620 -3762
647 -3762 10583 12833 274 -1714 7158 6105 -3189 -1507 6570 5289 -3206 -4847 -1555 -243 -2277
662 -2277 -4728 -4605 -1442 -1445 -6433 -6737 1577 2732 -6372 -6683 5489 7828 -4493 -3864 9826 8460
678 8460 -5494 -2290 12147 9480 -4292 -2545 6790 4249 -3935 -889 3382 -773 -4945 -2656
692b656J145k043k45Q49q38l01M15j224J192K790j093l909L637O283l808o748
708f554P297P178o776o619R030P385r477o987R316N567q444m115P885K128q085
723a271j984N839J379m396j013L305N93k161r15M82K199Q87k012n70L041R05m740
740d32k083M731J527o124j221N458j664p828J571O196k357o976L394O861m470
755c417o423M693N998l456m166M533N313l237l013K974M338m95k217M33L842J853
771G553l387k781L423M710l748n266M495N360o855p054O214N909q251o957O539
786i6M714q735m469P056K564p207k017O902J355n705K86N039J324l107J25K907
802I36J808j750j878J031L988M28n287r86N552J560p721j413Q613J497j0084k091
$$ plain form
692 -2656 -1511 -3554 -3799 -2950 -3788 -4089 -3674 -4898 -3706 -916 -2009 -5918 -2281 4002 194 -6554
708 -6554 743 7921 1145 -5474 3556 10941 1464 -5523 3793 9360 916 -3199 4686 6814 -1271
723 -1271 -3255 2584 3963 -433 -1446 1859 2452 291 -624 -142 2057 2944 932 362 3403 4308 -432
740 -432 -2515 2216 3743 -2381 -3602 1856 192 -7636 -6065 131 -2226 -9202 -5808 1053 -3417
755 -3417 -9840 -5147 851 -2605 -6771 -2238 3075 -162 -3175 -201 4137 3642 1425 1858 5700 7553
771 7553 4166 1385 4808 9518 5770 504 4999 10359 3504 -3550 2664 8573 322 -6635 -96
786 -96 4618 -4117 -8586 -1530 1034 -6173 -8190 -1288 67 -5638 -5352 -313 1011 -2096 -1971 936
802 936 2744 994 -884 147 4135 4563 -724 -1710 3842 5402 -2319 -3732 4881 6378 -3706 -5797
818e797J0324J562j0121q64R570K81q615R78Q052j502o921K123O433j760n334
833a591K036M649j867m044K95L544J036k844k740J659K951j985m608J317N334
848C142j701n855J963N735l418n165M278P031n275n941N860O826n939o236O619
863A924O364o657o069N902O153o018o361L491N171l114n658K751L944j968m824
878d969l83M783J864m040k574L715K208l632j066N786K221o036k581P268M183
893F747o177k089P494J715p010j032Q136J798p688j133N318O5n492J64L817j039
909C594m777j484K048J796j255k749j214J888M65k240K44M226m38n844Q80P473
925B613l26o295J752P509k636p926L146Q880k312p453J332O318j589m594K736
$$ plain form
818 -5797 4527 6089 -4032 -4896 4674 4955 -3660 -2682 5370 3868 -3053 -930 5503 3743 -1591
833 -1591 445 5094 3227 -817 -522 3022 4058 1214 -1526 133 3084 1099 -3509 -2192 3142
848 3142 1441 -4414 -2451 3284 -134 -5299 -1021 6010 735 -5206 654 7480 1541 -4695 1924
863 1924 8288 1631 -4438 1464 7617 1599 -4762 -1271 3900 786 -4872 -2121 1823 -145 -4969
878 -4969 -5352 -569 1295 -2745 -5319 -1604 604 -3028 -4094 1692 3913 -2123 -4704 2564 6747
893 6747 570 -1519 5975 7690 680 -352 7784 9582 1894 761 6079 6144 652 816 4633 3594
909 3594 -1183 -2667 -619 1177 -78 -2827 -4041 -2153 -1688 -3928 -3684 542 104 -5740 -4860 2613
925 2613 2287 -4008 -2256 5253 2617 -5309 -2163 6717 4405 -3048 -1716 4602 3013 -1581 1155
940A155L239k577l557K307L767j030k927n4K651N08l714o03M188K376m637l324
956b232M184L384m507l794N217L020o025l850N699L383o162l351M986K345n600
971c303j955M750J516m941j548M770J726m389j029M252K460l226j964L195L387
986C701k196k335L156L037j842m134K516L878j434m077J045L484j526m476Q63
1001c40M690j919n436L89M534j362m466J257L862k087m734K678N364j359n489
1016d418J078N132K81l983P73M440M52m502j472N089K945l595l627K870K523l343
1032F43k562M230K470n784l393N369L195n590l095N274K285o081k458O187L072
1047C762n492l265M244L043k481j929K100J788k494j276J468K950j60l738l50
$$ plain form
940 1155 4394 1817 -1740 567 4334 3304 377 323 2974 3482 -232 -835 3353 5729 1092 -2232
956 -2232 1952 5336 829 -2965 2252 5272 -753 -4603 1096 4479 -1683 -5034 -48 2297 -3303
971 -3303 -5258 -508 1008 -3933 -5481 -711 1015 -3374 -4403 -151 2309 -917 -2881 314 3701
986 3701 1505 -830 2326 5363 3521 -613 1903 5781 4347 270 1315 4799 3273 -1203 -340
1001 -340 4350 2431 -3005 -2616 1918 556 -3910 -2653 1209 -878 -5612 -2934 2430 1071 -4418
1016 -4418 -3340 1792 2073 -1910 -1137 3303 3755 -747 -2219 2870 5815 2220 -1407 1463 3986 643
1032 643 -1919 2311 4781 -1003 -4396 973 4168 -1422 -4517 757 3042 -3039 -5497 690 3762
1047 3762 -1730 -4995 -751 2292 -189 -2118 -18 1770 -724 -2000 -532 2418 2258 -1480 -1830
1062a830L806M84m267n22N140L33o318j78O673j07o878Q62P206o83p091J203O579
1079D412j316n760J856N177j816m572J221M002n68l722k65K377L33l009p76J859
1095e67J573l335k492K821L728l019l657K959L255l237l181M805M536m132m454
1110d397M347M594l264l105M692L464m671l696M883M080l655l829L039K499k882
1125B099l644K435L508l472m770J608M617j126n410Q0L785m4m504j34N344R58
1141A330n081j855N639J870n080j189N967J662n829j857O408K318o098j741O149
1156B613J721n541j419N016J344m385j726M311J371l247j663K225K282k583k308
1171a989J698L101j614l516J662M023j463m902J463N277j619n756J756N203j803
$$ plain form
1062 -1830 1976 2460 -1807 -2329 2811 3144 -3174 -3352 3321 3214 -3664 -2802 4404 3721 -3370 -2167 4412
1079 4412 3096 -2664 -808 4369 2553 -2019 -798 3204 2636 -1086 -1351 1026 1359 -1650 -2426 -567
1095 -567 1006 -2329 -4821 -2000 1728 -1291 -4948 -1989 1266 -1971 -5152 -347 4189 57 -4397
1110 -4397 -50 4544 1280 -1825 2867 6331 1660 -2036 2847 6927 3272 -557 2482 4981 2099
1125 2099 -1545 890 4398 926 -3844 -2236 2381 1255 -4155 -4075 -290 -334 -4838 -4972 372 1330
1141 1330 -3751 -5606 33 1903 -3177 -4366 1601 3263 -2566 -4423 1985 4303 -1795 -3536 2613
1156 2613 4334 -1207 -2626 2390 3734 -651 -2377 1934 3305 58 -1605 620 2902 319 -1989
1171 -1989 -291 2810 1196 -2320 -658 3365 1902 -3000 -1537 3740 2121 -3635 -1879 3324 1521
1186A521n334J757M553k603n009K384M733k710m063K573L446k105k811K072L147
1201A551q81j978P56K102K11j621j94K412Q45k353j341K711J381l325k115L213
1217A374K331l860k617L416K500m412k795M245K433m250j959L724J353l558j554
1232c629L785J016l722l25L783P84l326q25L061J625k073j300K154J927j530k754
1248a349J564K725j210l035O77L207j052m345M21M258j077m834O98M751p73n042
1264d416J216M782p41m364O08M361l52l849N86L564J82l192j66L159L86k722o06
1281a564L054J111k565j303K737J343l026j684L489K707l806l191L591K234l483
1296c56j824L622K003m081j689L109J601l608j176L801J602m533k263L931K226
$$ plain form
1186 1521 -3813 -2056 2497 -106 -5115 -2731 2002 -708 -4771 -2198 1248 -857 -3668 -1596 1551
1201 1551 670 -1308 -552 1550 1761 140 -54 2358 3203 850 -491 2220 3601 276 -1839 1374
1217 1374 3705 -155 -2772 644 3144 -1268 -4063 182 2615 -1635 -3594 130 1483 -2075 -3629
1232 -3629 156 1172 -2550 -2875 908 1692 -1634 -2459 602 2227 154 -1146 1008 2935 1405 -1349
1248 -1349 215 2940 1730 -1305 -628 2579 1527 -2818 -2397 1861 784 -4050 -3352 1399 626 -4416
1264 -4416 -3200 1582 841 -3523 -2915 1446 1094 -2755 -2169 1395 1577 -1615 -1781 1378 1764 -958 -1564
1281 -1564 1490 2601 36 -1267 1470 2813 -213 -1897 1592 4299 493 -2698 893 3127 -356
1296 -356 -2180 1442 3445 -636 -2325 784 2385 -1223 -2399 1402 3004 -1529 -3792 139 2365
1311B365l209l902K719L561j948m117R52L731j088l540Q33M419m62l483Q09L645
1327A285r48l122J635M727q34m307P97M034k3m115P79L674l50l682RL197m44k939
1345f27k40K760K29k778m31K458J33l610m51L138K39l524j499L572J560m037j631
1362d739L713K543l686k203L250L182k912k500K943L002k254k685K318L060k347
1377F85k806K469K725k292l526K001L023j282l253J311K815r32k901J034L016
1392B087p20k799Q17L014j186l793J383L718j044m466Q91M533n47m698q41M578
1408I27N71l710k55L816N0l940l79L640Q77l480n16K982O67l097j469L278K571
1425B533l675k232L282L432l132l597K917L720k892l266K809L147k785l619K400
$$ plain form
1311 2365 -844 -4746 -2027 1534 -414 -4531 -3579 152 -936 -4476 -3643 776 314 -3169 -2360 1285
1327 1285 337 -2785 -1150 3577 2743 -1564 -767 3267 3244 -871 -92 3582 3232 -450 -441 2756 2312 -627
1345 -627 -867 1893 2122 -656 -1087 1371 1504 -2106 -2557 581 820 -2704 -4203 -631 929 -3108 -4739
1362 -4739 -1026 1517 -2169 -4372 -1122 2060 -852 -3352 -409 2593 339 -2346 -28 3032 685
1377 685 -2121 348 3073 781 -2745 -744 2279 997 -2256 -945 1870 938 -1963 -929 2087
1392 2087 1367 -1432 -615 2399 1213 -2580 -1197 2521 1477 -2989 -2098 2435 1888 -2810 -3651 927
1408 927 1498 -2212 -2467 1349 1399 -2541 -2920 720 1597 -1883 -2399 583 1250 -1847 -3316 -38 2533
1425 2533 -1142 -3374 -92 3340 208 -3389 -472 3248 356 -2910 -101 3046 261 -3358 -958
1440i58K862k372k726J893K284j924k373K014K649j802k601K021L107j417l051
1455b394J509L590o87l659O32M039o28m241K35M375N72m154m66L724m76l403M
1472a428M661k95m516j111L828N25l416j118L233N21l579j213L117J740l573k269
1488d893L256L358k897k511K967K632l523k366M052L772l020l418K286K354j778
1503B71k291K449K592k801k559K092L124k036l075J554L317o42l382R82L544j049
1519B090l887K21L743N12l276j042K532Q4l742l22L786Q33l881j228L182J018
1535F23k972r00L128J068l232j077L308J190k984j030L175J191k964j033L196
1550F87J182k636j130L181J074k266o78J972J516j547j894J755J662j413k330
$$ plain form
1440 -958 1904 -468 -3194 -1301 983 -941 -3314 -1300 1349 -453 -3054 -1033 2074 657 -2394
1455 -2394 -885 2705 2018 -1641 -1009 3030 2402 -1839 -1604 2771 3343 -811 -1277 2447 1971 -1432 -1428
1472 -1428 3233 2938 -1578 -2689 1139 1664 -1752 -2870 363 884 -2695 -3908 -791 949 -2624 -4893
1488 -4893 -1637 1721 -1176 -3687 -720 1912 -1611 -3977 75 3847 827 -2591 -305 2049 271
1503 271 -2020 429 3021 220 -2339 -247 2877 841 -2234 -680 2637 1995 -1387 -405 3139 2090
1519 2090 -1797 -1576 2167 2679 -597 -1639 893 977 -2765 -3087 699 1532 -2349 -3577 -395 623
1535 623 -2349 -3249 -121 947 -2285 -3362 -54 1136 -1848 -2878 297 1488 -1476 -2509 687
1550 687 1869 -767 -1897 1284 2358 92 -586 1386 2902 1355 -539 1216 2878 1465 -865
1565h65Q29K366j426k855J007K733j055l322P54K777q00l044J618L371j858l245
1581c015J538K822j052l024J520L034j506k653M55K727l46k262L63K845n74k473
1597a601L84K607M83l451j06L199O74l232j261L116R19l312r46L530Q57l155j775
1614c070K706K254l187j024L613J020k833j626K567J809k277j793K639J679k732
1629b55k041J850K692k308k373J680K883j453k997J521L085j598k549J233L271
1644B641j250k855N32K931j134k898P43K998j113k904L24K920n61k899L34K836
1660F45l06k606o7L276K01k733k84K832R2k839j35K671J213l012j095K835J354
1677B042k517j439K827J873k061j580K026J860k501j303J882J644k064j398J490
$$ plain form
1565 -865 -36 2330 904 -1951 -944 1789 734 -2588 -1834 943 143 -2901 -1283 2088 230 -3015
1581 -3015 -1477 1345 293 -2731 -1211 1823 317 -2336 -1881 846 500 -1762 -1399 1446 872 -1601
1597 -1601 -1217 1390 1873 -1578 -1684 1515 2189 -1043 -2304 812 1731 -1581 -2527 1003 1860 -1295 -3070
1614 -3070 -364 1890 -1297 -2321 1292 2312 -521 -2147 420 2229 -48 -1841 798 2477 -255
1629 -255 -2296 -446 2246 -62 -2435 -755 2128 675 -2322 -801 2284 686 -1863 -630 2641
1644 2641 1391 -1464 -932 1999 865 -2033 -1290 1708 595 -2309 -1985 935 374 -2525 -2191 645
1660 645 339 -2267 -2334 942 1143 -1590 -1874 958 1050 -1789 -1924 747 1960 -1052 -2147 688 2042
1677 2042 -475 -1914 913 2786 725 -855 1171 3031 530 -773 1109 2753 689 -709 781
1692G81J225k075k221K118J517j747j624J004J488j452j965J727J856j155j895
1707b418Q86K078j207k620J121K739q14k549J176K817j157k439J200K971m41k761
1723a418R15K544o47k422L19K899l18k666K03K512j2k955r2K864L81k591j135
1740a619K977J504l112j389K592J976k886j729K608J384l087j966K689J674k625
1755a009k023K351J802k929j622L114J659j732k387K322J927j635j728J656K679
1770B445j747k574R67K203l75k383O92K510o12l229M81L629p70l155L29L926j58
1787B179l425J06L200m80l547M64L343J98l806m72K814L96k842L13K477M42k500
1804a140q44K561P76j951q59K034J829k152j411J573J136j940j428K081J735k160
$$ plain form
1692 781 2006 -69 -2290 -172 1345 -402 -2026 -1022 466 -986 -2951 -1224 632 -523 -2418
1707 -2418 -1532 546 -661 -3281 -2160 579 -235 -2784 -1608 1209 52 -2387 -1187 1784 1343 -1418
1723 -1418 -503 2041 1394 -1028 -709 2190 1872 -794 -591 1921 1909 -1046 -1138 1726 2107 -484 -1619
1740 -1619 1358 2862 -250 -1639 953 2929 43 -1686 922 2306 -781 -2747 -58 1616 -1009
1755 -1009 -3032 -681 1121 -1808 -3430 -316 1343 -389 -2776 -454 1473 -162 -1890 -234 2445
1770 2445 698 -1876 -909 1294 919 -1464 -772 1738 1126 -2103 -1622 2007 1237 -1918 -1589 2337 2179
1787 2179 -1246 -1140 2060 1580 -1967 -1503 1840 2038 -1768 -2240 574 970 -1872 -1559 918 1360 -1140
1804 -1140 -1984 577 1353 -598 -1457 577 2406 254 -1157 416 1552 -388 -1816 265 2000 -160
1820a60j972J928J928k589k034K695K386k429k472K305K558k487k369K352K398
1835B038j847k741J553L107j764k335J466K606j356k351J086K680p50k666P19
1850e55K885m70l282K02L363L37l292o31L457M58l713p13L574O78k810j128L017
1867A377O74k664j145K563O56k601r76K525R10k681j713K381J771k266j504J847
1883h46J834k082j759K097K397j691k198K070K399k120k244J890K471j439k297
1898a518J367K683j719k476J142K639r10k083R70K687r14l017R52K639k80k672
1914e10N2K433m71k774j31K281K48k816r8J993K91k459m18K570P44k309p01K489
1932D14J172k504j231K553J516k689r12K031J745l101j078K808J185k495j054
$$ plain form
1820 -160 -2132 -204 1724 -865 -2899 -204 2182 -247 -2719 -414 2144 -343 -2712 -360 2038
1835 2038 191 -2550 -997 2110 346 -1989 -523 2083 727 -1624 -538 2142 1392 -1274 -555
1850 -555 2330 1860 -1422 -1220 2143 2480 -812 -1443 2014 2472 -1241 -1954 1620 2298 -512 -1640 1377
1867 1377 2051 -613 -1758 805 1461 -1140 -2116 409 1319 -1362 -3075 -694 1077 -1189 -2693 -846
1883 -846 988 -1094 -2853 -756 1641 -50 -2248 -178 2221 101 -2143 -253 2218 779 -1518
1898 -1518 -151 2532 813 -1663 -521 2118 1208 -875 95 2782 1868 -1149 -197 2442 2162 -510
1914 -510 -458 1975 1504 -1270 -1401 880 1128 -1688 -1786 207 498 -1961 -2379 191 935 -1374 -2075 414
1932 414 1586 -918 -2149 404 1920 -769 -1681 350 2095 -1006 -2084 724 1909 -586 -1640
1947a640K032J683k202j076K319Q99j363j742J916J519j398j928J441J963j193
1962A230k470Q26K161q78k945J262K761p67k974N11K933j359k270J404K536p58
1978A203k976N71K610m88k475K15K574j66k145k18J958K88j822p73J889J232j912
1995d35j103K286O35k194j064K331J540k168j996K891Q77k182j523K546K291l061
2011c29j241K101J558k134j000J884J245j574j718J669J169j137j639J163J567
2026A584q54j800J143J574l87k078L47K764m89k608M71K284m70k505j15K202Q4
2043A147k902P9K330l7k960K09L232k90k832J33K948j74k114M59K080j89k047
2060i28k00K292l17j375m67J627L96j405m77R58J120j141j185J937J270j298j938
$$ plain form
1947 -1640 392 2075 -127 -1203 1116 2015 652 -1090 826 2345 947 -981 460 2423 1230
1962 1230 -1240 -414 1747 869 -2076 -814 1947 1180 -1794 -1283 1650 291 -1979 -575 1961 1203
1978 1203 -1773 -1202 1408 920 -1555 -1340 1234 1068 -1077 -1295 663 951 -871 -1644 245 1477 -435
1995 -435 -1538 748 1383 -811 -1875 456 1996 -172 -2168 723 1600 -582 -2105 441 2732 -329
2011 -329 -1570 531 2089 -45 -1045 839 2084 510 -1208 461 1630 493 -1146 17 1584
2026 1584 730 -1070 73 1647 1260 -818 -471 2293 1804 -804 -333 1951 1481 -1024 -1139 1063 1147
2043 1147 -1755 -1676 654 617 -2343 -2134 1098 808 -2024 -1891 1057 883 -1231 -772 1308 1119 -928
2060 -928 -1128 1164 847 -528 -995 632 1028 -377 -854 104 1224 83 -1102 835 2105 807 -1131
2077a131J664J927j596k168K386J859k339k284J917J969j852k197K219J514k281
2092c93k069K282J564j722j465J383J904j271j991O94J873n87j642M66K002m77
2108E51k279k57K717M02k518k25K940O30l038m40L154L54k845m06L001M86k781
2125e54n90K944N65k702n47K194O42k008j038K206O72j783q85J612J163j718j582
2142a409J515J428j657j687J623J530j418k298J783K225j566k099J334K237j297
2157B44k301J715K281j315k162J085J913j240k135J319K097j032k029O64J809
2172I13n97j810O99J992o1j768j77K481j72k274j33K660K84k470m92K074N81k786
2190a056l84K650N54k596p45K982N23k860m22K880J092l005n09K327P21k625q64
$$ plain form
2077 -1131 533 2460 864 -1304 1082 2941 602 -1682 235 2204 352 -1845 374 1888 -393
2092 -393 -2462 -180 1384 -338 -1803 -420 1484 213 -1778 -1084 789 202 -1440 -974 1028 551
2108 551 -1728 -1985 732 1134 -1384 -1609 1331 1961 -1077 -1517 1637 1991 -854 -1260 1741 2227 -554
2125 -554 -1144 1800 2365 -337 -884 1310 1952 -56 -1094 1112 1784 1 -884 728 1891 173 -1409
2142 -1409 106 1534 -123 -1810 -187 1343 -75 -2373 -590 1635 69 -2030 -696 1541 244
2157 244 -2057 -342 1939 624 -1538 -453 1460 220 -1915 -596 1501 469 -1560 -896 913
2172 913 316 -1494 -795 1197 1136 -632 -809 1672 1500 -774 -907 1753 2037 -433 -925 1149 1730 -1056
2190 -1056 -1440 1210 1764 -832 -1577 1405 1928 -932 -1354 1526 2618 -387 -896 1431 2152 -473 -1337
2207a337J868J227j749j815K247Q34j584j692J134K522j262k285J278K469j253
2222F02k563J108K954j127k768J128K512j145k548R19K533r62k496P11K502n98
2238G62j992R1K342J79k152l34K649J81k017l93J679P56j840q68K191Q31k505
2255d40j137K563Q65k429j136K409J146k510r85K130R96k493j071K250J002k024
2271h64j099K139J052j757j088R58J347q52j073J215J012m88j626O77J802p04
2287F51j389K64K251p99k030N86K138p39j997N91K833p83k538N29K484l89k482
2304h19O24K596q78k155O34J601p00j801K94J908q10j825N6J706Q2j259m88J571
2322C37N88j514j053J917J138j595j582J931J763k370j846K108J610j858j841
$$ plain form
2207 -1337 531 1758 9 -1806 441 1275 -309 -2001 -867 1655 393 -1892 -614 1855 602
2222 602 -1961 -853 2101 974 -1794 -666 1846 701 -1847 -928 1605 643 -1853 -1142 1360 762
2238 762 -1230 -1139 1203 1382 -770 -1104 1545 1726 -291 -684 995 1751 -89 -957 1234 2065 -440
2255 -440 -1577 986 1851 -578 -1714 695 1841 -669 -1654 476 1472 -1021 -2092 158 1160 -864
2271 -864 -1963 176 1228 -529 -1617 -659 688 -164 -1237 -22 990 502 -1124 -447 1355 651
2287 651 -738 -474 1777 978 -1052 -466 1672 933 -1064 -473 2360 1577 -961 -432 2052 1663 -819
2304 -819 -195 2401 1523 -632 2 1603 903 -898 -604 1304 494 -1331 -1275 431 513 -746 -1234 337
2322 337 925 -589 -1642 275 1413 -182 -1764 167 1930 -440 -2286 -178 1432 -426 -2267
2337b267K299J576j929j652K456R91j635j194K043J225j805j154J478J242q97
2352G77j439J227J014j226j453N26K087k99k053k40K539k79k249KK777N0k477
2369g16k42K332k60k249p8K746k23k249j76K678o02k219l30J960M54j569o78K196
2387G75K92j821m83J733J107j995p19J336J284j722j186J291J328j031j294J079
2403b6J591j383j415J445J531j390j510J605J647j639j457J082J920j434j813
2418a246J333J832j376j420R86J553j060j629N64J761n15j716K08J820O7k363
2434a201K44J709Q8k265J68K092kk309p2K195j34j776k58K446K64k216o05K275
2452F43L68j902l97K121K68j420q97J797Q64j755p85J729J095j262j352J311J801
$$ plain form
2337 -2267 32 1608 -321 -1973 483 1474 -161 -1355 688 1913 108 -1046 432 1674 777
2352 777 -662 565 1579 353 -1100 -574 1513 1214 -839 -1079 1460 1181 -1068 -1066 1711 1761 -716
2369 -716 -958 1374 1114 -1135 -1213 1533 1310 -939 -1115 1563 961 -1258 -1588 372 826 -743 -1421 775
2387 775 1067 -754 -1237 496 1603 -392 -1111 225 1509 -213 -1399 -108 1220 189 -1105 -26
2403 -26 1565 182 -1233 212 1743 353 -1157 448 2095 456 -1001 81 2001 567 -1246
2418 -1246 87 1919 543 -877 109 1662 602 -1027 -463 1298 783 -933 -725 1095 1162 -1201
2434 -1201 -957 752 840 -1425 -1257 835 833 -1476 -1548 647 513 -1263 -1521 925 1189 -1027 -1632 643
2452 643 1011 -891 -1288 833 1101 -319 -1216 581 1445 -310 -1095 634 1729 467 -885 426 2227
2469B227j813j500J362K205j765j946J674J643j742j616J260J955j375j897R16
2484d12J871j400j535R95K050j255j616O03J794o90j667K58J760j59j645j77J823
2501E98J4j775l72J887N01k114k55K225L25j916l43K281M78k297l27K314L41j832
2519b67m38J661M21j642p21J938N72j561p17J350Q67j551o56J233J121j549j200
2536a139J288J309j176j274J050J493j130j799J112J491j061j930J103J971q15
2551D93k308J506J679q54k243J064K209j084j974Q43K175r36j958P10J833m49
2567G06j808O22J343j99j286j02J390R6j060k21J648N69j987n61J497Q87j379
2584A55j085J888J007k168r24K012O98j570j231J909R51j613j667K358R68k018
$$ plain form
2469 2227 414 -1086 276 2481 716 -1230 444 2087 345 -1271 -11 1944 569 -1328 -412
2484 -412 1459 59 -1476 -481 1569 314 -1302 -699 1095 405 -1262 -1004 756 597 -1048 -1225 598
2501 598 612 -1163 -1535 352 853 -1261 -1516 709 1034 -882 -1225 1056 1534 -763 -1090 1224 1565 -267
2519 -267 -705 956 1377 -265 -986 952 1524 -37 -754 596 1463 -88 -744 489 1610 61 -1139
2536 -1139 149 1458 282 -992 58 1551 421 -1378 -266 1225 164 -1766 -663 1308 493
2551 493 -1815 -309 1370 516 -1727 -663 1546 462 -1512 -669 1506 570 -1388 -678 1155 706
2567 706 -1102 -480 863 664 -622 -724 666 762 -298 -519 1129 1698 -289 -850 647 1534 155
2584 155 -930 958 1965 -203 -1127 885 1583 13 -1218 691 1642 29 -1638 720 1688 -330
2600c30r11J379J232j603r08P50J286j068j303R90J182l79j686N67J542l06j767
2617a333M22J833j59j820J78K134m44j748l67K166J41k327N50J744Q1k039L98
2634e90J486Q7j606O9J661J27j663O5J295m7j079l41J120Q05j591o46J552O20
2652A324j742p35J293J067j093j424J569J146j578j361J883R44j691j152J261
2667b89J441j297j344J395J278j340q36O37J636j358j164R53J136l71j227L61
2683c89J690o55j253M39J132O8j500J18J468j21j690Q8J986j01j953K58J617o7
2701A135j877O8K190k69k051l7J726J75k139L7J683J72j557j87J106O98j407m38
2719i72J071O44j259j069J475J332j616j241J293J320j006j749J444J425p67j765
$$ plain form
2600 -330 -1241 138 1370 -233 -1141 -391 895 -173 -1476 -486 696 317 -1369 -802 740 434 -1333
2617 -1333 -911 922 763 -1057 -879 1255 811 -937 -1304 862 1003 -1324 -774 970 1051 -988 -590
2634 -590 896 983 -623 -554 1107 1234 -429 -364 931 884 -195 -536 584 1389 -202 -848 704 1324
2652 1324 -418 -1153 140 1207 114 -1310 259 1405 -173 -1534 349 1293 -398 -1550 -289
2667 -289 1152 -145 -1489 -94 1184 -156 -992 -355 1281 -77 -1241 -288 848 477 -750 -389
2683 -389 1301 646 -607 -168 964 1032 -468 -350 1118 997 -693 -605 1381 1280 -673 -415 1202 1135
2701 1135 -742 -674 1516 1247 -804 -841 885 1060 -1079 -1042 641 813 -744 -931 175 873 -534 -972
2719 -972 99 743 -516 -1585 -110 1222 -394 -1635 -342 978 -28 -1777 -333 1092 325 -1440
2735a440J495J338j226j223N64J754r38j292J004J232p26j431P56J262m93j381
2751g45M84J660p35j102K51J434m6j839J66J785q5j805l45J742K07j765k18J852
2769H96J32k163q6J871J23j458k67J367L54j344m34J412J28j280n11J323O70j341
2787f08n79J342Q00j591r46J280J245q02j728J820J022r71j657J238J088n20j817
2804a384J407J509j041j828J082J744j118j288R25J716j193j213M51J893j079
2819E83j911Q30J681l33j719J26J347j51j380j04J447J36j523m58J946M40k107
2836a150k51J499J018j937p52J812J101k439l74J930N88j751q97K249L10j236
2852b80p82J712P47j503q59J237J096j342n56O45J050n56j296Q44J001o25j515
$$ plain form
2735 -1440 55 1393 167 -1056 -492 1262 324 -968 36 1268 542 -889 -133 1129 636 -745
2751 -745 -261 1399 664 -438 -187 1247 1201 -638 -472 1313 1228 -577 -922 820 1027 -738 -956 896
2769 896 1028 -1135 -1221 650 773 -685 -952 415 769 -575 -1009 403 531 -749 -1260 63 733 -608
2787 -608 -1187 155 955 -636 -1582 -302 943 141 -1587 233 1255 284 -1373 -135 953 433 -1384
2804 -1384 23 1532 491 -1337 -255 1489 371 -917 8 1724 531 -682 -231 1662 583
2819 583 -1328 -498 1183 850 -869 -743 604 453 -927 -1031 416 552 -971 -1429 517 957 -1150
2836 -1150 -1401 98 1116 -821 -1573 239 1340 -1099 -1473 457 1045 -706 -1603 646 956 -280
2852 -280 -1062 650 1397 -106 -965 272 1368 26 -530 115 1165 609 -687 157 1158 533 -982
2869i82Q68J505o55j601N67J667p21j672Q7K069n51j633P45J110m63j466J36J964
2887I74o37j515O32J060J3j584k2J488j69j249q2J453J31j444K21J350K77j551
2905f54l82R76R08j512l21J318Q12j354j153J674J131j555j154J928Q42j473j098
2922a067J718Q72j316j471J597J099j444j144J311J330j170j263J020Q72l46j700
2938a102Q83R95m01j513L13J435lj860J99J996p02j604J00J985k72j799R9J829
2956E78N9k050N93J560j62j384j20J653R8j368m11J853K63j643m10J519M98j236
2974a10p68J328Q66j437q93J168J136j348r48J030J140j058r02R49J034j306j190
2991a309J129J332j210j183J010J211q70j028M42J391p59j291O16J045m87j066
$$ plain form
2869 -982 -114 1391 736 -865 -298 1369 648 -1024 -937 1132 581 -1052 -307 803 340 -1126 -990 974
2887 974 337 -1178 -546 514 527 -1057 -1079 409 240 -1009 -1091 362 493 -951 -730 620 897 -654
2905 -654 -1036 -60 848 -664 -985 333 1145 -209 -1362 312 1443 -112 -1266 662 1504 31 -1067
2922 -1067 651 1523 207 -1264 333 1432 -12 -1156 155 1485 315 -948 72 944 598 -1102
2938 -1102 -219 776 375 -1138 -825 610 607 -1253 -1054 942 240 -1364 -1264 721 449 -1350 -1251 578
2956 578 637 -1413 -820 740 578 -806 -926 727 825 -543 -954 899 1162 -481 -891 628 1126 -110
2974 -110 -878 450 1316 -121 -1014 154 1290 -58 -1006 24 1164 106 -796 153 1187 -119 -1309
2991 -1309 -180 1152 -58 -1241 -231 980 110 -918 -476 915 156 -1135 -519 526 39 -1027
3007a027Q0J541o77q17K25J132p1j387n5J756j70j542J09J724r0j509J43J366
3025G31K50j635m7J484J60j497j65J517K80j093l63R78M52j138n52J258L09j068
3043a39o97J372N61j319p76R67J043j277r33J146R98q18j565J088J296j238j068
3060a359J164J134j169j130J014J180j131r12R50R09r31j087R49J052p03r67O13
3077d24J239o20r62K9J429L3j114j16J148K06j434l57J707N83j876k01J672K5
3095I67j458l43J612M73j665n44K115m9j801n7J206N12j513k75R64N18r53j103
3113a394J469L63q85l47N66J053j081r42J045R42q96n64K08J348o95j715R09J593
3131I77o64j874J107J529q95j072O46J343p89j239O99J314l76j553R88Q06l87
$$ plain form
3007 -1027 -947 594 -83 -900 -675 457 386 -1001 -1056 700 530 -1012 -903 821 731 -778 -635 731
3025 731 981 -654 -701 783 943 -554 -719 798 1078 -15 -378 600 1052 -86 -638 620 929 -139
3043 -139 -836 536 1097 -222 -998 -31 1012 -265 -1198 -52 946 128 -1437 -349 947 -291 -1359
3060 -1359 -195 939 -230 -1360 -346 834 -297 -1209 -259 650 -281 -1368 -419 633 -70 -1037 -424
3077 -424 815 195 -767 -738 691 724 -390 -506 642 848 -586 -943 764 1347 -529 -730 942 967
3095 967 -491 -834 778 1251 -414 -958 1157 1108 -693 -750 456 968 -545 -820 144 662 -291 -1394
3113 -1394 75 438 -447 -794 -228 825 -256 -1198 -153 789 -107 -671 -463 885 190 -1525 -616 977
3131 977 313 -1561 -454 1075 180 -892 -246 1097 308 -931 -232 1082 706 -847 141 947 560
3148E60j148M62J015j21j529L20J111N3j137k59J048L39j522q9J366K31j412o00
3166a312J616N70j519p01J551Q61j974k15J203P62j684o18J372Q21j413p21J561
3183A60P54j598m99J242P60j253n07N83R73m57j194R07J026o09j201O99J197l66
3201F17j550M14J822m30j791K93J838m27j471J09J675j01j805L71J494l69j453
3218g64N9J332Pj493J20J095K72j188m57J036Q21j401o80J383L09j121m15J412
3236C27P47j602n46J515J72r57n62J031P20j262q15J195J094r91q02O00J123r59
3254B8p38L87J675j288j015Q92J196p55j156N18J319r50o46L60J073o81j016J81
3272f16J383k67j277K3J760j106q94L79J316m23j409J07J573l36j157p5J313K70
$$ plain form
3148 560 -588 -126 889 768 -761 -441 670 723 -414 -673 375 714 -808 -897 469 700 -712 -1312
3166 -1312 304 874 -645 -1346 205 1066 -908 -1123 80 842 -842 -1460 -88 733 -680 -1401 160
3183 160 914 -684 -1183 59 819 -434 -941 -358 615 158 -1036 -129 897 288 -913 -214 983 617
3201 617 -933 -519 1303 873 -918 -625 1213 786 -685 -576 1099 998 -807 -436 1058 689 -764
3218 -764 -705 627 634 -859 -739 356 628 -560 -1017 19 840 -561 -1241 142 451 -670 -1085 327
3236 327 1074 -528 -1074 441 613 -344 -906 125 845 -417 -1232 -37 1057 66 -736 -136 987 28
3254 28 -710 -323 1352 64 -951 -59 1137 382 -774 -256 1063 113 -533 -173 900 219 -797 -616
3272 -616 767 500 -777 -754 1006 -100 -994 -615 701 278 -1131 -1024 549 213 -944 -1019 294 564
3290E64j158m44J064M44j313j49J340K86j273l81J002Q76j114j183J744P31r28
3307A08j219J375J085j316j024Q82J433j090j151R68J387j209j298J212J171j057
3323B57j014J205P56j238p83P47J094q58q75M5J203m01j025K62J286j44j598J56
3341i25J260K65j400k50J436L5j342j38J218M07j472l45J662J81j106l53J114
3358B47O94j644O6R40K10q71m11J104K73p33m97P76Q50j113l95P60P27m40r70
3377d27M75J239q77j261Q27Q74p40r39P51J046r17j083O47Q52l73j363P85J176
3395F92m50j284Q00J000q84r19N52P74J31j215K50J039l14r28J91J052L9j295
3413g69K88J020j97j101J85J344J05j389l62J301L62j135k77J355L82j409k06
$$ plain form
3290 564 -594 -1038 26 470 -843 -992 348 634 -639 -1020 -18 858 -256 -1439 305 1036 108
3307 108 -1111 264 1349 33 -991 -109 1324 234 -917 51 1438 229 -1069 143 1314 257
3323 257 -757 448 1204 -34 -817 -70 1024 166 -709 -664 539 138 -887 -625 661 517 -1081 -925
3341 -925 335 600 -800 -1050 386 421 -921 -1059 159 566 -906 -1251 411 592 -514 -867 247
3358 247 941 -703 -637 303 513 -358 -769 335 608 -125 -622 154 1004 -109 -504 256 983 543 -427
3377 -427 48 1287 410 -851 -24 850 110 -829 -78 968 51 -1032 -385 467 94 -1269 -484 692
3395 692 242 -1042 -242 758 -126 -1045 -493 281 412 -803 -553 486 172 -756 -565 487 526 -769
3413 -769 -481 539 342 -759 -574 770 875 -514 -876 425 787 -348 -625 730 1112 -297 -503
3430e03J076K89r79n20J194K01o96r90J344N18q50q20Q42Q92j068j223J162P75
3448F44o74p67K79J048m51j246N16J004l59q20L05J100m47j156N25J110m43j090
3466i22K68J253l54j492Q96J098m71j076O2J229j56r82L42J014M9j148j22J454
3484I42n1j497J11R12M18r97L4L54P2l27p57J184P06j765m8J279k7o70p26Q18
3504c5P73j176j56L64P26p63o63O88P25p93o79R50J86l52j067J165P22o47q91
3523i23O63O70l41j035M43J483n40j384O58J078p94q99O66J327m68j283K26J398
3541I45m18j024o0J305L24j229n17J413J45j300k05J261jq44o37J143M32j243
3559e10n5O29O85j128q60J504M21j236p13J463O64j219p53Q58R38j101n82J004
$$ plain form
3430 -503 573 862 -117 -637 557 758 62 -928 416 934 84 -736 106 998 -70 -1293 -131 644
3448 644 -30 -797 -518 530 79 -1167 -651 353 -6 -826 -521 579 132 -1024 -499 611 168 -922
3466 -922 -654 599 245 -1247 -351 747 276 -800 -738 491 335 -647 -305 709 758 -390 -512 942
3484 942 891 -606 -495 417 835 -162 -128 226 298 -29 -786 398 1104 -661 -709 570 543 -127 -853 -35
3504 -35 738 -438 -594 -230 496 -267 -930 -242 483 -310 -989 -39 147 -205 -1272 -107 615 -32 -923
3523 -923 -260 410 69 -966 -523 960 420 -964 -306 772 -22 -921 -255 1072 604 -679 -453 945
3541 945 527 -497 -557 748 1072 -157 -674 739 884 -416 -621 640 639 -205 -842 301 733 -510
3559 -510 -565 64 749 -379 -1239 265 686 -550 -1263 200 864 -355 -1108 -250 688 -413 -995 9
3577IM80o10j043R06R26n22j052Q49R57n87j153L66J275q24l97j26J330k81j061
3596e58M35O41K0j153L99J393l10j593M01J044k09p42l07J493n14q12m61J184
3614C51J85j168K65N11L84j201k4Q98M47j365l58J131K69p06o72R47O41r56o63
3633a084J159L77r69m66P87O71q81r12J094J073r61p91P94P77n99o57N36Q20o59
3652A09p65O41J054o38j122Q74P51o14r73Q80O29j08j194M09Q77m36j247L48J311
3671G86M5j348m20J534p0j259k96J582r3j057l05J247J70j308k04J099N09q30
3689b18n97Q88N90j065l41R47M61n56p51M04J058r52n50J034L99o78o75O72J051
3708A121p99q21L23P52k10j260R28O19m97q61N54J035o54q31L36J087o16o47K15
$$ plain form
3577 9 489 -121 -1164 -258 668 146 -906 -57 900 313 -840 -474 801 -23 -420 -546 784 503 -558
3596 -558 -123 518 538 -615 -216 1177 867 -726 -325 719 510 -232 -539 954 440 -372 -833 351
3614 351 536 -632 -367 144 528 -673 -697 201 648 -717 -1075 56 325 -381 -1053 -106 535 -421 -1084
3633 -1084 75 452 -517 -983 -196 475 -406 -1318 -224 849 -112 -903 -109 668 69 -588 -52 768 109
3652 109 -656 -15 1039 401 -721 153 904 290 -683 197 826 718 -476 -67 810 374 -873 -525 786
3671 786 831 -517 -937 597 527 -732 -1028 554 461 -596 -901 346 516 -792 -996 103 612 -218
3689 -218 -815 73 663 -402 -743 204 665 109 -642 -238 820 -132 -682 352 751 73 -602 70 1121
3708 1121 322 -499 -176 576 366 -894 34 653 156 -705 -151 884 230 -601 -265 822 206 -441 -226
3727b26N63j31p25L57M87K02j245L11R52j25j322M57P35j36j006J97Q85J80r37
3746e27k36J110K6p63l15P43N22r75m50J129N22j107m38R97M29n81p04Q88M94
3765G64r67l68R92O25j042l38O47P98j020p72N50J314j021r48O96Q66o72r01N01
3784b96J038n33r71O82Q36l05r87J16R74k95j157Q9J229n3j019n2J001K9j214
3803h88O5R88n9n93k12J034K08j013Q9R03J67j161J2J000N07j255l18R35L67p75
3823Ao32P63O07r04p13J280L45p82n69P85P49q02p83Q00M44o17q03Q74O64q16
3843a09p47Q55N30l83q95N76O69m81p79N45O19k35p88J70J005m69q44J61Q75j17
3863A58p06RR79k92r58L75J051K64j437J67J178r3r35k55J153j27p66j75Q78N6
$$ plain form
3727 -226 337 206 -519 -162 325 527 -718 -407 545 420 -902 -445 290 154 -852 -655 230 410 -527
3746 -527 -763 347 373 -390 -705 38 560 -415 -865 264 786 -321 -759 238 667 86 -618 270 764
3765 764 -203 -571 421 1046 4 -334 313 1111 91 -681 -131 1183 162 -786 -90 776 104 -797 -296
3784 -296 742 209 -762 -80 756 451 -536 -420 554 259 -898 -809 420 367 -652 -704 297 326 -888
3803 -888 -823 165 106 -487 -699 335 543 -470 -381 522 689 -472 -460 540 1047 -208 -526 409 776 1
3823 1 -631 132 739 -165 -878 402 747 -35 -604 181 930 128 -655 145 589 -28 -831 43 707 -109
3843 -109 -856 -1 529 146 -749 -173 496 15 -764 -219 400 165 -623 -453 552 83 -761 -600 275 158
3863 158 -548 -539 440 148 -810 -435 616 880 -557 -390 788 695 -240 -495 658 531 -235 -410 468 524
3883E24q84k19J296O0r02m68P23R08j061l45P98O65j290k11O33M59o50q82Q60
3902A4N76o18r82Q34R24r97l68J05J091q25p35N29J208m83j025M25P41k83m81
3921c50J69Q51l61q99L17R99l53j061K35J015K51j077q1J145L8r86l30J202L39
3940A063j446%J281j28p44n97R60J69p26l89Q63K50p66k33P63M68r64k58N00K76
3960C42n60l36L96P26q87m45O54P39m82q59N10O19o54k05K33Q28k96j097M46J241
3980I13r30m33M62O58k54r16L05R92m01p04L02N10J0r30L16O26K46j128K10P09
4000E63J00j113J44M36L88j059O7Q59lp53m13R11K36q07k39P74M88j177k53R70
4020A19K50n42p04J071M79r06n51Q15N06p50o44O02Q99r60m66P61N73n67r99Q67
$$ plain form
3883 524 -360 -579 717 777 -125 -593 130 1038 -23 -368 430 1095 -195 -406 227 686 36 -846 14
3902 14 590 -28 -1010 -176 748 -249 -617 -512 579 -246 -981 -452 756 273 -752 -327 414 131 -350
3921 -350 -181 670 309 -590 -273 726 373 -688 -453 562 813 -264 -345 800 838 -148 -478 724 1063
3940 1063 -383 -383 898 770 26 -571 389 558 -168 -557 306 556 -210 -443 320 788 -176 -434 66 342
3960 342 -218 -554 -158 568 -319 -764 -110 629 147 -712 -202 417 -237 -442 -209 619 323 -774 -328 913
3980 913 -17 -450 12 670 416 -500 -195 797 396 -308 -6 504 514 -416 -100 526 772 -356 -146 563
4000 563 663 -450 -306 130 518 -541 -474 385 382 -371 -784 127 363 -444 -683 91 579 -598 -851 119
4020 119 369 -173 -877 194 673 -233 -784 31 537 -213 -857 -255 644 -316 -782 -21 552 -15 -1014 -147
4040a47O86m69n10M91O93j57j221P40P69m58p84L96Q17o12n97J59Q84L0j029L9
4060b80J283m54j040j1R26M26j083l41J014j94r69J44R16j45n26m73R51K95m10
4079B9o21R02M9o84k36Q35j15l53k63M13R18j355R4N15O27r65k25L89P52n84m99
4100c77O13M50p45m68Q18O05o08q17M88N06k04n75O37K85m43n88L78P10m61r62
4120g58M34R22l60j111M48N47K23q47J5J009k72p90p8J125l39o54j47N28N85n74
4140i4m65Q50m2l31l44N47M75p38j10N65J62p05k19N02R04j012m17O32R47j019
4160H8n36N66P22n71q28P56O62p59o88L97Q14l30q37L39O68k05r43L90J003n53
4180A55o43O1J026m53q22J51J113l39q62r3J009j39o12L3R10j90o31k86Q17J34
$$ plain form
4040 -147 539 70 -440 51 744 587 -634 106 875 417 -367 29 846 234 -363 -204 680 710 -319 -280
4060 -280 1003 549 -491 -502 424 850 -233 -574 440 246 -723 -579 337 192 -334 -807 144 439 29
4079 29 -592 310 359 -325 -561 274 159 -194 -457 -44 874 -481 -387 128 755 -210 -435 -46 706 122 -377
4100 -377 236 686 -59 -527 291 896 288 -529 -41 465 261 -314 323 608 165 -423 -45 665 204 -758
4120 -758 -324 598 238 -873 -425 122 345 -502 -487 522 250 -540 -618 507 168 -486 -633 -105 480 -94
4140 -94 -559 291 249 -82 -426 121 596 -142 -252 313 475 -230 -449 53 957 -55 -472 160 1107 88
4160 88 -448 118 840 269 -559 197 859 100 -588 -191 623 293 -544 -205 463 258 -685 -295 708 155
4180 155 -488 -427 599 146 -676 -525 588 249 -613 -706 303 164 -448 -415 495 305 -326 -612 205 339
4200C39r52Q1J009j25n04l66J100j3p78r2M89L71o31k13P84M28r27m51O44M76
4220F69q26j27N12M50l20p27N36N82o38n06M95K83k92l94J64M74n04o47Q84N67
4240F35p18l88M44M88n69p50K73J252l61q08P0O26m3r54M61Q37l32o19M5O92L08
4261E89r76NR57J0r23j33P79J25o82j49Q64J93o92m71P03N66r17k35O40O65j079
4282a61k40N28N90n95o34N79O57q31n42P73M78o77n44K82P57k85p27M25Q08p67
4302a26m59M74M15j35q52M16O04Jr60Q0J035m3q77p2J168l92j099O92O19K68j102
4323c45o9Q46m1o90J45N64J49q84J14R41n3p24j7N19K99r94j91J147j91p71j03
4344c49O33J85p65l49R22J43l55o95Q55N96q93l95J70P29m05m13L51M06m57m99
$$ plain form
4200 339 -613 -532 477 352 -152 -518 582 569 -209 -301 188 559 -72 -285 499 927 0 -451 193 669
4220 669 -157 -284 228 678 358 -369 167 749 111 -395 100 383 91 -303 -139 335 -169 -816 68 635
4240 635 -83 -471 -27 461 -108 -858 -585 667 306 -502 -432 194 151 -803 -342 495 163 -456 -411 281 589
4261 589 -387 -382 575 585 -338 -471 308 433 -249 -398 466 659 -33 -504 199 765 -152 -387 253 918 -161
4282 -161 -401 127 717 122 -512 67 724 -107 -649 124 602 -75 -619 -337 420 135 -592 -167 641 -126
4302 -126 -585 -111 304 169 -683 -267 337 338 -622 -542 493 450 -427 -499 669 277 -822 -130 489 757 -345
4323 -345 -414 432 391 -299 -154 410 559 -325 -211 730 677 -47 -64 455 754 -240 -431 716 525 -246 -349
4344 -349 284 469 -296 -645 277 420 65 -630 225 821 -72 -467 -297 432 27 -386 -35 371 -86 -585
4364e85O33O27p04p67N66N27k81m17J82P31m64n42J44Q45k60q32M31O94q7q14
4384c73j57Q21j7m76L01K87j90m44k00J184K9j247J89O50K26p58r4M79j46k62
4404a98l75Q22K19q65n2N64L64p97m4N95J66n61j96L47M38o51l42N86P39p94m62
4425d97J90P85j64o97J33N96n1q30J80Q31k77p04M28P85l39p55J62Q07j98n68
4445a83K49N47l77m18j2P11o0p68L36L93k29k65l81N79K87o72l34R52q4n12l0
4466b71M43K33o27n94R32jl5o93N18L20o51k15P23j98k14m0M02N00n30n32O99
4487A69M60n03n77L98M33m32k86L45N79o60l93N6J419p16p84N46N37m37k47K56
4507A63L31k49m47l1Q13k19m50j01O84j28p36P3P92l35o33K10Q10q5p30k4K54
$$ plain form
4364 -585 48 675 -29 -796 -230 297 16 -401 -219 512 48 -494 -350 495 235 -597 -166 528 441 -373
4384 -373 -530 291 274 -202 99 386 196 -248 -448 736 765 -482 -293 357 583 -175 -269 210 64 -198
4404 -198 -573 249 468 -397 -449 115 479 -318 -362 233 399 -162 -358 -11 427 -224 -566 20 759 -35 -497
4425 -497 -307 478 314 -383 -250 346 295 -535 -355 476 199 -505 -77 708 369 -386 -224 583 385 -183
4445 -183 66 613 236 -182 -194 517 457 -311 25 418 189 -76 -457 122 409 -263 -597 355 271 -241 -271
4466 -271 172 405 -222 -816 116 115 80 -613 -95 225 -426 -641 82 -116 -330 -370 32 532 2 -530 169
4487 169 629 126 -451 -53 380 -52 -338 7 586 -74 -467 -411 1008 292 -492 54 591 154 -93 163
4507 163 494 245 -202 -233 580 361 -89 -190 494 366 -370 -297 495 160 -473 -263 547 462 -268 -292 -38
4528c8P07q85l14O45K06m84n78R35J57p52j8M55N44q47j21M58O98p34m53P10J19
4549D10l59k25K44N32n29m35M75L96l46m66L90mJ91o56L83Q46n26n28K56N46j75
4570D20r78M56R05m70o44J51O04j06p21K38L80J02p12K33N86j31p59R3N39J53
4590C39m12k90P25k18l88m04J151j53m37k39P71j94m74m5P10L4p95p2P87K21o73
4611e6m50N87O85q02j52L31K01l63n46O56M18n15m01M09P40o57n84M75Q29q26
4631b1n27N35M40k52p02P0P05j35p58K35P09n98j16k36J095k46n85n6Q97j66q81
4652e93K21O41K78q59l00Q22J97p69j70N63L90q18R1N20Rn86J11M75M43m29p01
4673d64R81m2l28l00P8Q60p04m58N79K07k97o28O59M6J6m58k5P57l14p45L53O03
$$ plain form
4528 -38 669 -216 -530 115 321 -163 -741 194 351 -401 -419 36 580 -267 -388 70 768 34 -419 291 410
4549 410 51 -174 70 602 73 -362 113 509 163 -303 87 83 274 -382 1 847 321 -207 49 595 420
4570 420 -558 -102 803 333 -311 -160 444 338 -383 -145 235 337 -375 -142 444 313 -446 -353 186 339
4590 339 -73 -363 362 144 -244 -648 503 350 -87 -326 445 251 -223 -268 442 476 -319 -391 396 617 -56
4611 -56 -506 81 766 -36 -188 143 344 -19 -565 91 509 -6 -407 2 742 85 -499 -24 805 -21
4631 -21 -548 -13 427 175 -527 -457 248 113 -645 -410 299 -299 -415 -651 444 198 -387 -443 454 288 -593
4652 -593 -372 269 547 -312 -612 210 407 -362 -532 31 421 -397 -306 214 223 -363 -252 223 666 237 -464
4673 -464 517 475 147 -153 -75 785 81 -377 202 409 112 -516 143 189 205 -253 -278 479 165 -580 -227 376
4695C76m56n83N83M71k21n05MP76j02j034M56M88J4n43k6O31k04m99J7O83m8l79
4717a01j37L86L22p49k38J222l93l80n63Q53M55n19m50K16Q96o96p33Q84pq5n91
4738d08R07J20n06m79K44Q61p85j95K48K04l65j11J00O69n78k64Q2N90m60m33
4758e59J14R72l62o90M41K52j28m27M10L10j37o81K87L97L71j271K81Q74J18p44
4778a72q0O37Q2o07j40M32L78n63p5N03k5m29l07P99L4n03l51O44K15r00K43N56
4800C71j06k71m96N22M73n06o43O30M48m55n59R13J75o22k22J92O12p40k48L06
4820b26L62o5n38O13L36p6o85J91N70n34k72p9Q63O9q64N27K54l16l74K20P16
4841F92j67q22K8P11j71j018K08Q14K06q79j6N30K33p39j4P19Po20j87J012l78
$$ plain form
4695 376 -80 -663 -80 391 170 -335 -331 445 343 -691 -235 253 267 -276 -302 329 125 -374 -357 326 278 -101
4717 -101 -238 148 470 -279 -517 705 312 -68 -631 222 677 158 -292 -76 820 124 -609 275 268 183 -408
4738 -408 499 619 113 -366 -122 739 -46 -241 7 211 -154 -265 -165 504 -74 -338 -256 334 -126 -559
4758 -559 -445 527 165 -525 -84 168 40 -387 23 333 196 -485 -198 199 570 -701 -420 454 572 -172
4778 -172 -252 385 467 -140 -280 152 530 -33 -108 395 370 -59 -366 433 467 -36 -387 257 472 -428 -185 371
4800 371 265 -6 -502 20 493 -13 -656 -26 422 -33 -592 321 496 -126 -348 -156 456 -284 -532 -226
4820 -226 136 71 -467 146 482 406 -279 -88 482 -52 -324 -403 460 529 -335 192 446 130 -244 -24 692
4841 692 525 -297 -269 442 271 -747 -539 275 481 -398 -414 116 349 -390 -404 315 322 -298 -485 527 149
4862A49l33l87O80L34o77k19O67K47o82k10N66K53m40o08M86O67l58n89L17N96
4882D59n47l67N55P7J99k96N5K87j80p47O05O64k07r10J77Q41m86m82L49L56k84
4903A18m38P8L72Q7o39K29N11Q3n87k05J088p84k75j34P04J57p38j6K41K64o11
4924d95k29Q48J80n80O2K64K40p31r3O70K11o12j19M75K11m71m29N63L32j6n86
4945c05K44K24q9l31L18O70n64p58O10L25l27k39J73L49j73n14M15O72m53q44
4965e97M10N30k02m85J68N13j58l85l38P78k73l80J52P57k74n95M21J20K29q84
4985d93N6P93o2m64j55O58j14n48K6O08K17q81q5N17L52l60m94P17N22q37l33
$$ plain form
4862 149 -184 -571 109 443 -234 -453 214 461 -221 -431 135 388 -52 -660 -174 493 135 -454 -137 459
4882 459 -88 -455 100 177 376 80 135 422 242 -505 100 764 557 -353 -176 665 179 -303 46 402 118
4903 118 -320 -242 130 217 -422 -193 318 401 -186 -391 697 -87 -362 -496 208 365 -373 -389 -148 116 -495
4924 -495 -724 124 304 -276 -214 50 290 -441 -534 136 347 -265 -384 91 302 -169 -598 -35 297 281 -305
4945 -305 -61 163 74 -257 61 731 167 -591 19 344 17 -222 -49 300 127 -387 28 700 247 -597
4965 -597 -187 343 141 -344 -176 337 179 -206 -544 234 -39 -419 -267 490 216 -379 42 162 391 -493
4985 -493 -437 356 294 -170 -325 333 219 -329 -303 305 522 -359 -444 73 425 65 -429 288 810 -27 -360
$$ [...]
8191h3
##END NTUPLES=NMR FID
##END=
