##TITLE=1H_lae-B11M-3-17-3-12-5
 CDCl3, 8 sc, 
 26.6.2019
##JCAMPDX= 6.0         $$ Bruker NMR JCAMP-DX V2.0
##DATA TYPE= NMR FID
##DATA CLASS= NTUPLES
##ORIGIN= UXNMR, Bruker Analytische Messtechnik GmbH
##OWNER= root
$$ XWIN-NMR		Version 3.5
$$ Wed Jun 26 15:20:36 2019 Russian Standard Time (UT+4h)  she@DPX200
##.OBSERVE FREQUENCY= 200.13155
##.OBSERVE NUCLEUS= ^1H
##.DELAY= (6, 6)
##.ACQUISITION MODE= SIMULTANEOUS
##.ACQUISITION SCHEME= undefined
##.AVERAGES= 8
##.DIGITISER RES= 18
##SPECTROMETER/DATA SYSTEM= spect
##.PULSE SEQUENCE= zg30
##.SOLVENT NAME= CDCl3
##.SHIFT REFERENCE= (INTERNAL, CDCl3, 0, 15.7039)
##AUDIT TRAIL= $$ (NUMBER, WHEN, WHO, WHERE, WHAT)
$$ ##TITLE= Audit trail, XWIN-NMR		Version 3.5
$$ ##JCAMPDX= 5.01
$$ ##ORIGIN= Bruker BioSpin GmbH
$$ ##OWNER= she
$$ F:/spectra/data/she/nmr/H-F/1/audita.txt
$$ ##AUDIT TRAIL=  $$ (NUMBER, WHEN, WHO, WHERE, WHAT)
(   1,<2019-06-26 15:19:26.64 +0400>,<she>,<DPX200>,
      <created by zg, POWCHK disabled, PULCHK disabled
       configuration hash MD5:
       00 E9 B6 7A A2 85 ED C7 34 08 36 98 17 FE 4E 26
       data hash MD5: 16K
       CE B7 FB A9 11 10 55 DD 8B 66 59 CC 28 4E 9D 8C>)
$$ ##END=
$$ 
$$ hash MD5
$$ 5E 45 1A B7 D7 5D 85 B0 3A BB 17 D7 FD 86 0D AD
##$RELAX= 
##$RELAX= 
##$RELAX= 
##$RELAX= 
##$RELAX= 
##$RELAX= 
$$ Bruker specific parameters
$$ --------------------------
##$DU= <F:/spectra>
##$EXPNO= 1
##$NAME= <H-F>
##$PROCNO= 1
##$TYPE= <nmr>
##$USER= <she>
##$AMP= (0..31)
100 100 100 100 100 100 100 100 100 100 100 100 100 100 100 100 100 100 
100 100 100 100 100 100 100 100 100 100 100 100 100 100 
##$AQSEQ= 0
##$AQ_mod= 1
##$AUNM= <au_zg>
##$AUTOPOS= <>
##$BF1= 200.13
##$BF2= 200.13
##$BF3= 200.13
##$BF4= 200.13
##$BF5= 200.13
##$BF6= 200.13
##$BF7= 200.13
##$BF8= 200.13
##$BYTORDA= 1
##$CFDGTYP= 0
##$CFRGTYP= 5
##$CHEMSTR= <none>
##$CNST= (0..31)
1 1 145 1 1 1 1 1 1 1 1 1 1 1 1 1 1 1 1 1 1 1 1 1 1 1 1 1 1 1 1 1 
##$CPDPRG= <>
##$CPDPRG1= <>
##$CPDPRG2= <>
##$CPDPRG3= <>
##$CPDPRG4= <mlev>
##$CPDPRG5= <mlev>
##$CPDPRG6= <mlev>
##$CPDPRG7= <mlev>
##$CPDPRG8= <mlev>
##$CPDPRGB= <>
##$CPDPRGT= <>
##$D= (0..31)
0 1.2 0 0 0 0 0 0 0 0 0 0.03 0 0 0 0 0 0 0 0 0 0 0 0 0 0 0 0 0 0 0 0 
##$DATE= 1561547966
##$DBL= (0..7)
120 120 120 120 120 120 120 120 
##$DBP= (0..7)
150 150 150 150 150 150 150 150 
##$DBP07= 0
##$DBPNAM0= <>
##$DBPNAM1= <>
##$DBPNAM2= <>
##$DBPNAM3= <>
##$DBPNAM4= <>
##$DBPNAM5= <>
##$DBPNAM6= <>
##$DBPNAM7= <>
##$DBPOAL= (0..7)
0.5 0.5 0.5 0.5 0.5 0.5 0.5 0.5 
##$DBPOFFS= (0..7)
0 0 0 0 0 0 0 0 
##$DE= 6
##$DECBNUC= <off>
##$DECIM= 24
##$DECNUC= <off>
##$DECSTAT= 4
##$DIGMOD= 1
##$DIGTYP= 9
##$DL= (0..7)
0 120 120 120 120 120 120 120 
##$DP= (0..7)
150 150 150 150 150 150 150 150 
##$DP07= 0
##$DPNAME0= <>
##$DPNAME1= <>
##$DPNAME2= <>
##$DPNAME3= <>
##$DPNAME4= <>
##$DPNAME5= <>
##$DPNAME6= <>
##$DPNAME7= <>
##$DPOAL= (0..7)
0.5 0.5 0.5 0.5 0.5 0.5 0.5 0.5 
##$DPOFFS= (0..7)
0 0 0 0 0 0 0 0 
##$DQDMODE= 0
##$DR= 18
##$DS= 0
##$DSLIST= <SSSSSSSSSSSSSSS>
$$ [...]
##$SUBNAM2= <"">
##$SUBNAM3= <"">
##$SUBNAM4= <"">
##$SUBNAM5= <"">
##$SUBNAM6= <"">
##$SUBNAM7= <"">
##$SUBNAM8= <"">
##$SUBNAM9= <"">
##$SW= 24.9336996594482
##$SWIBOX= (0..15)
0 0 2 0 0 0 0 0 0 0 0 0 0 0 0 0 
##$SW_h= 4990.01996007984
##$TD= 16384
##$TD0= 1
##$TE= 0
##$TE2= 300
##$TE3= 300
##$TEG= 300
##$TL= (0..7)
0 120 120 120 120 120 120 120 
##$TP= (0..7)
150 150 150 150 150 150 150 150 
##$TP07= 0
##$TPNAME0= <>
##$TPNAME1= <>
##$TPNAME2= <>
##$TPNAME3= <>
##$TPNAME4= <>
##$TPNAME5= <>
##$TPNAME6= <>
##$TPNAME7= <>
##$TPOAL= (0..7)
0.5 0.5 0.5 0.5 0.5 0.5 0.5 0.5 
##$TPOFFS= (0..7)
0 0 0 0 0 0 0 0 
##$TUNHIN= 0
##$TUNHOUT= 0
##$TUNXOUT= 0
##$USERA1= <user>
##$USERA2= <user>
##$USERA3= <user>
##$USERA4= <user>
##$USERA5= <user>
##$V9= 5
##$VALIST= <valist>
##$VCLIST= <CCCCCCCCCCCCCCC>
##$VD= 0
##$VDLIST= <DDDDDDDDDDDDDDD>
##$VPLIST= <PPPPPPPPPPPPPPP>
##$VTLIST= <TTTTTTTTTTTTTTT>
##$WBST= 1024
##$WBSW= 4
##$XGAIN= (0..3)
0 0 0 0 
##$XL= 0
##$YL= 0
##$YMAX_a= 121208
##$YMIN_a= -218591
##$ZGOPTNS= <>
##$ZL1= 120
##$ZL2= 120
##$ZL3= 120
##$ZL4= 120
##$ABSF1= 10
##$ABSF2= 0
##$ABSG= 5
##$ABSL= 3
##$ALPHA= 0
##$AQORDER= 0
##$ASSFAC= 0
##$ASSFACI= 0
##$ASSFACX= 0
##$ASSWID= 0
##$AUNMP= <proc_1d>
##$AZFE= 0.1
##$AZFW= 0.1
##$BCFW= 1
##$BC_mod= 2
##$BYTORDP= 1
##$COROFFS= 0
##$CY= 11.3945322036743
##$DATMOD= 1
##$DC= 2
##$DFILT= <>
##$DTYPP= 0
##$F1P= 18.9103706918063
##$F2P= -1.10871071338519
##$FCOR= 0.5
##$FTSIZE= 0
##$FT_mod= 4
##$GAMMA= 1
##$GB= 0.15
##$INTBC= 1
##$INTSCL= 1
##$ISEN= 128
##$LB= 0.24
##$LEV0= 0
##$LPBIN= 0
##$MAXI= 10000
##$MC2= 0
##$MEAN= 0
##$ME_mod= 0
##$MI= 1.114404
##$NCOEF= 0
##$NC_proc= 0
##$NLEV= 6
##$NOISF1= 3.799351
##$NOISF2= 2.8
##$NSP= 1
##$NTH_PI= 0
##$NZP= 0
##$OFFSET= 15.70392
##$PC= 1
##$PHC0= -8499.27
##$PHC1= 15.20097
##$PH_mod= 1
##$PKNL= yes
##$PPARMOD= 0
##$PSCAL= 0
##$PSIGN= 0
##$REVERSE= no
##$SF= 200.130013532006
##$SI= 16384
##$SIGF1= 3
##$SIGF2= 2
##$SINO= 400
##$SIOLD= 16384
##$SREGLST= <1H.CDCl3>
##$SSB= 0
##$STSI= 0
##$STSR= 0
##$SW_p= 3612.71676300578
##$SYMM= 0
##$S_DEV= 0
##$TDeff= 0
##$TDoff= 0
##$TI= <>
##$TILT= no
##$TM1= 0
##$TM2= 0
##$TOPLEV= 0
##$USERP1= <user>
##$USERP2= <user>
##$USERP3= <user>
##$USERP4= <user>
##$USERP5= <user>
##$WDW= 1
##$XDIM= 8192
##$YMAX_p= 0
##$YMIN_p= 0
$$ End of Bruker specific parameters
$$ ---------------------------------
##NTUPLES= NMR FID
##VAR_NAME=  TIME,          FID/REAL,        FID/IMAG
##SYMBOL=    X,             R,               I
##VAR_TYPE=  INDEPENDENT,   DEPENDENT,       DEPENDENT
##VAR_FORM=  AFFN,          ASDF,            ASDF
##VAR_DIM=   8192,          8192,            8192
##UNITS=     SECONDS,       ARBITRARY UNITS, ARBITRARY UNITS
##FACTOR=    0.0002004,     1,               1
##FIRST=     0,             0,               0
##LAST=      1.6414764,     0,               0
##MIN=       0,             -218591,         0
##MAX=       1.6414764,     121208,          0
$$ Real data points
##PAGE= N=1
##DATA TABLE= (X++(R..R)), XYDATA
$$ [...]
2088E03J06M29j3n75j02M27N4l86l14Q3L60p52n76N05K02k19n47j67L83J13l58
$$ 503 609 1038 1025 450 348 775 829 443 129 212 572 -180 -756 -251 -49 -268 -815 -982 -599 -486 -844
2109h44k01j43J89L57R5p26K69M16K9o81j20J155K07o00l79N08N20P0m94M77K14
$$ -844 -1045 -1188 -999 -642 -547 -1273 -1004 -588 -559 -1240 -1360 -205 2 -598 -977 -469 51 121 -373 104 318
2130C18j41L08O8j0k19P46m69R6l04O39L5o15L19O28K15r44m32L99N98n91m76
$$ 318 177 485 553 543 324 1070 601 697 393 1032 1067 452 771 1399 1614 670 238 637 1235 644 168
2151A68kM06n56k65K55J29l16Ok14r2q2J03o1o43o3Q40K1m47p57J212Oo71j2M10
$$ 168 166 572 16 -249 6 135 -181 -175 -389 -481 -563 -460 -521 -1164 -1227 -387 -366 -813 -1570 -358 -352 -1023 -1035 -625
2175f25N02p59k78Q12L70k80k15J00R26L9r4o33L85J20L99K11o67J86K43j84Q8
$$ -625 -123 -882 -1160 -348 22 -258 -473 -373 553 592 498 -135 250 370 769 980 313 499 742 558 646
2196F46j09N47L0n92k61M55P96j133j83L14K42j08m13K8J98k34p08k24L76K57
$$ 646 537 1084 1114 522 261 716 1512 379 196 510 752 644 231 259 457 223 -485 -709 -333 -76
2216g6K19q72j08J34Q16m93q65K62K95K08n48j09O90n3l43m04O04J97j22l6j71
$$ -76 143 -729 -837 -703 113 -380 -1245 -983 -688 -480 -1028 -1137 -447 -500 -843 -1247 -643 -446 -568 -604 -775
2237g75N32M55r8l42J20M30M41l03K4k34O95j01m42J78O84k73m77o6O24J74p77
$$ -775 -243 212 114 -228 -108 322 763 460 484 250 945 844 402 580 1264 991 514 448 1072 1246 469
2258D69j81J85K48K03m98R1j45J80k12n28j17K86K56o24m60L86J68k23p15K26
$$ 469 288 473 721 924 426 517 372 552 340 -188 -305 -19 237 -387 -847 -461 -293 -516 -1231 -1005
2278a005Q25m02m98l0N48K49j64l62l4L97j96K07M3j10K31M36l72o5N24O96p68
$$ -1005 -180 -582 -1080 -1110 -562 -313 -477 -839 -873 -476 -672 -465 -422 -532 -301 135 -237 -302 222 918 150
2299A50L2L60K87j58k83K02O19l26n44P3N74K7m30k84K98K49j04l40Nj57N47k32
$$ 150 182 542 829 671 388 590 1209 883 339 412 986 1013 583 299 597 846 742 402 407 250 797 565
2321E65n12K6r0M51k63l65k77M61l87m05p2M08L48p43n9L39j76k9R7j44J28L60
$$ 565 53 79 -11 440 177 -188 -465 -4 -391 -796 -868 -460 -112 -855 -914 -575 -751 -780 -683 -827 -699 -339
2343c39l48k37K50N94J9k61k53L36N84l86l24P80m4k7p7p2N15P9k51j44K28L90
$$ -339 -687 -924 -674 -80 -61 -322 -575 -239 345 -41 -365 415 371 344 267 195 710 789 538 394 622 1012
2365A012q3k68l79N51M33n68P5k20L28m99j95P8n1K99m61q0j18M24j87k47j44
$$ 1012 929 661 282 833 1266 698 773 553 881 382 187 265 214 513 52 -28 -146 278 91 -156 -300
2386c00J97j23m13k32N1L46J36k29n14O71P7N2o53K53L42J45k97j11J89O13m44
$$ -300 -103 -226 -639 -871 -820 -474 -338 -567 -1081 -410 -333 -281 -934 -681 -339 -194 -491 -602 -413 200 -244
2407b44l34O37J69p5l0k77M52L80j93k0J56M3R8j27j80L38J22k6r50O47L23j51
$$ -244 -578 59 228 153 123 -154 298 678 485 465 621 664 762 635 455 793 915 889 -61 586 909 758
2429G58l66k50L20Q1n18j16N9K48k30m66P9J10M26p85q9j38N63n2o27q8N07k0
$$ 758 392 142 462 543 25 -91 -32 216 -14 -480 -401 -291 135 -650 -739 -877 -314 -366 -993 -1081 -574 -594
2451e94j1m27q7Q10L02j074J07O10K17m09N4K35N00l9k36j0J30J76J7K23k9K81
$$ -594 -605 -1032 -1119 -309 -7 -1081 -974 -364 -147 -556 -502 -267 233 194 -42 -52 78 254 271 494 465 746
2473G46j8n2m00N27o5J39l06K40J41J93p88J68k1M45n43m92K32K49j40j32l77
$$ 746 728 676 276 803 738 877 571 811 952 1145 357 525 504 949 406 -86 146 395 255 123 -254
2494b54k66O30m4l61k98N01o34J30l54K06J46P8l57J87J48J26l15j02K76pl6q1
$$ -254 -520 110 66 -295 -593 -92 -726 -596 -950 -744 -598 -520 -877 -690 -542 -416 -731 -833 -557 -564 -600 -681
2516f81j0N28K66m70l05N45N30K05p13K61L15L30m91m7K82M13j09m67K36K41p6
$$ -681 -691 -163 103 -367 -672 -127 403 608 -105 156 471 801 310 263 545 958 849 382 618 859 783
2537G83l57J23l5J29j09k5k70J65R8k73l77l7L15q2k07j95M1K41j06q66L11l5
$$ 783 426 549 514 643 534 509 239 404 502 229 -148 -185 130 48 -159 -354 -313 -72 -178 -1044 -733 -768
2559g68K89n45L07K05r5j17j61L41J32o2o7J18N0j12M01m73K34M08m5k0N7J08
$$ -768 -479 -1024 -717 -512 -607 -724 -885 -544 -412 -474 -541 -423 -373 -485 -84 -557 -323 85 40 20 77 185
2581A85Q4O7j71L85M75k56m32J34J28N07p98P5J50J43l6k90r5M36k9l89k72m2
$$ 185 269 336 165 550 1025 769 337 471 599 1106 308 383 533 676 640 350 255 691 662 273 1 -41
2603d1K99j62k51k80K84L97k72n65J41L37P1m70m02J32N43l24m38K17M15N3p15
$$ -41 258 96 -155 -435 -151 246 -26 -591 -450 -113 -42 -512 -914 -782 -239 -563 -1001 -784 -369 -316 -1031
2624a031K87j2L67J75o13J48P91K9n11J45J42N05m81Q7J62J37M11m00l81O09N91
$$ -1031 -744 -756 -389 -214 -827 -679 112 141 -370 -225 -83 422 -59 28 190 327 738 338 -43 566 1157
2645A157p19l20M47K23j97j57K4rO19l39q42L8Q94l76m18O9K9L1j73k10k50L01
$$ 1157 438 118 565 788 591 434 458 449 1068 729 -113 -75 819 443 25 94 123 154 -19 -229 -479 -178
2667a78k12k19q9K16J67m50j76L46J85j29J25l41l6K95L3j50J80N46k45k05j00
$$ -178 -390 -609 -698 -482 -315 -765 -941 -595 -410 -539 -414 -755 -791 -496 -463 -613 -433 113 -132 -337 -437
2688d37K78M98j53l58K73M00j12k86K85J77N6j88r3L48K6N8o9k26L7L33j00m00
$$ -437 -159 339 186 -172 101 501 389 103 388 565 621 433 340 688 714 772 703 477 514 847 747 347
2710C47K9J91N3m10l08L86J0j29o38N03J35k91l58Q6Mm5K5P0k94j98K51j9k90
$$ 347 376 567 620 210 -98 288 298 169 -469 34 169 -122 -480 -394 -390 -435 -410 -340 -634 -832 -581 -600 -890
2733h90J11K68J81m32j52O03j63p9k28O58Q3o5j42j92L69O5m2L55k70O14L9l26
$$ -890 -779 -511 -330 -762 -914 -311 -474 -553 -781 -123 -40 -105 -247 -439 -70 -5 -47 308 38 652 691 365
2755C65j11M60P6k75k94L54P6R6R6n44L53M00p77l41M64kj29j28O6j16N2l75n0
$$ 365 254 714 790 515 221 575 651 747 843 299 652 1052 275 -66 398 396 267 139 205 89 141 -234 -284
2778b84J02K50l82l09J10R1L81n82j40o8M61q7k32j92O78j9l43j76K70L97q5l12
$$ -284 -182 68 -314 -623 -513 -422 -41 -623 -763 -831 -370 -457 -689 -881 -203 -222 -565 -741 -471 -74 -159 -471
2800d71J91L54Nj81l34N24K7K75r8n3N4N02n28M0K57o2K27n03K47J62K82m32k94
$$ -471 -280 74 79 -102 -436 88 115 390 292 239 293 795 267 307 564 502 729 226 473 635 917 485 191
2823A91K74J63k51k00j9K64m75O2j74o8N50l2n82o27N22L25k72l91k1N22k60m92
$$ 191 465 628 377 177 158 422 -53 9 -165 -233 317 285 -297 -924 -402 -77 -349 -740 -761 -239 -499 -991
2845i91J64M86j89R5k02K38j01R2J41k54M62%J42l69J37K57N75p99j68O56J93
$$ -991 -827 -341 -530 -435 -637 -399 -500 -408 -267 -521 -59 -59 83 -286 -149 108 683 -116 -284 372 565
2866E65j81r8J38L83j79n12p1P14P9l08l89N01l49J93K45l42j49J48k4j90l09
$$ 565 384 286 424 807 628 116 45 759 838 530 141 642 293 486 731 389 240 388 364 174 -135
2887a35L34j27o14P8J08M83m91n25M0O33j00o24KM73j63J92k02J51j97p3J82J79
$$ -135 199 72 -542 -464 -356 127 -364 -889 -849 -216 -316 -940 -938 -465 -628 -436 -638 -487 -684 -757 -575 -396
2909c96k00K87J25k91J53M77L5k05j5L79M25m62m11K82L25j16J62q7N4K11k01
$$ -396 -596 -309 -184 -475 -322 155 190 -15 -30 349 774 312 -99 183 508 392 554 467 521 732 531
2930E31l35M27j44K58n39J77K0L28j13k94l94K98j75j69R9o4J99n08P1J85j10
$$ 531 196 623 479 737 198 375 395 723 610 316 -78 220 45 -124 -25 -89 110 -398 -327 -142 -252
2951b52k85KR8J94k88J75k39m8J50J21j95j31K62K89J59k84k92M56P8k27j13N35
$$ -252 -537 -535 -437 -243 -531 -356 -595 -643 -493 -372 -567 -698 -436 -147 12 -272 -564 -108 -30 -257 -370 165
2973A65KL0m74K98L94R5o6j16L56l27K78m02J51K59L8o5n52J56M72Q6n27l58N58
$$ 165 167 197 -277 21 415 510 444 328 684 357 635 233 384 643 681 616 64 220 692 778 251 -107 451
2996D51j3k43l28P8N57o41p5N0M19m23m85j11M45J06ln78K09M5L6L10m99j37P75
$$ 451 438 195 -133 -55 502 -139 -214 -164 255 -168 -653 -764 -319 -213 -216 -794 -585 -540 -504 -194 -693 -830 -55
3019e5k71k14qN54J12n62k86O34M62l92l00M55L91k69R1m18J19K58o3L97j72J71
$$ -55 -326 -540 -548 6 118 -444 -730 -96 366 -26 -326 129 520 251 342 -76 43 301 238 635 463 634
3041F34J34m04m7L64J99k27j37k01K43J12l71m16J98P1J15n07L04q7j74qk26n0
$$ 634 768 364 317 681 880 653 516 315 558 670 299 -117 81 152 267 -240 64 -23 -197 -205 -431 -481
3063d81J04R2l81K22j15N31k95j38m9J8J80n65K91L14q9J66k28K69K20M7m31O7
$$ -481 -377 -285 -666 -444 -559 -28 -323 -461 -510 -492 -312 -877 -586 -272 -361 -195 -423 -154 66 113 -318 -251
3085b51Q4K20M4k04n2N08k1j2j86J82L08p3n44J93M93L9l40k11N81m1m2n17O1
$$ -251 -167 53 97 -107 -159 349 328 316 130 312 620 547 3 196 689 728 388 177 758 717 675 158 219
3108B19R4r3q5r8Q9J64n12M8l91M91jk53j07N00l66k94L4mM05q7J7m59L4J43K00
$$ 219 313 220 135 37 126 290 -222 -174 -565 -74 -75 -328 -435 65 -301 -595 -561 -565 -160 -247 -230 -689 -655 -512 -312
3133c12k71K0L66J74k86K34K66n1q7k20r6O65J4j73k11N15p4J22l98J82R2J70
$$ -312 -583 -563 -197 -23 -309 -75 191 140 53 -167 -263 402 416 243 32 547 473 595 197 379 471 641
3155F41m69L23k18K40k14k6l0L4L59l75j80j72L13l18J78k24J5N39n41k3l1j49
$$ 641 172 495 277 517 303 277 247 281 640 265 85 -87 226 -92 86 -138 -123 416 -125 -148 -179 -328
3177c28J6l14k49L93j0K4k57J80M23J7l87j33N01l8j36k34L31j24K70K0lJ16M37
$$ -328 -312 -626 -875 -482 -492 -468 -725 -545 -122 -105 -492 -625 -124 -162 -298 -532 -201 -325 -55 -35 -38 78 515
3200E15m26k41N71J73n6j06j72L64Q4m44Q7J34j9L48l08k20J40n7p9j78KK08k27
$$ 515 89 -152 419 592 536 430 258 622 706 262 349 483 464 812 504 284 424 367 288 110 112 320 93
3223I3j02R2J41O3o91Q9K08k3o2k51P5K17l53J42j30K75n4j88O6l8j79J29K65
$$ 93 -9 83 224 287 -404 -315 -107 -130 -192 -443 -368 -151 -504 -362 -492 -217 -271 -459 -393 -431 -610 -481 -216
3246b16l32L22K09p7j08J2L72p2k99L14j02K69j05q5j75M98j75K63j62k36K43
$$ -216 -548 -226 -17 -94 -202 -190 182 110 -189 125 23 292 187 102 -73 425 250 513 351 115 358
3267C58J70l09O1J61Q5K68o00K86K7j35j93k33R2M71l26j47j18L10o5n39J29j7
$$ 358 528 219 280 441 526 794 194 480 507 372 179 -54 38 509 183 36 -82 228 163 -376 -247 -264
3289b64J18R6m08k04K95m2Q8l59N37M0j30k64L0R0K21k74l7L30jk02K6J20K85
$$ -264 -146 -50 -458 -662 -367 -409 -321 -680 -143 -103 -233 -497 -467 -377 -156 -430 -467 -137 -138 -340 -314 -194 91
3312I1J94m30J18J55L56K4l42j08M06K10l79k22J83K2K23l42J94R4Nk41k04R4
$$ 91 285 -145 -27 128 484 508 166 58 464 674 295 73 256 278 501 159 353 447 452 211 7 101
3334A01M17l56k50KL47k16j18r9P5qj08k15l3J09N2n8j84K20k49N19j01m83N74
$$ 101 518 162 -88 -86 261 45 -73 -172 -97 -105 -213 -428 -461 -352 -300 -358 -542 -322 -571 -52 -153 -636 -62
3357f2j67j28J54j09M13j89l88N11K66k52j14k5p3O54k35L5k30N28k15l35J99
$$ -62 -229 -357 -203 -312 101 -88 -476 35 301 49 -65 -90 -163 491 256 291 61 589 374 39 238
3378B38j97N12k72j68L49L02k24j75l95K85K13m7m04j75J63O5J54j87p2L8j16
$$ 238 41 553 281 113 462 764 540 365 -30 255 468 421 17 -158 5 70 224 37 -35 3 -113
3399a13m5jM6J79l53L05k94l1J22o53L19Q8K37j84J0q9L02k10K22k04l5N26j68
$$ -113 -158 -159 -113 66 -287 18 -276 -307 -185 -838 -519 -431 -194 -378 -368 -457 -155 -365 -143 -347 -382 144 -24
3422b4j00N9j15N47m92O2J51K19l05J31K60K42k76r1O9L07l3l07J88l46L00j24
$$ -24 -124 -65 -180 367 -125 -63 88 307 2 133 393 635 359 268 337 644 611 304 492 146 446 322
3444C22KL3n27M66M5l30L0L0R3m56K8K17J7j79k21K89K09j16k88k42L35j43r2
$$ 322 324 357 -170 296 341 11 41 71 164 -292 -264 -47 -30 -209 -430 -141 68 -48 -336 -578 -243 -386 -478
3467d78K23N2O6P3q0r8p9R9m3O8j61P72m04R7l10L04N20q6n15N02j19k3m15M47
$$ -478 -255 -203 -137 -64 -144 -242 -321 -222 -265 -197 -358 414 10 107 -203 101 621 535 20 522 403 380 -35 412
3491D12N9l4j33J38R8k96L70m24M6j53M20l40j32J95l17M1j88J22K81j44j51l40
$$ 412 471 437 304 442 540 244 614 190 236 83 503 163 31 226 -91 -50 -238 -116 165 21 -130 -470
3513d70R7L73l64j66M4K23r0M7o0j8K15k96K55k08J17M1M6m0k53O63j44K2j56
$$ -470 -373 0 -364 -530 -486 -263 -353 -306 -366 -384 -169 -465 -210 -418 -301 -260 -214 -254 -507 156 12 34 -122
3536a22r7L50Q2m00K56J83l0K9L5J05K72l57j46J75J39p1J42m02j50M96K2n55
$$ -122 -219 131 213 -187 69 252 222 251 286 391 663 306 160 335 474 403 545 143 -7 489 511 -44
3558d4K96k57K3l4j5PK2k12K5K87l4k31l25k33Q80m45k56L97n94N02J37l61L3
$$ -44 252 -5 18 -16 -31 -24 -2 -214 -189 98 64 -167 -492 -725 155 -290 -546 -149 -743 -241 -104 -465 -432
3581d32r3J63L34m43M9M99j83J25j1m4L65l11R3p9J45j6l7N2l2L61ol51q2M43
$$ -432 -525 -362 -28 -471 -422 77 -106 19 8 -36 329 18 111 32 177 161 124 176 144 505 499 148 66 509
3605E09j12r2n03K31O37j04m93j8Q9K32k30M2O9j04k21o65O28K59j90j91m5K03
$$ 509 397 305 -198 33 670 566 73 55 144 376 146 188 257 153 -68 -733 -105 154 -36 -227 -272 -69
3627f9k7j1m12j7K81P8L7m88J10J42L49j86n0M87q7n16K30R4L34l11j21K18J11
$$ -69 -96 -107 -519 -536 -255 -177 -140 -628 -518 -376 -27 -213 -263 224 137 -379 -149 -55 279 -32 -153 65 176
3650A76l3p7J65L08k53M8J59j55J2J47l29K97q3o2P4o4j01j7L05j56p00M27K65
$$ 176 143 66 231 539 286 334 493 338 350 497 168 465 382 320 394 330 229 212 517 361 -339 88 353
3673C53l69j74K63J87k23j80Nj34J36K0j96p7K05K00m04k42J88K29J19m26N02
$$ 353 -16 -190 73 260 37 -143 -138 -272 -136 -116 -312 -389 -184 16 -388 -630 -442 -213 -94 -520 -18
3694a8j27l05K90j78K38M4m53L72j65M12k44Q3J67l98M36M6j66q2M15j09L4j77
$$ -18 -145 -450 -160 -338 -100 -56 -509 -137 -302 110 -134 -51 116 -282 154 200 34 -48 367 258 292 115
3716A15J43J39o7l30K99K90j42k66k82L57J4l87L06k0k37L05%l95N5k14M38k20
$$ 115 258 397 330 0 299 589 447 181 -101 256 270 -117 189 169 -68 237 237 -158 -103 -317 121 -99
3738i9k7j69M51m57l01K41L34j59n3n94N99k00j16M93k33K85j73J77m82L82J04
$$ -99 -126 -295 156 -301 -602 -361 -27 -186 -239 -833 -234 -434 -550 -57 -290 -5 -178 -1 -483 -101 3
3759CJ41m38O7L35m5J26k54K18j29J60l97M62o1K89l76L01K05k77J31l22J49J05
$$ 3 144 -294 -227 108 63 189 -65 153 24 184 -213 249 188 477 101 402 607 330 461 139 288 393
3781C93l98L80m58K81K97m40J10l84K30M2j95l47K01J64p1m12L25J30k05k30J81
$$ 393 -5 375 -83 198 495 55 165 -219 11 53 -142 -489 -288 -124 -195 -607 -282 -152 -357 -587 -406
3802d06L38j09k77l5j50M00L7K86n50L30J99j66l0Q0j45L58j48j88M70r6J78k03
$$ -406 -68 -177 -454 -489 -639 -239 -202 84 -466 -136 63 -103 -133 -53 -198 160 12 -176 294 198 376 173
3824A73M23k96j07k9J93J95m47J93q2N7K42q2l16M6O3J28j08j42j91J32N2k80
$$ 173 596 300 193 164 357 552 105 298 216 273 515 433 117 163 226 354 246 104 -87 45 97 -183
3846a83K03l7j3k04J18p1K81l33j38K75m7m50N77m08K51N2k63J70k14L26Q2j71
$$ -183 20 -17 -30 -234 -116 -187 94 -239 -377 -102 -149 -599 -22 -430 -179 -127 -390 -220 -434 -108 -26 -197
3868a97jNM86m14J7j0K78j53p6J11l9J92N5k52K41J07j64J84j52L94p0k69K35
$$ -197 -198 -193 293 -121 -104 -114 164 11 -65 46 7 199 254 2 243 350 186 370 218 612 542 273 508
3891E08m63lJ59n7r6R1K20k12j26j03J11J7J32k27o2R1J28m70n3K97N4N9n12O2
$$ 508 45 42 201 144 48 139 359 147 21 -82 29 46 178 -49 -111 -20 108 -362 -415 -118 -64 -5 -517 -455
3915d55K05J98j20k76L06k98Q0K83l60K71L84l39k16K66K16Q4j34j53L1L49Pr
$$ -455 -250 -52 -172 -448 -142 -440 -360 -77 -437 -166 218 -121 -337 -71 145 229 95 -58 -27 322 329 320
3937C20L2k64K85q9L02ok80Ol04J27M35k25k31Q5k56K85k81J16J73Q1j07m45N2
$$ 320 352 88 373 284 586 580 300 306 2 129 564 339 108 193 -63 222 -59 57 230 311 204 -241 -189
3960a89J54l6K72n51P2R3k47J46l8J67r4J7j81J04K30M9p3j54j0q1N6J24J58j77
$$ -189 -35 -71 201 -350 -278 -185 -432 -286 -324 -157 -251 -234 -415 -311 -81 -32 -105 -259 -269 -350 -294 -170 -12 -189
3984a89J45M1l75N28r5J34k34L7R7k68M82j86L47Q1k06j7NJ27j79j38K15j46L38
$$ -189 -44 -3 -378 150 55 189 -45 -8 89 -179 303 117 464 545 339 322 327 454 275 137 352 206 544
4007E44k20l52K28K0o6j60k53M84j59k28K6K0j75L0k11P6K05J10j7l54j01N06
$$ 544 324 -28 200 220 154 -6 -259 225 66 -162 -136 -116 -291 -261 -472 -396 -191 -81 -98 -452 -553 -47
4029d7j64l29M22k95J89o7qR7P3J0l7k24M95m5k41O0j18K12M66n61J57L69O8l38
$$ -47 -211 -540 -118 -413 -224 -291 -299 -202 -129 -119 -156 -380 115 70 -171 -111 -229 -17 449 -112 45 414 482 144
4053A44n4%L86J7n46k79O93J14K55n59K37j21k03j28k40M33j48P7l07K48Oj17
$$ 144 90 90 476 493 -53 -332 361 475 730 171 408 287 84 -44 -284 149 1 78 -229 19 25 -92
4075i2r2l8J32P2m53L62j24j26K46k66M7K01k93L34k07nK67Pk05O9j22Q1N24l45
$$ -92 -184 -222 -90 -18 -471 -109 -233 -359 -113 -379 -332 -131 -424 -90 -297 -302 -35 -28 -233 -164 -286 -205 319 -26
4099b6J37q3R0K9K07m23N28k48r1J24k02L94j07N9m28M79L3k22J77j84l8k39r4
$$ -26 111 28 118 147 354 -69 459 211 120 244 42 436 329 388 -40 439 472 250 427 243 205 -34 -128
4122a28K83k4j02R2k3j8Pj8j75j48J26N7j50l9O2J62k56Q2j56J05j30N3K7J34
$$ -128 155 131 29 121 98 80 87 69 -106 -254 -128 -71 -221 -260 -198 -36 -292 -210 -366 -261 -391 -338 -311 -177
4146a77p4l60R5K77K98q9k16l9K62J47M8l41J83K41q2k10J97j72L14m54j11L46
$$ -177 -251 -611 -516 -239 59 -30 -246 -285 -23 124 172 -169 14 255 173 -37 160 -12 302 -152 -263 83
4168H3K81k28r6J00M03l79O2l79k1N44m83K09j93L14j0k62q4M6J88r4l97J04M26
$$ 83 364 136 40 140 543 164 226 -153 -174 370 -113 96 -97 217 207 -55 -139 -93 95 1 -396 -292 134
4191A34k77k44oL53j16j21j8m65J56N75k66M8K49j10J04m50K63K04J94l55J21
$$ 134 -143 -387 -393 -40 -156 -277 -295 -760 -604 -29 -295 -247 2 -108 -4 -454 -191 13 207 -148 -27
4212b7L16n9J82n44K71j28OK20M3q9l3k2K70l19L49k67J28j57N2J00j23k05Q8
$$ -27 289 230 412 -132 139 11 17 237 280 191 158 136 406 87 436 169 297 140 192 292 169 -36 52
4235E2K28l68M11m19J75j35j13J03o4K25j91R0j87l41P2L32N0k87O5K16r0k78
$$ 52 280 -88 323 -96 79 -56 -169 -66 -130 95 -96 -6 -193 -534 -462 -130 -80 -367 -302 -86 -176 -454
4257d54K51R5j47K00k62L61q5j77n1L82k3R9k23K15p9K4K27q1m6L4J62j30j75
$$ -454 -203 -108 -255 -55 -317 44 -41 -218 -269 113 90 189 -34 181 102 126 353 272 226 260 422 292 117
4280A17M4L37j09j70m2K5L8l1k47Q0L56l23j87L23l00K73m61K30N5k06J52p8K0
$$ 117 161 498 389 219 177 202 240 209 -38 42 398 75 -112 211 -89 184 -277 -47 8 -198 -46 -124 -104
4303a04M22k98l90J56j5K50j39k47J68K65k71r3r3K65j21L88k94M73o78L79J99
$$ -104 318 20 -370 -214 -229 21 -118 -365 -197 68 -203 -296 -389 -124 -245 143 -151 322 -356 23 222
4324B22k25j00K79q6J7O9p0K55l62J67K7Q7q1K10m37K27j56LK74j22J34k9k04
$$ 222 -3 -103 176 90 107 176 106 361 -1 166 193 280 199 409 -28 199 43 46 320 198 332 303 99
4347I9j58J02M02j89l70J07k24j2O7j35M48l16J57l87J18J22J99n70J93Q0Q8m9
$$ 99 -59 43 445 256 -114 -7 -231 -243 -176 -311 137 -179 -22 -409 -291 -169 30 -540 -347 -267 -179 -228
4369b28j03K94j77J11q1j78K79J45m4k93J98P2P3k10O9j30M34J14m76L64o0j46
$$ -228 -331 -37 -214 -103 -184 -362 -83 62 18 -275 -77 -5 68 -142 -73 -203 231 345 -131 233 173 27
4391B7J62J5k8n1L9j16q0K63L86m46n0K28K42j94m85q7J90J54k07j08L36q7pk17
$$ 27 189 204 176 125 164 48 -32 231 617 171 121 349 591 397 -88 -175 15 169 -38 -146 190 103 96 -121
4415a21k5J43l0j35Rl3j26J65J29k19k46N64Rl32N1%j0p7L07r2L61l06k20L71
$$ -121 -146 -3 -33 -168 -159 -192 -318 -153 -24 -243 -489 75 84 -248 -197 -197 -207 -284 23 -69 292 -14 -234 137
4439A37m4N5J09j61K53k24J60m1l1K34j97j27J55j3rj40L0j40Q8O9j47J5p7J20
$$ 137 93 148 257 96 349 125 285 244 213 447 250 123 278 265 256 116 146 6 94 163 16 31 -46 74
4463G4l7j74K76p4Q9k61K40k28j01J8N1M1j43j05k7k76L42N9j41M20j33J27k26
$$ 74 37 -137 139 65 154 -107 133 -95 -196 -178 -127 -86 -229 -334 -361 -637 -295 -236 -377 43 -90 37 -189
4486a89J31M6o5M45n94J34j50K32K84j98j34J13j8J65J2k51J28qM4J44K84k03
$$ -189 -58 -12 -77 368 -226 -92 -242 -10 274 76 -58 55 37 202 214 -37 91 83 127 271 555 352
4508C52j16p0j18K94k33k17K26N5J04j80l25j90P8J89J81j75P2l6q2O8m0L41m41
$$ 352 236 166 48 342 109 -108 118 173 277 97 -228 -418 -340 -151 30 -145 -73 -109 -191 -123 -163 178 -263
4531b63J65m13N44k81L5P5L5j25pK36p8J44j44j38J57l9M09m75k0L21j15M83n16
$$ -263 -98 -511 33 -248 -213 -138 -103 -228 -235 1 -77 67 -77 -215 -58 -97 312 -163 -183 138 23 506 -10
4554a0L94k29o6j27J52nj84N22l48M3K52Q7Q5l18j69R8J77l09J70n90N32P4m49
$$ -10 384 155 89 -38 114 109 -75 447 99 142 394 481 566 248 79 177 354 45 215 -375 157 231 -218
4577b18J34m3Q2k8mK1N24n34K24k12J08k30r7j53K34N0J00J03j96k5L30j67m38
$$ -218 -84 -127 -45 -73 -77 -56 468 -66 158 -54 54 -176 -273 -426 -192 -142 -42 61 -135 -160 170 3 -435
4600d35N39PJ9o10K86L22j1k00O0k81M43M0J02J04k98M80l94n29O59q5M9m0l82
$$ -435 104 111 130 -480 -194 128 117 -83 -23 -304 139 179 281 385 87 567 173 -356 303 218 267 227 -155
4623a55L69J16n13K85P9M9j98M0j09M09l46N9Q7k73L65j95m39k3L97M4j60M7j87
$$ -155 214 330 -183 102 181 230 32 72 -37 372 26 85 172 -101 264 69 -370 -393 4 48 -112 -65 -252
4646b52L58j76m6K51m19J86k18J15N2J0M0J12J58j0r3K20k2l39N05l93k27L91
$$ -252 106 -70 -116 135 -284 -98 -316 -201 -149 -139 -99 13 171 161 68 288 266 -73 432 39 -188 203
4668B03K7l6J38j30n1r3j38k4J83j11R7j63J98Q6o1R5j58O2O7L9n08L8J62k88
$$ 203 230 194 332 202 151 58 -80 -104 79 -32 65 -98 100 186 125 220 62 124 191 230 -278 -240 -78 -366
4692c66M80k88J64k58J75j81Q7K22k55L9j14m9J69rn0P4J24J8J45l24P6J53K86
$$ -366 114 -174 -10 -268 -93 -274 -187 35 -220 -181 -295 -344 -175 -184 -234 -160 -36 -18 127 -197 -121 32 318
4715C18k89k71J10K59l17j0L6L66K71j47j0p7J5R4k03k01N45j35k81Q5j31K14
$$ 318 29 -242 -132 127 -190 -200 -164 202 473 326 316 239 254 348 145 -56 489 354 73 158 27 241
4737B41k9R1k98N6O7M5l4k98k4K81j14J2j66J59n4q3K49k02k92K40m04L47o6l0
$$ 241 212 303 5 61 128 173 139 -159 -183 98 -16 -4 -170 -11 -65 -148 101 -101 -393 -153 -557 -210 -276 -306
4761c06j62K89Q1j51R3K31j61O0k97K99J25L4j93M9K4k2QO1j3K66n3k41J29J27
$$ -306 -468 -179 -98 -249 -156 75 -86 -26 -323 -24 101 135 -58 -9 15 -7 1 62 49 315 262 21 150 277
4785B77m12K34K10j62n5j64K99j57J05J67m6k83oK92m4j73m11N25k32K47j40r6
$$ 277 -135 99 309 147 92 -72 227 70 175 342 296 13 7 299 255 82 -329 196 -36 211 71 -25
4807b5j0L3k37l1M3o9J11P9o7k63L40K7j57K40k14q7M57n05m5L85J01m59L33j96
$$ -25 -35 -2 -239 -270 -227 -296 -185 -106 -173 -436 -96 -69 -226 14 -200 -287 170 -335 -380 5 106 -353 -20 -216
4831b16L73p9o7K0R5nJ09j05J26%K26j96j12L6L8k15l6K43P8l24L39l31J90j47
$$ -216 157 78 11 31 126 121 230 125 251 251 477 281 169 205 243 28 -8 235 313 -11 328 -3 187 40
4855D0l7J97n03L81j32j96L67o3j8k19o3N2J42j91Q7r6m3L73k57K08l05K49k10
$$ 40 3 200 -303 78 -54 -250 117 54 36 -183 -246 -194 -52 -243 -156 -252 -295 78 -179 29 -276 -27 -237
4878b37n9j28M21j73p8K10M0n2J33k03R7K5RK9J83k9j49NP6q4j14M01k79K7J41
$$ -237 -296 -424 -3 -176 -254 -44 -4 -56 77 -126 -29 -4 5 34 217 188 39 44 120 36 -78 323 44 71 212
4903B12j78Q6J34k60K44K32l29O8j40l6k4q0j60K78k37m9K41Nk35J37K2j00M24
$$ 212 34 120 254 -6 238 470 141 209 69 33 9 -71 -231 47 -190 -239 2 7 -228 -91 -69 -169 255
4926B55k24l46N02n86M61k14j28j61L74J72q0j08J06k75K06o6R8o9l1M5j14J04
$$ 255 31 -315 187 -399 62 -152 -280 -441 -67 105 25 -83 23 -252 -46 -112 -14 -83 -114 -69 -183 -79
4948g9K63J88l07J74J33k14k12K27j32j5K8K41m14O08l81J8N9j79K76m44M26l97
$$ -79 184 372 65 239 372 158 -54 173 41 26 54 295 -119 489 108 126 185 6 282 -162 264 -133
4970a33J89j11J18o3m59N96l80P1j66K47K66k65p0j73Q6K15j14pN9p5j38L1K5
$$ -133 56 -55 63 0 -459 137 -243 -172 -338 -91 175 -90 -160 -333 -247 -32 -146 -153 -94 -169 -307 -276 -251
4993b51R1L07k40l8J99J93k30J31n8k20K7k4%K10K17m05J19Q2J02m10L52K3k35
$$ -251 -160 147 -93 -131 68 261 31 162 104 -116 -89 -113 -113 97 314 -91 28 110 212 -198 154 177 -58
5016e8K09N3k14J73j26J68j33q0O9j57L27j56r4P4k46L10l35J34L0k19Q2N9r9
$$ -58 151 204 -10 163 37 205 72 -8 61 -96 231 75 -19 55 -191 119 -216 -82 -52 -271 -189 -130 -229
5039b29n6K02k0K79m28K23p2K46j19K27l65J80j39o0N2j24p7L25j07N0K4o5l3
$$ -229 -285 -83 -103 176 -252 -29 -101 145 26 253 -112 68 -71 -131 -79 -203 -280 45 -62 -12 12 -53 -86
5062h6l5M32k47K22P0j32K39m38L58j91j80K03j16j66o5o5K13j18K53j51Q4j33
$$ -86 -121 311 64 286 356 224 463 25 383 192 12 215 99 -67 -132 -197 16 -102 151 0 84 -49
5084d9J66j47m37N91k71J83l80L03j09Pj60O1K83p1j45K9O7j63M9r4m9K69K45
$$ -49 117 -30 -467 124 -147 36 -344 -41 -150 -143 -303 -242 41 -30 -175 -146 -79 -242 -193 -287 -336 -67 178
5107A78l05m9K81N2m5m03L57P5j30l55M06RJ28l00L50p5j64J17L7j39K54lk5l6
$$ 178 -127 -176 105 157 112 -291 66 141 11 -344 62 71 199 -101 249 174 10 127 164 25 279 276 251 215
5131B15j09k58K78P4l2J34k46Ol55J52O2J65O0m31L52k15o5M8j31M7J97k19R5
$$ 215 106 -152 126 200 168 302 56 62 -293 -141 -79 86 146 -285 67 -148 -213 -165 -296 -249 -52 -271 -176
5154a76N2K00k62L02m25Q0K5J21O6m1r7J34P6k20J73l5j28K09J79J84k63Q3N7
$$ -176 -124 76 -186 116 -309 -229 -204 -83 -17 -58 -155 -21 55 -165 8 -27 -155 54 233 417 154 237 294
5177B94K12m75J54r2J32k38J29P2k48J18o4J55k98M4L20j98l5j10K47l69L28k11
$$ 294 506 31 185 93 225 -13 116 188 -60 58 -6 149 -149 -105 215 17 -18 -128 119 -250 78 -133
5199a33J57k70J78K0mj78O4J08R9m7l8L5l25L77j16J8q3Q0k67J44N10l82J1j92
$$ -133 24 -246 -68 -48 -52 -230 -166 -58 41 -6 -44 -9 -334 43 -73 -55 -138 -58 -325 -181 329 -53 -42 -234
5223b34K39J36m35K44j57J54O9J11j88K47J93l76J88J84j93Q3p3J92j20k17N5
$$ -234 5 141 -294 -50 -207 -53 16 127 -61 186 379 3 191 375 182 265 192 384 264 47 102
5244A02k99M06j08k98k6J81l0J65P6l20K1R8k36N79j78p7j93L4j08J94j82M7N2
$$ 102 -197 209 101 -197 -223 -42 -72 93 169 -151 -130 -32 -268 311 133 56 -137 -103 -211 -17 -199 -152 -100
5267a00K40k04J11j19l4k6J57l83J94o4M9J25M4j55l0J44J67oj85K88o3J8l61
$$ -100 140 -64 47 -72 -106 -132 25 -358 -164 -228 -179 -54 -10 -165 -195 -51 116 110 -75 213 150 168 -193
5290a93R3J99k00L26k14n0M9L87k96j63j1LK27k30J38k28J49M4m9j32L41k88k30
$$ -193 -100 99 -101 225 11 -39 10 397 101 -62 -73 -70 157 -73 65 -163 -14 30 -19 -151 190 -98 -328
5313c28L03K30j76k00R5J87k31J25k08J74k0J16j39j00N97l63l54KP0K10r3n1
$$ -328 -25 205 29 -171 -76 111 -120 5 -203 -29 -49 67 -72 -172 425 62 -292 -290 -220 -10 -103 -154
5335a54n5J67N47o52N0J40J60p1n1l56L48J17j93k46N23q7m13K25P4K47m03K48
$$ -154 -209 -42 505 -147 -97 43 203 132 81 -275 73 190 -3 -249 274 187 -226 -1 73 320 -83 165
5357A65j45j91R8J1q7L95O6o69J35J22J46m29L56J62m64K26r4K11o3j19j8P9N
$$ 165 20 -171 -73 -62 -149 246 312 -357 -222 -100 46 -383 -27 135 -329 -103 -197 14 -49 -168 -186 -107 -102
5380a02Q6j28j33J87L30k35k96K10L2J44j11J80k1j76j34K93j18J80m43K41J20
$$ -102 -16 -144 -277 -90 240 5 -291 -81 -49 95 -16 164 143 -33 -167 126 8 188 -255 -14 106
5401A06J29j90Q8P5j0n8j72L33l63P3K11N8k61K14k63L9k40L72l7j92M17j94P
$$ 106 235 45 133 208 198 140 -32 301 -62 11 222 280 19 233 -30 9 -231 141 104 -88 329 135 142
5424A42n31K55L48J38m11j99Q6J99j67K71k71J78K2K9r5p0L0N1k87L35r2M1ml
$$ 142 -389 -134 214 352 -59 -258 -172 27 -140 131 -140 38 60 89 -6 -76 -46 5 -282 53 -39 2 -2 -5
5448ej19J13L17j16l82O75o10J0L48l32L53k97j14M18l93M02k97p4J57ojJ1J32
$$ -5 -124 -11 306 190 -192 483 -127 -117 231 -101 252 -45 -159 259 -134 268 -29 -103 54 48 47 58 190
5471A90l03N1j06J62Qkj04J34l7K3j20j37L39l13K92P2k70l5K01M6K5l09J93r1
$$ 190 -113 -62 -168 -6 2 0 -104 30 -7 16 -104 -241 98 -215 77 149 -121 -156 45 91 116 -193 0 -91
5495i1J18j58N8K0l18N40m3j09j27m2K2K8J78k10OK39j23M11j28j69j14K89j84
$$ -91 27 -131 -73 -53 -371 169 126 17 -110 -152 -130 -102 76 -134 -128 111 -12 399 271 102 -12 277 93
5518I3j14K1o6K46j84j30L97k80K62j28j80J41m0J34k10J59q7R9Kr3j0o4l81M16
$$ 93 -21 0 -66 180 -4 -134 263 -17 245 117 -63 78 38 172 -38 121 34 133 135 42 32 -32 -413 3
5542Ck63L34k2l66Q5J57l7R3k08J77kK96j10P7j91n38P74k3k80L40k71k2N3K76
$$ 3 -260 74 52 -314 -229 -72 -109 -16 -224 -47 -49 247 137 214 23 -515 259 236 -44 296 25 3 56 332
5566C32q1m23J40m2j9J31M07n66J64J8K5K60m29J76K9J00j28K89l69J5j48M74
$$ 332 251 -172 -32 -74 -93 38 445 -121 43 61 86 346 -83 93 122 222 94 383 14 29 -119 355
5588C55j44l58n8K52qqK33o16J34J68QJ19m55M77l28L09m15N7J20J86L9r5J57
$$ 355 211 -147 -205 47 39 31 264 -352 -218 -50 -42 77 -378 99 -229 80 -335 -278 -158 28 67 -28 129
5611A29l22pM07j10J22J1j22k10L44L1l25j90J85K53l22P1M6j0K46m5K2l82L65
$$ 129 -193 -200 207 97 219 230 108 -102 242 273 -52 -242 -57 196 -126 -55 -9 -19 227 182 204 -178 187
5634A87m73M33Kr7J82j93O1K6m57N12j93j01j08J54mK59k02j3jj8j38l27N82j60
$$ 187 -286 147 149 52 234 41 102 128 -329 183 -10 -111 -219 -65 -69 190 -12 -25 -26 -44 -182 -509 73 -87
5658h7j2j93N48n60K71j1m3j07j0J1K72j73j17J68k27K44K40p4J72m17M01N9j38
$$ -87 -99 -292 256 -304 -33 -44 -87 -194 -204 -193 79 -94 -211 -43 -270 -26 214 140 312 -105 296 355 217
5681B17j70J7o3l0J80l23L06k65K51l13J32K37Nl93N81k08k30k7R2J97l07Q6j33
$$ 217 47 64 1 -29 151 -172 134 -131 120 -193 -61 176 181 -212 369 161 -69 -96 -4 193 -114 -28 -161
5704a61J26K64j99j25O2KR9k96J82J69J72k71k87J55J86J41l35n3L79l72K6M3
$$ -161 -35 229 30 -95 -33 -31 68 -228 -46 123 295 24 -263 -108 78 219 -116 -169 210 -162 -136 -93
5726i3Q2J05L7Om66K70K37j25j59K5Q5j9J60m5j4n3k55J99q0J28l21M73L6n8R9
$$ -93 -11 94 131 137 -329 -59 178 53 -106 -81 4 -15 145 100 86 33 -222 -23 -103 25 -296 177 213 155 254
5751B54l92K55m1j29L32l02oJ74p6R4j90Q0k10N1o7J23k94M85m33K34j55K0n2
$$ 254 -138 117 76 -53 279 -23 -29 145 69 163 -27 53 -157 -106 -173 -50 -344 141 -292 -58 -213 -193 -245
5774b45J77R1l08J22k44N22l05O0q0K35n7l55L07J59J3j12O5Q9k1j71L18l04J61
$$ -245 -68 23 -285 -163 -407 115 -190 -130 -210 25 -32 -387 -80 79 92 -20 45 134 113 -58 260 -44 117
5797A17m8j77P2K86j31J7k51K6k9R6o5J55nJ80l03k50L86r3o4K05m65J39o1K11
$$ 117 69 -108 -36 250 119 136 -115 -89 -118 -22 -87 68 63 243 -60 -310 76 -17 -81 124 -341 -202 -263 -52
5821e2l9r2n2K56l2J7j0o0J33k13j8k2K39o9j70k25L39k4L14n43J34M4Q9K41L4
$$ -52 -91 -183 -235 21 -11 6 -4 -64 69 -144 -162 -184 55 -14 -184 -409 -70 -94 220 -323 -189 -145 -56 185 219
5846B19k54L01m90K56N5k20K51j09J10j05pj09K04l97M11L4j01J17k18J18p4m9
$$ 219 -35 266 -224 32 87 -133 118 9 119 14 7 -102 102 -295 116 150 49 166 -52 66 -8 -57
5868e7J91p3P1j58j63O28k84j44k48Q6M68m74J85k65Kk18K98q3K06J93l61k4J52
$$ -57 134 61 132 -26 -189 439 155 11 -237 -151 317 -157 28 -237 -235 -453 -155 -238 -32 161 -200 -224 -72
5891g2L59m47J20K54l27M35l79Q2j27M09n6m32J97q9K41k66K60qM38l28j70k1
$$ -72 287 -160 -40 214 -113 322 -57 25 -102 307 251 -181 16 -73 168 -98 162 154 592 264 94 73
5913G3j28K54m87L10P3K46o0k60j12O0R8J80k86J21R6j9k50K35K8k18j4J77j30
$$ 73 -55 199 -288 22 95 341 281 21 -91 -31 67 247 -39 82 178 159 -91 144 172 -46 -60 117 -13
5936a3Q9l55J57j13J65k7p5j15K52n3m0K85M6l70M25m23L46l73K30k59k3K96k27
$$ -13 76 -279 -122 -235 -70 -97 -172 -287 -35 -88 -128 157 203 -167 258 -165 181 -192 38 -221 -244 52 -175
5959a75J56J34r3R9O9j91n5O1M1R3j70L50l01Q9l76R6P2J46J07J66r2j06K61k12
$$ -175 -19 115 22 121 190 -1 -56 5 46 139 -31 319 18 107 -269 -173 -101 45 152 318 226 120 381 169
5983A69j94p1J24q1N8nj15l4J52k73J54j85l3P5R5J57j52J00pm2K75j1J30l30
$$ 169 -25 -96 28 -53 5 0 -115 -149 3 -270 -116 -301 -334 -259 -164 -7 -159 -59 -66 -108 167 156 286 -44
6007d4L3O0J32PR8j53k32J63j27R0J5LL1p1J5r9k0jJ32O2K15l98J76o4J38k14
$$ -44 -11 49 181 188 286 133 -99 64 -63 27 42 45 76 5 20 -79 -99 -100 32 94 309 -89 87 23 161 -53
6033e3j90M77j17J8k71k04J80L24j18k76k19O11j76O0q5nk31M38k96J64P4j59
$$ -53 -243 234 117 135 -136 -340 -160 164 46 -230 -449 162 -14 46 -39 -44 -275 163 -133 31 105 -54
6055e4J8j23pK15j52J91k3j01q6K49n19M42K29l03J85j33R5q4j20J83R7n00N94
$$ -54 -36 -159 -166 49 -103 88 65 -36 -122 127 -392 50 279 -24 161 28 123 39 -81 102 199 -301 293
6078B93j35k11J25nK92m13J97l61K47r7o0J91l39K7K97o3J5J28M1l16K43l92N29
$$ 293 158 -53 72 67 359 -54 143 -218 29 -68 -128 63 -276 -249 48 -15 0 128 169 -147 96 -296 233
6101B33k72k26o8M35p4p7RK01l79M5K54j53j2J6J0K01l93K64O5k62Q7k77M58j13
$$ 233 -39 -265 -333 102 28 -49 -40 161 -218 -173 81 -72 -84 -68 -58 143 -250 14 79 -183 -96 -373 85 -28
6125b8Q2k67L25K9j04qjOJ2K43l04L2Q3J34k42r8K7J49j04J30j28l79M17o3l1
$$ -28 54 -213 112 141 37 29 28 34 46 289 -15 17 100 234 -8 -106 -79 70 -34 96 -32 -411 6 -57 -88
6150h8j27K98k1K08m03P5J79j93p9J25K02k51P9o1l3k5N3Q4L73l10J71k71l88
$$ -88 -215 83 62 270 -133 -58 121 -72 -151 -26 176 -75 4 -57 -90 -115 -62 22 395 85 256 -15 -403
6173d03M48k40N7K96j30p4m5J09m0K53m05K25j96J5K7q3K02J66j93L5Mj98M84
$$ -403 45 -195 -138 158 28 -46 -91 18 -22 231 -174 51 -145 -130 -103 -186 16 182 -11 24 28 -170 314
6196C14l71k96L05J70p6j26j4J94j43J45l39R1N9K19K07l55k1o8M0N0j6o5o2L08
$$ 314 -57 -353 -48 122 46 -80 -94 100 -43 102 -237 -146 -87 132 339 -16 -37 -105 -65 -15 -31 -96 -158 150
6220A50r6J52l00j49M32l55N2K68k48J58l2j93K95l30L81l45l7L8L23j80j49J24
$$ 150 54 206 -94 -243 189 -166 -114 154 -94 64 32 -161 134 -196 185 -160 -197 -159 164 -16 -165 -41
6242d1K2J62K2J0p1k13P8K70j58J36m97K96j59O6J64n8k41l2L34M9m03L41j74
$$ -41 -19 143 165 175 104 -109 -31 239 81 217 -280 16 -143 -77 87 29 -212 -244 90 139 -264 77 -97
6265i7j59j07J58L31K2M4l24K22qo0O7j57o1K85m1l4k63J7J41J57k87K02J07k03
$$ -97 -256 -363 -205 126 148 192 -132 90 82 22 89 -68 -129 156 115 81 -182 -165 -24 133 -154 48 155 -48
6289d8J37j11K20r6j53L84o5j18J65m68J29J79k19lk3K76q3n6p6l7J36j84N4K6
$$ -48 89 -22 198 102 -51 333 268 150 315 -153 -24 155 -64 -67 -90 186 103 47 -29 -66 70 -114 -60 -34
6313c4J5M3l7j53J28J21K37k13l02J24L49k89J22k00p0N5j69j65L60N5K59j68
$$ -34 -19 24 -13 -166 -38 83 320 107 -195 -71 278 -11 111 -89 -159 -104 -273 -438 -78 -23 236 68
6335F8j73j74K79J2J62k89K91l59O9n3j04L82J37o1k55O8j99R5L36j05m71M02
$$ 68 -105 -279 0 12 174 -115 176 -183 -114 -167 -271 111 248 187 -68 0 -199 -104 232 127 -344 58
6357E8K22l57j11N2L73k37K34j86Qk8K2j5JJ81k22k10lL92j92P4r8J40R9l02m0
$$ 58 280 -77 -188 -136 237 0 234 48 56 28 50 35 36 217 -5 -215 -218 174 -18 56 -42 98 197 -105 -145
6382a45J06q5J69k81L18l35J23K62m03J42L88m14l7K23k3O1m7q4j80M11k52J31
$$ -145 -39 -124 45 -236 82 -253 -130 132 -271 -129 259 -155 -192 31 8 69 22 -62 -242 169 -83 48
6404D8n3O1k5J10k53K36M8k13r4L4L2K51l21j1J89J09K7l86K16k3k3L9J22j80
$$ 48 -5 56 31 141 -112 124 172 -41 -135 -101 -69 182 -139 -150 39 148 175 -211 5 -18 -41 -2 120 -60
6428f0J91l4J68P4m17O8Q3R7n01L64j26k14K25K9R2l25M49q0k21J99q6m3K76j51
$$ -60 131 97 265 339 -78 -10 73 170 -331 33 -93 -307 -82 -53 39 -286 163 83 -138 61 -25 -68 208 57
6452E7j0l5j74K09L92n25j63J87j38j60K36K85m27J89q1K54J6Kj68j37P9J28j68
$$ 57 47 12 -162 47 439 -86 -249 -62 -200 -360 -124 161 -266 -77 -158 96 112 114 -54 -191 -112 16 -152
6475a52L33k60j6J04O0o2J38k0j02R2j47J40l28k9K73J3n2L1m0K8p2l2P3N4r9
$$ -152 181 -79 -95 9 69 7 145 125 23 115 -32 108 -220 -249 24 37 -15 16 -24 4 -68 -100 -27 27 -72
6500g2K35l61q7n5K70K60m74M78k32K17m07J29L98l94Q0M5j45JL97k50k30K76
$$ -72 163 -198 -285 -340 -70 190 -284 194 -38 179 -228 -99 299 -95 -15 30 -115 -114 283 33 -197 79
6522G9M8k37qL60n09M16l39J38J13O3n1R2k35K54j93L2j84K42k13j98K31L77p5
$$ 79 127 -110 -118 242 -267 149 -190 -52 61 124 73 165 -70 184 -9 23 -161 81 -132 -330 -99 278 203
6545B03l33q3j02Q64n19K67o09K12J74Q8K1l39K58j75K7K41m36J89J08R7l87N17
$$ 203 -130 -213 -315 549 30 297 -312 -100 74 162 183 -156 102 -73 -46 195 -241 -52 56 153 -234 283
6567B83j79k47P8P1K36L3m79N30j89k05L55l67J16N6o6K43l02j01J24Q5j93O6
$$ 283 104 -143 -65 6 242 275 -204 326 137 -68 287 -80 36 92 26 269 -33 -134 -10 75 -118 -52
6589e2J92l94K00j51L07Q0k44K53j92j66N7j38K67l43L86o9m4k01J13K22j72L61
$$ -52 140 -254 -54 -205 102 182 -62 191 -1 -167 -110 -248 19 -324 62 -7 -51 -252 -139 83 -89 272
6611B72o6ql34P1K03l44L42j96j18K04P4k99L02oQJ2m94N31l30L20p5L1J03r7
$$ 272 206 198 -136 -65 138 -206 136 -60 -178 26 100 -199 103 97 105 117 -377 154 -176 144 69 100 203 106
6635A06J17m4n6J10M6l36J11r1J23J66l23J97j28J09k4j75J76j09R0j16j68L30
$$ 106 223 179 123 233 279 -57 54 -37 86 252 -71 126 -2 107 83 -92 84 -25 65 -51 -219 111
6657A11ll53K57j65P5k3k39J3L69k31k1K77k6l99K78K53q3k26k2L88J2l55J72
$$ 111 108 -245 12 -153 -78 -101 -340 -327 42 -189 -210 67 41 -358 -80 173 90 -136 -158 230 242 -113 59
6680E9J9o5p0L15l29j64N00q1Q7j07l30j02N70m90K06k68M32l53J51L8j03J82
$$ 59 78 13 -57 258 -71 -235 265 184 271 164 -166 -268 302 -188 18 -250 182 -171 -20 18 -85 97
6702I7j74j19J14K53J00l33j42N57k47l23L03q2L1n6l1J52m2k5l14L42N4l1j42
$$ 97 -77 -196 -82 171 271 -62 -204 353 106 -217 86 4 35 -21 -52 100 58 33 -281 61 115 84 -58
6725e8J53l28K14O6J8j13j7J63m46N12l16J32l24J69K41k26K44J83j91K69n30
$$ -58 95 -233 -19 47 65 -48 -65 98 -348 164 -152 -20 -344 -175 66 -160 84 267 76 345 -185
6746a85J14P4k40n0L44k03k68K39L01k47M35l41J55l03K73Q5l30q6M0K01k94L20
$$ -185 -71 3 -237 -287 57 -146 -414 -175 126 -121 314 -27 128 -175 98 183 -147 -233 -193 8 -286 34
6768C4k5m8K54m68L11m0K0k07K64N4l82J37K87m55L78l03J29j70M24j97j1p3J19
$$ 34 9 -39 215 -253 58 18 38 -169 95 149 -233 -96 191 -264 114 -189 -60 -230 194 -3 -14 -87 32
6791C2O1K1j51o5O68o82J6K95m46K26J36l0J3k06M60j71l79L54j37J3m1k3J96
$$ 32 93 114 -37 -102 566 -116 -100 195 -251 -25 111 81 94 -112 348 177 -202 152 15 28 -13 -36 160
6814A60M5q5j25K67l47j7Q1j00J65O6l4Rk99K49j00J7j31M8m6K02O2j86J93k91
$$ 160 205 120 -5 262 -85 -102 -21 -121 44 110 76 85 -214 35 -65 -48 -179 -131 -177 25 87 -99 94 -197
6838a97K99k13K82n06N15n2j46r2N1k7L26n12L41j58P8J69j53K60k84p6K38l6
$$ -197 102 -111 171 -335 180 128 -18 -110 -59 -86 240 -272 69 -89 -11 158 5 265 -19 -95 143 107
6860A07k07J71o2j6J54jL8J30j63n2k4m04L3M68r7m1j7o8N9O3l46M06J2k23M9
$$ 107 -100 71 9 -7 147 146 184 314 151 99 75 -329 -296 172 75 34 17 -51 8 71 -275 131 143 -80 -31
6885c1o0o7M6r2K98j93p1J06m7O4Rj19R8JK9j91j21J82pJ10K2m9K99mj67j06K3
$$ -31 -91 -158 -112 -204 94 -99 -170 -64 -111 -47 -38 -157 -59 -58 -29 -220 -341 -159 -166 -56 -34 -83 216 212 45 -61 -38
6912c8J14J87j49n8k48L12m60K78k3j38L43l18L43p8K63m08L31k84O9j43L65r2
$$ -38 76 263 114 56 -192 120 -340 -62 -85 -223 120 -198 145 67 330 -78 253 -31 38 -105 260 168
6934A68M4n8m99M93q3L3k42R8J43m06L36J54l57J29L15k64l44O63l80j92J94l8
$$ 168 212 154 -345 148 65 98 -144 -46 97 -309 27 181 -176 -47 268 4 -340 323 -57 -249 -55 -93
6956i3Q9j34L84r4p3J04j74j61N5q1L00J7l11k63N11r4K29k40L7j87L40p6J16
$$ -93 -4 -138 246 152 79 183 9 -152 -97 -178 122 139 -172 -435 76 -18 211 -29 8 -179 161 85 201
6979B01j85l12K08j2L62j83Qj41j88K22l83K59j50M76l2l21J94j24J60M2j70N9
$$ 201 16 -296 -88 -100 262 79 87 -54 -242 -20 -403 -144 -294 182 150 -171 23 -101 59 101 -69 -10
7001a0J1km6r0j37L05j2O3l81J29M11n81K83K05K7k74j77L99k2o4j04k00L04M
$$ -10 1 -1 -47 -137 -274 31 19 82 -299 -170 241 -340 -57 148 175 -99 -276 123 101 37 -67 -267 37 41
7025D1k5r1l20N40r7j07L0j27M47k15o3J33j55R9l6K18j93k92K45J78l26K25p1
$$ 41 16 -75 -395 145 48 -59 -29 -156 291 76 13 146 -9 90 54 272 79 -213 32 210 -116 109 38
7048C8P7k07j06J73j16n0J51o6J74k25L97l22L35m28L53J58n38M43j20k18N0K18
$$ 38 115 -92 -198 -25 -141 -191 -40 -106 68 -157 240 -82 253 -175 178 336 -202 241 121 -97 -47 171
7070A71k68K26j65j77K84j78O2K29j96k61M41J30m83L81lmj06k96K86j85Q1J52
$$ 171 -97 129 -36 -213 71 -107 -45 184 -12 -273 168 298 -185 196 193 189 83 -213 73 -112 -31 121
7092A21m59K00L34j09N6n82N45pk20O6j89L95m8J6J8n2k37jN7K25J41l97N0o8
$$ 121 -338 -138 196 87 143 -439 106 99 -121 -55 -244 151 103 119 137 85 -152 -153 -96 129 270 -127 -77 -145
7116a45J90j1r8j61P5J61R2k10k5J90m71L54L39k54o0K01k21J80k38K52K9J01
$$ -145 45 34 -64 -225 -150 11 103 -107 -132 58 -413 -59 280 26 -34 167 -54 126 -112 140 169 270
7138B70j07q2j6Q7J60m72M9m4K86k42L46k90L35k23m60N75r9j07L13l33Q0jj76
$$ 270 163 81 65 152 312 -160 -111 -155 131 -111 235 -55 280 57 -403 172 73 -34 279 -54 26 25 -151
7161a51J67N8n9o5R7l3r5L5mrL47l56J37Kk17K77l10K75k8k07N2K29K66m61J76
$$ -151 16 74 15 -50 47 14 -81 -46 -50 -59 288 -68 69 71 -146 131 -179 96 68 -139 -87 142 408 -53 123
7186A23j11j71j43M34r8k22J23k8L55l17q6J03j32J94o3M9J25J85m12J01J94k24
$$ 123 12 -159 -302 132 34 -188 -65 -93 262 -55 -141 -38 -170 24 -39 10 135 320 -92 9 203 -21
7208b1k57L60J20O9k43l03J36j27K73P7l05k9n7N03k25k69J93R8k40p5n3N91K12
$$ -21 -278 82 202 271 28 -275 -139 -266 7 84 -221 -250 -307 196 -29 -298 -105 -7 -247 -322 -375 216 428
7231D28l10Mj77q4J71o5J05L9M11m20p9k32J86k53L45Pj25K28QJ59k41p2k68J84
$$ 428 118 122 -55 -139 32 -33 72 111 522 102 23 -209 -23 -276 69 76 -49 179 187 346 105 33 -235 -51
7255e1j25N3M24k02J69r8m59L81k32K16k28K78j24K8o6P6l0k2J04j79O3k39K41
$$ -51 -176 -123 301 99 268 170 -289 92 -140 76 -152 126 2 30 -36 40 10 -12 92 -87 -24 -263 -22
7278b2Q8k19j22m5q4J78N66l75j88n8J84Q3mJM3k42L28O9j76k05J29O4N0k27J16
$$ -22 66 -153 -275 -320 -404 -226 340 -35 -223 -281 -97 -14 -18 -17 26 -216 112 181 5 -200 -71 -7 43 -184 -68
7303f8n9J78j79m7j19N02l37o7R3P9L80m88R3j16J47j70J96j60K85r4O8j94R9
$$ -68 -127 51 -128 -175 -294 208 -129 -196 -103 -24 356 -132 -39 -155 -8 -178 18 -142 143 49 117 -77 22
7326B2j08O2J86j80l4q5kn5q0J18M5k44K8J47J73L97o72L31l75L40k15J69M74
$$ 22 -86 -24 162 -18 -52 -137 -139 -194 -274 -156 -111 -355 -327 -180 -7 390 -282 49 -326 14 -201 -32 442
7349D42k58r8O2l8j62M12m61m0L14r3K03k83J39p6R3K6l32q6M19j79R3j21j61
$$ 442 184 86 148 110 -52 360 -101 -141 173 80 283 0 139 63 156 182 -150 -236 183 4 97 -24 -185
7372a85K80J12l87Q0J7M6r3J85k48J64K2j00J21K2j22J25l8j1r4L3J59l29L07
$$ -185 95 207 -180 -100 -83 -37 -130 55 -193 -29 -7 -107 14 36 -86 39 1 -10 -104 -71 88 -241 66
7395F6k00K34mj78K97q3R3n9K01l69J54Op8m9M2kK57r7k06k9N4j92L31k17r5J26
$$ 66 -134 100 96 -82 215 132 225 166 367 -2 152 158 80 31 73 71 328 231 25 -4 50 -142 189 -28 -123 3
7421Ck70K63O7j87qK58l50J43P1K7j82L39j35J7k20N2J20M9Q3r3k39K01J43j54
$$ 3 -267 -4 63 -124 -132 126 -224 -81 -10 17 -165 174 39 56 -164 -112 8 57 140 47 -192 9 152 -2
7445bj97K4J40K4J68j03n8j15K26j54L63k23q8q6j9l8R0p0J39O9m01K95k80L85
$$ -2 -199 -175 -35 -11 157 54 -4 -119 107 -47 316 93 5 -81 -100 -138 -48 -118 21 90 -311 -16 -296 89
7469H9j03J4J06R4o0j3j52l1J50j6J32j52Rj20J61Lm02L80K05m54L22j28k0j0
$$ 89 -14 0 106 200 140 127 -25 -56 94 78 210 58 67 -53 108 111 -291 89 294 -160 162 34 14 4
7493Dj48K9K74l52J13J94k91N8j21N69m76KK34P4l66L71k6N2l03j73M67n7O2k19
$$ 4 -144 -115 159 -193 -80 114 -177 -119 -240 329 -147 -145 89 163 -203 168 142 194 -109 -282 185 128 190 -29
7517b9j06O6K77l64K58p8k7j07k43L79LJ01l04K6M87m3Q6o00L98j35J39k61l22
$$ -29 -135 -69 208 -156 102 24 -3 -110 -353 26 29 130 -174 -148 339 296 382 -218 180 45 184 -77 -399
7540c99N25n6JK94m76L37k83J32j25P0l01R3K65Rj2L3o6L8j17k2L7N3j4q0J44
$$ -399 126 70 71 365 -111 226 -57 75 -50 20 -281 -188 77 86 74 107 41 79 -38 -60 -23 30 16 -64 80
7565H0o9j32J24k2K44l03K87j64J30k11J04J76j66N0j44k04L86M8j11l04J50M3
$$ 80 11 -121 3 -19 225 -78 209 45 175 -36 68 244 78 128 -16 -220 166 214 103 -201 -51 -8
7587hO1q8pk9k33L86j83P6k42K82j96L72l15j2l2K73o5J41l34L63l18L49l02k80
$$ -8 53 -35 -42 -71 -304 82 -101 -25 -267 15 -181 191 -124 -136 -168 105 40 181 -153 210 -108 241 -61 -341
7611c41L73j42r7j73N79j60j99N8J03m1mP9j08J4j22J41K31j98j43m8L65l81J20
$$ -341 32 -110 -207 -380 199 39 -160 -102 1 -40 -44 35 -73 -59 -181 -40 191 -7 -150 -198 167 -214 -94
7634i4J50Jj99J88k2K25l43J66j00n7L46j37L66m91j5K74j75j42K50n5j16j28
$$ -94 56 57 -142 46 24 249 -94 72 -28 -85 261 124 490 -1 -16 258 83 -59 191 136 20 -108
7656a08J93j21j24j10J12J86k03n9L54j47p2l7k7m5K11l5O0k35R7j15J22r7J57
$$ -108 85 -36 -160 -270 -158 28 -175 -234 120 -27 -99 -136 -163 -208 3 -32 28 -207 -110 -225 -103 -200 -43
7679d3m8J84k12J9q5J79P2j0l8J17j2k75J25q2R9m4L3q2L62J31l71R8J78l54n0
$$ -43 -91 93 -119 -100 -185 -6 66 56 18 135 123 -152 -27 -109 -10 -54 -21 -103 259 390 19 117 295 -59 -109
7704a09k54J51K45k71L6K63K50o12L13n1M3P1k03J31j41L72mk78k3n9PJ03P0K3
$$ -109 -363 -212 33 -238 -202 61 311 -301 12 -39 4 75 -128 3 -138 234 230 -48 -71 -130 -123 -20 50 73
7728G3L5o6j19k09M02l01K16j65M5K81k90j13J00J06J42J41k69J42J90j60k60
$$ 73 108 42 -77 -286 116 -185 31 -134 -89 192 -98 -211 -111 -5 137 278 9 151 341 181 -79
7749g9J90j37K12n2J98k08K7N0k04K86k6j79J4P5Q8m72K20J73m87M5L61J52J05
$$ -79 111 -26 186 134 332 124 151 201 -3 283 257 78 92 167 255 -217 3 176 -311 -266 95 247 352
7772C52l54K58k42p9j67j1J21j37K66K43m72P4K55n09L66r6j09J84K06l0k42j51
$$ 352 -2 256 14 -65 -232 -243 -122 -259 7 250 -222 -148 107 -402 -36 -132 -241 -57 149 119 -123 -274
7794b74K81L8K58l44N1R6l37J47M7J05j03K32k00k4K73k78L97n13M04k40N5m7
$$ -274 7 45 303 -41 10 106 -231 -84 -37 68 -35 197 -3 -27 246 -32 365 -148 256 16 71 24
7816B4qKK92l56Ll8j58J35J54q8j42K21RJ78l01k56j21N01n1l5j45L17k21P7k35
$$ 24 16 18 310 -46 -43 -81 -239 -104 50 -38 -180 41 50 228 -73 -329 -450 51 0 -35 -180 137 -84 -7 -242
7841b42J27j11M3K33k76j22J35K02L67n14K2K70k68J09J78o6j58Pj38L07j09k77
$$ -242 -115 -226 -183 50 -226 -348 -213 -11 356 -158 -136 134 -134 -25 153 87 -71 -64 -202 105 -4 -281
7863b81L81k27M01l18N5j6p8j67L44l53K34J22k93M86l85J70qj38L3k9L3m6K90
$$ -281 100 -127 274 -44 11 -5 -83 -250 94 -259 -25 97 -196 290 -95 75 67 -71 -38 -67 -34 -80 210
7886B10j83j87J19o9J53K8k38K14l37M48l25J92J4J17j16m9J71k77k6J62k15J16
$$ 210 27 -160 -41 -110 43 71 -167 47 -290 158 -167 25 39 156 40 -9 162 -115 -141 21 -194 -78
7908g8j0R4J29k64o7K99O9p6K92m06L60l06K93p4k10mj9J3n4N8R8k4j2l20K13
$$ -78 -88 6 135 -129 -196 103 172 96 388 -18 342 36 329 255 45 41 22 35 -19 39 137 113 101 -219 -6
7933fQ1k56J03m6J65k23k54M43j05J67j26j11L33M8j80r8L92m29o7l2K33M2L5
$$ -6 75 -181 -78 -124 41 -182 -436 7 -98 69 -57 -168 165 213 33 -65 327 -102 -169 -201 32 74 109
7956A09J4k77R7J50j74pj70J72k8J04P5j0J84l03Opk09O74n64P9J52n3j13K35
$$ 109 123 -154 -57 93 -81 -88 -258 -86 -114 -10 65 55 239 -64 -58 -65 -274 400 -164 -85 67 14 -99 136
7980A36j21q3J51J25Q5j57j48q9j32J89L94l00o1j57L04j56%j10P2N6p3L25j10
$$ 136 15 -68 83 208 293 136 -12 -101 -233 -44 350 50 -11 -168 136 -20 -20 -130 -58 -2 -75 250 140
8003A40M5k21j82L64m38K76K03l59R8pk04N26m24K53j26L42l15L25l24K26P7l06
$$ 140 185 -36 -218 146 -292 -16 187 -172 -74 -81 -285 241 -183 70 -56 286 -29 296 -28 198 275 -31
8025c1j22K63o0J93l20N5L74p73O84l58J11O5J06l40K05K4J96o6r6k21J78jk01
$$ -31 -153 110 50 243 -77 -22 352 -421 263 -95 16 81 187 -153 52 76 272 206 110 -111 67 66 -135
8048a35K98J9r3J51k33K37k70N0k14M3K88K65m23p1K18j96J61j4o1j00R8p8JK03
$$ -135 163 182 89 240 7 244 -26 24 -190 -147 141 406 -17 -88 130 -66 95 81 20 -80 18 -60 -59 144
8072A44r1q5o2l7L90m9j85j5J1p5j03J91J37j80j0J09KK47j16j51k6p7J09k1J4
$$ 144 53 -32 -94 -131 259 210 25 10 21 -54 -157 34 171 -9 -19 90 92 339 223 72 46 -31 78 57 71
8097G1k07l0K24j06K66k81MK8L4J4k00J84J8j82j58K01n8Q5J80j63j27K58J29
$$ 71 -136 -166 58 -48 218 -63 -59 -31 3 17 -183 1 19 -163 -321 -120 -178 -93 87 -76 -203 55 184
8120A84k69N9J95k67K56k79p8L22l11K56J58Q3k43p2K05l26R4J29j01kJ23j93
$$ 184 -85 -26 169 -98 158 -121 -199 123 -188 68 226 309 66 -6 199 -127 -33 96 -5 -7 116 -77
8142g7n0J33J63l74N4J23j95K73l69K27K19K41j49p9k3K11q0j71Q3j42n3j27L56
$$ -77 -127 6 169 -205 -151 -28 -223 50 -319 -92 127 368 219 140 117 328 248 77 160 18 -35 -162 194
8165A94l20LJ8j85ML54N8j89R5l4K46l04P8q5J2n3M5M2L7l9j2j7j75J30KQ3
$$ 194 -126 -123 -105 -290 -286 68 126 -63 32 -2 244 -60 18 -67 -55 -108 -63 -21 16 -23 -35 -52 -227 -97 -95 -12
8191a2
$$ Imaginary data points
##PAGE= N=2
##DATA TABLE= (X++(I..I)), XYDATA
0@%%%%%%%%oJ4j6J6j6J6k4L2l8M6n2O0p2Q6r7J11j30J48j67J91k17K43k74L08
$$ 0 0 0 0 0 0 0 0 0 -6 8 -8 8 -8 8 -16 16 -22 24 -28 32 -40 46 -51 60 -70 78 -89 102 -115 128 -146 162
32A62l45L87m30M79n34N94o58P28q07Q94r89J095j214J348j498J668j864K093
$$ 162 -183 204 -226 253 -281 313 -345 383 -424 470 -519 576 -638 710 -788 880 -984 1109
50A109k365K689l088L593m252N158o485Q613j2574K2361q7795j45555K15075J14015
$$ 1109 -1256 1433 -1655 1938 -2314 2844 -3641 4972 -7602 14759 -73036 -218591 -3516 110499
64A10499j44123r6971J39069O7556j20133n0460J31845N2916j00774l6745R0701
$$ 110499 -33624 -130595 8474 76030 -44103 -94563 37282 90198 -10576 -47321 43380
75D3380J6458q0924p201P1598j4775p5603J3283P2451j5883o4009J8369O2034
$$ 43380 59838 -21086 -28287 43311 28536 -47067 -33784 38667 22784 -41225 -22856 39178
87C9178j5183n1679J7495M7999j4117l5491K1332L4793k7392m2895J3677L6971
$$ 39178 23995 -27684 -10189 37810 23693 -11798 9534 44327 16935 -25960 -12283 24688
99B4688n894k4148N016J0760j4329j0261J8846J2682j5182q939J4096L106j6844
$$ 24688 18794 -5354 -338 10422 -3907 -14168 4678 17360 2178 -6761 7335 10441 -6403
112f403k065J5522k799k1575j364J7205m97j6234R03J1376o123r695J3107J3236
$$ -6403 -8468 7054 4255 -17320 -18684 -1479 -1976 -18210 -17307 -5931 -12054 -21749 -8642 4594
126D594j3145j1979J9282J8742j8055k2632J4226K3906j0013j9837R026J7537
$$ 4594 -8551 -20530 -1248 17494 -561 -23193 -8967 14939 4926 -14911 -5885 11652
138A1652j2362j9872J1169K3016n077j7012O152J2999o535p858J6477J0202j8774
$$ 11652 -710 -20582 -9413 13603 8526 -8486 -2334 10665 4130 -3728 12749 22951 4177
151D177j2087K0367J4540k1324j4818K2018J4554k3970j7402K2021J7545k0817
$$ 4177 -7910 12457 26997 5673 -9145 12873 27427 3457 -13945 8076 25621 4804
163D804j6517J8591J4514j9259j5879J4392J2200j2170q424Q707J97j2791J681
$$ 4804 -11713 6878 21392 2133 -13746 646 12846 676 -7748 959 1156 -11635 -9954
176i954J4754k556j5692J628J3762l744j3119O939J3237q167j4244P766J3065
$$ -9954 4800 2244 -13448 -11820 1942 -1802 -14921 -7982 5255 -2912 -17156 -9390 3675
189C675p337j0680R274Q780j0392n959J2020M535j2690p82J7001O76j7770J078
$$ 3675 -3662 -14342 -5068 3712 -6680 -12639 -619 3916 -8774 -9556 7445 8121 -9649 -8571
203h571J9905j187j9383N043K2767l280k4116J405K2180P04j8112O14J4195k101
$$ -8571 11334 10147 -9236 -4193 18574 15294 -8822 -7417 14763 15467 -2645 -2031 12164 10063
217A0063j2445K635R195m602o332O811K501r563k742J1790K080j3761l969J2447
$$ 10063 -2382 253 9448 4846 -1486 5325 7826 -1737 -4479 7311 9391 -4370 -8339 4108
231D108L822j3326n113J2287N530j1516p437Q401N831n847l703N293L581o012
$$ 4108 7930 -5396 -10509 1778 7308 -4208 -11645 -3244 2587 -3260 -6963 -1670 1911 -4101
245d101l980L733M511q19j494O83j344j217K466M125j392k962J094K737j380j684
$$ -4101 -8081 -4348 163 -656 -2150 -1467 -2811 -4028 -1562 2563 1171 -1791 -697 2040 660 -1024
261a024L492L214k757m246J986L585r27k304J045L054j677m365K91M050R83l277
$$ -1024 2468 5682 2925 -1321 665 4250 3323 1019 2064 5118 3441 -924 -633 3417 4400 1123
277A123j000K101p74l044p00L038R32k601j382K35r50p66K743J180l335k585K887
$$ 1123 123 2224 1450 -1594 -2294 744 1676 -925 -2307 -2072 -3022 -3788 -1045 135 -3200 -5785 -2898
294b898J970l629q95N841J215o806j562O906K540n641q85O574O79o572q15O746
$$ -2898 -928 -4557 -5452 389 1604 -5202 -6764 142 2682 -2959 -3844 2730 3409 -3163 -3978 2768
310B768K362m913l07L157Q5k545J220K184j511n04L392o06m675L73O626N55p024
$$ 2768 5130 217 -90 3067 3152 607 1827 4011 2500 1996 5388 4782 107 480 7106 7661 637
327F37j831N321J871n043k155L892Q25l397k087J852K62k023L63P07k091j668
$$ 637 -1194 4127 5998 955 -1200 2692 3517 120 -1967 -115 147 -1876 -1513 -806 -2897 -4565
343d565J896J216k438k028K213J142k007q74K359J197k492q26L006J670k695j666
$$ -4565 -2669 -1453 -3891 -5919 -3706 -2564 -4571 -5445 -3086 -1889 -4381 -5207 -2201 -531 -3226 -4892
359d892K937K651j229j817J241J370j68O17J156l52r82J848J399j192j564K418
$$ -4892 -1955 696 -533 -2350 -1109 261 93 710 1866 1514 532 2380 3779 2587 1023 3441
375C441L081k444l227J968M150j413l844N07L561r35l333P57K169j367k738J35
$$ 3441 6522 4078 851 2819 6969 5556 1712 2219 5780 4845 1512 2269 4438 3071 333 468
391D68R51p16j268J60n06j357P12R35j929k289J862K595k284l241J862L166k061
$$ 468 1419 703 -565 -405 -911 -2268 -1556 -621 -2550 -4839 -2977 -382 -2666 -5907 -4045 -879 -2940
408b940l664J695M237j472k962P66K761L86j681o2J589O56o0J55L11K49J253P36
$$ -2940 -6604 -4909 -672 -2144 -5106 -4340 -1579 -1193 -2874 -2936 -1347 -691 -751 -596 -285 -36 1217 1953
426A953j219l55K549J687j661k007J692K876j089l105R84L426n21l160j152K684
$$ 1953 734 379 2928 4615 2954 947 2639 5515 4426 1321 2305 5731 5210 2050 898 3582
442C582J190k717j532J320J287j317k293K56P67r0j001j249m73L80J330j453k097
$$ 3582 4772 2055 523 1843 3130 1813 -480 -224 543 453 -548 -1797 -2270 -1890 -560 -2013 -4110
459d110K02K485J15l574n1L363Q99m227j475L938K837l536k249L044L093k233
$$ -4110 -3908 -1423 -1308 -4882 -4933 -1570 -671 -4898 -6373 -2435 402 -3134 -5383 -2339 754 -1479
475a479k196J994K981m78j652N73J679N46N8m73m53J294J422j40j805j46K802
$$ -1479 -3675 -1681 1300 822 -830 -257 1422 1968 2026 1553 1100 2394 3816 3676 1871 1725 4527
492D527O76k783j583K405K505k456l054J729K353j668k902O58K535j251k538j83
$$ 4527 5203 2420 837 3242 5747 3291 237 1966 4319 2651 -251 407 2942 1691 -847 -1030
508a030J327n21n01r43L3p79K68r3r64o73J185P78j531j725J935J536j062j973
$$ -1030 297 -224 -725 -1668 -1635 -2414 -2146 -2239 -3203 -3876 -2691 -1913 -3444 -5169 -3234 -1698 -2760 -4733
526d733J334K239l99j464M75K063k62r78K88J513L33j38M26Q51n44J35J299j41
$$ -4733 -3399 -1160 -1559 -3023 -2548 -485 -747 -1725 -1437 76 409 271 697 1548 1004 1139 2438 2297
544B297o67Q06J162K70j928K82J616L36j612n02J182M92j216o86M58q7j034l69
$$ 2297 1630 2436 3598 3868 1940 2222 3838 4174 2562 2060 3242 3734 2518 1832 2290 2203 1169 800
562H00J22o06k45J75o97j043k09O79j88q42m44L36n60m20O69K66m09m41L44P14
$$ 800 922 316 71 246 -451 -1494 -1703 -1024 -1212 -2054 -2498 -2162 -2722 -3142 -2473 -2207 -2616 -3057 -2713 -1999
582a999m99l22J90N40M47M35Q5m68L53J072M66p15L22J358L44j475j07K677Q21
$$ -1999 -2498 -2820 -2630 -2090 -1643 -1208 -1123 -1591 -1238 -166 300 -415 -93 1265 1609 134 27 2704 3525
601C525j672j328J448J421j215l90J029M10j010m32P3m11O82J76k22k398M61J622
$$ 3525 1853 525 1973 3394 2179 1789 2818 3228 2218 1786 1859 1448 2130 2306 2084 -314 147 1769
619A769n36k762K23L106p14m352l2L343Q01l394j324K339Q26j953q28J570J125
$$ 1769 1233 -1529 -1306 1800 1086 -3266 -3298 45 846 -2548 -3872 -1533 -707 -2660 -3488 -1918 -793
636g93o70p18k75k99J630J940j775k239J488L946q82m140R44M552L32m025m37
$$ -793 -1463 -2181 -2456 -2755 -1125 815 -960 -3199 -1711 2235 1353 -2787 -1843 2709 3041 -984 -1421
653a421L948J239k826j428L014J716k179j585J148J054M68j95j634r39L31J791
$$ -1421 2527 3766 940 -488 2526 4242 2063 478 1626 2680 3148 2953 1319 380 711 2502
669B502n96k088K29K565j741l320L80L457M27l867j625J988J744k003j400J195
$$ 2502 1906 -182 47 2612 871 -2449 -2069 1388 1815 -2052 -3677 -1689 55 -1948 -3348 -2153
685b153J270j061j497M51P83Q6qn4l37Q63K33m67m98J160K329n66k231j62K480
$$ -2153 -883 -1944 -3441 -2990 -2207 -2121 -2129 -2183 -2520 -1657 -1424 -1891 -2389 -1229 1100 534 -1697 -1859 621
704F21J325j352K16J385m86j049K33K458L45r86q21P11M03m93J46M82l6r72m24
$$ 621 1946 594 810 2195 1709 660 893 3351 3696 2710 1889 2600 3003 2510 2656 3138 3102 2130 1706
723A706J98n38L00k4k46q47j33R5q55j082N99J135l66k392j094J245J055q51k72
$$ 1706 1904 1366 1666 1642 1396 549 416 511 -344 -1426 -827 308 -58 -2450 -3544 -2299 -1244 -2095 -2367
742b367k12j31r19JQ66O11O10r48j340L0K279J022n40j474R62J253p4p85Q24J238
$$ -2367 -2579 -2710 -3629 -3628 -2762 -2151 -1541 -2489 -3829 -3799 -1520 -498 -1038 -2512 -1550 -297 -371 -1156 -332 906
762I06P55j086J06N40O45l2M13M54Q0L16r1j249j20J581J349j345k265o1K208
$$ 906 1661 575 681 1221 1866 1834 2247 2701 2781 3097 3006 1757 1637 3218 4567 3222 957 896 3104
781C104J36j512l92J311j203j723k31J593N85j289j826j31M82N73l77j125l89
$$ 3104 3240 1728 1336 2647 1444 -279 -510 1083 1668 379 -1447 -1578 -1096 -523 -900 -2025 -2414
798b414N92K41j023j508J192K035o45j970j9K023Q9k034N84K233P03j584j534
$$ -2414 -1822 -1581 -2604 -4112 -2920 -885 -1530 -3500 -3519 -1496 -1407 -3441 -2857 -624 79 -1505 -3039
815c039J301J777P14k57p29R6N85P88j77K1J288O61j490j482J667K297p14k326
$$ -3039 -1738 39 753 496 -233 -137 448 1236 1059 1080 2368 3029 1539 57 1724 4021 3307 981
833I81K24J961k08j894n09J711O96j657p40N09Q7r39n22M15L82k03j354p48M64
$$ 981 1205 3166 2958 1064 555 2266 2962 1305 565 1074 1161 222 -300 115 497 294 -1060 -1808 -1344
852a344O37L68r22j170P0J289k73j183L45J258n11j521J15K190O94j568o37J144
$$ -1344 -707 -339 -1261 -2431 -2361 -1072 -1345 -2528 -2183 -925 -1436 -2957 -2842 -652 42 -1526 -2163 -1019
870a019R83n61m52Q39Q14j5n34L07oQ09K54lj54P32N76j093j202J483J464o45
$$ -1019 -36 -597 -1049 -210 604 589 55 362 356 1165 1419 1416 1262 1994 2570 1477 275 1758 3222 2577
890B577k017K67J140p9r43J71L91m4j121r66N27N94O7j060r02P7J021n39j062
$$ 2577 560 827 1967 1888 945 1116 1507 1463 342 -624 -97 497 564 -496 -1398 -1321 -300 -839 -1901
909a901l9J242R4j782n19L76J592m87o85nQ93j60r18P63O91P01k01o70l17R07
$$ -1901 -1940 -698 -604 -2386 -2905 -2529 -937 -1424 -2109 -2114 -1221 -1381 -2299 -1536 -845 -144 -345 -1015 -1332 -425
929d25J353P3p52J79P30m7j22N8J411M02r91p72M32R21J7m71m82L86J80p04l22
$$ -425 928 1001 249 428 1158 1111 989 1047 2458 2860 1869 1097 1529 2450 2467 1996 1514 1900 2080 1376 1054
950A054k40O53K03q18r76J78L92l74o78l26M38O4q56j329R44R95l57j283m58N57
$$ 1054 814 1467 1670 852 -124 54 446 72 -606 -932 -494 -430 -1286 -2615 -1671 -676 -1033 -2316 -2774 -2217
970b217M88l73k24J88P94l69o29J54J190L30k8o80J93P70P80o54j64J302O82o55
$$ -2217 -1729 -2102 -2326 -2138 -1344 -1713 -2342 -2188 -998 -668 -696 -1376 -1183 -413 367 -287 -451 851 1533 878
990H78m06L36J156L41q40J8O37N13j130k03M14J373p40p34o34Q92M41n73q36K16
$$ 878 472 808 1964 2305 1465 1483 2120 2633 1503 1300 1714 3087 2347 1613 979 1871 2312 1739 903 1119
1010A119J43j58q33p89O68M13r79j043j69Q64J60j189l51N51O62j201r69P81R08
$$ 1119 1262 1104 271 -518 150 563 -416 -1459 -1628 -764 -604 -1793 -2144 -1593 -931 -2132 -3101 -2320 -1412
1029a412j1j101k94J501L35o77p69J371P61k79o45K00J015O82m55k67M07Q16J80
$$ -1412 -1423 -2524 -2818 -1317 -982 -1659 -2428 -1057 -296 -575 -1220 -1020 -5 677 222 -45 362 1178 1358
1048A358o77l56J133J255j052p09M43J274L5j451q1J170L13j176r61Q77P52n56
$$ 1358 681 325 1458 2713 1661 952 1395 2669 2704 1253 1172 2342 2655 1479 518 1395 2147 1591
1066A591j629L75N68K84j195p69J24Q39l70j079l98P56M87j057r90M62R68o0j293
$$ 1591 -38 337 905 1189 -6 -775 -651 188 -182 -1261 -1659 -903 -416 -1473 -2463 -2001 -1033 -1093 -2386
1085b386L1Q05P14q19j301J218R90k03n17J15J509N8j253M11J053N11j0p23K84
$$ -2386 -2355 -1550 -836 -1655 -2956 -1738 -748 -951 -1468 -1353 156 214 -1039 -628 425 936 926 203 487
1104D87R22J90l76k77M22Q42p7o98r9M86O64p81m98L23O93o56q04k38N64R6q96
$$ 487 1409 1599 1223 946 1368 2210 2133 1435 1336 1822 2486 1705 1207 1530 2223 1567 763 525 1089 1185 289
1125B89k66L67J03q19q24K58L25l13j78l55OJ76r5m40k89L59K72j62n17M60O82
$$ 289 23 390 493 -326 -1150 -892 -567 -880 -1058 -1413 -1407 -1231 -1326 -1766 -2055 -1696 -1424 -1586 -2103 -1643 -961
1146i61J19q53j93J004N77j86l73L29P60J35k17J57M06L04N6o28M17M82P69m45
$$ -961 -842 -1695 -1888 -884 -307 -493 -866 -537 223 358 141 298 704 1008 1064 436 853 1335 2104 1659
1166A659p78N79O86m26m11r1L72L45q73j53K50J90m25m96l83N80J25j003m91J93
$$ 1659 881 1460 2146 1720 1309 1218 1590 1935 1062 909 1159 1349 924 428 45 625 750 -253 -744 -551
1186e51N41j32j089k17Q40j29p89k78M93O21p62n80M9P21j4k43K34j80M02L99
$$ -551 -10 -142 -1231 -1448 -608 -737 -1526 -1804 -1311 -690 -1452 -2032 -1983 -1262 -1276 -1519 -1285 -1465 -1063 -664
1206f64j31n39Q43J114q07l96M28J089K56j385M70J462O2q54j86N11R19l47p86
$$ -664 -795 -1334 -491 623 -184 -580 -152 937 1193 -192 278 1740 1802 948 762 1273 2192 1845 1059
1225A059N2O55J78l93o07J10Q08l90o89n14M38N60n96j442M08Q08j06j599p6O43
$$ 1059 1111 1766 1944 1551 944 1054 1862 1472 783 269 707 1267 671 -771 -363 445 339 -1260 -1336 -693
1245f93N54j068o43L74P09l94r56K93O46J47k99n60K04Q27J00n71k47P75P77l47
$$ -693 -139 -1207 -1850 -1476 -767 -1161 -2117 -1824 -1178 -1031 -1330 -1890 -1686 -859 -759 -1330 -1577 -802 -25 -372
1265c72q48R64Q28rq30L82R97M12r01n07J329O76l41j085K85J149l18k71l1m58
$$ -372 -1220 -256 572 563 -267 115 1112 1524 623 116 1445 2121 1780 695 980 2129 1811 1540 1509 1051
1285A051M70k73l60P3M77j16p15o00m7M31j10r47m92Q69N41j428l46M12L51o66
$$ 1051 1521 1248 888 961 1438 1322 607 7 -40 391 281 -666 -1158 -289 252 -1176 -1522 -1110 -759 -1425
1305a425m45Q7L58om01j95L24N65J39l22k78M00P42m61m91O68M71N49p52N05P90
$$ -1425 -1870 -1783 -1425 -1431 -1832 -2027 -1703 -1138 -999 -1321 -1599 -1199 -457 -918 -1409 -741 -270 279 -473 32 822
1326H22n21j23J10J042L76n06m10L66N42K77n46k85L32J03J87m48n39L87L21k37
$$ 822 301 178 288 1330 1706 1200 790 1156 1698 1975 1429 1144 1476 1579 1766 1318 779 1166 1487 1250
1346A250r20M61L74o98p25J38P85k65o60p30J01L44m87l7o6k11R2kk61l08P17
$$ 1250 330 791 1165 467 -258 -120 665 400 -260 -990 -889 -545 -1032 -1069 -1135 -1346 -1254 -1256 -1517 -1825 -1108
1367a108L0n79n03N54J281m10j191K14J546K4o83k08J153L77l11k08P66j66P8
$$ -1108 -1078 -1657 -2160 -1606 -325 -735 -1926 -1712 -166 -142 -825 -1033 120 497 186 -22 744 578 656
1386F56PK79L35M5K49n92k01N52J139m67j438L28J356m38r99n14J448k35j266
$$ 656 663 942 1277 1322 1571 979 778 1330 2469 2002 564 892 2248 1810 811 297 1745 1510 244
1405B44m99R31q1o19n68L43K96P8m79r11j96M30Q88p96o75j94J010m77p36N45
$$ 244 -255 676 595 -24 -592 -249 47 125 -354 -1265 -1461 -1031 -143 -939 -1614 -1808 -798 -1275 -2011 -1466
1425a466J069m97j461N89J566K17j137l61J105M63m0m94N61K5j12R1L21P9M99
$$ -1466 -397 -894 -2355 -1766 -200 17 -1120 -1481 -376 87 47 -447 114 139 27 118 439 518 1017
1444A017L22q20j8J019M02o67r84R91J201r56j225L02J249n25p21J9N51j96j116
$$ 1017 1339 519 501 1520 1922 1255 271 1262 2463 1507 282 584 1833 1308 587 606 1157 961 -155
1463a55j31N44o0n9n39p71K62Q05j06p97o54R70L51p20q64Q98M78j052j73P93
$$ -155 -286 258 198 139 -400 -1171 -909 -104 -210 -1007 -1661 -691 -340 -1060 -1924 -1026 -548 -1600 -1773 -980
1483i80N58l14j101O43Q59M08l20l67k56P30O48J09l93k59R24L18r02K56R26J09
$$ -980 -422 -736 -1837 -1194 -335 73 -247 -614 -870 -140 508 617 224 -35 889 1207 305 561 1487 1596
1503A596j369L6J142Q64p80r73M07L25p8l04q2j12J53k63o7o06M38L0k14j099
$$ 1596 227 263 1405 2269 1489 516 923 1248 1170 866 784 672 825 562 495 -111 327 357 143 -956
1523i56J67P35K22j565l87J070N28j100n11O96P4m49K3L01M63m70m45J05O44M6
$$ -956 -789 -54 168 -1397 -1784 -714 -186 -1286 -1797 -1101 -1027 -1476 -1453 -1152 -689 -1159 -1604 -1499 -855 -809
1543h09J62J14m83L98P57M55p21K8N75R15q53m76J155M61q21j3M57K06Jp37N52
$$ -809 -647 -533 -1016 -618 139 594 -127 -99 476 1391 538 62 1217 1678 857 844 1301 1507 1508 771 1323
1564A323K71r1j06k53J2n40M82L2n57k49J14L6q87K25M13Q2j055p16Q50L24o59
$$ 1323 1594 1503 1397 1144 1156 616 1098 1130 573 324 438 474 -413 -188 225 307 -748 -1464 -614 -290 -949
1585i49m78R5L09l1m75J44j82J67L99m72P7K17L01j7m47M36R72k60o00l71J314
$$ -949 -1427 -1332 -1023 -1054 -1529 -1385 -1567 -1400 -1001 -1473 -1396 -1179 -878 -895 -1342 -906 66 -194 -794 -1165 149
1606A49O69p31O1K81N56j67l27M12N83J19m26l90M23P14l41m84l52L45M22k96
$$ 149 818 87 148 429 985 818 491 903 1486 1605 1179 789 1212 1926 1585 1101 749 1094 1516 1220
1626A220p45k5R77m79q88J95K51M9n96p87P62Qm26m92J65l6L98r56k44K15N55
$$ 1220 475 450 1427 948 60 255 506 555 -41 -828 -66 -58 -484 -976 -811 -847 -449 -1405 -1649 -1434 -879
1647h79L5m97k11Q91J58j015j35R44P59m81o92R2J255J16o24J45N57K89k74k64
$$ -879 -844 -1341 -1552 -661 -503 -1518 -1653 -709 50 -431 -1123 -1031 224 340 -284 -139 418 707 433 169
1667A69Q8N29M23k69n02M13N82n49j14JN68N38r55n08N33N27l53o66k90P81l68
$$ 169 257 786 1209 940 438 851 1433 884 770 771 1339 1877 922 414 947 1474 1121 455 165 946 578
1688E78n41j98N32j02o77k08j95L53R6p31m7L28J37k82j51j21K38L44l77k66Q7
$$ 578 37 -161 371 269 -408 -616 -811 -458 -362 -1093 -1140 -812 -675 -957 -1108 -1229 -991 -647 -1024 -1290 -1203
1709a203Q43l72n57K04R37L43l96l25L94N33o1o6j98L64Q4L75m90K05N67R1k95
$$ -1203 -360 -732 -1289 -1085 -148 195 -201 -526 -132 401 340 274 76 440 524 899 409 614 1181 1272 977
1730I77j45M97J04j38o17J29L42k3p96J59O39n45r1n29R4M04l45o64n4J40K14
$$ 977 832 1329 1433 1295 678 807 1149 1126 330 489 1128 583 492 -37 57 461 116 -548 -602 -462 -248
1751b48j89p53J91P25n03n01%L64K77n15k63K42N74m39J82n75P99M28j02o93L21
$$ -248 -437 -1190 -999 -274 -777 -1278 -1278 -914 -637 -1152 -1415 -1173 -599 -1038 -856 -1431 -632 -204 -306 -999 -678
1772f78P27K49k82k53K73O83k64j70K07Q63j95o26J43O47K04m93k93J97M16l88
$$ -678 49 298 16 -237 36 719 455 285 492 1355 1160 534 677 1324 1528 1035 742 939 1355 967
1792I67j63j7J16J13k00n80J02J04O8o81k97M49L72p24m36j21O16j06o05j38K44
$$ 967 804 787 903 1016 816 236 338 442 510 -171 -468 -19 353 -371 -807 -928 -312 -418 -1023 -1161 -917
1813i17K75m36k75J27L82k91L4K4J97J19Q8k47M6M60N62n78k72N56P33k13n69
$$ -917 -642 -1078 -1353 -1226 -844 -1135 -1101 -1077 -880 -761 -673 -920 -874 -414 148 -430 -702 -146 587 374 -195
1834a95L86M88L19l48m77R36K11M9p47N3P24j84m49j74L79K20j93l10m80O38O3
$$ -195 191 679 998 650 173 1109 1320 1369 622 675 1399 1215 766 592 971 1191 998 688 208 846 909
1855I09p14l96K20M16m64k05j61K63J55p29m23K25M8K50q70Q9N96n1m15K3M57
$$ 909 195 -201 19 435 -29 -234 -395 -132 23 -706 -1129 -904 -856 -606 -1476 -1387 -791 -842 -1257 -1234 -777
1876g77Q7N1q10N75O01j45n2l27O49L43m11m9K61N01J48l18mK10N63j22o03K79
$$ -777 -690 -639 -1449 -874 -273 -418 -470 -797 -148 195 -216 -265 -4 497 645 327 323 533 1096 974 371 650
1898F50P66j83k82k66N01j2k63j85j76K77R5m61n44P97l86k69j92J0J92j16m75
$$ 650 1416 1233 951 685 1186 1174 911 726 550 827 922 461 -83 714 328 59 -133 -123 69 -47 -522
1919e22k05K78k6k89k32l19M17qj05m35N28R7j29j16J3L83J70k62j0K63M06M3
$$ -522 -727 -449 -475 -764 -996 -1315 -898 -906 -1011 -1446 -918 -821 -950 -1066 -1053 -670 -500 -762 -772 -509 -103 -60
1941f0l50K08L43j2l08K35L64K48J67r6p4K43J55rk08L1M23K8l69n41K28O02m19
$$ -60 -410 -202 141 129 -179 56 420 668 835 739 665 908 1063 1054 846 877 1300 1328 959 418 646 1248 829
1964H29j93K4J90j41p59J4L44N0p09k59L97J38m22n09O01k61J75k36k11k72L23
$$ 829 636 660 850 709 -50 -36 308 358 -351 -610 -213 -75 -497 -1006 -405 -666 -491 -727 -938 -1210 -887
1985h87L33p30k34O40K77j49p42N63Q22l25n00J46Q47j12m57L90L15n4M42k65
$$ -887 -554 -1284 -1518 -878 -601 -750 -1492 -929 -107 -432 -932 -786 61 -51 -508 -118 197 143 585 320
2005C20K5K93J08qj78Q4L10L90m00k98l4P00n01o02L97M20m0r59M25L15j13p89
$$ 320 345 638 746 738 560 644 954 1344 944 646 612 1312 811 209 606 1026 986 27 452 767 654 -135
2027a35j10J31K90j73m98m25O30J30l52l72l43P76j43n68l10N26O92n81l09J45
$$ -135 -245 -114 176 3 -495 -920 -290 -160 -512 -884 -1227 -451 -594 -1162 -1472 -946 -254 -835 -1144 -999
2047i99P03k48k77k64Q79J68j50m24K94N91M3l2o58M72N89j07j70M4O90O9o44
$$ -999 -296 -544 -821 -1085 -206 -38 -188 -612 -318 273 316 284 -374 98 687 580 410 454 1144 1213 569
2068E69k52O79N93p94m72L24N20j46l90j01K08l4o48kn3K80n6l52m88K84M59k47
$$ 569 317 996 1589 795 323 647 1167 1021 631 530 738 704 56 54 1 281 225 -127 -615 -331 128 -119
2090a19o64j91N40L11r52J82J40J40n46j73L72O69m16j77n4K30K34L15k01l12
$$ -119 -783 -974 -434 -123 -1075 -893 -753 -613 -1159 -1332 -960 -291 -707 -884 -938 -708 -474 -159 -360 -672
2110f72L56P48O7k86l28K79L53l26l6Q52j33n17o6M54P27m42m94K44N18j59m24
$$ -672 -316 432 499 213 -115 164 517 191 155 1007 874 357 291 745 1472 1030 536 780 1298 1139 715
2131G15OJ06l90R4K24m30O9om88j33L8K10L33q51k49K44N06q12m64O29L16q00
$$ 715 721 827 437 531 755 325 394 388 -100 -233 -195 15 348 -503 -752 -508 -2 -814 -1278 -649 -333 -1133
2153a133p4L72M1j9l90K54k4J75M07m12O0K91M35m8n98N56J64N99k45l09N25J73
$$ -1133 -1207 -835 -794 -813 -1203 -949 -973 -798 -391 -803 -743 -452 -17 -65 -663 -107 57 656 411 102 627 800
2175H00j39n55Q83p3J80o49J48P67k4m23K1m74M47K44p69L4J40k3J41m20j90K35
$$ 800 661 106 989 916 1096 447 595 1362 1338 915 936 462 909 1153 384 418 558 535 676 256 66 301
2197C01N5r82k37P94J9k72n88k36P27l35L0l38J82K87m44l0L78K61k73k73r9K94
$$ 301 356 -626 -863 -69 -50 -322 -910 -1146 -419 -754 -724 -1062 -880 -593 -1037 -1067 -689 -428 -701 -974 -1073 -779
2219g79P15j93o88J45J036k86k46K49J57M49m86J36L48L10k74L5p2M94k29k67
$$ -779 -64 -257 -945 -800 236 -50 -296 -47 110 559 73 209 557 867 593 628 556 1050 821 554
2239E54J40j40L32L38n09n84L81M56n73k14J24K31k77o65P7N52j40k83n60L47
$$ 554 694 554 886 1224 715 131 512 968 395 181 305 536 259 -406 -329 223 83 -200 -760 -413
2259d13L23l78k48k32N1K32j37r7l4J84K72m73l31P42M21l29n72N03P28n86k15
$$ -413 -90 -468 -716 -948 -897 -665 -802 -899 -933 -749 -477 -950 -1281 -539 -118 -447 -1019 -516 212 -374 -589
2280e89L45K84L51m57J89L7L73r1J6K74Kp7J03m20J26O27J86o81j56M17k24L54
$$ -589 -244 40 391 -66 123 160 533 442 458 732 734 657 760 340 466 1093 1279 598 442 859 635 989
2302I89j000M72M47k19o15K56J25k93m83n1P7j18R8l10j81J94J87r2m91k81O51
$$ 989 -11 461 908 689 74 330 455 162 -321 -372 -295 -413 -315 -625 -806 -612 -425 -517 -1008 -1289 -638
2323f38p7k72j43L09K97j43n02M73P53k94j10m08M35M94o9k32j51N09K92k37L9
$$ -638 -715 -987 -1130 -821 -524 -667 -1169 -696 57 -237 -347 -755 -320 174 105 -127 -278 231 523 286 325
2344C25J60J45J36k36K3N42j60k91k26N09L00l00p12L8P80K5n73o8m6r4l07o6
$$ 325 485 630 766 530 553 1095 935 644 418 927 1227 927 215 253 1033 1058 485 417 371 277 -30 -96
2366i6J73n8o0k73k25J20L45j02o01q3K86j6k04j79J83K58j15l39L11K54N5k02
$$ -96 77 19 -41 -314 -539 -419 -74 -176 -777 -860 -574 -590 -794 -973 -790 -532 -647 -986 -675 -421 -366 -568
2388e68l7Q4k7M42j97j51L56N29k2m91p2O63J32j56J11J69M06l32j91J22M47k70
$$ -568 -605 -521 -548 -106 -303 -454 -98 431 409 -82 -154 509 641 485 596 765 1171 839 648 770 1217 947
2410I47n59J98L57j2n2n00nK09o1l52p5J87n8n8m63l6j4K19p01m9M91J95o61m1
$$ 947 388 586 943 931 879 379 374 583 522 170 95 282 224 166 -297 -333 -347 -128 -829 -878 -387 -192 -853 -894
2434h94J74J73j66m10J3Q42m5k01n01J80M00J08k31k08N51M55k39l0r6M27J30
$$ -894 -720 -547 -713 -1123 -1110 -268 -313 -514 -1015 -835 -435 -327 -558 -766 -215 240 1 -29 -125 302 432
2455D32n1k42M51K40l59k18M68M04m48l12J66L12K9m91j73p7P97k41m48J20m26
$$ 432 381 139 590 830 471 253 721 1125 677 365 531 843 872 381 208 131 928 687 239 359 -67
2476f7M65k67k60m3M33k43k95o0K0l40K13l55k13M88j13j84N5L75J10n40P6n3
$$ -67 398 131 -129 -172 261 18 -277 -337 -317 -657 -444 -799 -1012 -524 -637 -821 -766 -391 -281 -821 -745 -798
2498g98M99l5m95J46L61L12l33J03M24j06J05r9k31L19L92l1k01M14j67J49l80
$$ -798 -299 -334 -829 -683 -322 -10 -343 -240 184 78 183 84 -147 172 564 533 332 746 579 728 348
2519C48j84P73M8J2n65l56O37L18n37l43K98Nj32R5l58m5L11l26k26k37K00k44
$$ 348 164 937 985 997 432 76 713 1031 494 151 449 454 322 417 59 14 325 -1 -227 -464 -264 -508
2541e08P7k58L75j97L4l99o3M97k9j81j71L21K9j41j71r2P09O7m24L9K71M49n2
$$ -508 -431 -689 -314 -511 -477 -876 -939 -442 -471 -652 -823 -502 -473 -614 -785 -877 -168 -101 -525 -486 -215 234 182
2564A82m78M44J08l2l32L02M92k14K04l57q2O19K5n60R6L37M78o87j21%N30n15
$$ 182 -296 148 256 224 -108 194 686 472 676 319 237 856 881 321 417 754 1232 545 424 424 954 439
2586D39l87J67J49M7m05n61O42J47o09j04j85M57j36k02j94L63L1k23k76KL77
$$ 439 52 219 368 415 10 -551 91 238 -371 -475 -660 -203 -339 -541 -735 -372 -341 -564 -840 -838 -461
2607d61J90m74j87K38K36J55l24j5M48K28l91q9M97j2j91j1L52J18K19l3m46N70
$$ -461 -271 -745 -932 -694 -458 -303 -627 -642 -194 34 -357 -446 51 39 -152 -163 189 307 526 493 47 617
2629F17K48k9m57J77L37J69m78l60J64M41k24l98j67M93K98p01p9R4L03m02p0
$$ 617 865 836 379 556 893 1062 584 224 388 829 605 207 40 533 831 130 51 145 448 46 -24
2650b4l03K2K41n39R4m1K54j99j19J49J14p7j9l56NN59k63n35M37K39L23q5n26
$$ -24 -327 -305 -64 -603 -509 -550 -296 -495 -614 -465 -351 -428 -447 -803 -798 -239 -502 -1037 -600 -361 -38 -123 -649
2673f49K95L56K39k19j07K50M3J62k08K25L43N5m35J95J15K2l90J68K55m2K6o17
$$ -649 -354 2 241 22 -85 165 208 370 162 387 730 785 350 545 660 682 292 460 715 673 699 82
2695H2N96j68J48o16m8J37L66k39l57K6J07M8l79L9l09L14N1l57j14K37Q3k93
$$ 82 678 510 658 42 -6 131 497 258 -99 -73 34 82 -297 -258 -567 -253 -202 -559 -673 -436 -353 -646
2717f46j37J00N40n15j29P2L57l41M18k75L05q8K60K4k39J1N04j40j68o0O98q9
$$ -646 -783 -683 -143 -658 -787 -715 -358 -699 -281 -556 -251 -339 -79 -55 -294 -283 221 81 -87 -147 551 462
2739D62j64k83M83M13m67k58J65O33m07j0J75k54j9L35m35Lj2L9k92n8l6L68m62
$$ 462 298 15 498 911 444 186 351 984 577 567 742 488 469 804 369 372 360 399 107 49 13 381 -81
2762h1k28k4K19J81l90m17K50O5M6l26J0L45P2l78P3j39N07k71l36r9Q70Rm35
$$ -81 -309 -333 -114 67 -323 -740 -490 -425 -379 -705 -695 -350 -278 -656 -583 -722 -215 -486 -822 -921 -51 -42 -477
2785d77N5J65M68qk97K74O1R4l38N2L84K40j41j17J03K50r1O1k11k39N03k92j65
$$ -477 -422 -257 211 203 -94 180 241 335 -3 49 433 673 532 415 518 768 677 738 527 288 791 499 334
2808C34Q3O3J18m49k42L65N73p40l55J25J74q3l99m7L19nj03n0k27j44L68q15
$$ 334 417 480 598 149 -93 272 845 105 -250 -125 49 -34 -433 -480 -161 -166 -269 -319 -546 -690 -322 -1137
2830a137K34L43J04n7n10J24L12K35j94j01P3O87j48m30J66Q5K39k18K37K70j84
$$ -1137 -903 -560 -456 -513 -1023 -899 -587 -352 -546 -647 -574 113 -35 -465 -299 -214 25 -193 44 314 130
2851A30n3J24J19P4K69j43o38K22Q20j97j01j24K4P1O3q90O63J69l32n89M94J31
$$ 130 77 201 320 394 663 520 -118 104 924 727 626 502 526 597 660 -230 433 602 270 -319 175 306
2873C06k71j45l34N26n7k11k39k5j10J67j2K56m39K64J61k40m56J93M29k27l69
$$ 306 35 -110 -444 82 25 -186 -425 -450 -560 -393 -405 -149 -588 -324 -163 -403 -859 -666 -237 -464 -833
2894h33K87O00k43l82K06L41J84J01m85L93k50J06K88k84L35R8Lk00K75n4K63
$$ -833 -546 54 -189 -571 -365 -24 160 261 -224 169 -81 25 313 29 364 462 465 265 540 486 749
2915G49m17K03J3J50k1l23l0K79m38j96K79J86j34j38n49M47J07lo20k60L22J52
$$ 749 332 535 548 698 677 354 324 603 165 -31 248 434 300 162 -387 60 167 164 -456 -716 -394 -242
2937b42k5j83m95N46k6rj21M6K77n64j19O53J77q3m10p3O24l9q3j18J92K23J30
$$ -242 -267 -450 -945 -399 -425 -434 -555 -509 -232 -796 -915 -262 -85 -168 -578 -651 -27 -66 -149 -267 -75 148 278
2960B78J01j59p6K34K93m89K8J10M33m36L27kk8k5k19Q1k3L55n47J17j6m4l00
$$ 278 379 220 144 378 671 182 210 320 753 317 644 642 614 589 370 451 428 783 236 353 337 293 -7
2983gJ20p1N9K23l92q7k35L18q4o50L51O0J36m06m02O43J46j20m68L28M00k13
$$ -7 113 42 101 324 -68 -155 -390 -72 -156 -806 -455 -395 -259 -665 -1067 -424 -278 -398 -866 -538 -138 -351
3005c51k92J46K14N7j10J49J51L9j84K42j96n9N58J3k81K58L13p8m02k44P59J86
$$ -351 -643 -497 -283 -226 -336 -187 -36 3 -181 61 -135 -194 364 377 96 354 667 589 187 -57 702 888
3027H88k82j42J58l6M50n01k36j39M77m32L2k19j0M67n75k29L83M03l18l06m04
$$ 888 606 464 622 586 1036 535 299 160 637 205 237 18 8 475 -100 -329 54 457 139 -167 -571
3048e71L82N45q33k88p2K98l3J52r1J74j13j50K83l67N21k57j7M8O20j34n05K67
$$ -571 -189 356 -477 -765 -837 -539 -572 -420 -511 -337 -450 -600 -317 -684 -163 -420 -437 -389 231 97 -408 -141
3070a41K47N7J21m86K74N27k11n38P23k33L87j59k56K9L60m3j61k68L82L4J8r7
$$ -141 106 163 284 -202 72 599 388 -150 573 340 727 568 312 341 701 658 497 229 611 645 663 566
3092E66o21n1L78k31k6Q9Q5k92l2K60n43K55j74K51k19j8j73k51P9K47j56M79
$$ 566 -55 -106 272 41 15 104 189 -103 -135 125 -418 -163 -337 -86 -305 -323 -496 -747 -668 -421 -577 -98
3114i8p46R5M23j31j24j17M99j28L70l85mO12j26j7k42J66l5J34l51N06J9q9p6
$$ -98 -844 -749 -326 -457 -581 -698 -199 -327 43 -342 -346 266 140 123 -119 47 12 146 -205 301 320 231 155
3137A55j83L50K54k06P9l55K02K74l80j43K80P5j09l30K2J97R1j70l99J21L88
$$ 155 -28 322 576 370 449 94 296 570 190 47 327 402 293 -37 -15 182 273 103 -296 -175 213
3158B13q0n09P2K41p8l30N2J89k75J73k91Q4J37J47m52J31L46j17q8K53j80M61
$$ 213 133 -376 -304 -63 -141 -471 -419 -230 -505 -332 -623 -539 -402 -255 -707 -576 -230 -347 -435 -182 -362 99
3180I9M3m47O9J47L06k33K1L40j76J36l17J73L92K0j28j00K27O1K68o14J49J8
$$ 99 142 -305 -236 -89 217 -16 5 345 169 305 -12 161 553 573 445 345 572 633 901 287 436 454
3202D54K02l44k95j34N45q5k50m04K83M51l53l49L30k28r3L3k13J44j06J94l24
$$ 454 656 312 17 -117 428 343 93 -311 -28 423 70 -279 51 -177 -270 -237 -450 -306 -412 -218 -542
3223e42K16p6K19n14K83k77O09k16p4l10N22O5k58J07J9M03k75J56k08N21RJ76
$$ -542 -326 -402 -183 -697 -414 -691 -82 -298 -372 -682 -160 -95 -353 -246 -227 176 -99 57 -151 370 379 555
3245E55m19J91K57k93j53l4L25K02n7k97J27J10k0k06M2K20k6l21k58Q0K01o2
$$ 555 136 327 584 291 138 104 429 631 574 277 404 514 494 288 330 550 524 203 -55 25 226 164
3267A64J6j36k2o9Q5M2m53M27n28J15l03L58L23k58m79J01L55n8n59L41J25n7
$$ 164 180 44 22 -47 38 80 -373 54 -474 -359 -662 -304 19 -239 -718 -617 -262 -320 -879 -538 -413 -470
3289d70p3j27L17J49Q4p9K75r0L25k98L09n12N97J4K15l46l6K00m50M40k26L95
$$ -470 -543 -670 -353 -204 -120 -199 76 -14 311 13 322 -190 407 421 636 290 254 454 4 444 218 613
3311F13j10m2R8K4m09K51j26j64K33O1l92j2L07p3k31m24M11r3J4j11j43J77m2
$$ 613 503 461 559 583 174 425 299 135 368 429 37 25 332 259 28 -396 15 -78 -64 -175 -318 -141 -183
3334a83r9m17L34J11k32K07j65k9K36m8j72J23J58m3JJ34J84j80K10l59M00j3
$$ -183 -282 -699 -365 -254 -486 -279 -444 -473 -237 -285 -457 -334 -176 -219 -218 -84 100 -80 130 -229 171 158
3356A58K19j51k55L56J99l68JJ47K90l16j43K4L71j00m2j84k90L54k2k30M3K01
$$ 158 377 226 -29 327 526 158 159 306 596 280 137 161 532 432 390 206 -84 270 248 18 61 262
3378B62k49L58l76m04M66p4k01j13J73J25l40k6J92j02J16j71Q4k91n2J41K9J78
$$ 262 13 371 -5 -409 57 -17 -218 -331 -158 -33 -373 -399 -207 -309 -193 -364 -280 -571 -623 -482 -453 -275
3400b75r0J84m8m08O40K38m56K31l28M65J2j96O2O2K92Jm42K42M29r7N2n28L13
$$ -275 -365 -181 -229 -637 3 241 -215 16 -312 153 165 -31 31 93 385 386 -56 186 615 518 570 42 355
3423C55K41k74j51q0J81K29j86J20l35L10j51k89K8J47K77o61l9K11J01l44R5
$$ 355 596 322 171 91 272 501 315 435 100 410 259 -30 -2 145 422 -239 -278 -67 34 -310 -215
3444b15m5l94N61n50M62j61k3r2op7J50L53k73l84L97L48l53j42J06L86k67K67
$$ -215 -260 -654 -93 -643 -181 -342 -365 -457 -463 -540 -390 -37 -310 -694 -297 51 -302 -444 -338 48 -219 48
3466D8p0N3J98p3L7J80J97k55p4k90L09o1P5k37J07J83L57l29Q1k56M15j72j73
$$ 48 -22 31 229 156 193 373 570 315 241 -49 260 199 274 37 144 327 684 355 436 180 595 423 250
3489B50k74K44P2m98L0L11K12m46j31l21N04N1k01l5l43J89L56k49l44L89R4k79
$$ 250 -24 220 292 -206 -176 135 347 -99 -230 -551 -47 4 -197 -232 -575 -386 -30 -279 -623 -234 -140 -419
3511d19P6k85O94k08j33K73j5K97m41j18K34K37n8l62J72M20l91J69l1Q8J23k3
$$ -419 -343 -628 66 -142 -275 -2 -17 280 -161 -279 -45 192 134 -228 -56 364 -27 142 111 199 322 299
3533B99l9l15M70L85p74L13J79j69j72q3l66N61L7m92R6K51m83K47q8J41k46J16
$$ 299 260 -55 415 800 26 339 518 349 177 94 -272 289 326 -166 -70 181 -302 -55 -143 -2 -248 -132
3555a32q3m3l2O4J75k92k88J01M32k57j90L52K62l63R8m39L57K34j94J48j50K17
$$ -132 -215 -258 -290 -226 -51 -343 -631 -530 -98 -355 -545 -193 69 -294 -196 -635 -278 -44 -238 -90 -240 -23
3577b3l1RK29m14N18O5m00J86L53r1j97k94K50L50m7j85J5Q8o4j9j71J41Q5k54
$$ -23 -54 -45 184 -230 288 353 -47 139 492 401 204 -90 160 510 463 278 293 381 317 298 127 268 353 99
3601I9J81k18k4N09o08j44R7K91j68l27o8K44L0k41m3P5K52j94k51L14L9K6l22
$$ 99 280 62 38 547 -61 -205 -108 183 15 -312 -380 -136 -106 -347 -390 -315 -63 -257 -508 -194 -155 -129 -451
3624d51K0K0J22k40J62m3L23N0L1j29L59l10K35k69J01L11Rk2l09P08l68P0j45
$$ -451 -431 -411 -289 -529 -367 -410 -87 -37 -6 -135 224 -86 149 -120 -19 292 301 279 -30 678 310 380 235
3647B35L61n48J22J47n2N9K25j71k34J42J1Nl73j79J9K68L9l03j64M39J77o22
$$ 235 596 48 170 317 265 324 549 378 144 286 297 302 -71 -250 -231 37 76 -227 -391 48 225 -397
3669c97j32K74m6k37m4J74K60l67J10kM3K47k63k66J56K44K06K0r3QJK55l93M05
$$ -397 -529 -255 -301 -538 -582 -408 -148 -515 -405 -407 -364 -117 -380 -646 -490 -246 -40 -20 -113 -105 -104 151 -242 163
3693A63K61j00l35q0M29L3j4r8k34O05k6K1L5n35J80J62k06k51k56P75j3o54L25
$$ 163 424 324 -11 -91 338 371 357 259 25 630 604 625 660 125 305 467 261 10 -246 529 516 -138 187
3716A87J33m13Q7m64M07q3l81J12m5M61r2k03m78M11J32qj98N9K89K13m55N7j4
$$ 187 320 -93 -6 -470 -63 -146 -527 -415 -460 1 -91 -294 -772 -361 -229 -237 -435 -376 -87 126 -329 -272 -286
3739b86K60j32q1J68J52j97r8J87K48k41l7K99p4K63n2j19j81L97J6m03J22M8
$$ -286 -26 -158 -239 -71 81 -116 -214 -27 221 -20 -57 242 168 431 379 260 79 476 492 89 211 259
3761B59L9K78k08k78K46M20n10k68O09o17M44k56j38K24k82N6n02M28J73m05J78
$$ 259 298 576 368 90 336 756 246 -22 587 -30 414 158 20 244 -38 18 -484 -56 117 -288 -110
3782a10l08J1O6L2l8L5J78k63j2k9L71k15k58L54j55L12k57J41q0L88j88J10j46
$$ -110 -418 -407 -341 -309 -347 -312 -134 -397 -409 -438 -67 -282 -540 -186 -341 -29 -286 -145 -225 163 -25 85 -61
3805f1p2J57P2j02L65q1L15J53m68j20K83k17J23j28q8N75m20k22J47M49l37M4
$$ -61 -133 24 96 -6 359 278 593 746 278 158 441 224 347 219 131 706 286 64 211 660 323 367
3827C67m79J40J44r3j56N7o9L09k97n16M35q7L9j9l64L18L25k81r1k19K56l4k05
$$ 367 -112 28 172 79 -77 -20 -89 220 -77 -593 -158 -245 -206 -225 -589 -271 54 -227 -318 -537 -281 -315 -520
3850e20R9r9M82k34kK54O4j72N9k08L10M57o01L11J81qJ57l24j79O38q3j36l71
$$ -520 -421 -520 -38 -272 -274 -20 44 -128 -69 -277 33 490 -111 200 381 373 530 206 27 665 582 446 75
3873G5M44O7J01m78o2q4L42n13Q5N9K27k00l54M15k31K79n53M45O9j89k6k51j16
$$ 75 519 586 687 209 147 63 405 -108 -23 36 263 63 -291 124 -107 172 -381 64 133 -56 -82 -333 -449
3896d49K57J5J34l40J2O2j7l2J93l2L65l93Q8o6J33j01k24L34j4o6J81k6j21K0
$$ -449 -192 -177 -43 -383 -371 -309 -326 -358 -165 -197 168 -225 -137 -203 -70 -171 -395 -61 -75 -141 40 14 -107 -87
3920h7J95j60L02J85j66nk61L29L47l83J41n74K19K36j26p3M5J44j87j23J77l32
$$ -87 108 -52 250 435 269 264 3 332 679 296 437 -137 82 318 192 119 164 308 121 -2 175 -157
3942a57J22K4l53N51j64n7k06M7N7r0j09j35k2L07K3k06K0L8N3j28k2J65J68L2
$$ -157 -35 -11 -364 187 23 -34 -240 -193 -136 -226 -335 -470 -492 -185 -162 -368 -348 -310 -257 -385 -407 -242 -74 -42
3966d2m4O2J5R9j09l44L86j72M27l16J87o8L02k60k30M11J85m07j04K64M2K68
$$ -42 -86 -24 -9 90 -19 -363 23 -149 278 -38 149 81 383 123 -107 304 489 82 -22 242 284 552
3988E52k05m3k08N2N20o25k50M46K09km48N8l8K55m03K7j27O9Q3m14M78n8k85
$$ 552 347 304 96 148 668 43 -207 239 448 446 -2 56 18 273 -130 -103 -230 -161 -78 -492 -14 -72 -357
4011c57k56J42J87L06n37M08k76J45l9m1j31M79M09l51l07p3J59K39l04J24L8
$$ -357 -613 -471 -284 22 -515 -107 -383 -238 -277 -318 -449 30 439 88 -219 -292 -133 106 -198 -74 -36
4032c6K92O8k86J50K1J32L2m53J54J58J78l35L73k86J75j05k76J29L22J47m57
$$ -36 256 324 38 188 209 341 373 -80 74 232 410 75 448 162 337 232 -44 85 407 554 97
4053I7n4O9l45K55M3J14j94j97k97J92m9K05j23N7k4J39j8l05K53K1o8n8j64M28
$$ 97 43 112 -233 22 65 179 -15 -212 -509 -317 -366 -161 -284 -227 -251 -112 -130 -435 -182 -161 -229 -287 -451 -23
4077b3r2L1Q3j95k27L67K29k71K02L75m76J5o6N39K3j15n01M05J88j23m51L32
$$ -23 -115 -84 -1 -196 -423 -56 173 -98 104 479 3 18 -48 491 514 399 -102 303 491 368 -83 249
4099B49J10j20j30L4K77K1r2l03L43l10r7j9N4N7Ok66N7J81l00N96m19j40R5l7
$$ 249 359 239 109 143 420 441 349 46 389 79 -18 -37 17 74 80 -186 -129 52 -248 348 -71 -211 -116 -153
4123a53j67l8l3J23K32j40k78M76k27J21l57j35L83L0j97L14L01m24J90l2N6j8
$$ -153 -320 -358 -391 -268 -36 -176 -454 22 -205 -84 -441 -576 -193 -163 -360 -46 255 -169 21 -11 45 27
4145B7N8J80k82J70L36k32j17j45L10M8j42K74P6l25r6q3j1J6K09k89J87L4j32
$$ 27 85 265 -17 153 489 257 140 -5 305 353 211 485 561 236 140 57 46 62 271 -18 169 203 71
4168G1J54q8l21J99L6k67J86m22M97r2k1k59J1K48j07l29J63L42l87k20K05L00
$$ 71 225 137 -184 15 51 -216 -30 -452 45 -47 -68 -327 -316 -68 -175 -504 -341 1 -386 -606 -401 -101
4190a01K3J80j11j5m27L46N9k3n5K70Ml23J59L09Rn68M61N6J37rk78K63l77J16
$$ -101 -78 102 -9 -24 -451 -105 -46 -69 -124 146 150 -173 -14 295 304 -264 197 253 390 381 103 366 -11 105
4214A05j93K90r5J43J3l67J08N3Jj24j97M24k87K7j51M5O2K14n20L02Rj65r1K9
$$ 105 -88 202 107 250 263 -104 4 57 58 -66 -263 161 -126 -99 -250 -205 -143 71 -449 -147 -138 -303 -394 -365
4238c65L13n5m42K60R2OL8J63Ol77P72o02K24j87K19j07k8O4M2L55l51j73K65
$$ -365 -52 -107 -549 -289 -197 -191 -153 10 16 -361 411 -191 33 -154 65 -42 -70 -6 36 391 40 -133 132
4261A32R4n4k4L7P3P3j04J81k76O7L7P3j07k41k06J28L53m40K14L63j21l21K48
$$ 132 226 172 148 185 258 331 227 408 132 199 236 309 202 -39 -245 -117 236 -204 10 373 252 -69 179
4284A79l2j94j34R5k69J9J89j34j50R3J10j48m1Q9M4p3q9J03K53J83O1o43K08
$$ 179 147 -47 -181 -86 -355 -336 -147 -281 -431 -338 -228 -376 -417 -328 -284 -357 -446 -343 -90 93 154 -489 -281
4307b81J69J00k15J11J53l1o8J46J69J73l61Lo2K46p9J34m91L14k0m3J27j73K04
$$ -281 -112 -12 -227 -116 37 6 -62 84 253 426 65 68 6 252 173 307 -184 130 110 67 194 21 225
4330B25J78j64k54k37P59m12k70L05m6K4J51l63J6J07J13m44J3K07j79J16j6j75
$$ 225 403 239 -15 -252 507 95 -175 130 84 108 259 -104 -88 19 132 -312 -299 -92 -271 -155 -171 -346
4352c46K32k51K5M95k95k02j97L26P8Rk53O5J27J88J74o7N5l2j30q6K40j5j06
$$ -346 -114 -365 -340 155 -140 -342 -539 -213 -135 -126 -379 -314 -187 1 175 108 163 131 1 -85 155 140 34
4375C4L66R9n23J31J6M58n61N4O0J37j58p9J37L64l28j27J41k61J37m89L05%K7
$$ 34 400 499 -24 107 123 581 20 74 134 271 113 34 171 535 207 80 221 -40 97 -392 -87 -87 -60
4398f0N5Pj86m9L12k02n6p3j7j45K64n47N84L88n63j26J33K20J28l96O0K76o3
$$ -60 -5 2 -184 -233 79 -123 -179 -252 -269 -414 -150 -697 -113 275 -288 -414 -281 -61 67 -329 -269 7 -56
4421e6Q0j62P4r4L54j15k9L02j22j68j4N7M9L51l40l0K08K48l42l28J3M33r0l51
$$ -56 24 -138 -64 -158 196 81 52 354 232 64 50 107 156 507 167 137 345 593 251 -77 -64 369 279 -72
4445g2J19J71J26n82K61M04k01k91m52K60J04K16m0m66O04j86J00l02L27l48R3
$$ -72 47 218 344 -238 23 427 226 -65 -517 -257 -153 63 23 -443 161 -25 75 -227 100 -248 -155
4466a55J26k13O8N2j14j25N46k07j13k28J84N17j35j78J03J9O5J12k47k53L66
$$ -155 -29 -242 -174 -122 -236 -361 185 -22 -135 -363 -179 338 203 25 128 147 212 324 77 -176 190
4487A90J14r7k20M3j09O61o24J40j70L28m8j97L93m64N13k83J56k14J5j15l15
$$ 190 304 207 -13 30 -79 582 -42 98 -72 256 208 11 404 -60 453 170 326 112 127 12 -303
4508c03p6K50L21k05Qm37J56M56l7o00N34j03n0k73J13N24l79J06o3l33M88j27
$$ -303 -379 -129 192 -13 -5 -442 -286 170 133 -467 67 -36 -86 -359 -246 278 -101 5 -58 -391 97 -30
4530c0r6k04o3K21K85k62K04K90O3l25MQ4k07M28l51P5k34M28j64J39k93j36J66
$$ -30 -126 -330 -393 -172 113 -149 55 345 408 83 87 171 -36 392 41 116 -118 310 146 285 -8 -144 22
4553B2L8L37n0k47j33r6M30L4k51k22j29N79l20P6l37L33l3l62J65P3l56K29j60
$$ 22 60 397 347 100 -33 -129 301 335 84 -138 -267 312 -8 68 -269 64 31 -331 -166 -93 -449 -220 -380
4576c80M33l00J71j70K22J63k23K15m98K29K32L2j35M8J3K3j03j04K25j33R2J60
$$ -380 53 -247 -76 -246 -24 139 -84 131 -367 -138 94 126 -9 39 52 75 -28 -132 93 -40 52 212
4598B12l58L36j35K38l03L35l0j15K19m74J99J35j40q6K16k15q0K17l86J51K02
$$ 212 -146 190 55 293 -10 325 295 180 399 -75 124 259 119 33 249 34 -46 171 -215 -64 138
4619A38j84J22N0l6j69rj93q4M38k27k8k71L66J71l00l66L20J26j14m3N14k69
$$ 138 -46 76 126 90 -79 -88 -281 -365 73 -154 -182 -453 -87 84 -216 -582 -262 -136 -250 -293 221 -48
4641d8n3j50P8j31N51l96J8J90p4L06L4l27k83O31k68K32r4J68m03J17L7O5J85
$$ -48 -101 -251 -173 -304 247 -149 -131 59 -15 291 325 -2 -285 346 78 310 216 384 -19 98 135 200 385
4664C85l28J28j24J02L0o4p2K8J06J87k66k95L41l15J55K90l61K23l07p3J97j25
$$ 385 57 185 61 163 193 129 57 85 191 378 112 -183 158 -157 -2 288 -73 150 -157 -230 -33 -158
4686a58J06k47m2J91J03n2m4m1q5M18m38J15J23M01k91l32N79Q1m76L3J82o3J89
$$ -158 -52 -299 -341 -150 -47 -99 -143 -184 -269 149 -289 -174 -51 350 59 -273 306 387 -89 -56 126 63 252
4709B52q9o0m4L8j6j8ol4R8NK12k64K28r0J13k87J17q7q8j1k19L17j10J44j31
$$ 252 163 103 59 97 81 63 57 23 121 126 338 74 302 212 325 38 155 68 -20 -31 -250 67 -43 101 -30
4734c0Q1k2k85kqK77K1o6k09j18L32k64J1K45q2J20j78j32j6M34Ok95k7p9j07
$$ -30 51 29 -256 -258 -266 11 32 -34 -243 -361 -29 -293 -282 -37 -119 1 -177 -309 -325 109 115 -180 -207 -286 -393
4759c93N28k10OM9j74L14l14R4N96l06j47J3j3M16q8m04K69r5R0j51N43o36J98
$$ -393 135 -75 -69 -20 -194 120 -194 -100 496 190 43 56 43 459 371 -33 236 141 231 80 623 -13 185
4782A85k90K41jQ2j08k9k77K71j50q2j7l5K54j0j44j6k93J81L19j60jl68L01j79
$$ 185 -105 136 135 217 109 80 -197 74 -76 -158 -175 -210 44 34 -110 -126 -419 -238 81 -79 -80 -448 -147 -326
4806c26L33o1K9l46L34n2k04K65L5o3J06M1N5k15j93N37l73R0j14J59J69j48J2
$$ -326 7 -54 -25 -371 -37 -89 -293 -28 7 -56 50 91 146 -69 -262 275 -98 -8 -122 37 206 58 70
4829G0p3J54%k13J38J04J1k59J79n0R6Jk77J07K03l47J60J44l63J11k31L07L3
$$ 70 -3 151 151 -62 76 180 191 -68 111 61 157 158 -119 -12 191 -156 4 148 -215 -104 -335 -28 5
4852EOj37O5O0o6l09K3j2M40j17l20L87l25N4nj5%J88L83j66l26K54k27J66K33
$$ 5 11 -126 -61 -1 -67 -376 -353 -365 75 -42 -362 25 -300 -246 -251 -266 -266 -78 305 139 -187 67 -160 6 239
4877B39l15j27J14L42l10K13O2j33p0J86l6k0k5n4J06k2Rk93L6M37m91M63k70
$$ 239 -76 -203 -89 253 -57 156 218 85 15 201 165 145 120 66 172 150 159 -134 -98 339 -152 311 41
4900D1j06o6M57m42j96J84j46K73j80K04j92J67m75M13j74K9J00l7n5K39k01j53
$$ 41 -65 -131 326 -116 -312 -128 -274 -1 -181 23 -169 -2 -477 -64 -238 -209 -109 -146 -201 38 -163 -316
4922c16L69j03j12J61n2j25L06l54K54j6J26J09p6k07o1M18j97K65j57k55K49
$$ -316 53 -50 -162 -1 -53 -178 128 -226 28 12 138 247 171 -36 -97 321 124 389 232 -23 226
4943B26K47l31k6j20o3qj29M62J0l50Q5Nj11oO6J45K3O5l35L3j7J12l76L97q7
$$ 226 473 142 116 -4 -67 -75 -204 258 268 -82 3 8 -103 -109 -43 102 125 190 -145 -112 -129 -17 -393 4 -83
4968h3K1k8j2K4j15k6K93k46K27j80r9J66K14m32j54M30j64J37O6J7j22j11N26
$$ -83 -62 -90 -102 -78 -193 -219 74 -172 55 -125 -224 -58 156 -276 -430 0 -164 -27 39 56 -66 -177 349
4991C49l91p6N84l26j34J09m6L50k56j37J66RK65m75J48j34J80l57L06j01K49
$$ 349 -42 -118 466 140 6 115 69 419 163 26 192 201 466 -9 139 5 185 -172 134 33 282
5012B82o12N22q2k36N3j56N7M6Q2K78n03J50K10k32l41K15K04j75J60m58L57K17
$$ 282 -330 192 110 -126 -73 -229 -172 -126 -44 234 -269 -119 91 -141 -482 -267 -63 -238 -78 -536 -179 38
5034C8j03k33K54R8O0j88K02j49Q1M12n41L36l06q9K11p7J05m0R3K6l9pj9k49
$$ 38 -65 -298 -44 54 114 -74 128 -21 60 472 -69 267 -39 -128 83 6 111 71 164 190 151 144 125 -124
5058a24r5M70j05n5j67K61J38j02j15n0j89n6J07N0j77K64j50J29j29k08N51m51
$$ -124 -219 251 146 91 -76 185 323 221 106 56 -133 -189 -82 -32 -209 55 -95 34 -95 -303 248 -203
5080b03J28j9k1O0q0J43j12k2J0K7N6K08k03j32M8j1N1K07j04q8j3J57M7j3l2
$$ -203 -75 -94 -115 -55 -135 8 -104 -126 -116 -89 -33 175 -28 -160 -112 -123 -72 135 31 -57 -70 87 134 121 89
5105H9J6J68k57j1K57k60K40m41L9L49m8k15N1k13L53l56K55L0rJ13q0p0Q2J37
$$ 89 105 273 16 5 262 2 242 -199 -160 189 141 -74 -23 -236 117 -239 16 46 37 150 70 0 82 219
5129B19k05j29J04j90K17k57j73L86p6j0J40r6J37J5l9l35J65J04j73O4J6K15
$$ 219 14 -115 -11 -201 16 -241 -414 -28 -104 -114 26 -70 67 82 43 -292 -127 -23 -196 -132 -116 99
5151I9j13k66K01L6R1l27J84j07N9K39L0j96l4K61m40M16M9J40l14K37k78M40
$$ 99 -14 -280 -79 -43 48 -279 -95 -202 -143 96 126 -70 -104 157 -283 133 182 322 8 245 -33 407
5173D07j79m49L22J11k73J98k94L36r7j30l2j29K88N3j6p1j1j88r0K78r0P0j45
$$ 407 228 -221 101 212 -61 137 -157 179 82 -48 -80 -209 79 132 116 45 34 -154 -244 34 -56 14 -131
5196a31R3j66L83k34k79q1J95K65k17J16P4j6J77j10n99N68L7k06L14q9l08M44
$$ -131 -38 -204 179 -55 -334 -415 -220 45 -172 -56 18 2 179 69 -530 38 75 -131 183 94 -214 230
5218B30j96l7J6J01J63k9k05J84m9k46J46l09M26J04l8m35J99l0m25N13j27J46
$$ 230 34 -3 13 114 277 248 43 227 178 -68 78 -231 195 299 261 -174 25 -5 -430 83 -44 102
5240A02l63m4M5L81J29m08K95k44q0K07m4j61R6J6r4j59L59j60K62Nk89q4L43
$$ 102 -261 -305 -260 121 250 -158 137 -107 -187 20 -24 -185 -89 -73 -167 -326 33 -127 135 140 -149 -233 110
5263A10K50o95K63J10j39M61l02j37P1k1J22j60L26k79J86k35J44J69r7J08l04
$$ 110 360 -335 -72 38 -101 360 58 -79 -8 -29 93 -67 259 -20 166 -69 75 244 147 255 -49
5284d9P4J8M5p1J13M0m4j19m3Q4j26N0R1k15J78m47M48j7j14l6rM50l69j71L34
$$ -49 25 43 88 17 130 170 126 7 -36 48 -78 -28 63 -152 26 -421 27 10 -104 -140 -149 301 -68 -239 95
5309I5j31J70m33K48l86J17K73k28L10l34M63j48j16L42p44N86j22O1J1n7L7o8
$$ 95 -36 134 -299 -51 -437 -320 -47 -275 35 -299 164 16 -100 242 -502 84 -38 23 34 -23 14 -54
5331e4L18l22L60k31j79K10j10J37L1K76J51o26k8M24m18L59m23J56k68L79j90
$$ -54 264 -58 302 71 -108 102 -8 129 160 436 587 -39 -67 357 -61 298 -125 31 -237 142 -48
5352d8p9L3K77k05q8J27jL70n36O1J97q7m16J56K3K61r0k75N52l20P3J3j94J71
$$ -48 -127 -94 183 -22 -110 17 16 386 -150 -89 108 21 -395 -239 -216 45 -45 -320 232 -88 -15 -2 -196 -25
5376b5K34k96j27K62j3Q4k31P8O1L35r2k90K39k04K8K3K08m7j39k38O38l67k36
$$ -25 209 -87 -214 48 35 119 -112 -34 27 362 270 -20 219 15 43 66 274 227 88 -150 488 121 -115
5399a15j32R0O1K68ln8oJ87o61M47j82j81J58J18l80K42O5R2m96N15k02q0O6j07
$$ -115 -247 -157 -96 172 169 111 105 292 -369 78 -104 -285 -127 -9 -389 -147 -82 10 -486 29 -173 -253 -187 -294
5423b94N33m60o0%j24M75L2J42n31oO1K71J66o9k29n0J60k16K74K37k28j0oo3
$$ -294 239 -221 -281 -281 -405 70 102 244 -287 -293 -232 39 205 136 -93 -143 17 -199 75 312 84 74 68 5
5447Ek8J1j3R4M5l11N0M23k10K12j22M4k41mM0P4j43J82nj85K42l83L51L1k94
$$ 5 -23 -12 -25 69 114 -197 -147 276 66 278 156 200 -41 -45 -5 69 -74 108 103 -82 160 -223 128 159 -135
5472a35O7mj65J73J38j66kK7J6qJ70J18l25n5J95o1J12j1k9J17j61j78J52J55
$$ -135 -68 -72 -237 -64 74 -92 -94 -67 -51 -59 111 229 -96 -151 44 -17 95 84 55 172 11 -167 -15 140
5496A40p7J35J64k31Jo5j6J29r2j68J28K30q1k72J59L5K07j0r5r9J57l91k6ll3
$$ 140 63 198 362 131 132 67 51 180 88 -80 48 278 197 -75 84 119 326 316 221 122 279 -112 -138 -141 -174
5521a74j38K44j82L76j31k21K10k76L75m06j78M58J84n90M30R3l00L03L9j26j99
$$ -174 -312 -68 -250 126 -5 -226 -16 -292 83 -323 -501 -43 141 -449 -19 74 -226 77 116 -10 -209
5542b09rJ15k7q7L36L0l8q2k70L12k84K09L61j7k17J87j28j46R4K37m69J49K8
$$ -209 -218 -103 -130 -217 119 149 111 29 -241 71 -213 -4 357 340 123 310 182 36 130 367 -102 47 75
5565G5K78l12k0J44k52J50K9j30p0J54j92L68j44k85j1L13l23l3N01n48R4k44
$$ 75 353 41 21 165 -87 63 92 -38 -108 46 -146 222 78 -207 -218 95 -228 -261 240 -308 -214 -458
5587d58L53k5K26k67k2r9J09J48j56O8J39N0r8J57j3j55k12K97j05M21q7j36n3
$$ -458 -105 -130 96 -171 -193 -292 -183 -35 -191 -123 16 66 -32 125 112 -43 -255 42 -63 358 271 135 82
5610H2NN7m22L48K78j88k18L86j9j80J57m6l64K21q4j64lL8R2k3k24O6K49Q7k50
$$ 82 87 144 -278 70 348 160 -58 328 309 129 286 240 -124 97 13 -151 -154 -116 -24 -47 -271 -205 44 131 -119
5635a19l5K56j6J02m66O9j3J50k21P3K52N2j4j07j77L23j16P4o1k11J45R6L46
$$ -119 -154 102 86 188 -278 -209 -222 -72 -293 -220 32 84 70 -37 -214 109 -7 67 6 -205 -60 36 382
5658C82o67K67LJ60n16M42k4K25k56o1J07M5L0q3kk7K63n88J71K92p4J17l01J2
$$ 382 -285 -18 -15 145 -371 71 47 272 16 -45 62 107 137 54 52 25 288 -300 -129 163 89 206 -95 -83
5682h3K02m02K83m4N1k14K90k18M9J89oOn6q7J07K26p61J95K70O1j06nK53m14
$$ -83 119 -283 0 -44 7 -207 83 -135 -86 103 97 103 47 -40 67 293 -468 -273 -3 58 -48 -53 200 -214
5706b14J57j63M09k77M7l26L01p5K48L2j32k4j6J90k79J15K6J23j9j40m8J90q0
$$ -214 -57 -220 189 -88 -41 -367 -66 -141 107 139 7 -17 -33 157 -122 -7 19 142 123 -17 -65 125 45
5729D5j06K48k6M1j01P1l9o5J32k91K96l33K99r3l26J87J44M2o8J19j22J1k40
$$ 45 -61 187 161 202 101 172 133 68 200 -91 205 -128 171 78 -248 -61 83 125 57 176 54 65 -175
5752a75j19l0N92l36J65k30L27m58LK65n5J59j47no2R6J49k48j06J71j06J07J84
$$ -175 -294 -324 268 -68 97 -133 194 -264 -261 4 -51 108 -39 -44 -106 -10 139 -109 -215 -44 -150 -43 141
5775A41p7J54l45J69K29j94K52m36J74o3L16k08J59k09j23L3J51rK25m99J80k31
$$ 141 64 218 -127 42 271 77 329 -107 67 4 320 112 271 62 -61 -28 123 114 339 -160 20 -211
5797b11OL02j68o4K25l54K16R0Lq1kJ24J04k64L24R8n4m33R2p5k63K85p1J80j64
$$ -211 -205 97 -71 -135 90 -264 -48 42 45 -36 -38 86 190 -74 250 348 294 -139 -47 -122 -385 -100 -171 9 -155
5822a55M55m70K55k67J4J00j10K37J95j80K13p3m60L4L36nm10M67l98K72n4p5
$$ -155 300 -170 85 -182 -168 -68 -178 59 254 74 287 214 -246 -212 124 119 -291 176 -222 50 -4 -79
$$ [...]
8191d4
##END NTUPLES=NMR FID
##END=
