##TITLE=1H_lae-B11M-3-17-3-12-11
 Py-d5, 8 sc, 
 26.6.2019
##JCAMPDX= 6.0         $$ Bruker NMR JCAMP-DX V2.0
##DATA TYPE= NMR FID
##DATA CLASS= NTUPLES
##ORIGIN= UXNMR, Bruker Analytische Messtechnik GmbH
##OWNER= root
$$ XWIN-NMR		Version 3.5
$$ Wed Jun 26 14:49:16 2019 Russian Standard Time (UT+4h)  she@DPX200
##.OBSERVE FREQUENCY= 200.13155
##.OBSERVE NUCLEUS= ^1H
##.DELAY= (6, 6)
##.ACQUISITION MODE= SIMULTANEOUS
##.ACQUISITION SCHEME= undefined
##.AVERAGES= 8
##.DIGITISER RES= 18
##SPECTROMETER/DATA SYSTEM= spect
##.PULSE SEQUENCE= zg30
##.SOLVENT NAME= Pyr
##.SHIFT REFERENCE= (INTERNAL, Pyr, 0, 15.7039)
##AUDIT TRAIL= $$ (NUMBER, WHEN, WHO, WHERE, WHAT)
$$ ##TITLE= Audit trail, XWIN-NMR		Version 3.5
$$ ##JCAMPDX= 5.01
$$ ##ORIGIN= Bruker BioSpin GmbH
$$ ##OWNER= she
$$ F:/spectra/data/she/nmr/H-F/1/audita.txt
$$ ##AUDIT TRAIL=  $$ (NUMBER, WHEN, WHO, WHERE, WHAT)
(   1,<2019-06-26 14:48:14.06 +0400>,<she>,<DPX200>,
      <created by zg, POWCHK disabled, PULCHK disabled
       configuration hash MD5:
       00 E9 B6 7A A2 85 ED C7 34 08 36 98 17 FE 4E 26
       data hash MD5: 16K
       EC 46 B9 43 EC 00 09 E4 AC FF F6 B3 AD D5 DE CC>)
$$ ##END=
$$ 
$$ hash MD5
$$ 3F 47 52 1A BE CD 31 1F E0 13 E7 2D A1 4E AB 7F
##$RELAX= 
##$RELAX= 
##$RELAX= 
##$RELAX= 
##$RELAX= 
##$RELAX= 
$$ Bruker specific parameters
$$ --------------------------
##$DU= <F:/spectra>
##$EXPNO= 1
##$NAME= <H-F>
##$PROCNO= 1
##$TYPE= <nmr>
##$USER= <she>
##$AMP= (0..31)
100 100 100 100 100 100 100 100 100 100 100 100 100 100 100 100 100 100 
100 100 100 100 100 100 100 100 100 100 100 100 100 100 
##$AQSEQ= 0
##$AQ_mod= 1
##$AUNM= <au_zg>
##$AUTOPOS= <>
##$BF1= 200.13
##$BF2= 200.13
##$BF3= 200.13
##$BF4= 200.13
##$BF5= 200.13
##$BF6= 200.13
##$BF7= 200.13
##$BF8= 200.13
##$BYTORDA= 1
##$CFDGTYP= 0
##$CFRGTYP= 5
##$CHEMSTR= <none>
##$CNST= (0..31)
1 1 145 1 1 1 1 1 1 1 1 1 1 1 1 1 1 1 1 1 1 1 1 1 1 1 1 1 1 1 1 1 
##$CPDPRG= <>
##$CPDPRG1= <>
##$CPDPRG2= <>
##$CPDPRG3= <>
##$CPDPRG4= <mlev>
##$CPDPRG5= <mlev>
##$CPDPRG6= <mlev>
##$CPDPRG7= <mlev>
##$CPDPRG8= <mlev>
##$CPDPRGB= <>
##$CPDPRGT= <>
##$D= (0..31)
0 1.2 0 0 0 0 0 0 0 0 0 0.03 0 0 0 0 0 0 0 0 0 0 0 0 0 0 0 0 0 0 0 0 
##$DATE= 1561546093
##$DBL= (0..7)
120 120 120 120 120 120 120 120 
##$DBP= (0..7)
150 150 150 150 150 150 150 150 
##$DBP07= 0
##$DBPNAM0= <>
##$DBPNAM1= <>
##$DBPNAM2= <>
##$DBPNAM3= <>
##$DBPNAM4= <>
##$DBPNAM5= <>
##$DBPNAM6= <>
##$DBPNAM7= <>
##$DBPOAL= (0..7)
0.5 0.5 0.5 0.5 0.5 0.5 0.5 0.5 
##$DBPOFFS= (0..7)
0 0 0 0 0 0 0 0 
##$DE= 6
##$DECBNUC= <off>
##$DECIM= 24
##$DECNUC= <off>
##$DECSTAT= 4
##$DIGMOD= 1
##$DIGTYP= 9
##$DL= (0..7)
0 120 120 120 120 120 120 120 
##$DP= (0..7)
150 150 150 150 150 150 150 150 
##$DP07= 0
##$DPNAME0= <>
##$DPNAME1= <>
##$DPNAME2= <>
##$DPNAME3= <>
##$DPNAME4= <>
##$DPNAME5= <>
##$DPNAME6= <>
##$DPNAME7= <>
##$DPOAL= (0..7)
0.5 0.5 0.5 0.5 0.5 0.5 0.5 0.5 
##$DPOFFS= (0..7)
0 0 0 0 0 0 0 0 
##$DQDMODE= 0
##$DR= 18
##$DS= 0
##$DSLIST= <SSSSSSSSSSSSSSS>
$$ [...]
##$SUBNAM2= <"">
##$SUBNAM3= <"">
##$SUBNAM4= <"">
##$SUBNAM5= <"">
##$SUBNAM6= <"">
##$SUBNAM7= <"">
##$SUBNAM8= <"">
##$SUBNAM9= <"">
##$SW= 24.9336996594482
##$SWIBOX= (0..15)
0 0 2 0 0 0 0 0 0 0 0 0 0 0 0 0 
##$SW_h= 4990.01996007984
##$TD= 16384
##$TD0= 1
##$TE= 0
##$TE2= 300
##$TE3= 300
##$TEG= 300
##$TL= (0..7)
0 120 120 120 120 120 120 120 
##$TP= (0..7)
150 150 150 150 150 150 150 150 
##$TP07= 0
##$TPNAME0= <>
##$TPNAME1= <>
##$TPNAME2= <>
##$TPNAME3= <>
##$TPNAME4= <>
##$TPNAME5= <>
##$TPNAME6= <>
##$TPNAME7= <>
##$TPOAL= (0..7)
0.5 0.5 0.5 0.5 0.5 0.5 0.5 0.5 
##$TPOFFS= (0..7)
0 0 0 0 0 0 0 0 
##$TUNHIN= 0
##$TUNHOUT= 0
##$TUNXOUT= 0
##$USERA1= <user>
##$USERA2= <user>
##$USERA3= <user>
##$USERA4= <user>
##$USERA5= <user>
##$V9= 5
##$VALIST= <valist>
##$VCLIST= <CCCCCCCCCCCCCCC>
##$VD= 0
##$VDLIST= <DDDDDDDDDDDDDDD>
##$VPLIST= <PPPPPPPPPPPPPPP>
##$VTLIST= <TTTTTTTTTTTTTTT>
##$WBST= 1024
##$WBSW= 4
##$XGAIN= (0..3)
0 0 0 0 
##$XL= 0
##$YL= 0
##$YMAX_a= 213402
##$YMIN_a= -288542
##$ZGOPTNS= <>
##$ZL1= 120
##$ZL2= 120
##$ZL3= 120
##$ZL4= 120
##$ABSF1= 10
##$ABSF2= 0
##$ABSG= 5
##$ABSL= 3
##$ALPHA= 0
##$AQORDER= 0
##$ASSFAC= 0
##$ASSFACI= 0
##$ASSFACX= 0
##$ASSWID= 0
##$AUNMP= <proc_1d>
##$AZFE= 0.1
##$AZFW= 0.1
##$BCFW= 1
##$BC_mod= 2
##$BYTORDP= 1
##$COROFFS= 0
##$CY= 11.3945322036743
##$DATMOD= 1
##$DC= 2
##$DFILT= <>
##$DTYPP= 0
##$F1P= 18.9103706918063
##$F2P= -1.10871071338519
##$FCOR= 0.5
##$FTSIZE= 0
##$FT_mod= 4
##$GAMMA= 1
##$GB= 0.15
##$INTBC= 1
##$INTSCL= 1
##$ISEN= 128
##$LB= 0.24
##$LEV0= 0
##$LPBIN= 0
##$MAXI= 10000
##$MC2= 0
##$MEAN= 0
##$ME_mod= 0
##$MI= 1.114404
##$NCOEF= 0
##$NC_proc= 0
##$NLEV= 6
##$NOISF1= 3.799351
##$NOISF2= 2.8
##$NSP= 1
##$NTH_PI= 0
##$NZP= 0
##$OFFSET= 15.70392
##$PC= 1
##$PHC0= -8501.943
##$PHC1= 18.80097
##$PH_mod= 1
##$PKNL= yes
##$PPARMOD= 0
##$PSCAL= 0
##$PSIGN= 0
##$REVERSE= no
##$SF= 200.130013532006
##$SI= 16384
##$SIGF1= 3
##$SIGF2= 2
##$SINO= 400
##$SIOLD= 16384
##$SREGLST= <1H.CDCl3>
##$SSB= 0
##$STSI= 0
##$STSR= 0
##$SW_p= 3612.71676300578
##$SYMM= 0
##$S_DEV= 0
##$TDeff= 0
##$TDoff= 0
##$TI= <>
##$TILT= no
##$TM1= 0
##$TM2= 0
##$TOPLEV= 0
##$USERP1= <user>
##$USERP2= <user>
##$USERP3= <user>
##$USERP4= <user>
##$USERP5= <user>
##$WDW= 1
##$XDIM= 8192
##$YMAX_p= 0
##$YMIN_p= 0
$$ End of Bruker specific parameters
$$ ---------------------------------
##NTUPLES= NMR FID
##VAR_NAME=  TIME,          FID/REAL,        FID/IMAG
##SYMBOL=    X,             R,               I
##VAR_TYPE=  INDEPENDENT,   DEPENDENT,       DEPENDENT
##VAR_FORM=  AFFN,          ASDF,            ASDF
##VAR_DIM=   8192,          8192,            8192
##UNITS=     SECONDS,       ARBITRARY UNITS, ARBITRARY UNITS
##FACTOR=    0.0002004,     1,               1
##FIRST=     0,             0,               0
##LAST=      1.6414764,     0,               0
##MIN=       0,             -288542,         0
##MAX=       1.6414764,     213402,          0
$$ Real data points
##PAGE= N=1
##DATA TABLE= (X++(R..R)), XYDATA
0 0 0 0 0 0 0 -1 8 -8 8 -15 16 -18 24 -32 40 -47 56 -65 79 -90 106 -124 144 -168 192 -220 250 -283 323
29 323 -364 412 -462 519 -581 646 -722 803 -891 989 -1098 1214 -1345 1489 -1650 1828 -2027
46 -2027 2254 -2507 2801 -3142 3543 -4023 4613 -5350 6313 -7620 9517 -12529 18077 -31745
60 -31745 137675 121542 -97087 101956 213402 97824 -41217 53929 109540 13265 -77353
71 -77353 -12801 19156 -44066 -95283 -54719 -40049 -66491 -73741 -41697 -36624 -41652 -32755 -22806
84 -22806 -33197 -21446 8041 11615 -13627 -5685 27125 27440 -7080 -10459 19118 22420 -13705
97 -13705 -25298 4720 20244 -7584 -22870 6445 33506 14578 -7690 9708 37537 34291
109 34291 18401 22850 31041 25361 20319 26796 25293 4420 -19144 -32678 -34735 -30175 -34129 -56803
123 -56803 -74587 -63993 -52258 -71925 -92481 -73699 -47707 -55047 -63543 -35850 -8368 -19907
135 -19907 -31433 -4417 26242 21683 7459 15253 28856 26992 17905 15878 23567 31660 25684 2057
149 2057 -11967 4429 20761 4055 -12839 6077 26432 8464 -9423 16486 43949 21044
161 21044 -13369 214 36855 35042 2736 -10200 2423 6312 -9785 -27485 -33401 -31519 -31592
174 -31592 -40155 -47238 -40333 -27647 -30175 -39747 -29056 -4477 -371 -13650 457 42059 57024
187 57024 31567 24418 58480 77667 49504 31403 60017 79956 46690 13696 33392 59261
199 59261 34747 -3236 1620 25676 18432 -7143 -10895 4962 12288 6797 1156 1245 6659 10307
213 10307 3109 -6376 294 12616 2389 -18242 -15499 1070 -9490 -39432 -42878 -20582 -16882
226 -16882 -38819 -46106 -26550 -12474 -20865 -26025 -8361 13225 13783 2468 9635 34696 45022
239 45022 32429 29450 48483 55756 31597 11976 26215 39663 17231 -13104 -11424 5514 -1606
252 -1606 -26130 -33710 -23126 -22227 -37892 -46529 -34197 -18855 -22365 -33611 -27208 -8040 -6833 -25230
266 -25230 -31087 -14552 -3342 -13867 -25919 -20324 -10111 -15368 -28367 -32000 -21749 -15219 -23824
279 -23824 -32084 -17985 4820 1621 -14537 -2464 29532 30038 5716 12695 47453 48503 17534
292 17534 16138 46325 46303 13195 2836 20302 17962 -9669 -22633 -14760 -14254 -24484 -30207 -31536
306 -31536 -30123 -24623 -24100 -34952 -35979 -15245 -1319 -13136 -17299 6158 22208 5249 -6777
319 -6777 12028 26587 9855 -4985 10636 27586 14787 -4336 2257 19522 15277 -1891 47
332 47 19642 26620 13897 10725 28796 41915 31594 20506 30775 45696 39739 22303 18471
345 18471 26872 27246 13300 0 -152 3921 -5067 -25821 -33601 -21266 -15940 -32167 -41313 -23149
359 -23149 -7026 -20496 -33570 -14778 8008 1292 -14127 -1239 24260 25758 10540 8721 22647
372 22647 27829 14492 1333 6101 20037 17744 -1570 -7572 9343 15883 -4699 -17820 1587
385 1587 18453 2709 -13726 2088 22476 13306 -4390 1213 14507 8642 -5732 -7359 -1484
398 -1484 -3976 -15759 -25420 -26365 -21731 -22816 -34866 -43191 -35471 -26669 -34216 -42996 -29145 -8748
412 -8748 -10152 -22916 -13316 9632 11523 -3605 420 23894 30868 13206 5722 20691 28154 12116
426 12116 290 8271 13886 578 -11099 -4741 3160 -3465 -12334 -8863 -2198 -4085 -9342 -9837
440 -9837 -4265 3400 5623 -950 -6676 454 8306 -1866 -14693 -7959 3573 -8176 -27530 -20773
454 -20773 -1869 -7113 -27955 -25273 -5841 -4820 -18028 -14504 5789 13792 5832 5130 19815 31125
468 31125 27762 20667 25295 35976 35899 24050 19066 28672 33789 18465 2184 5417 15052 6188
482 6188 -10792 -10412 2826 2990 -12107 -18759 -5507 5561 -1314 -12602 -7245 6444 6918 -4078
496 -4078 -4343 8202 11230 -1972 -9138 -293 5887 -4988 -16530 -10291 2734 402 -13125 -14425
510 -14425 -100 7907 -1238 -7962 5638 22544 18337 5281 12330 31269 29619 12231 11609 26648
524 26648 25877 7373 895 9904 10250 -3432 -12518 -10287 -10434 -16571 -22928 -23814 -20074 -16960 -21167
539 -21167 -26535 -20038 -6297 -6792 -20238 -18011 1087 4452 -10847 -12317 5973 10179 -7821 -14909
553 -14909 910 8122 -6798 -18087 -8925 1633 -3105 -11694 -7144 3663 4166 -2876 -4285 5065
567 5065 13139 10699 6182 11317 20401 17039 5017 3075 12174 13299 -946 -11430 -5726 1647
581 1647 -7708 -23945 -24056 -11430 -11345 -27338 -30916 -14373 -6375 -18749 -23911 -6193 8455 -391
595 -391 -9886 1339 15973 12970 3438 6558 16440 17130 10103 6683 10154 13596 9596 216 -610
610 -610 8725 11478 9 -4903 9077 19003 7338 -3332 8720 22300 14313 1353 7893 20761
624 20761 16673 3186 1634 9318 8731 -2738 -11144 -9339 -4757 -7264 -15540 -17503 -10792 -9239 -17880
639 -17880 -19176 -5946 2753 -5131 -11362 1085 14699 11390 3107 10598 23153 20329 8650 8900
653 8900 19207 19960 8392 3206 10519 14243 4461 -6191 -3023 5200 2099 -8292 -8846 875 4970
668 4970 -2434 -7345 -1317 6599 3442 -5887 -4540 5062 4961 -7585 -12463 -1294 3067 -12134 -24371
683 -24371 -14176 -2877 -13293 -27918 -20309 -4798 -8076 -19953 -15521 -557 1870 -5883 -5105
696 -5105 5985 13191 10970 5923 8486 16282 18231 9597 2737 8865 14734 5723 -7839 -3935 6636
711 6636 -177 -15628 -14454 -444 -1960 -17295 -19254 -4233 2694 -7624 -14160 -4317 5661 -56
725 -56 -9176 -5236 5045 3957 -6211 -9703 -1964 2032 -5190 -12311 -8654 -2662 -4495 -10720 -9797
740 -9797 -961 2796 -1767 -3960 5007 13612 10252 4168 11321 22426 19482 8508 11220 22379
754 22379 20094 6496 3644 12281 11979 -1018 -7968 -1041 2731 -5079 -13701 -11906 -4041 -3502 -11100
769 -11100 -13457 -4705 3193 -2194 -8902 -1390 10549 6845 -4385 -1144 11447 10000 -2940 -3443
783 -3443 7384 8754 -2557 -7027 815 5787 -208 -6428 -3059 5923 7373 1232 -1260 8078 16781
798 16781 11388 2668 8099 19525 16341 3116 3427 15008 13673 -1240 -7736 994 4178 -7640
812 -7640 -17329 -11799 -4327 -10394 -20789 -17447 -6064 -5436 -15426 -16291 -3995 2784 -3944 -8679 206
827 206 9611 5705 -1818 451 7665 8495 1173 -3203 1375 5896 2302 -6446 -6361 2315 3366 -6738
843 -6738 -9417 2639 7254 -2824 -7396 4747 12591 3065 -4837 4813 13922 5043 -5739 -1475
857 -1475 6632 2586 -7879 -9281 -4417 -4449 -11631 -17049 -13466 -6581 -8139 -16125 -16169 -5706 0 -6213
873 -6213 -8662 496 8821 3500 -1779 5008 14198 11920 4053 4876 12398 12417 3276 -662 5258 8762
889 8762 755 -6534 -1197 7426 2319 -8800 -5594 6330 7139 -3550 -5656 6824 11962 3027
903 3027 -4473 2208 11463 7529 -3421 -4304 3425 4317 -5512 -11396 -4880 1029 -5666 -14306 -9889
918 -9889 -760 -2584 -10883 -7648 3530 6372 -492 -1287 6775 13289 9344 4502 8978 17054 14628
933 14628 5024 2058 10878 14794 4390 -4574 753 7092 -303 -10602 -6119 3535 -126 -10335
947 -10335 -8708 2003 2134 -6580 -6594 2730 6124 -466 -4918 -10 5360 1937 -4488 -3745 965 508
963 508 -6248 -10112 -5568 -433 -4639 -11429 -9463 -73 1294 -6285 -7294 2685 8460 1489 -2594
978 -2594 6789 15558 8832 -779 4422 14455 9714 -1022 119 8734 4929 -7270 -8410 -246
992 -246 688 -8548 -12705 -7453 -2920 -6720 -11464 -8702 -969 461 -5260 -7736 -606 6689 2136 -6115
1008 -6115 -1977 7956 6473 -4565 -6601 2434 5298 -3261 -8627 -1984 3238 -2183 -9329 -5256 4397
1023 4397 4314 -2786 -3425 5436 10115 3491 -555 7611 14654 7822 -767 4169 12699 7640 -3592
1038 -3592 -3722 4988 4635 -5653 -10178 -5148 -1263 -5523 -10931 -8362 -1978 -2009 -7105 -6868 312 4236
1054 4236 -694 -3898 2796 9510 6070 192 1717 7903 6842 -139 -1135 4692 7096 -624 -6776
1069 -6776 -1531 5327 1895 -6294 -3998 5659 5613 -4112 -3625 8459 11136 1039 -2185 7347 11074
1084 11074 2441 -1923 4046 7747 1357 -5134 -3239 96 -1508 -6695 -9283 -6419 -2860 -4827 -10533
1099 -10533 -9807 -1843 1082 -5604 -7274 2309 8059 302 -5091 3649 12607 6577 -3082 1054 10341
1114 10341 7776 -3170 -4176 4233 6058 -2588 -7760 -1394 4230 -1371 -8608 -4183 4006 2493
1128 2493 -4720 -3807 4130 5744 -441 -2748 3238 6822 1856 -3786 -1747 3344 1750 -5673 -8723
1143 -8723 -3243 1175 -4898 -11668 -7917 -54 -2088 -9914 -8003 2286 4103 -3584 -4645 4737 8959
1158 8959 3268 -1107 5057 11320 6362 -395 1953 8505 6504 -1976 -3622 2647 4082 -3729 -7065
1173 -7065 -1508 3061 -2412 -8769 -3200 3182 1604 -4135 -3161 3504 5119 666 -1453 1976 5153
1188 5153 2134 -1929 -1895 2429 2068 -4126 -6768 -1770 2554 -3390 -9265 -3930 3388 -120 -7340 -4423
1204 -4423 5924 6217 -2098 -2107 8061 11233 2719 -1749 5794 12005 5145 -2340 1285 8042 4377
1219 4377 -4551 -4383 2019 1791 -4607 -7502 -3392 671 -1878 -6218 -4441 926 2555 -1901 -4318
1234 -4318 1294 6803 1982 -4504 -443 7606 4685 -5091 -4752 4424 4581 -5883 -8363 73 3906
1249 3906 -3792 -9094 -2246 4836 817 -6169 -3198 5221 5408 -533 -1246 6081 8843 3412 -902
1264 -902 3170 7299 3701 -2514 -1396 2903 1596 -4060 -5866 -2210 -411 -4288 -7813 -4980 70
1279 70 -1250 -6340 -5368 1880 4279 -2008 -4644 2315 7376 1973 -3687 885 7030 2987 -4340 -2245
1295 -2245 4426 3194 -4666 -6051 107 2496 -3180 -6860 -1309 4741 986 -4877 -1520 5920 5135
1310 5135 -1321 -1384 6457 7988 1207 -2090 2817 6108 1473 -3740 -2152 1850 1234 -4216 -7047 -2856
1326 -2856 1066 -1938 -8252 -5831 2101 1987 -5314 -5817 4272 6960 -1630 -4314 4849 9526 1879
1341 1879 -4495 2228 8721 2675 -4744 -1850 5186 2949 -4480 -5736 -152 2512 -2085 -5466 -1498
1356 -1498 3646 1848 -3127 -1961 3730 5699 832 -1866 2649 6427 2944 -1759 -192 4279 3258
1371 3258 -3672 -5196 132 2541 -3479 -7432 -2027 2875 -2053 -8051 -3259 4695 2160 -5157 -3175
1386 -3175 5416 5912 -1192 -1955 5039 7182 1584 -2226 1408 5429 1911 -3430 -2635 1862 2411 -2848
1402 -2848 -5318 -1342 1673 -2494 -6071 -2099 3560 2316 -2970 -2122 3941 4688 -818 -2515 2879
1417 2879 5944 2065 -3310 -1107 4583 2485 -4997 -5643 1348 3199 -4922 -8546 -1229 4031 -1831
1432 -1831 -7288 -2029 5442 2353 -4634 -2322 5495 5690 -533 -1296 3933 6277 1250 -2827 256
1447 256 4499 1782 -4047 -4004 1100 1836 -3023 -5713 -1067 2707 -880 -6014 -3656 3162 4104 -2009
1463 -2009 -2970 3424 6728 1030 -3851 1157 6724 2805 -4919 -1399 5168 2409 -5158 -5256 1841 1858
1479 1858 -4916 -6166 359 2726 -2557 -5330 -546 4281 2200 -1687 -875 3760 4791 345 -1652
1494 -1652 2285 5540 2190 -2590 -1155 3287 1737 -4227 -4784 324 2052 -2236 -5892 -1376 3208
1509 3208 -301 -5365 -2178 4280 3124 -3221 -2396 4991 6475 -903 -2962 3452 6815 277 -4934
1524 -4934 -537 4421 1221 -5448 -3666 1968 1785 -4106 -5665 -390 3315 -292 -4628 -1749 3826
1539 3826 3707 -1989 -1929 4076 6149 287 -3264 1318 5572 1593 -3661 -1652 3367 2397 -4414 -5290
1555 -5290 358 2739 -2749 -6666 -994 4788 958 -5381 -2783 4950 4461 -2741 -2801 4909 6785 -599
1571 -599 -3446 1975 5439 965 -4017 -1491 2511 748 -3617 -3570 247 1061 -2016 -4326 -1580 1974
1587 1974 768 -3301 -2086 3458 4215 -656 -2193 2978 5841 821 -3200 934 5390 1449 -4245
1602 -4245 -2291 3739 2474 -4266 -5317 1016 2792 -2939 -5795 -169 4116 214 -4132 -239 4517
1617 4517 2102 -2980 -1135 4491 4020 -542 -2528 1388 3489 427 -3598 -2422 1702 956 -4155
1632 -4155 -4820 274 3335 -1996 -5623 -996 4519 1419 -3636 -1459 4790 3876 -1962 -1662 4397 6026
1648 6026 235 -3136 748 5061 809 -4385 -1977 3550 1926 -4437 -5055 1263 3018 -3000 -5805
1663 -5805 -260 4359 903 -3750 -1251 4458 3455 -1846 -2462 2171 4561 390 -2987 -597 3842
1678 3842 1594 -3675 -3767 1277 2075 -3406 -5100 -527 3212 -1293 -5052 -895 4278 2148 -3327 -1271
1694 -1271 4496 4083 -1356 -1839 3521 5846 901 -3118 46 4267 404 -4607 -2355 2627 1440
1709 1440 -3590 -3760 631 1835 -2167 -3804 -792 2337 1372 -1975 -1277 3188 3151 -659 -2330 2228
1725 2228 4264 75 -3774 -761 4282 1207 -4336 -2899 2631 2282 -4467 -4953 1462 3572 -1398
1740 -1398 -4644 140 4834 1638 -3258 -832 4654 3887 -1684 -2266 3104 4682 216 -3113 68
1755 68 3380 165 -4488 -3034 1431 1440 -3305 -4374 150 3211 -868 -4846 -1645 4005 2663 -3187
1771 -3187 -2513 3719 5051 -1063 -3407 1953 5275 163 -4300 -598 4190 1218 -4074 -2474 2491
1786 2491 2322 -2773 -3961 1208 3315 -441 -3404 -68 4171 2286 -1845 -912 3779 3715 -1409 -2609
1802 -2609 1650 3841 -221 -3602 -728 2687 648 -4135 -3888 711 1621 -2722 -4337 -318 3134
1817 3134 227 -3881 -1414 3543 2327 -2861 -1470 4093 4026 -1195 -2326 2667 4477 -252 -3428
1832 -3428 -136 3103 410 -3493 -2156 2439 2180 -2683 -3663 1308 3321 -545 -3477 -214 4068
1847 4068 2104 -2422 -1286 3413 3509 -1344 -3448 359 3341 28 -3764 -1984 2500 1024 -4230
1862 -4230 -4511 1242 2796 -2544 -5248 97 4102 -282 -4437 -133 4969 2252 -3084 -1128 3954
1877 3954 4297 -1116 -2078 2047 3631 -145 -3432 -858 2993 1465 -3003 -2951 1388 2360 -1502 -3855
1893 -3855 -95 3315 786 -3258 -1212 3583 2471 -2418 -2276 2661 3364 -1001 -3606 462 3052
1908 3052 -213 -4556 -1975 2963 1256 -3918 -3423 1884 2615 -2099 -3550 1123 3738 119 -2627
1923 -2627 779 4122 2367 -2067 -787 3130 3402 -229 -2302 1144 3750 109 -2932 -1053 2421
1938 2421 849 -3305 -2999 1447 2462 -2005 -3796 443 3394 -255 -3323 -1055 3692 2224 -2805
1953 -2805 -2461 2503 4146 -1412 -3704 361 3365 -491 -4573 -1396 3128 1274 -3430 -2323 2368
1968 2368 2514 -2546 -3205 1301 3729 669 -2150 160 3642 2715 -1329 -1883 2522 3590 -533 -2902
1984 -2902 171 3436 764 -3944 -2182 2300 1507 -3361 -3899 778 2471 -1482 -4089 -141 3443
1999 3443 458 -3637 -1427 3511 2238 -2794 -2386 2555 3195 -1616 -3112 994 3042 -698 -4012
2014 -4012 -1217 2468 1036 -2219 -2426 1474 2551 -414 -2159 469 3116 1257 -2108 -502 3226
2029 3226 3060 -1243 -2091 2004 3138 -1026 -3175 16 2876 125 -4058 -1852 2599 1124 -3716
2044 -3716 -3284 1662 2478 -2211 -3976 459 3986 310 -3342 -301 4055 1825 -2408 -1694 2536 3198
2060 3198 -931 -2543 728 3113 643 -2794 -1205 2290 1841 -1818 -2801 1175 3247 -319 -3047
2075 -3047 100 4115 1347 -3101 -1123 3484 2726 -2218 -2702 1836 3285 -1349 -3913 -621 2992
2090 2992 180 -3730 -2192 2446 1772 -2928 -3326 1223 2926 -1094 -3796 374 3469 927 -2590
2105 -2590 -255 2972 1984 -1365 -1673 1782 2541 -363 -2721 -260 2592 1257 -2586 -2052 1993 2376
2121 2376 -1914 -3062 935 3677 -481 -3470 442 4023 1367 -2943 -1197 3129 1823 -2546 -2204
2136 -2204 1618 2026 -1356 -3331 -457 2280 -403 -3654 -1821 1809 1100 -2597 -2317 1342 2328 -1093
2152 -1093 -2725 713 3282 872 -2055 -893 2424 2593 -1323 -2323 619 3193 90 -2931 -790
2167 -790 3401 1244 -3516 -2410 2616 2403 -2808 -3021 1908 3428 -1012 -3531 690 3639 159 -3140
2183 -3140 -1165 2961 1788 -2418 -2295 1437 2296 -1039 -3244 -462 2552 467 -2976 -1939 1910
2198 1910 2065 -2082 -2376 1080 3194 379 -2756 -533 3374 1943 -1857 -1155 2574 2891 -1058 -2691
2214 -2691 1229 3090 -451 -3504 -831 2963 884 -3183 -1722 2573 2098 -2108 -2843 1287 2776
2229 2776 -411 -2939 145 2920 845 -2319 -1355 1986 1344 -1592 -2245 921 2158 -855 -2577 -273
2245 -273 2152 820 -2413 -1667 1869 2232 -1216 -2484 1208 3357 422 -2560 -247 3613 1685 -2531
2261 -2531 -1644 2937 2832 -2049 -2752 1547 3208 -1239 -3799 -175 2872 -36 -3589 -1597 1977 1597
2277 1597 -2175 -2575 1165 2581 -708 -2682 -222 2661 854 -2339 -1387 2196 2045 -1427 -2664 520
2293 520 2765 -47 -2988 -1129 2835 1452 -2784 -2297 2119 3128 -1512 -3443 813 3942 117
2308 117 -3327 -452 3591 1360 -2882 -1852 2590 1872 -1604 -2098 1178 2518 -653 -2716 -637 1781
2324 1781 609 -2246 -1787 1528 1996 -1332 -2198 712 2956 159 -2769 -635 2411 1425 -1947 -1703
2340 -1703 1679 2281 -1230 -2806 271 3228 229 -2808 -883 2933 1354 -2228 -1792 2268 2680 -1649
2356 -1649 -2661 1274 3479 -147 -2864 449 3106 739 -2399 -1146 2320 1969 -1713 -2234 720
2371 720 2197 -313 -2517 -515 2213 671 -2317 -1904 1356 2428 -752 -2238 505 3062 426
2386 426 -2576 -858 2669 1503 -2368 -2041 1937 2730 -1334 -3186 735 3221 43 -3663 -1027 3258
2402 3258 1128 -2980 -1617 2372 2296 -1807 -2506 967 2781 -56 -2023 -137 2334 1083 -1576 -1659
2418 -1659 891 1704 -399 -2073 -361 1894 542 -2318 -1247 1754 1298 -1787 -2618 1256 2192 -1150
2434 -1150 -3121 534 2927 371 -2844 -876 2835 1662 -2103 -2106 1878 2492 -1348 -2196 458 2444
2450 2444 -298 -2492 -401 2358 839 -1939 -1523 1716 1699 -1084 -1583 660 2452 -218 -2229 -557
2466 -557 2242 1845 -1893 -2176 1163 2280 -1347 -2499 -1 2614 752 -2916 -895 2336 1495 -1885
2482 -1885 -2304 1693 2542 -844 -2399 376 3126 113 -2650 -582 2967 1612 -2367 -1804 2185 2041
2498 2041 -1273 -2151 714 2614 -168 -2249 -672 2050 1012 -1707 -1821 1294 2008 -668 -2256 -38
2514 -38 2465 981 -2086 -1530 2272 2000 -1442 -2336 1309 2533 -712 -2973 -506 2964 179 -2749
2530 -2749 -1125 2470 1830 -2221 -1897 1891 2545 -1088 -2488 589 2547 178 -2195 -590 2285 1186
2546 1186 -1584 -1438 1097 1843 -752 -2035 -516 2003 731 -2171 -1378 1340 2037 -1356 -2303 996
2562 996 2607 -488 -2716 -15 2808 331 -2828 -1137 2210 1518 -1867 -1893 1369 1907 -772 -2580
2578 -2580 225 2833 249 -2347 -1008 2219 1587 -1584 -1718 1533 1962 -879 -2109 376 2254 493
2594 493 -1939 -829 1639 1693 -1569 -1589 1114 2234 -238 -2547 -201 2055 781 -2465 -1412 1950
2610 1950 2243 -1442 -2567 808 2644 -605 -2810 171 2554 841 -2564 -1331 2134 1790 -2035
2625 -2035 -2209 1565 2248 -497 -2422 389 2451 289 -2193 -1047 2033 1088 -1281 -1667 1274 2024
2641 2024 -458 -2001 -275 1990 735 -1730 -1334 1478 1562 -1086 -2298 445 2596 7 -2644 -337
2657 -337 2278 851 -2549 -1337 2072 1704 -1968 -2230 1618 2480 -864 -2401 375 2517 172 -2309
2673 -2309 -900 1861 904 -1946 -1428 1093 1748 -546 -2047 164 1974 405 -1888 -1082 1469 1454
2689 1454 -1253 -1845 558 2132 -292 -2392 -372 2574 1033 -2324 -1416 1987 1788 -1731 -2378 1367
2705 1367 2465 -544 -2422 -99 2523 876 -2399 -1236 1854 1376 -1490 -2068 1253 2021 -716 -2155
2721 -2155 209 2328 880 -2003 -1346 1441 1809 -1268 -1578 813 1870 101 -1742 -254 2242 1286
2737 1286 -1760 -1408 1833 2001 -862 -2029 355 2415 181 -2284 -517 2449 1153 -2299 -1522 1957
2753 1957 1980 -1508 -2223 864 2161 -327 -2241 42 1908 539 -2058 -955 1665 1076 -1409 -1653
2769 -1653 810 1690 -111 -1955 -132 1659 839 -1329 -974 1402 1579 -852 -1836 199 2022 344
2785 344 -1891 -651 2372 1217 -2363 -1792 1586 2098 -1802 -2275 1112 2524 -644 -2795 107 2328
2801 2328 543 -2232 -780 2024 1415 -1393 -1777 831 1686 -331 -1797 -334 1670 823 -1338 -1228
2817 -1228 1336 1837 -731 -2151 608 2228 75 -2293 -684 2014 1072 -1536 -1548 1550 1957 -825
2833 -825 -2288 571 2372 -23 -2366 -173 2215 1099 -2288 -1441 1690 1477 -1431 -2054 812 2219
2849 2219 -346 -2185 -85 1785 771 -1523 -1236 1287 1574 -623 -1795 530 1944 68 -1982
2864 -1982 -586 1770 1025 -1466 -1298 1032 1776 -742 -1888 218 2061 380 -2032 -774 1983 1112
2880 1112 -2174 -1529 1571 1953 -1117 -2577 706 2045 -131 -2306 -339 2115 510 -2033 -1074 1499
2896 1499 1320 -1413 -1718 635 1720 -22 -1866 -319 1623 780 -1292 -1343 1121 1632 -531 -1608
2912 -1608 228 1880 308 -1926 -740 1774 1393 -2064 -1678 1530 1819 -908 -2222 433 2341 216
2928 216 -2272 -519 2109 920 -1707 -1335 1449 1736 -1067 -1669 643 2106 -203 -1861 -375 1780
2944 1780 784 -1741 -1205 1101 1582 -655 -1613 197 1747 325 -1569 -606 1723 1135 -1481 -1968 1064
2961 1064 2065 -491 -1744 324 1906 565 -1751 -808 2005 1164 -1777 -1724 1116 1754 -1127 -1726
2977 -1726 200 1321 74 -1752 -556 1623 1037 -1339 -1410 1508 1555 -530 -1406 486 1489 233
2993 233 -1902 -496 1372 913 -1480 -1272 1040 1610 -478 -1657 83 1817 181 -1877 -909 1847
3009 1847 1108 -1348 -1678 1444 1919 -705 -2041 211 2127 166 -1862 -656 1446 1004 -2065 -1719
3025 -1719 1110 1537 -965 -2058 559 1811 -151 -1648 -229 1595 893 -1296 -1391 995 1954 -305
3041 -305 -1687 98 2017 609 -1957 -889 1433 1560 -989 -1906 1035 1987 -287 -2231 -51 1944
3057 1944 322 -1932 -705 1513 1210 -1427 -1496 1062 1983 -905 -1685 459 1668 34 -1798 -612
3073 -612 1360 713 -1150 -1347 979 1505 -517 -1655 -54 1434 227 -1563 -952 970 1202 -818
3089 -818 -1465 894 2039 -302 -1831 131 2075 540 -2196 -790 1884 1126 -1470 -1300 788 1696
3105 1696 -849 -2014 -65 1709 205 -1637 -477 1613 1214 -1342 -1298 877 1562 -519 -1839 238
3121 238 1898 95 -1614 -869 1727 615 -1248 -1337 452 1274 -330 -1702 -178 1838 718 -1233
3137 -1233 -872 1643 1769 -881 -1880 845 2084 -355 -1740 -7 2140 308 -2224 -1068 1711 1241
3153 1241 -1573 -1577 792 1533 -569 -1892 30 1807 529 -1414 -660 1445 1457 -1065 -1315 1147 1540
3170 1540 -94 -1506 114 1466 510 -1249 -1187 1174 990 -930 -1654 519 1450 65 -2001 -129
3186 -129 1863 514 -1522 -942 1690 1515 -1256 -1858 826 1883 -410 -1736 266 1579 244 -1990
3202 -1990 -566 1332 670 -1084 -1381 380 1426 -352 -1721 -93 1819 548 -1473 -824 1223 1196
3218 1196 -1022 -1381 383 1700 54 -1432 -218 1669 511 -1547 -1114 1432 1371 -1113 -1440 671
3234 671 1711 -245 -1696 -238 2016 558 -1745 -738 1303 1429 -1195 -1524 774 1496 -235 -1614
3250 -1614 -306 1186 564 -1679 -952 1307 1003 -767 -1417 227 1827 217 -1431 -91 1565 691
3266 691 -1103 -1125 919 1425 -795 -1497 443 1574 -148 -1993 -663 1610 807 -1787 -1288 1523 1198
3283 1198 -1092 -1533 746 1771 -608 -1675 -78 1583 301 -1058 -702 1305 1049 -1039 -1478 647
3299 647 1195 -339 -1627 -490 1389 422 -1109 -1072 831 1237 -984 -1556 273 1506 -174 -1949 -270
3316 -270 1736 832 -1199 -1197 1204 1607 -1125 -1581 918 1717 -353 -1660 -81 1853 289 -1690 -998
3333 -998 1351 1008 -898 -1409 656 1395 -261 -1280 7 1285 990 -1150 -747 1254 1298 -616 -1453
3350 -1453 250 1713 189 -1526 -401 1238 800 -1302 -1206 1010 1456 -769 -1604 665 1601 51
3366 51 -1484 -151 1548 1001 -1296 -1107 1084 1522 -953 -1576 589 1735 -15 -1413 -391 1330
3382 1330 469 -1743 -893 850 860 -911 -1082 472 1302 13 -1377 46 1602 775 -935 -771 1183
3399 1183 1758 -674 -1572 114 1693 142 -1424 -626 1457 851 -1622 -1290 906 1471 -532 -1791
3415 -1791 181 1781 135 -1410 -390 1555 703 -1208 -958 1145 777 -769 -1131 411 1080 -220
3431 -220 -1300 -333 957 532 -1400 -756 677 1077 -707 -1420 272 1509 237 -1358 -408 1759 1016
3448 1016 -1415 -1483 984 1442 -775 -1760 293 1788 -44 -1637 -469 1525 778 -1401 -1044 1007
3464 1007 1063 -979 -1532 675 1423 -11 -1417 -503 1296 374 -1146 -1097 784 1123 -499 -1360 144
3481 144 1094 133 -1133 -699 1354 895 -1030 -1275 1023 1416 -434 -1686 65 1746 307 -1432 -344
3498 -344 1456 1007 -996 -1021 1191 1148 -592 -1396 277 1383 65 -1544 -187 1205 681 -998 -798
3515 -798 934 844 -461 -1056 495 1419 166 -1221 -527 1179 1038 -972 -939 766 1470 -401 -1176 24
3533 24 1354 474 -1327 -552 1558 941 -1067 -1080 690 1430 -624 -1320 309 1473 138 -1238 -157
3550 -157 1515 609 -1215 -1010 1176 1259 -768 -1253 -86 1058 -94 -1407 -511 950 673 -814 -1410
3567 -1410 626 1230 -216 -1214 -49 1286 131 -1145 -474 1073 884 -1111 -1090 714 1193 -460 -1647
3584 -1647 36 1300 220 -1677 -1006 1339 1034 -1121 -1239 926 1247 -462 -1190 -10 989 56 -1662
3601 -1662 -446 678 738 -680 -953 881 947 -314 -1505 134 1114 125 -1098 -510 777 856 -1150
3618 -1150 -820 403 1208 -403 -1284 292 1535 306 -1145 -411 1401 1161 -839 -1084 599 1564 -404
3635 -404 -1154 96 1499 -41 -1467 -625 1114 743 -882 -861 719 1265 -421 -1461 262 1193 357
3652 357 -832 -390 1052 1070 -729 -1002 648 990 -283 -1224 -194 929 326 -1113 -571 901 911 -698
3670 -698 -872 834 1542 34 -1275 268 1480 452 -1193 -566 1285 924 -1032 -964 640 1211 -158
3687 -158 -1348 415 1353 324 -1122 -514 925 524 -941 -957 353 824 -118 -1044 160 1374 326
3704 326 -917 -919 736 762 -769 -991 150 1411 -449 -1109 -106 1395 500 -1222 -595 1255 734 -893
3722 -893 -712 698 1045 -351 -1474 20 1197 2 -1247 -584 999 530 -839 -774 423 928 -651
3739 -651 -1106 -182 1069 310 -1197 -872 688 711 -864 -1160 208 1152 -534 -984 -243 1344 586 -1160
3757 -1160 -847 930 558 -948 -1256 201 1342 -316 -1345 -182 945 428 -1134 -684 1011 933 -891
3774 -891 -907 975 1574 -260 -1182 346 972 260 -639 -404 688 645 -414 -811 120 1173 -184 -1057
3792 -1057 -46 958 717 -746 -583 549 1068 -548 -1139 502 1451 89 -1119 -88 1138 292
3808 292 -1007 -345 1070 1036 -679 -1063 780 1240 28 -1021 266 1074 244 -629 -372 1120 736 -536
3826 -536 -881 534 1059 -91 -857 -242 1337 561 -642 -709 506 626 -543 -1001 -82 1012 48 -1339
3844 -1339 -761 1182 305 -1171 -740 986 664 -579 -1606 450 1211 -71 -1114 -377 987 332 -1137
3861 -1137 -639 972 439 -700 -902 225 1143 -305 -966 -81 1069 447 -751 -693 710 966 -246
3878 -246 -961 369 1233 139 -1201 -341 1138 404 -888 -865 922 836 -565 -1058 199 644 -192 -1236
3896 -1236 22 1207 355 -1193 -975 529 834 -600 -924 246 1178 -70 -1249 271 1233 529 -844
3913 -844 -293 403 770 -390 -1079 272 620 -59 -925 -235 676 407 -969 -673 557 835 -551 -1085
3931 -1085 290 1044 -22 -1258 -206 884 464 -1149 -655 1014 849 -369 -1022 131 1361 -305
3947 -305 -814 -13 1159 551 -869 -331 766 931 -234 -646 280 915 283 -640 -39 1046 420 -357
3965 -357 -507 674 702 -304 -946 42 1087 -19 -1159 -530 690 546 -760 -899 892 954 -564 -891
3983 -891 -61 1110 55 -1203 -141 1241 442 -855 -946 622 687 -638 -966 35 1268 -535 -951
4000 -951 -152 733 547 -696 -681 443 706 -445 -775 264 904 -45 -744 -161 739 840 -864 -903 420
4019 420 586 -418 -1168 176 987 -113 -1055 -313 917 930 -876 -898 445 562 -692 -949 131 907
4037 907 -269 -1118 -243 750 455 -641 -162 734 636 -451 -769 150 784 109 -909 -164 738 620 -917
4056 -917 -809 407 889 -262 -838 85 948 228 -1006 -582 673 511 -819 -711 573 781 -720 -777
4074 -777 474 1012 326 -966 -270 811 536 -785 -631 714 968 -208 -699 161 821 -66 -615 174
4092 174 943 575 -654 -432 547 695 -327 -1010 139 914 127 -788 -610 483 888 -620 -580 858
4110 858 1056 -384 -1032 111 955 391 -656 -625 726 760 -910 -642 633 811 -367 -915 120 916
4128 916 -22 -853 -389 739 648 -623 -658 581 725 -49 -873 88 872 240 -823 -485 654 553 -538
4147 -538 -838 328 864 -179 -745 -161 1233 46 -836 -340 488 672 -820 -978 427 809 -844 -1128
4165 -1128 28 791 -63 -1010 -473 1115 -88 -889 -495 341 740 -285 -925 5 774 193 -894 -121
4183 -121 561 393 -549 -643 371 518 -201 -633 -4 699 225 -980 -597 490 386 -626 -486 394 840
4202 840 -416 -749 317 868 245 -519 -527 823 522 -359 -749 295 611 -332 -878 453 791 33 -761
4221 -761 -240 786 396 -119 -887 381 726 -215 -976 25 948 25 -626 -97 513 576 -735 -754 322
4240 322 1129 -127 -745 44 894 198 -708 -106 775 406 -685 -747 309 1085 -204 -943 206 729 169
4259 169 -951 -374 214 549 -968 -523 206 635 -316 -722 32 542 -101 -660 -366 720 700 -464 -632
4278 -632 419 804 -364 -739 -89 723 17 -851 -328 604 373 -551 -784 406 514 -218 -908 -12 751
4297 751 136 -543 -557 755 505 -724 -811 117 652 -316 -933 233 834 156 -498 -110 410 276 -417 -465
4317 -465 328 714 -17 -914 -98 716 344 -333 -727 928 655 -340 -871 475 815 -44 -688 -162 776
4336 776 146 -726 -364 648 374 -352 -906 620 757 -223 -525 2 824 142 -854 -237 360 479 -336
4355 -336 -869 352 448 -275 -712 -19 689 405 -339 -518 668 940 -158 -302 495 541 -8 -630 -3 908
4375 908 305 -482 -558 683 696 14 -756 478 851 -14 -740 -185 640 220 -615 -39 652 640 -352 -571
4395 -571 243 571 75 -534 -2 569 288 -490 -112 627 778 -316 -687 -25 879 10 -633 -298 624 436
4415 436 -597 -491 593 872 -600 -829 309 682 -145 -983 -87 798 221 -802 -244 584 591 -295 -915
4434 -915 218 605 -109 -770 -254 594 22 -651 -399 254 271 -386 -723 344 536 -149 -555 -364 299 161
4454 161 -480 -630 564 256 -443 -830 369 508 -247 -842 -243 752 70 -904 -719 541 699 -469 -989
4473 -989 263 844 -23 -1047 -36 572 82 -207 -500 544 753 -393 -705 140 470 -361 -511 -295
4491 -295 798 563 -168 -379 512 553 -302 -614 278 688 -145 -406 -164 771 487 -315 -462 451 882 -280
4511 -280 -550 -68 711 225 -773 -381 691 267 -524 -491 538 401 -193 -137 -109 813 -39 -570 -131 422
4531 422 332 -530 -399 702 565 -441 -535 409 829 -21 -503 -280 533 332 -360 -372 646 520 -115 -673
4551 -673 104 392 -41 -720 -241 614 304 -491 -326 662 575 -418 -803 -244 707 -103 -418 -157 609 427
4571 427 -602 -217 460 939 -239 -554 261 443 -331 -504 -264 156 174 -680 -425 428 708 -65 -629 -10
4591 -10 483 38 -499 -76 545 490 -259 -492 429 521 -407 -832 392 325 -84 -869 -322 718 296 -826
4611 -826 -468 500 80 -291 -528 20 727 -51 -967 -229 382 443 -702 -186 128 710 -100 -660 -93 433
4631 433 -389 -457 34 492 291 -491 -229 532 493 -505 -498 73 378 73 -823 -216 641 258 -546 -170 631
4652 631 709 -367 -388 197 843 -85 -730 -62 429 371 -623 -524 257 587 -423 -355 76 462 251 -156 -164 319
4674 319 494 -343 -257 554 260 -381 -760 -254 569 99 -663 11 691 358 -682 -409 416 577 2 -680
4694 -680 -104 719 230 -776 -97 1101 121 -484 -657 345 533 -209 -402 256 305 12 -674 -544 478
4713 478 621 -509 -720 205 447 -22 -222 40 544 109 -645 -31 523 104 -496 -315 311 748 -357
4732 -357 -422 513 640 264 -494 -245 440 177 -788 -370 493 556 -207 -543 -164 574 15 -664 -110 414 139
4753 139 -361 -400 837 395 -510 -283 -225 526 -109 -685 -312 451 738 -438 -143 329 853 -227 -641 89
4773 89 635 446 -842 -208 531 68 -405 -455 461 606 -301 -286 -46 467 -27 -581 -175 497 86 -608 -747
4794 -747 202 581 -367 -305 -5 491 -65 -266 -34 485 445 -256 -643 238 471 -15 -628 21 562 317 -843
4815 -843 -374 562 39 -153 -475 134 477 -118 -322 168 640 243 -507 -303 582 349 -492 -520 275 750
4835 750 -48 -613 141 650 -134 -633 -122 357 402 -390 -403 85 591 -224 -439 49 654 251 -809 -329
4855 -329 547 661 -612 -437 303 677 -206 -479 -177 561 167 -741 -63 449 249 -451 -287 253 786 -292
4875 -292 -605 -62 499 -82 -380 -52 352 408 -492 -392 99 78 -194 -242 147 582 132 -486 -163 242 40
4896 40 -390 -548 523 441 24 -186 -46 802 147 -521 -27 381 226 -604 -365 136 493 180 -526 240
4916 240 513 -120 -330 1 544 -38 -644 -408 255 336 85 -641 -104 266 -120 -519 -82 621 184 -238
4936 -238 -491 238 503 94 -467 104 554 364 -226 -129 725 344 -501 -180 591 446 50 -523 -391 569
4956 569 35 -440 -269 441 481 -539 -321 413 495 -47 -335 171 658 -77 -164 -98 80 520 -141 -249 182
4977 182 379 -203 -546 74 380 -3 -621 -82 359 322 -398 -252 466 126 -66 -358 -45 585 397 -675
4997 -675 -369 332 678 -311 -449 205 399 231 -629 35 326 162 -471 -471 508 492 -378 -494 421 640 37
5018 37 -274 -144 612 109 -259 -266 117 194 -369 -432 341 416 -11 -494 -25 524 377 -347 -421 473 287 -303
5040 -303 -362 28 668 -183 -601 57 388 349 -525 -14 506 508 -507 -276 62 335 -184 -418 271 270 371 -337
5062 -337 -409 415 337 -380 -486 80 526 -295 -713 -154 632 68 -472 -303 580 719 -223 -382 258 647 170
5083 170 -495 -416 506 -11 -356 97 676 538 -94 -569 17 656 -89 -195 137 526 354 -607 -454 432
5103 432 112 -527 -494 93 265 -104 -422 73 379 97 -533 -250 207 287 -241 -230 -63 398 -222 -570 118
5124 118 95 179 -547 -88 225 480 49 50 338 485 -13 -378 32 214 92 -356 12 448 377 -199 -406 311
5146 311 385 -481 -368 276 214 -84 -132 -520 457 138 -145 -306 231 587 -275 -288 -349 595 53 -643 -339 528
5168 528 255 -188 -722 244 540 127 -556 -87 606 449 -479 -442 463 640 -418 -309 365 403 -115 -581
5188 -581 -145 385 133 -403 -445 312 413 -306 83 46 360 -1 -143 38 652 142 -362 137 296 254 -210
5209 -210 -480 146 313 114 -133 -245 220 -38 -285 -81 148 290 -101 -340 341 423 180 -178 -163 274 -50
5230 -50 -404 -277 209 545 -282 -540 100 691 -5 -467 -12 285 421 -266 -80 44 290 -280 -800 -94
5250 -94 284 293 -242 -119 523 4 -433 -388 30 246 -540 -308 207 493 115 -492 79 677 310 -604 -176
5271 -176 455 180 43 -642 -115 493 -253 -272 93 518 260 -422 -725 31 431 -317 -331 18 172 -136 -488
5292 -488 95 304 480 -359 -525 153 255 24 -300 -103 477 -197 -461 -178 590 79 -538 -585 137 503
5312 503 43 -387 -4 171 -66 -390 -434 400 103 -137 -414 146 248 -12 -293 257 625 17 -368 -295 481
5333 481 307 -348 -284 62 515 -190 -323 -37 240 -446 -391 -62 91 410 -104 -398 290 358 -140 -588 40
5354 40 614 59 -366 24 439 254 -372 -435 385 230 -131 -236 -151 416 -69 -201 -24 353 405 -106 -72 571
5376 571 408 -273 -451 328 472 -38 -31 -25 232 424 -326 -166 493 224 134 -289 -51 410 -26 -376 -64 429
5398 429 93 -78 -500 342 576 -95 -480 -121 508 -144 -330 43 142 467 -71 -449 345 329 -52 -173 -48
5419 -48 414 291 -263 -375 427 278 -124 -311 293 569 -56 -424 90 594 -54 -438 -278 520 153 -266
5439 -266 -24 236 288 -11 -261 192 371 -140 -385 145 17 285 -337 -356 104 285 -189 -433 34 204 81
5460 81 -372 -394 317 337 -412 -220 152 286 -375 -421 65 204 -96 -453 -143 552 139 -321 -40 60 89 -221
5482 -221 -437 -39 727 -106 -310 -166 385 121 -266 -378 -77 316 -261 -191 247 467 10 -399 222 330
5502 330 121 -105 -238 289 128 36 -243 -63 284 376 -393 53 394 57 -80 -441 94 290 -52 -170 232
5523 232 501 -390 -211 -406 350 89 -295 -92 28 288 -169 -148 76 562 -141 -248 -356 261 157 -146
5543 -146 -303 97 328 -305 -445 111 385 159 -275 -7 272 249 128 -460 70 114 137 -466 206 288 119
5564 119 -338 -242 597 -11 -387 -184 -69 523 -561 -483 -35 183 71 -247 -210 193 533 -254 -410 191 434
5585 434 -212 -285 14 494 65 -284 -71 319 186 -357 30 -118 215 -456 -121 -71 46 265 -356 -222 266
5606 266 358 -74 -312 212 165 -1 -310 55 341 -96 -290 -285 352 202 -272 -237 478 205 -54 -323 9 517
5628 517 250 -185 58 -54 327 -236 -239 55 493 -202 -428 51 178 207 -300 174 398 184 -400 -547 74
5649 74 453 -57 -47 -50 370 112 -260 -259 143 147 27 -180 262 413 3 -392 -206 424 119 -453 78 312 228
5672 228 -184 -210 -151 273 16 -84 297 469 97 -229 -42 306 112 -402 -397 240 86 -4 -457 -26 144 102
5694 102 -152 -23 51 273 -201 -482 471 328 -166 -333 235 516 57 -229 -426 340 449 -285 29 -288
5714 -288 320 -129 -366 -141 491 376 -319 -13 317 219 -150 48 80 206 -87 -335 268 302 365 -405 -111
5735 -111 161 12 -185 -324 296 201 37 -315 -91 225 116 -238 132 358 379 163 -119 -40 366 -161 -446
5756 -446 102 190 126 -90 -266 -44 -70 89 -404 -38 250 -233 96 159 209 86 -368 -167 254 241 -108 -120
5778 -120 -333 -63 -163 -27 32 163 -82 -213 152 143 17 -244 -440 126 391 -131 -431 177 263 -117 -505
5799 -505 -223 435 390 -39 -266 261 199 -250 -72 -3 91 237 -524 -141 264 129 -278 -364 -35 229 -362 -52
5821 -52 103 -115 -101 -329 -57 310 68 -190 -241 36 422 -110 -27 -91 111 231 -213 -41 235 338 -108 -291
5843 -291 230 -77 55 -228 167 392 104 -337 -104 62 9 -61 -28 95 44 -60 -135 39 439 125 -158 -295
5865 -295 258 173 45 -153 123 189 -21 -84 -33 279 -228 -494 -118 303 292 -101 -106 154 -66 -157 -581 -350 363
5888 363 82 -425 -160 70 293 33 -90 -27 143 131 -319 19 4 337 -189 -223 -39 -69 24 -441 197 216
5910 216 98 -438 48 302 154 -239 -141 5 120 22 101 -162 365 -11 -65 -85 455 273 -392 34 443 20
5932 20 60 -202 182 192 -254 -413 -167 425 -435 -489 38 55 361 33 -13 109 251 -66 -18 32 343 16 -161
5955 -161 -250 19 90 189 -100 129 -209 -42 -103 -52 21 69 70 -43 25 117 -221 -109 259 110 -129 -38 126 209
5979 209 -147 -461 -249 314 317 -76 58 -217 369 -52 -283 24 275 -132 -98 -15 63 166 -217 -120 156 108
6001 108 -366 -326 -139 258 -67 -265 -306 143 184 -264 -391 6 102 236 -237 -1 117 -5 154 -213 182
6022 182 119 63 -391 -117 154 84 -286 4 100 100 -467 -155 230 157 -160 -325 242 373 -255 49 -140 374
6044 374 107 0 -6 90 373 -114 -214 192 423 -30 -236 -141 136 -25 -277 -200 390 -57 133 -213 -54 385
6066 385 -170 -450 -122 -2 177 -223 -10 371 116 -130 -250 430 154 304 -246 -23 240 -122 -523 -164
6086 -164 241 401 -327 -133 176 53 46 -218 -49 556 -103 50 -396 41 175 -220 -289 9 176 -133 -152
6107 -152 -19 -210 -206 -272 -30 170 264 -71 -147 -50 534 76 -18 122 -173 56 -141 1 154 244 84 -36 110
6130 110 184 87 -324 48 136 202 -174 -177 322 289 -44 -444 5 232 139 -204 111 273 15 -324 -188 2 194
6153 194 -292 -313 -15 212 -144 -94 -140 329 276 -215 -31 62 235 -10 -12 -293 -177 158 -286 16 214 241 -266
6176 -266 78 220 132 34 73 -155 488 87 -386 14 76 -82 -341 215 233 178 135 -312 218 346 -288 -30
6198 -30 -65 244 -38 -407 -288 45 251 -147 -158 196 105 -30 -374 -141 -71 263 -287 -296 96 151 -212 -566 -49
6221 -49 52 166 52 237 404 219 -12 -119 95 284 -117 76 -33 -1 -43 -151 4 14 70 -213 19 263
6243 263 16 -142 -195 144 142 299 -6 27 85 246 -348 -227 64 436 -33 -87 242 -49 166 -261 -192 102
6265 102 53 -322 -67 -76 154 -3 -412 -34 -6 -108 -454 -39 88 124 -116 -184 -64 125 -141 -277 131 134 148
6288 148 -131 135 50 -233 -357 12 302 254 -71 -169 120 -100 247 -190 235 374 243 34 -254 133 278
6309 278 142 -184 -129 219 47 -90 -67 241 57 48 -152 -7 234 -239 -344 -63 212 30 -126 -219 43 49
6331 49 -41 -325 35 70 -162 -162 511 -22 14 -268 -108 131 -1 55 4 98 283 240 -42 173 377 89 -30
6354 -30 138 332 191 -114 -38 85 162 32 -158 -108 153 154 -124 -20 95 34 -100 -206 76 -64 -246 -62
6376 -62 195 133 -23 -269 171 89 -178 41 112 158 122 -220 -92 229 315 -134 -362 -90 142 258 -75 56
6398 56 201 354 154 -272 -70 447 20 11 -65 164 -76 -182 -119 -148 51 161 -174 -199 150 -230 -174 15 480
6421 480 -84 -476 -437 68 -73 64 -307 185 55 -9 -449 11 154 -123 -196 -215 46 293 48 50 400 166
6443 166 6 -371 -140 -276 -98 -65 -69 122 -143 66 -372 -95 -48 222 -238 -101 28 311 -362 -145 323
6464 323 398 -102 -170 249 208 -28 -336 121 -90 244 -52 -283 199 136 74 -44 -29 196 93 -446 -115 247
6486 247 -15 -163 106 111 73 -187 -325 89 232 390 -27 124 99 327 2 -222 235 40 -289 -253 98 237
6508 237 114 -110 -199 236 208 -21 -201 193 -34 -173 -242 15 506 100 -36 -78 479 225 -45 -103 230 147
6530 147 -89 -17 20 -17 -31 -198 370 53 175 -105 -278 275 203 -55 -198 169 178 -345 -149 -281 80 90 -380
6553 -380 -306 -127 277 -128 -101 -11 94 -189 -304 -80 187 165 -153 100 -140 14 -266 20 15 276 162 48
6575 48 -60 -109 -50 96 -197 -13 336 31 -185 61 -14 74 21 110 161 -4 -13 -176 313 5 -75 -56 -1 74 6
6600 6 -306 76 212 31 -360 179 37 446 -148 -208 23 209 -7 -271 24 -24 5 -233 -12 -227 -12 -116
6622 -116 -332 -210 312 -317 -160 76 112 -137 -319 192 183 189 -448 -89 -28 -133 -79 -186 48 228 -159 -168 -259
6645 -259 210 136 -130 -169 -165 60 176 -115 50 -43 338 3 -160 85 -40 -58 -213 243 212 167 19 211 153
6668 153 -118 -97 -132 114 64 66 -428 198 240 32 -324 -11 46 158 -321 -93 32 36 -160 -99 0 -87 246 -8
6692 -8 116 15 -248 -133 -39 31 27 -86 -86 197 256 108 -151 96 57 158 -122 -107 256 135 92 -108 398 78
6716 78 12 -34 -200 -73 288 -250 -120 -53 174 -107 -35 10 -59 -236 -247 -226 168 -118 -82 -69 212 -160 114 -284
6740 -284 -245 348 -100 -76 -42 79 236 -80 -289 237 -20 -172 16 41 98 -90 -177 -249 1 208 -246 104
6762 104 280 241 85 147 -145 131 -91 111 95 176 -92 -223 108 -68 169 173 -436 243 387 -114 87 252
6784 252 81 -109 91 -25 6 286 16 -243 -359 5 -223 -50 -13 175 -239 -153 -166 66 72 -363 -6 246
6806 246 90 147 266 -114 -9 271 -112 -53 -36 -24 -234 -326 66 266 -81 -235 159 551 -100 -477 -77 -63
6828 -63 128 120 127 -36 235 211 16 -147 -34 94 62 -231 114 176 -132 -124 246 88 -18 -247 -92 111 180 -199
6852 -199 -220 175 -75 9 81 -71 223 102 -303 99 219 122 -39 -222 213 242 -51 -349 36 158 -205 29
6874 29 -399 70 159 -6 -194 71 213 -326 119 1 289 -86 -130 173 -11 151 -55 -268 278 311 -147
6895 -147 -432 -111 163 159 -131 91 80 -60 -80 111 350 122 -260 86 26 126 -115 -222 145 68 66 -156 -21
6918 -21 96 109 32 113 -20 -286 174 -36 -76 180 -14 -260 23 -131 277 -47 40 103 41 -42 -337 -177 129
6941 129 106 -67 -43 28 121 -183 -389 265 291 -77 -190 8 162 -11 -9 171 283 242 -141 -214 -160 -111 227 -108
6965 -108 -157 462 227 -163 -338 215 -2 -334 -43 -62 177 -191 -188 401 -3 61 -298 36 213 -4 118 -8
6987 -8 176 -102 -281 0 -107 479 56 -12 -31 -93 -29 23 -80 96 86 -190 -271 112 -31 77 -215 -266 115
7010 115 -71 -331 -136 432 33 -168 -150 -222 -206 92 -133 -11 -181 165 -99 -98 67 317 123 -300 -322 -188
7032 -188 25 -328 -159 -30 51 -302 -30 -57 274 -54 -642 -6 63 118 111 -222 118 222 -81 -98 28 306
7054 306 -148 -422 -391 303 260 -350 136 69 -26 145 -185 46 224 300 -222 146 365 91 -90 83 363 120
7076 120 93 132 106 114 36 152 -146 230 78 -396 48 262 30 -9 -185 280 465 190 -94 -87 -205 267 133
7099 133 -203 75 8 -52 -308 -34 101 79 -364 159 284 -7 -272 -87 22 64 96 35 161 42 -126 -286
7121 -286 222 106 90 -159 208 271 340 -168 -124 94 251 -33 -236 -32 179 23 17 -238 406 135 -7 126
7143 126 147 96 122 163 2 7 40 -109 19 411 98 -170 -255 -65 -21 3 -184 46 160 -130 -103 -302 213 -28
7167 -28 -161 -29 -8 354 202 -170 80 98 -93 -2 -339 152 173 -86 -348 335 -1 76 -90 -229 -26 -144
7189 -144 -89 -146 -8 94 -198 -254 225 169 312 -289 256 391 -78 80 -160 196 51 -216 -101 18 161
7210 161 292 -81 154 402 183 -123 -374 160 109 -268 -208 302 13 -78 -34 -103 177 69 -184 -200 173 27
7232 27 112 -144 69 84 30 -214 11 330 257 -289 -185 174 -48 -90 -112 39 24 -24 99 -94 131 -164 302
7255 302 186 -97 217 -428 -54 211 545 180 -156 -42 27 167 -14 -122 213 162 -42 44 85 198 171 -191
7277 -191 -205 155 291 -159 -233 127 438 -306 -212 -190 -79 166 -129 -71 -68 218 -156 -171 133 120 -106 66 -94
7300 -94 -73 343 -191 194 112 172 -190 -336 -38 416 5 -436 -13 383 10 -164 14 73 -145 -279 -318 144
7322 144 75 23 86 -148 -71 30 -309 104 23 62 -43 22 1 196 -63 -277 -253 -34 -68 113 67 10 -106 -202
7346 -202 -17 60 123 -261 -45 -47 471 -80 -300 -35 233 55 -424 -256 156 -7 9 117 -5 561 53 -196
7368 -196 -300 277 73 -183 -64 182 520 -164 -228 33 -49 -73 -192 -16 345 -90 -191 -361 69 267 -454
7389 -454 -265 34 135 -139 -169 34 55 207 -254 -76 126 110 21 -141 -120 237 -471 -345 -35 323 249 -132
7411 -132 -127 118 16 -203 199 -177 273 -258 -259 -104 -74 306 -59 -84 405 241 70 57 161 -99 2 -158
7433 -158 -57 302 126 -130 -306 285 199 -201 -116 15 204 227 -124 -60 -14 -139 -188 138 -184 -51 159 -193
7455 -193 -5 15 345 -338 -32 372 87 -159 -155 177 202 -228 -10 191 455 147 -236 -186 -70 127 -229 -99
7477 -99 330 98 -22 -74 32 163 -2 -149 0 219 90 -170 70 105 232 204 -346 -76 547 -43 -191
7498 -191 196 104 186 121 86 -52 155 199 -226 -155 208 -89 -251 15 -333 284 -317 -180 285 -300 -108 -139
7520 -139 -143 158 91 -165 -324 274 -72 6 -163 -264 379 69 -131 -117 70 82 -276 -4 80 137 -114 -205 28
7543 28 363 -94 -88 -257 280 47 -269 268 316 -161 -254 108 66 312 -24 -140 36 -121 337 -171 -409 293
7565 293 173 -162 -139 87 -41 372 -108 -28 155 -110 186 -176 -40 199 -299 45 35 -25 -256 -288 192 -142
7587 -142 -147 -343 -286 343 12 151 -34 -43 42 231 -79 -50 170 -120 -336 -234 -103 324 -12 26 -59 85 -5
7610 -5 -478 55 162 70 -461 19 -121 -98 -384 -102 102 308 -519 -531 -71 58 197 -465 -442 142 163 -373
7632 -373 246 367 63 62 143 111 19 -145 -346 -228 20 -67 -143 -582 366 -132 114 -530 -16 224 -2 -290
7654 -290 86 85 18 -1 -73 213 309 248 -304 40 14 124 -323 -113 94 176 212 -40 128 228 6 -209 33
7677 33 317 -171 -379 -77 160 278 -293 -107 -48 299 72 -340 -198 260 47 -57 -181 5 434 262 -259
7698 -259 213 150 -162 6 -277 217 -32 -210 -53 141 -43 56 -120 -119 279 -128 -375 -154 209 121 -295 104
7720 104 79 59 -129 67 -166 159 215 -308 105 339 -64 -383 -259 309 158 71 -196 134 -63 48 -272
7741 -272 -156 237 146 237 -132 214 376 -131 -506 12 178 37 -459 -10 200 138 -35 -159 -59 -40 -225
7762 -225 -167 -2 207 -189 21 -84 -51 -387 -140 -22 317 60 -275 -231 196 60 6 -45 -106 306 40 -206
7784 -206 170 134 220 -264 90 164 133 144 -376 337 -211 231 195 -87 235 202 -208 246 -228 -12 -142 -180 -168
7807 -168 135 205 -125 16 191 168 -249 -284 -99 200 183 -158 56 330 193 -148 -257 196 -19 -50 -186 88
7829 88 -126 -40 -310 -262 209 30 251 170 65 228 -232 -205 149 -24 1 -457 7 8 236 -232 20 224 352
7852 352 83 -24 84 210 -87 68 -213 141 54 -249 -39 276 1 -413 -306 65 422 177 -37 -69 93
7873 93 256 -34 -178 156 185 28 -385 -141 -88 -62 -164 18 153 347 -394 -92 231 181 -112 -267 -34 62
7895 62 0 -127 -289 310 203 -272 -202 147 274 141 -110 85 394 84 -75 -252 431 23 -504 -204 100
7916 100 117 -90 -48 -360 339 -178 -49 -124 332 -112 -33 -157 -40 337 -150 -187 135 375 -4 -173 -342 335
7938 335 9 -61 -132 410 -41 82 -105 -485 -49 -354 -271 -332 244 -127 -388 16 279 314 -4 -312 137 110
7960 110 -148 -105 -410 -281 64 21 -400 -158 41 -167 -82 -182 385 142 -153 44 -2 -9 -24 -591 83 391
7982 391 -57 77 115 217 385 -301 -60 60 220 -375 -108 291 213 90 110 -238 66 -20 -143 -271 79
8003 79 84 -84 -326 313 48 -146 63 109 362 198 -180 4 254 -102 -341 -103 160 56 -5 -362 49 401
8025 401 -49 19 -240 417 -95 -193 -209 103 390 -269 -123 200 224 119 -139 184 174 153 -124 -110 259 -132
8047 -132 -329 -47 77 -73 -4 -72 -24 98 331 -13 70 289 -68 11 -153 67 172 89 -325 -242 161 164 -372
8070 -372 -225 -68 143 138 -32 16 99 117 -63 -42 93 -78 134 -164 170 9 -450 -210 146 415 -109 -283
8092 -283 46 406 129 -141 -148 52 58 -177 -153 14 278 -108 -337 119 45 -188 -188 100 142 88 -13 -166 -38
8115 -38 329 -23 -130 68 -35 95 -153 -46 315 246 97 -320 -59 194 49 -260 145 304 183 -263 188
8136 188 406 201 -43 -306 -23 169 -239 -25 -370 38 235 -104 -282 54 261 -358 -158 106 374 -270
8156 -270 -315 -76 101 409 94 -77 114 149 -56 46 134 181 82 -13 69 37 295 -332 -68 28 495 -9 -457
8179 -457 -144 85 343 -40 -246 151 28 -290 -77 38 155 -150
8191a50
$$ Imaginary data points
##PAGE= N=2
##DATA TABLE= (X++(I..I)), XYDATA
0 0 0 0 0 0 0 0 0 8 -8 8 -8 8 -16 16 -21 24 -32 32 -40 48 -56 64 -73 88 -100 112 -128 147 -168 188 -212
31 -212 237 -267 298 -332 369 -411 455 -505 559 -619 685 -758 842 -932 1034 -1151 1283 -1437
49 -1437 1615 -1826 2084 -2400 2808 -3345 4095 -5218 7079 -10726 20550 -100718 -288542 -33821
63 -33821 124975 3365 -124668 -6738 84598 -4774 -84825 -2774 49270 -17983 -69517
74 -69517 -21924 1928 -34696 -52353 -25719 -24536 -43334 -41963 -30233 -34980 -24235 4750 11392
87 11392 -6056 7249 44910 49467 21141 23901 57363 60810 25143 13569 39828 45575 6464
100 6464 -19421 -2485 7127 -28380 -62727 -52028 -31021 -44305 -66650 -61647 -45448 -43766 -43061
113 -43061 -28657 -20837 -27885 -31910 -19943 -783 14526 17122 4487 -3419 10801 22023 2240
126 2240 -17793 -1472 19235 4955 -13004 3821 22299 4511 -10456 14914 42346 33278
138 33278 16775 29719 50024 50806 44151 47447 56181 58956 46585 24040 12670 25246 32275
151 32275 6180 -19682 -11553 -1732 -27279 -51933 -34381 -14085 -38884 -66927 -42603 1108
163 1108 1186 -25624 -23428 6986 23423 16822 11623 20914 34550 39477 34467 29297 33839 39100 29022
178 29022 12237 13899 26640 19836 -956 3636 31102 32314 -867 -10302 22634 39940 12824
191 12824 -1888 29328 49882 18246 -9466 14591 39542 11502 -27695 -20911 2043 -12225
203 -12225 -45020 -50801 -36626 -36252 -50522 -59484 -57324 -50330 -44322 -44918 -44052 -28457 -8780 -8455 -16515
218 -16515 -2046 23266 21771 2439 8965 37051 40156 15768 6024 22655 27734 8580 -7168
231 -7168 -1 8938 -4096 -23424 -21174 -3080 242 -16182 -20691 -2228 5619 -13567 -23546 -1875
245 -1875 16235 -1402 -24464 -13890 7032 -1167 -27373 -33473 -21767 -22608 -39931 -47791 -35296
258 -35296 -23791 -31429 -42584 -34254 -14853 -11566 -23491 -18706 8403 26519 21283 17208 31196
271 31196 46362 44279 33525 34119 44241 46513 33005 20646 26057 35212 19841 -6660 -4668
284 -4668 15329 5662 -24806 -22747 7770 6932 -24161 -21966 12525 16662 -11434 -14606 13195 17955
298 17955 -4331 -8738 7783 12824 1221 -5590 -4812 -4941 -5558 -9021 -18852 -20141 -2787 6962 -5884
313 -5884 -11026 11086 26430 11629 3944 27696 47142 34235 23737 43115 60561 45111 24096
326 24096 30250 43587 31639 7911 3563 15146 10562 -12632 -23840 -13488 -9698 -26725 -40497
339 -40497 -29864 -15515 -21363 -34899 -29919 -11935 -5487 -12889 -16452 -7020 2843 -1473 -14132 -13468
353 -13468 1698 6831 -9625 -19119 -4551 5434 -12568 -28491 -12550 6549 -3960 -20667 -6848
366 -6848 17956 16450 -303 2004 20134 26260 14736 6933 16720 29545 24089 3552 -2940 9616
380 9616 9629 -15919 -32232 -17636 -7785 -29831 -50001 -36228 -18595 -30932 -49081 -39244 -19631
393 -19631 -20264 -28733 -20931 -5066 -551 -4826 -4252 5034 14338 14954 6265 1964 10350 17711 8029
408 8029 -2760 5799 19003 9368 -8580 -3473 14888 12484 -4647 -413 22161 27000 8434
421 8434 3779 22103 30936 16017 6184 17163 23488 9809 -2333 3693 9028 -3006 -16455
434 -16455 -15876 -12353 -17844 -26444 -26553 -19851 -14242 -13306 -18014 -17898 -5771 6078 3068 -1714 11535
449 11535 28270 22677 10128 21227 41207 34968 13267 14296 31447 27580 8096 5701 19992
462 19992 19260 2377 -4064 6828 11999 2502 -5804 56 10274 9558 -175 -790 11021 15431 2483
477 2483 -9405 -1894 8545 -255 -16401 -15575 -4081 -8385 -26169 -32244 -19416 -11604 -22209 -32895
491 -32895 -25140 -9888 -8380 -16290 -12184 4497 10798 2295 1237 15736 25539 17428 9644 18525
505 18525 29510 22373 6197 2813 12958 12980 -2424 -13462 -5526 4033 -7521 -24245 -19100 -3403
519 -3403 -6837 -23456 -21251 -3153 -1157 -16052 -16861 -1837 2338 -8904 -14330 -7255 -4467 -10171
533 -10171 -15347 -14735 -11755 -11297 -17092 -21914 -16653 -6534 -9044 -20447 -16080 3763 8635 -4176
547 -4176 -2332 19225 25402 10664 7446 26814 35303 19623 9078 19502 28495 18674 5076
560 5076 5414 10277 4224 -8896 -14074 -7790 -3986 -11226 -17703 -13742 -6294 -8933 -17129 -13617 -176
575 -176 4144 -4709 -8266 3318 13712 6746 -5478 -1309 12824 11360 -4922 -8070 6470 11326
589 11326 -3869 -10661 4270 15378 3078 -7823 4643 19425 15504 6479 11823 24407 24823
602 24823 18408 16618 21735 24316 18719 10036 8121 14624 12201 -2402 -10608 -2086 1631 -14667
616 -14667 -27475 -17336 -5767 -16021 -28136 -19495 -4161 -7039 -17804 -13196 546 3295 -3239
629 -3239 -5512 2909 11001 9410 2745 1913 7845 7776 -1625 -4242 4894 8658 -3182 -11368 -1122
644 -1122 9356 2415 -7767 -765 11280 8009 -2554 781 13191 14826 4055 774 9057 11402
658 11402 503 -9498 -5876 352 -5971 -18834 -20621 -12883 -13021 -23011 -28704 -21798 -14286 -18013
672 -18013 -24128 -18535 -5966 -3297 -10812 -9246 5948 13151 2296 -4493 9823 22524 11847
685 11847 -1588 6176 19882 12133 -3132 -1554 9632 7130 -5512 -6751 2691 6517 18 -5535
699 -5535 -1175 6709 7661 640 -2556 5780 12463 5166 -5068 537 11074 4065 -11241 -9730 2454
714 2454 -1537 -17983 -19941 -5600 -1570 -14616 -21180 -9363 539 -4939 -11407 -3094 10283 10920
728 10920 3198 5081 16883 22944 16286 11152 16540 22034 18446 10119 9016 14335 13211 3645 -1866
743 -1866 2867 6311 -1280 -9228 -4357 4599 -67 -10196 -5934 6504 5560 -5821 -5161 6449 8102
758 8102 -3356 -6579 2647 6529 -2340 -10784 -7689 -811 -3235 -12770 -14804 -7213 -1591 -7961 -14293
773 -14293 -6136 5055 1963 -6851 -886 13954 13917 3586 5117 18717 20264 8963 5150 13274
787 13274 16639 7353 -1222 793 5678 2111 -8762 -12783 -6700 -2947 -10629 -19775 -13937 -2855
801 -2855 -6118 -16737 -13298 741 1718 -9927 -11542 1328 6753 -3660 -10258 -2222 5880 -1356
815 -1356 -11508 -8107 1812 -560 -12160 -13125 -1763 2599 -5944 -10340 -694 8124 4062 -2080 3125
830 3125 12708 13324 7268 5719 12318 16624 11191 3103 3419 10099 7799 -4334 -8376 -309 1178
845 1178 -11695 -18103 -7603 -998 -12284 -19834 -8938 1189 -6447 -14136 -5493 6693 4317 -3645
859 -3645 -583 7897 9255 2904 61 5250 10384 6771 -2164 -2605 5537 7822 -1216 -5763 2323
874 2323 8244 1720 -4205 3338 12231 9200 1696 4391 13857 14027 5741 3766 10596 13482 5221
889 5221 -2146 2513 7833 186 -11482 -10013 -330 -2491 -15302 -17525 -5921 -1682 -11327 -16774
903 -16774 -6949 3689 494 -7672 -4019 7287 10235 2354 -41 8790 14942 7568 -619 3682
917 3682 11510 6729 -3172 -1975 6363 5396 -4950 -7293 593 4660 -1424 -6015 -460 6725 4437
932 4437 -3922 -3373 7437 10732 1237 -6083 860 7558 -127 -10075 -6172 2627 -3547 -15561 -14041
947 -14041 -4668 -6020 -15674 -15110 -5436 -2663 -9440 -11682 -3500 3551 1761 -2020 2140 9088 9398
962 9398 4515 2814 9217 13242 7620 502 1914 8482 6147 -3806 -6451 1564 3739 -5393 -10492
977 -10492 -2020 4664 -2783 -11449 -4552 6986 3060 -6393 -2588 7154 4971 -5140 -4487 5713
991 5713 5953 -4709 -8289 -2124 953 -4821 -10535 -7575 -1417 -2051 -8402 -9753 -1896 4918 -241
1006 -241 -5772 462 11740 10689 1241 2450 13409 16867 7341 2850 9822 13910 6483 -1531 2029
1021 2029 8652 4781 -5599 -7561 -120 1999 -6435 -10770 -3093 2977 -3740 -10213 -3543 6079 2533
1036 2533 -6747 -3356 7237 7533 -2177 -5081 2314 6014 167 -5534 -2875 2186 -379 -6637 -6545
1051 -6545 -294 1711 -3929 -6383 576 6938 2910 -1884 2083 9336 9034 3658 4344 10814 11617 4470
1067 4470 -704 4039 9739 3855 -5974 -4951 2540 -558 -11231 -11894 -1642 -718 -11865 -14331 -3795
1082 -3795 925 -6740 -9917 -1224 4694 -958 -5220 -158 5355 4175 -356 -1173 2139 4313 1519
1097 1519 -4428 -3575 2588 3231 -4892 -7320 693 4912 -3273 -8180 1501 9588 3308 -5074 1077
1112 1077 11299 8439 -1112 -350 9050 10056 827 -4031 1919 5891 -1596 -9321 -6000 810 -3044
1127 -3044 -11684 -11080 -2933 -2423 -8896 -9942 -2540 1865 -2406 -5784 -571 5907 5407 57 -430 6420
1143 6420 10500 4179 -2065 1879 8579 5201 -3791 -2771 5397 4883 -4496 -6045 2516 5461 -1937
1158 -1937 -5594 1727 7132 3040 -2491 1512 8688 6705 -711 -1213 5743 6630 -799 -4914 1060
1173 1060 4056 -3131 -9773 -4984 596 -3107 -9860 -8170 -1685 -490 -5122 -5968 -586 3315 1280
1188 1280 -1350 1741 7026 7567 2106 886 6876 10091 3832 -1780 2402 8218 2973 -5754 -3568
1203 -3568 5172 3226 -6606 -6987 2522 4335 -4919 -8183 651 6801 151 -5855 -47 7536 3767
1218 3767 -4424 -2920 4384 4110 -3591 -5940 -842 1271 -2776 -7414 -5881 -1642 -1362 -6437 -7785
1233 -7785 -2107 2634 -1249 -5948 -698 7792 5273 -2627 -314 9704 9961 26 -1825 7270 10137
1248 10137 1037 -4842 1595 6601 247 -7797 -5168 1883 242 -6651 -7323 -131 1743 -3614 -6518
1263 -6518 -1226 4021 1008 -3409 -1167 4501 3593 -1618 -2311 2228 3194 -987 -4379 -1678 2089 -791
1279 -791 -6152 -5420 1221 1998 -5071 -7278 755 5699 542 -4084 1400 8956 5076 -821 2089 9657
1295 9657 7806 -90 -673 5398 6585 -259 -4485 259 4373 -1312 -7922 -5213 1603 -455 -7713
1310 -7713 -6947 1419 2691 -4168 -5981 975 5014 549 -2923 357 5535 4381 -566 -2086 2177
1325 2177 5178 1025 -4932 -2841 4000 2630 -5897 -6278 2304 4542 -4476 -6895 2761 7462 -443
1340 -443 -5302 2961 9585 3581 -2826 1606 9105 5737 -1893 -2698 3256 4425 -1524 -5304 -1944
1355 -1944 1596 -1689 -7229 -6245 -535 12 -5122 -6586 -1193 2857 -34 -3886 -904 4927 3966 -1451
1371 -1451 -1917 4846 6818 686 -3372 2152 5913 150 -6064 -1566 5138 888 -7220 -4326 3384
1386 3384 2786 -4334 -4637 2874 4894 -336 -3298 2224 5768 2840 -2007 -143 5113 4506 -1158 -3335
1402 -3335 560 2494 -2268 -5865 -2732 1627 -1218 -7015 -5790 -44 277 -4541 -5205 676 4274
1417 4274 564 -2993 672 6654 4797 -1171 -1118 6124 7257 -1006 -4194 2815 7003 -444 -6547
1432 -6547 -1542 4716 132 -6999 -4739 2917 2668 -3938 -4188 2025 4422 -692 -3416 1187 5788
1447 5788 2872 -2453 -1090 4197 4272 -1258 -3404 415 2531 -1806 -6537 -4029 1952 854 -5259
1462 -5259 -5723 378 3348 -2396 -5821 429 6420 2418 -3572 622 8292 5444 -2515 -1184 5739
1477 5739 5163 -1824 -2983 2850 4254 -2314 -5505 -871 2504 -766 -5312 -3895 928 1117 -2613
1492 -2613 -3465 970 4135 1061 -2616 214 4678 3448 -2001 -2070 3442 4633 -1242 -4375 -84 3553
1508 3553 -910 -6623 -3193 2647 777 -5926 -4525 2768 3822 -3078 -4629 2744 6395 478 -3582
1523 -3582 1990 7689 3503 -2471 -233 4760 3661 -2652 -3911 1383 3352 -1232 -5607 -3075 1709
1538 1709 439 -4903 -4839 1168 3032 -2434 -5167 1053 5329 1514 -3169 154 5393 3492 -2718
1553 -2718 -2638 3070 4712 -1275 -4648 -92 4572 -272 -6934 -3994 3618 2041 -4894 -4513 3352 4795
1569 4795 -2404 -4525 2734 6018 1403 -2588 823 5342 3159 -1323 -954 2436 2616 -1307 -3612
1584 -3612 -958 1455 -767 -5222 -3673 1104 1081 -4423 -4773 668 3314 -1178 -4097 1089 5398 2145
1600 2145 -2784 -284 5719 4145 -2320 -3013 2880 4263 -2088 -4912 750 3786 -1407 -5757 -1771
1615 -1771 2852 -69 -4402 -2184 3291 2986 -1739 -2575 2463 4775 1061 -2059 504 4581 3237
1630 3237 -1722 -2475 2164 3942 -1704 -5469 -1013 3244 -702 -6332 -3571 2604 1300 -4378 -3976
1645 -3976 2849 3846 -1760 -4323 1407 5669 1904 -2793 179 5603 3143 -2919 -2884 3115 3680 -2812
1661 -2812 -5333 -113 3742 -757 -5450 -2842 2500 1074 -3801 -3633 1863 3997 -83 -2903 987
1676 987 4935 2662 -2298 -1459 3819 4007 -1480 -3167 1419 3910 -1211 -5016 -1409 3098 -105 -5674
1692 -5674 -3432 2396 2164 -3409 -3328 2540 4260 -661 -3190 1212 4942 1534 -2635 5 4826 2903
1708 2903 -2673 -2513 1882 2338 -2342 -3983 -865 1919 -411 -3856 -2305 1823 1257 -2685 -3067 1393
1724 1393 4019 -227 -2877 973 5304 2269 -3128 -1050 4618 3294 -3326 -3649 2453 3974 -2187
1739 -2187 -5454 -525 3677 -294 -5531 -2354 2621 1755 -3444 -2883 2783 4443 -353 -2853 1532
1754 1532 4953 1251 -2735 -423 4266 2869 -2235 -3025 1446 3056 -1681 -5016 -1476 2988 881
1769 881 -4652 -3369 2962 3474 -2569 -4250 1973 5047 192 -3393 804 5566 2382 -3201 -1326
1784 -1326 3788 2493 -2667 -3476 1011 2739 -1700 -4422 -1022 2385 -5 -4408 -2228 2276 1850
1799 1850 -2726 -3143 1854 3889 457 -2355 828 4347 1748 -2426 -1818 2604 3197 -1567 -3318 741
1815 741 2985 -805 -4942 -1457 2871 444 -3798 -2575 3240 2882 -2330 -2670 2872 4179 -388 -3004
1831 -3004 964 4574 1693 -2901 -810 3427 2079 -3255 -3295 1060 2576 -1769 -4771 -970 3005
1846 3005 491 -3783 -2452 2637 2574 -2104 -3080 1572 4175 693 -2610 113 4276 2390 -2755 -2145
1862 -2145 2810 3290 -2378 -4413 991 3969 -991 -5038 -900 4063 540 -4829 -2143 3557 2701
1877 2701 -2259 -2370 2337 3617 -91 -2280 189 3583 1589 -2133 -2074 2168 2461 -1692 -3760 -139
1893 -139 2600 -729 -4364 -1899 2594 1112 -3000 -2424 2827 3410 -1235 -2673 1737 4380 1125 -2632
1909 -2632 361 4927 2063 -2761 -2415 2670 3014 -2279 -3658 1108 2987 -1006 -3773 -744 2732
1924 2732 178 -3273 -1747 2234 2668 -1318 -2382 1672 3508 443 -2330 -282 3181 1325 -2908
1939 -2908 -2259 2272 2486 -2531 -4110 459 2287 -1265 -4385 -1273 3217 1322 -3491 -2740 3034 3438
1955 3438 -1328 -2955 1809 4576 534 -3413 115 4762 2073 -3125 -1726 2746 2040 -2768 -3642
1970 -3642 770 2966 -778 -3876 -985 2681 895 -2859 -2517 1301 2519 -883 -2695 979 4288
1985 4288 883 -3247 -1533 3106 1862 -2798 -3199 1701 2916 -1837 -3819 315 3502 -176 -4450
2000 -4450 -1563 3432 1696 -2833 -1838 3241 3612 -1080 -2400 2137 3701 45 -2410 210 3365
2015 3365 1741 -2266 -1979 1358 1743 -1449 -3405 -593 1950 -525 -3137 -1471 2382 1701 -2294 -2339
2031 -2339 1859 3004 -1229 -2869 1166 4007 364 -2984 -527 3572 1478 -3028 -2229 2378 2485
2046 2485 -2201 -3712 941 3825 -426 -3881 -569 3480 1579 -2877 -1634 2853 3299 -898 -2116
2061 -2116 1534 3821 473 -2533 -440 2729 1497 -2265 -2605 1200 2449 -1634 -4272 -839 2512
2076 2512 -187 -4055 -1864 2816 1687 -3165 -2496 2480 3294 -1326 -3351 910 3892 649 -3298
2091 -3298 -621 2963 2043 -2720 -2893 1995 2456 -1498 -3382 494 3396 -87 -3110 -662 2766 1499
2107 1499 -2312 -1796 1987 2422 -234 -2361 236 2888 1094 -2614 -2046 1941 1779 -2136 -3090 1003
2123 1003 2838 -1451 -4168 -538 3135 -26 -3718 -1508 2931 1659 -2322 -1936 2621 2830 -1352
2138 -1352 -2445 1186 2945 287 -2805 -522 2971 1275 -2389 -2084 1748 1996 -1435 -2900 438
2153 438 2742 147 -2777 -890 2239 1781 -1427 -2090 1456 3357 -326 -2805 223 3645 1042 -3124
2169 -3124 -1559 2937 2398 -3093 -3072 2097 2916 -1812 -3638 475 3108 -61 -3519 -864 3530 1763
2185 1763 -2535 -1550 2358 3181 -606 -2693 863 3033 923 -2525 -1049 2376 2027 -1589 -2389 1033
2201 1033 2474 -497 -2996 -752 2598 1115 -2587 -1676 2263 2415 -1649 -2894 1596 3008 -480
2216 -480 -3312 64 3312 651 -3224 -2042 2594 1729 -2868 -2573 1376 2350 -1191 -3132 126 2679
2232 2679 198 -2539 -998 2292 1410 -1722 -1736 1760 2542 -515 -1951 517 2464 389 -2303 -1458
2248 -1458 1846 1290 -1756 -2520 456 2488 -654 -3482 -790 2900 495 -3051 -1644 2855 2222 -2082
2264 -2082 -2798 1776 3045 -1357 -2819 624 3239 378 -3048 -1189 2350 1084 -2472 -2247 1146
2279 1146 2292 -1150 -2862 310 2734 740 -2259 -799 2144 1811 -1472 -2301 1406 3182 143
2294 143 -2230 -215 2913 1205 -3091 -1773 2012 2679 -2069 -3376 1066 3430 -710 -3761 -474
2309 -474 3348 847 -2893 -1273 2851 2246 -1636 -1760 1842 2610 -689 -2219 168 2309 517 -2376
2325 -2376 -1237 1948 1606 -1290 -2524 784 2241 -393 -2751 -512 2257 1053 -1824 -1375 2055
2340 2055 2249 -1221 -2140 1006 2850 176 -2604 -642 2927 1201 -2559 -1985 2198 2252 -2132 -2606
2356 -2606 1043 2798 -1030 -3046 365 2940 422 -2484 -1051 2390 1623 -1642 -1756 1276 2113 -288
2372 -288 -2230 -252 2196 713 -2231 -1587 1667 1814 -1490 -2547 487 2430 -307 -2720 -621 2765
2388 2765 1503 -2495 -1671 2229 2439 -1709 -2663 1216 3445 -407 -3237 -279 3123 693 -3406 -1707
2404 -1707 2677 1866 -2485 -2625 1237 2498 -715 -2317 -182 2352 858 -1875 -1190 1450 1756 -591
2420 -591 -1878 403 2260 361 -2435 -981 2125 1573 -2156 -2110 1652 1981 -1135 -2727 421 2843
2436 2843 7 -2749 -731 2589 1323 -2289 -1404 2499 2207 -1440 -2204 1378 2663 -401 -2653 -115
2452 -115 2580 633 -2039 -1145 1667 1458 -1373 -2073 706 2066 -96 -2135 -219 2122 1199 -1822
2468 -1822 -1572 1416 2240 -1172 -2355 409 2590 306 -2849 -953 2532 911 -2436 -1868 1731 2208
2484 2208 -1407 -2635 563 2544 -314 -2786 -523 3042 835 -2448 -1300 2508 1890 -1547 -2145
2499 -2145 1379 2410 -363 -2336 -127 2204 926 -1736 -1593 1257 1859 -518 -2329 63 2209
2514 2209 612 -2155 -1422 1954 1773 -1768 -2212 1087 2434 -1270 -2780 225 2730 413 -3001 -1231
2530 -1231 2437 921 -2458 -1810 1670 1957 -1563 -2377 725 2468 -195 -2688 -337 2090 798 -1638
2546 -1638 -1180 1658 1425 -744 -1841 282 1698 262 -2052 -1189 1392 1602 -1443 -1757 1338 2039
2562 2039 -674 -2240 142 2354 224 -2862 -844 2630 1314 -2357 -1531 1796 1827 -1189 -2368 612
2578 612 2428 -297 -2585 -303 2232 1260 -2024 -1514 1684 1830 -1246 -1705 583 2254 -201 -2297
2594 -2297 -422 2342 1113 -1473 -1380 1379 2383 -567 -2136 154 2247 562 -2405 -1207 2099
2609 2099 1623 -1783 -2362 1375 2413 -1253 -2655 64 2636 501 -2396 -1007 2540 1612 -1827 -1741
2625 -1741 1144 2035 -1064 -2481 442 2332 116 -2481 -367 2225 1144 -1228 -1353 1217 1753 -591
2641 -591 -1592 47 1987 913 -2105 -1119 1685 1583 -1257 -1993 575 2493 10 -2372 -56 2386
2657 2386 1043 -2464 -952 2107 1717 -1860 -2186 1583 1784 -1266 -2386 674 2348 -201 -2073 -164
2673 -164 1866 914 -1630 -1395 1081 1730 -639 -1920 335 1793 89 -2076 -832 1843 1351 -1465
2689 -1465 -1679 988 2202 -142 -2171 -115 2196 581 -2146 -1294 2302 1740 -1760 -2200 1213 2304
2705 2304 -854 -2852 319 2979 176 -2617 -850 2215 1281 -1670 -2195 1303 1928 -657 -2182 293
2721 293 2341 381 -2207 -873 1991 1243 -1212 -1533 950 1647 -347 -1896 44 2175 745 -1841
2737 -1841 -1285 1361 1594 -1298 -2107 902 2004 -447 -2355 -134 2594 617 -2163 -1377 2164 1604
2753 1604 -1685 -2081 1196 1969 -703 -2564 333 2071 254 -2193 -354 2168 1040 -1512 -1254 942
2769 942 1691 -619 -1374 -40 2015 463 -1812 -971 1587 1220 -879 -1749 632 2008 -282 -1813
2785 -1813 -437 2273 891 -1790 -1320 2046 1880 -1199 -2289 1050 1959 -935 -2906 103 2378 406
2801 406 -2482 -885 2011 1011 -1676 -1481 1258 1622 -796 -1772 177 1976 755 -1936 -844 1366
2817 1366 1550 -1050 -1843 890 2330 -253 -1954 -206 2324 1037 -1648 -1591 1350 1804 -1256 -1964
2833 -1964 603 2247 -169 -2316 -612 2270 959 -2106 -1106 1911 1468 -1258 -2105 1019 1936 -832
2849 -832 -1896 -97 2178 479 -1714 -1141 1630 1286 -1041 -1515 551 1840 -241 -1820 -325 1629
2865 1629 683 -1706 -1061 1218 1314 -632 -1662 420 2089 80 -1765 -547 2003 1080 -1834 -1203
2881 -1203 1398 1400 -1142 -1944 880 1856 -762 -2271 -15 2422 741 -1931 -722 1681 1210 -1326
2897 -1326 -1516 1087 1738 -531 -1941 -97 1828 509 -1732 -672 918 1623 -1031 -1785 350 1960
2913 1960 298 -2020 -496 2093 1055 -1461 -1307 1711 2109 -1179 -1849 596 2361 -399 -2471 -247
2929 -247 2193 584 -2227 -1318 1804 1301 -1286 -1865 833 2005 -388 -1757 -383 1732 699 -1769
2945 -1769 -1285 777 1172 -670 -1624 620 1853 -44 -1635 -590 1632 833 -1640 -1537 1275 1933
2961 1933 -830 -1978 293 2208 45 -1953 -591 1716 966 -1463 -1091 1577 1490 -1282 -1764 548
2977 548 2072 -422 -2047 -145 1618 784 -1725 -1226 1171 1251 -1225 -1611 581 1338 -7 -1546 -202
2994 -202 1552 945 -1118 -990 1244 1595 -538 -1755 306 1924 -86 -1850 -827 1826 962 -1674
3010 -1674 -1670 1274 2144 -868 -1774 565 2252 -13 -2087 -319 1996 800 -1753 -1210 1379 1551 -826
3027 -826 -2017 838 2036 -69 -2079 -124 1707 662 -1410 -1056 1178 1474 -641 -1612 247 1334
3043 1334 267 -1568 -601 1656 1278 -1531 -1412 1068 1626 -1100 -1987 157 1835 -21 -2030 -408
3059 -408 1915 986 -1602 -1450 1131 1744 -787 -1824 452 1809 213 -1866 -275 1730 777 -1292
3075 -1292 -1135 1085 1312 -724 -1427 405 1594 -99 -1512 -728 1013 1022 -1350 -1127 832 1723 -871
3092 -871 -1761 136 1844 62 -1908 -525 1887 1034 -1571 -1499 1496 1753 -813 -1682 176 1702 -78
3109 -78 -1829 -516 1595 667 -1552 -1284 1196 1642 -803 -1739 364 2024 113 -2262 -351 1827
3125 1827 1080 -1207 -1123 1222 1545 -782 -1600 -68 1307 268 -1647 -770 1341 1281 -1294 -1292 1053 1763
3143 1763 -732 -1746 9 1993 347 -1806 -349 1539 1347 -1467 -1351 1139 1567 -765 -1691 572
3159 572 1663 138 -1761 -532 1613 1076 -1287 -1068 850 1364 -796 -1448 85 1406 409 -1423
3175 -1423 -882 1339 1297 -1121 -1496 823 1492 -378 -1941 -38 1626 352 -1721 -840 1527 1123 -1646
3192 -1646 -1459 1006 1517 -677 -1440 196 1814 191 -1628 -555 1390 971 -1247 -1311 581 1363 -517
3209 -517 -1706 -21 1447 82 -1553 -459 1499 1037 -1161 -1297 870 1385 -307 -1816 -126 1760
3225 1760 641 -1693 -1077 1401 1277 -1346 -1535 1052 1543 -573 -1913 136 1606 170 -1698 -1004
3241 -1004 1541 861 -1240 -1192 891 1281 -598 -1452 378 1548 323 -1519 -398 1346 605 -906
3257 -906 -1328 677 1563 -36 -1670 -3 1511 364 -1531 -715 1418 944 -1136 -1606 403 1620
3273 1620 -254 -1885 -2 1555 668 -1729 -1044 1591 968 -1162 -1641 766 1454 -465 -1530 184
3289 184 1913 111 -1827 -545 1414 1111 -807 -796 920 1375 -176 -1546 149 1073 385 -1192 -846
3306 -846 1137 1033 -772 -1716 425 1519 -85 -1888 -219 1688 607 -1428 -848 1651 1478 -1125
3322 -1125 -1787 931 1713 -474 -1646 35 1804 287 -1300 -427 1597 1117 -1038 -963 1171 1187 -745
3339 -745 -1458 44 1350 447 -1368 -662 1140 1203 -650 -1372 986 1753 -414 -1675 -47 1812 648
3356 648 -1208 -793 1299 1276 -1164 -1442 573 1531 -514 -1620 -210 1294 345 -1863 -685 1193 894
3373 894 -1213 -1284 692 1635 -161 -1681 166 1586 365 -1643 -842 1445 909 -709 -994 566 1205
3390 1205 -329 -1690 -241 1112 852 -912 -807 1159 1242 -640 -1570 803 1584 -156 -1618 -140
3406 -140 1545 391 -1357 -1400 1264 1071 -938 -1612 393 1385 -246 -1947 92 1477 222 -1370
3422 -1370 -547 1037 926 -989 -1114 589 1551 -231 -1467 -255 1089 538 -963 -947 1184 1239 -547
3439 -547 -1381 83 1361 157 -1617 -364 1081 727 -1081 -1042 992 1288 -738 -1518 194 1669 68
3456 68 -1495 -310 1537 509 -1796 -913 1096 1198 -1314 -1376 429 1252 -480 -1392 -264 1369 536
3473 536 -1275 -1115 822 1322 -736 -1138 143 1728 72 -1034 -365 1400 1061 -975 -855 780 1260
3490 1260 -705 -1487 424 1360 -89 -1942 -298 1564 752 -1302 -843 1008 1081 -886 -1621 496 1796
3507 1796 -284 -1657 -308 1328 656 -1463 -1070 962 838 -603 -1235 663 1207 -247 -1466 -638
3523 -638 1505 742 -1045 -886 783 1174 -834 -1451 113 1260 155 -1649 -648 1298 648 -1336
3539 -1336 -1095 725 1000 -1098 -1426 371 1492 -176 -1655 -425 1268 270 -1609 -644 931 1006 -1009
3556 -1009 -1245 513 1207 -135 -1236 -220 1210 723 -1021 -807 637 918 -147 -1042 284 1270 305
3573 305 -1409 -448 1166 778 -1125 -1251 1023 1420 -428 -1378 626 1761 133 -1704 -411 1125
3589 1125 299 -1105 -1004 801 1108 -1036 -1357 365 1198 -331 -1052 -345 1236 459 -1285 -872 668
3606 668 1131 -460 -1038 114 972 241 -1084 -353 1299 691 -804 -845 628 1244 -506 -1121 509 1252
3624 1252 586 -1333 -101 1464 783 -1275 -1152 954 1291 -518 -1370 328 1406 -99 -1340 -197
3640 -197 1311 710 -1430 -951 511 947 -617 -1402 273 1001 -218 -1431 -857 980 555 -740 -813
3657 -813 1272 789 -357 -1243 -102 1385 456 -1168 -496 999 764 -1145 -1040 762 1216 -753 -1368
3674 -1368 68 1623 55 -1485 -460 1300 811 -942 -1055 978 1186 -865 -1061 284 1714 -189
3690 -189 -1313 -324 1219 214 -1215 -965 491 726 -686 -993 326 998 -107 -1287 -613 1014 790
3707 790 -979 -958 573 1438 -112 -1304 -7 1350 85 -1006 -498 1368 883 -781 -1115 939 1120
3724 1120 -608 -1250 280 1187 102 -1231 -278 1188 417 -653 -765 557 779 -657 -1296 240 1079
3741 1079 312 -1180 -435 804 785 -707 -1079 346 1319 -227 -1376 -56 1334 525 -1144 -210 1153
3758 1153 1111 -482 -905 914 1612 -472 -1261 301 1470 298 -1109 -209 1394 997 -705 -983 447
3775 447 1182 -565 -1315 65 1331 -42 -1221 -536 661 735 -567 -842 448 1116 -382 -1104 -127
3792 -127 895 66 -1064 -472 879 932 -608 -989 317 1118 -231 -968 56 1448 404 -1107 -404
3809 -404 921 1014 -1228 -663 672 1361 -375 -1057 -46 1056 75 -1309 -615 1165 377 -1126 -960
3826 -960 590 852 -434 -1101 -70 944 -2 -1079 -780 629 945 -576 -1322 -245 1152 -249 -1450
3843 -1450 -115 1321 482 -918 -620 1009 777 -686 -816 706 1369 -265 -1224 -3 1487 201
3859 201 -831 -606 1040 491 -647 -696 639 781 -78 -713 167 1039 44 -790 -317 847 773 -1033 -960
3878 -960 553 827 -209 -1365 -439 1118 388 -930 -655 680 900 -985 -1018 419 1231 -181 -1257
3895 -1257 -99 1043 510 -1000 -534 937 926 -581 -957 834 1565 -34 -894 64 1074 99 -1166
3912 -1166 -565 920 922 -509 -1031 535 1056 -169 -1354 86 1076 295 -837 -608 702 993 -346
3929 -346 -998 587 1002 -354 -1091 -189 994 471 -944 -728 891 858 -557 -1023 663 1156 -47 -1116
3947 -1116 8 1095 525 -1112 -719 851 818 -565 -1049 372 896 -86 -1070 -144 672 504 -886 -571
3965 -571 996 481 -765 -1058 383 707 -195 -1024 -221 945 163 -826 -780 638 604 -868 -1253 425
3983 425 1225 -427 -1299 -161 1240 525 -830 -653 992 692 -715 -925 403 1015 -220 -1237 84
4000 84 1064 257 -954 -886 657 639 -605 -1136 332 1052 -131 -1254 -183 1163 346 -782 -634 509
4018 509 565 -430 -1173 65 574 -130 -1123 -484 1038 406 -1014 -435 929 685 -433 -1061 556 1270
4036 1270 18 -927 -42 923 710 -835 -294 1025 1034 -746 -378 236 782 14 -642 -107 1094 545 -698
4055 -698 -358 618 508 -328 -747 172 1022 -80 -1049 -108 1017 267 -836 -477 664 903 -532 -898
4073 -898 381 1110 154 -1047 225 1173 385 -1065 -627 741 773 -423 -969 586 851 42 -672 130
4091 130 842 593 -605 -674 865 782 -519 -800 282 719 -197 -590 -326 947 150 -1191 -986 571
4109 571 844 -626 -1392 -56 724 -377 -1134 -474 979 379 -991 -655 504 870 -680 -895 205
4126 205 806 -270 -841 -274 767 500 -788 -472 630 970 -462 -910 45 1046 -32 -1000 -369 706
4144 706 584 -890 -624 276 694 -406 -683 -137 872 402 -1196 -460 568 305 -819 -548 627 1029
4162 1029 -605 -1077 269 838 326 -1011 -289 710 442 -634 -446 843 819 -485 -695 454 1150 -53
4180 -53 -1156 -89 1036 242 -679 -354 611 794 -436 -455 113 1033 115 -959 -325 1110 456 -505 -728
4199 -728 577 637 -265 -793 45 954 -195 -887 -239 853 299 -620 -427 572 739 -416 -888 53 808
4218 808 3 -907 -332 790 508 -431 -670 737 820 -194 -704 -172 715 221 -829 -335 723 613 -881
4237 -881 -844 181 661 -191 -1111 -19 771 -57 -755 -671 708 498 -719 -575 378 941 -488 -999 347
4256 347 873 204 -819 -274 560 270 -693 -565 589 978 -252 -696 104 803 347 -808 -258 686 403
4275 403 -478 -757 312 625 -240 -711 -157 1133 -116 -1141 -508 540 471 -492 -650 272 725 -368
4293 -368 -739 35 1000 134 -967 -382 566 548 -584 -569 786 579 -511 -866 124 850 453 -766 213
4312 213 842 422 -299 -558 542 694 -101 -836 31 1043 500 -678 -336 832 971 -863 -564 356
4330 356 959 117 -716 109 1061 45 -953 -410 539 535 -491 -577 182 809 -292 -642 136 992 424 -633
4350 -633 -7 644 747 -596 -433 398 695 -10 -730 160 796 130 -828 -255 1022 565 -643 -706 522
4369 522 561 -258 -749 325 987 341 -652 -363 605 348 -579 -760 341 861 -99 -758 321 722 142
4388 142 -1033 -362 666 458 -597 -723 265 679 -65 -625 -9 1092 135 -549 -205 508 410 -445 -558
4407 -558 222 747 -72 -654 58 745 200 -765 -432 601 483 -490 -662 227 519 163 -618 -337 668
4426 668 -75 -814 -272 516 374 -415 -667 291 411 -321 -1001 9 686 71 -985 -255 504 506 -784 -586
4446 -586 -10 380 -132 -820 57 740 130 -411 -669 574 701 -248 -450 356 1052 -153 -790 -99 423
4465 423 90 -555 -319 700 726 -500 -929 487 756 -295 -760 -145 886 213 -757 -319 818 526
4483 526 -435 -525 608 651 -17 -526 -118 544 219 -510 -618 251 753 0 -466 52 626 -401 -752 -126
4503 -126 652 180 -663 -296 616 734 -267 -872 204 1005 -241 -951 179 575 402 -749 -373 618
4521 618 462 -41 -598 335 319 -311 -108 -53 821 341 -504 -374 674 379 -657 -869 41 539 -171 -1122
4541 -1122 -229 593 334 -723 -558 591 292 -337 -451 316 747 -104 -786 -349 700 328 -1061 -580
4559 -580 123 542 -403 -811 305 694 -332 -602 -351 658 248 -642 -60 358 245 -615 -476 151 757
4578 757 0 -482 -29 624 202 -221 -329 297 410 -239 -852 389 322 -183 -601 148 426 300 -616 -104
4598 -104 195 566 -247 -291 222 587 -49 -632 -113 395 444 -718 -205 620 402 -306 -531 335 451 -344
4618 -344 -457 -45 550 51 -710 -170 509 484 231 -612 236 1032 274 -629 19 355 286 -398 -485 563 500
4639 500 -242 -578 246 855 18 -686 -299 596 380 -119 -321 600 430 -216 -448 212 518 74 -499 -190
4659 -190 494 398 -582 -406 631 611 -266 -404 169 670 263 -726 -386 662 90 -493 -261 299 465 -524
4679 -524 -432 -101 759 -69 -866 -224 872 371 -1069 -417 237 543 -515 -503 -47 479 -245 -696 65 550
4699 550 344 -521 -292 589 306 -649 -362 3 592 58 -679 -272 836 206 -325 -650 464 284 -81
4718 -81 -700 253 611 60 -244 -124 509 209 -449 -554 492 636 -206 -619 320 500 233 -682 -488 916
4738 916 277 -638 -319 389 565 -266 -615 250 648 143 -540 5 468 178 -445 -92 370 618 -192 -679
4758 -679 124 444 219 -717 -189 471 468 -512 -511 307 272 -73 -756 124 696 -254 -359 -120 502 560 -697 -220
4780 -220 601 398 -408 -622 262 591 126 -489 -270 420 90 -485 -497 675 309 -273 -312 63 695 316
4800 316 -524 -29 373 127 -335 -512 307 532 -406 -461 109 567 162 -566 -164 551 428 -784 -524 472
4820 472 359 -189 -748 18 660 -79 -555 -254 625 0 -614 -427 70 225 -120 -440 78 428 154 -428
4840 -428 -547 707 212 -489 -401 573 463 -267 -345 203 405 -164 -677 -267 644 246 -639 73 278 103
4860 103 -660 -446 237 564 97 -643 -2 521 353 -320 -611 242 305 -686 -501 -263 558 182 -969 -374
4880 -374 711 110 -461 -446 431 227 127 -523 91 512 282 -260 -344 433 225 -238 -399 423 410 -338 -614
4901 -614 -120 684 -57 -454 -277 604 183 -423 -547 72 327 -48 -306 238 554 338 -557 53 488 218
4921 218 -279 -551 443 367 -152 -350 193 232 195 -393 121 303 289 -512 -505 294 627 -158 -345 -55 542 111
4943 111 -336 -472 -1 312 -319 -579 356 651 -142 -761 311 816 149 -651 -40 554 358 -426 -370 443
4963 443 433 -303 -449 -110 446 103 -514 -341 470 6 -564 -177 227 618 38 -43 40 477 156 -363 -390
4984 -390 292 596 -491 -550 -2 265 -218 -743 -130 413 264 -466 101 459 275 -306 -413 212 434 -133
5004 -133 -579 48 444 309 -544 -62 750 192 -656 -325 208 452 -199 -176 108 579 332 -464 -279 302
5024 302 267 -370 -604 55 345 -248 -291 294 536 256 -348 -205 327 347 -381 -476 341 573 -343 -562 124
5045 124 411 0 -276 -176 391 413 -582 -270 79 415 -59 -544 -121 438 307 -632 -484 480 278 83
5065 83 -330 31 325 -121 -156 74 429 -205 -396 -364 361 584 -319 -563 222 5 -109 -614 -87 629 -28
5086 -28 -632 -333 -5 257 -510 -66 158 553 -261 -333 33 237 -7 -380 -477 343 179 -450 -181 391 123
5107 123 -274 -304 45 617 216 -411 -415 71 487 -355 -326 442 316 22 -223 148 467 412 -493 -138 280 151
5129 151 -356 -385 245 486 -122 -554 -213 621 194 -370 -494 429 317 -413 -245 216 353 -311 -435 -194
5149 -194 384 184 -406 -61 216 446 -347 -74 168 405 57 -353 114 496 114 -434 -156 225 345 -285
5169 -285 -227 -274 376 264 -493 150 388 218 -294 -92 392 213 -302 -263 31 339 -79 -480 -435 33 -103
5190 -103 -244 -241 438 66 -109 -412 176 786 94 -455 -101 374 281 -187 -369 70 253 -86 -437 7 277
5211 277 87 -392 -286 400 -32 -581 -237 398 612 -320 -256 273 368 -274 -402 16 612 109 -372 34 175
5232 175 553 -75 -114 262 114 -209 -334 34 403 131 -534 -203 187 486 -91 -405 311 245 104 -236 26
5253 26 363 340 -189 -156 677 495 -286 -125 106 330 -303 -199 -81 698 136 -430 -382 284 -26 -320 -190
5274 -190 -117 550 -260 -348 -284 99 -108 -574 -183 348 163 -168 -310 104 205 -236 -279 -62 253 78 -462
5295 -462 -351 69 373 27 -31 -178 346 8 -341 171 1 166 5 -217 273 190 -262 -99 9 333 -399
5316 -399 -170 -84 18 98 -293 -341 118 239 -145 -382 32 97 -184 -48 -44 112 384 -145 -183 231 307 -45 -321
5339 -321 148 517 130 -348 -1 512 381 -450 -502 81 377 -258 -204 50 475 207 -383 -94 219 30 -153
5360 -153 -33 91 360 -23 -51 148 436 -189 -350 133 332 94 -272 -57 204 258 -234 -398 39 446 -13
5381 -13 -232 -187 482 81 -612 -679 12 193 -161 -110 180 372 -96 -355 -272 489 -75 -378 -403 190 403 -97
5403 -97 -450 365 597 135 -467 -149 76 190 -433 -190 315 431 -112 -66 21 93 -22 -290 -148 197 -189
5424 -189 -342 -397 227 260 25 -274 -179 63 -115 -390 36 277 128 -622 -321 309 109 -414 -341 123 181 -80
5446 -80 46 -130 404 220 -68 -133 260 279 -479 -507 264 436 -176 33 -80 422 83 -308 -146 83 229
5467 229 -68 -97 303 201 236 -340 47 437 346 -299 -170 377 294 -261 -193 226 375 212 -295 -96 281 -70
5489 -70 -183 -305 325 182 -124 -119 -176 135 -50 -333 -177 547 194 -140 -52 339 180 -140 -274 -8 469 62
5511 62 -107 -39 176 -97 -255 -211 203 56 -257 -261 31 302 125 -228 -308 244 204 -116 -521 68 316 98
5533 98 -134 331 465 311 -226 8 177 89 -73 -89 86 -60 -191 -311 82 155 53 -333 -217 139 292
5554 292 -319 -212 269 139 5 -255 -32 21 -10 -310 -211 332 97 -287 -69 608 354 17 -38 233 448
5575 448 64 -90 -128 249 221 -49 -235 310 220 -275 -333 362 373 76 -179 -255 233 172 -361 -266 312 246 -217
5598 -217 -17 10 278 109 93 189 202 83 -137 -44 270 24 58 -164 94 247 10 -84 -280 583 -56 -136 -466
5621 -466 84 184 -122 90 174 195 -273 -350 111 -154 301 -322 252 123 232 -217 -337 -111 269 -72 -339
5642 -339 -147 237 147 -89 -487 139 182 -205 -366 -22 231 -242 -402 -26 349 -228 -96 -370 190 -83 11
5663 11 -26 245 493 -40 -102 -294 516 201 -306 -62 -25 284 -8 75 -51 244 88 -290 -191 349 130 88
5685 88 -96 64 332 25 -176 85 270 4 -329 -112 138 201 -455 -133 360 250 -287 -295 91 137 201 -74
5707 -74 -79 333 114 -319 -182 33 187 109 -145 -360 645 67 -315 170 243 -20 -367 -383 260 419 -335 -226
5729 -226 34 54 65 -283 19 231 63 -104 -10 71 125 -182 -259 28 504 41 -341 83 227 205 -249 -325 127
5752 127 60 -106 -151 -161 219 268 -340 36 185 396 -103 -59 371 567 -10 -208 92 358 200 -395 76 121
5774 121 213 -154 -115 90 100 -291 -137 -227 249 -9 -208 88 336 216 -104 -400 264 340 -106 -349 -136 432
5796 432 -28 -283 -149 328 14 -158 -160 -22 195 -10 146 -394 436 -86 -105 -256 36 87 -473 -410 -193 138
5818 138 -115 -318 46 189 44 -69 -282 -35 158 7 -245 243 158 -63 21 60 130 175 -387 -315 37 173
5840 173 -74 -203 164 383 -379 -157 -276 220 -17 -63 -153 153 316 -475 -101 438 274 -282 -144 217 -50
5861 -50 24 -404 158 449 20 -211 -403 69 248 -304 108 54 -77 283 -197 -147 139 270 -161 -386 202
5882 202 153 -172 -281 12 237 -29 53 -60 235 83 -154 -157 291 227 -52 -289 -259 54 18 -233 83 258
5904 258 335 -228 -130 249 76 144 -396 39 248 41 -173 -128 -50 235 -3 -349 193 401 -43 -191 110 414
5926 414 47 -322 -43 495 318 -98 -172 137 254 -55 -197 -31 182 -68 -254 138 107 95 -209 -263 85
5947 85 145 -17 -119 64 132 173 -252 -462 359 33 63 -146 -359 181 136 -104 -208 518 -136 -467 -12 269
5969 269 122 113 -257 254 111 -229 -173 94 261 282 -74 -166 -23 -134 -116 -178 208 287 -23 -205 311 488 119
5992 119 -138 21 186 9 -62 -291 265 218 -226 -448 81 -29 -59 -78 74 243 -116 -34 -215 22 355 -268
6014 -268 -309 -110 167 179 -396 -212 -16 13 -161 -70 258 175 56 -170 189 208 62 21 -220 285 92 3 -193
6037 -193 172 -95 143 -256 340 317 -58 -137 13 459 -112 -195 34 -230 246 -5 -95 108 356 82 -321
6058 -321 -205 240 277 -68 42 504 158 -136 -160 -185 545 -158 -463 -355 28 229 -105 30 61 74 74 -248
6080 -248 -7 174 -102 -260 -268 329 61 -265 -13 13 253 -166 -450 106 282 63 -404 63 297 331 -313
6101 -313 -435 323 208 -151 -214 79 197 144 -74 -199 295 45 -286 -206 157 230 120 -251 167 260 -10 -234
6123 -234 50 153 14 -79 -158 292 -70 -34 -108 49 361 -192 -113 -164 130 311 -28 -165 361 131 -291 5
6145 5 -60 336 -242 -259 -235 -98 339 104 -30 186 224 -116 -261 164 186 -9 -132 -152 -72 351 -84 -252 347
6168 347 74 -94 -1 141 180 200 -267 -79 211 -114 -250 -191 303 77 24 -31 69 633 15 -350 -148 363
6190 363 256 -389 161 252 458 125 38 -463 290 -128 -73 -265 240 206 146 12 233 401 -70 -8 330 393
6212 393 55 -48 -142 164 296 -193 -32 -71 105 32 -281 -94 302 26 -165 -142 267 215 -232 -190 113 261
6234 261 55 -245 -1 401 -88 -113 -222 -105 315 -237 -191 419 -116 -145 -494 141 11 -214 132 -20 67
6255 67 -70 68 -96 50 329 87 -299 20 327 34 -358 39 60 279 214 -275 46 363 -84 -218 23
6276 23 351 -129 -87 11 296 122 -312 -246 184 149 -196 -130 124 81 -51 71 -23 204 391 -255 -85 24 264
6299 264 -241 -423 -47 45 115 -561 -11 -185 -128 -475 -299 -67 -65 89 -25 299 200 100 -311 -75 391 58
6321 58 99 -422 192 83 -15 -243 226 526 -225 -116 41 138 31 -121 -137 -115 -17 120 -124 56 173 -116
6343 -116 -45 -102 249 181 -18 -162 347 274 -86 -51 -68 86 233 -115 -21 131 262 19 -126 167 350 -293
6365 -293 -140 389 117 -149 -259 -5 129 12 -197 -165 118 51 -5 -114 104 13 -61 -295 -129 20 110 -451
6387 -451 -241 108 -21 -338 -200 160 338 5 156 370 -117 292 -64 -101 92 74 -91 -143 -135 241 124 -191
6409 -191 65 208 158 -53 -115 42 284 0 -278 -93 289 84 -42 -147 -33 61 -183 281 275 254 99 139
6431 139 84 273 -9 -226 -317 433 220 -178 -26 11 246 100 -489 42 -72 5 -55 -245 43 418 -89 -131
6453 -131 114 -83 -320 -246 350 303 89 -485 -119 190 75 184 -517 119 100 -375 14 16 226 -39 -297 -170
6475 -170 30 193 -458 48 257 -115 213 -294 8 -51 176 89 -77 207 -114 -303 -49 116 -104 76 -289
6496 -289 -62 128 363 -434 -212 151 265 -61 -366 32 307 -31 -157 -261 275 162 4 -130 55 376
6516 376 -399 -83 -211 -25 -120 -464 87 223 130 -115 -127 -106 227 131 -101 305 251 -82 -251 132 -58 14
6538 14 -283 -120 131 -323 111 -56 538 344 72 -77 79 212 -139 -147 -233 142 315 -356 -270 161 106 -151
6560 -151 -497 -6 274 -228 -16 -86 -17 230 -280 -179 344 289 224 -340 27 241 130 3 -120 44 136 109
6582 109 -148 18 200 193 -181 -56 165 165 -411 64 -13 299 41 -12 62 278 33 -244 -40 249 -40 -132 -14
6605 -14 223 207 -109 -101 468 142 126 174 156 105 66 -115 -202 31 419 86 -54 -38 37 237 -245 143 182 -33
6629 -33 40 4 -275 452 0 32 12 79 -54 -297 -180 101 94 -276 -269 196 118 19 -210 300 322 155 -438 -8
6653 -8 81 -20 -308 -316 198 -20 -225 -393 -90 207 -40 -163 -69 498 57 97 -203 114 67 -281 -125 219 107
6676 107 314 -181 -27 -21 -79 -53 -72 46 197 -257 -304 -126 244 -59 -133 3 322 51 -20 -221 288 -122 -12
6699 -12 -209 19 417 -396 193 372 -117 78 -22 -494 221 32 116 -22 82 176 2 -569 16 314 -107
6720 -107 285 -264 190 374 -191 -573 -14 214 -97 -380 -500 226 163 32 108 355 -163 -6 -248 42 437
6741 437 -106 -349 107 90 -26 -101 -392 438 302 -264 -53 341 164 91 108 36 179 503 -426 59 129 109
6763 109 -23 -135 -130 397 96 -98 126 83 140 -38 -71 94 247 -241 -12 -124 175 32 -243 47 -8 105
6785 105 124 -40 65 87 -109 -317 -241 -23 155 -211 251 -119 88 -125 -45 -41 70 -205 -241 6 218 -119
6807 -119 95 78 -3 49 20 -319 120 -141 -33 84 54 -12 -15 76 -88 505 58 -310 -228 217 -148 65 -83
6830 -83 121 -1 -82 -137 166 325 57 -202 -367 260 -11 193 -238 74 42 -59 -62 -136 7 125 -70 -238
6852 -238 43 31 180 -179 267 312 48 -67 165 478 -24 -216 27 215 233 63 -33 -93 10 -110 -243 -49
6874 -49 72 114 -305 -219 113 379 315 -197 187 230 -150 -175 193 240 -206 -378 26 135 397 -45 37 322 352
6897 352 24 -247 264 254 322 -285 -89 357 -263 -253 -226 146 -39 -173 -124 195 309 25 -361 -306 -24 258
6919 258 -87 -38 -136 400 -62 -518 -120 117 172 -224 -178 476 181 -370 -248 207 167 -112 -84 -35 -34 -260 -174
6942 -174 -146 -6 203 -131 -254 146 265 -182 -335 -18 146 53 -133 47 -74 95 -297 -95 -249 112 74
6963 74 -381 5 123 149 -50 113 -7 394 -142 -127 200 99 6 -366 -187 350 130 -248 -18 119 177 128
6985 128 -9 -140 35 -319 -48 203 -38 -168 103 -119 194 278 -175 -157 200 150 5 -213 -136 -172 -54 -410
7007 -410 103 227 46 -288 -106 -20 75 148 78 -208 139 10 -181 -87 189 190 151 -64 137 15 -268 -258 62
7030 62 -103 113 -59 -111 54 126 -210 143 295 177 163 108 -39 143 14 38 174 103 8 -93 -43 170 -90
7053 -90 50 -127 -69 40 127 60 -223 20 49 -1 -367 91 430 2 -412 -93 224 159 -143 -44 40 284 63
7076 63 75 -73 252 -25 -307 149 138 -90 18 -299 134 236 -391 -452 -180 173 -45 -170 -67 378 -72
7097 -72 -20 -150 147 96 -231 -28 99 -33 -318 60 -133 105 46 -188 -23 -81 106 -21 -242 -15 134 117
7119 117 -420 26 321 75 -230 -145 159 31 -146 -109 106 378 -154 -309 46 308 -206 -270 2 88 72 -292
7141 -292 113 21 433 -129 -251 10 215 -292 -204 -238 74 -248 -21 -250 -255 295 -70 -282 -26 67 110 -253
7163 -253 -7 82 -75 130 -119 201 36 -10 -278 91 454 -166 -297 -301 372 108 -165 -254 -63 237 -66 74
7185 74 -15 312 41 -282 -72 -89 328 -241 -100 -265 11 -367 -264 -46 -190 -7 -68 -256 50 78 -279 -259
7207 -259 70 -93 -144 -187 61 143 163 -296 -178 307 -13 54 -298 -337 448 38 -302 -165 110 234 -194 -61
7229 -61 288 111 -406 -83 -80 -180 -181 -240 24 264 370 154 -146 218 -66 119 -20 -173 408 149 -237 68
7251 68 256 -167 -339 -109 223 337 -141 -122 105 -9 63 -133 -213 183 210 -231 152 -33 112 26 -287 145
7273 145 278 254 -162 -363 135 -11 -22 -174 233 -122 299 -209 135 80 -60 -286 45 381 100 140 -302
7294 -302 185 128 37 28 140 66 -41 -267 251 4 71 15 -143 34 76 215 -272 203 509 93 -167 137 231
7317 231 -6 190 64 -147 158 -41 -128 202 25 40 -69 -211 363 -140 -398 -165 131 47 350 -81 -310
7338 -310 312 -132 -373 -296 93 168 135 187 148 -28 -430 -238 319 127 126 101 35 187 252 -202 59 207 66
7361 66 -6 259 -173 -116 -120 -197 -144 8 47 -287 -360 -122 -59 -168 -319 -30 -3 216 -24 116 278 164 247 -77
7385 -77 -142 117 -92 -298 -143 213 182 -291 80 550 96 109 -402 -146 -8 113 -77 -75 299 173 -422 12
7407 12 200 -11 -251 -127 -96 -67 -186 -47 267 211 88 -189 -132 403 196 -53 -321 204 103 -191 -215 -270
7429 -270 50 -27 -130 -289 265 24 -365 -292 43 506 40 -143 107 141 102 -301 -172 26 29 37 -266 -40 33
7452 33 143 -226 -128 -21 -305 -106 -185 -50 113 19 -451 -154 57 -181 -60 207 1 277 -281 -65 401
7473 401 113 -199 35 348 169 58 -1 -231 -56 64 -230 -197 213 92 23 -278 301 180 139 -160 -152 107
7495 107 80 -326 49 38 0 8 -23 313 -216 -124 -335 125 303 73 -222 -165 299 -38 -5 -94 91 321 -12
7518 -12 -273 59 286 129 -222 -185 234 227 -38 86 -128 77 41 72 120 122 17 204 -331 275 297 -409 -184
7541 -184 118 308 24 -86 -26 -56 226 -81 -175 132 200 163 -224 -216 -167 60 -184 153 152 -229 -269 73 -37 178
7565 178 14 -137 172 255 223 -240 -252 219 -60 -204 -6 350 257 -167 -55 185 265 200 -7 -208 201 -37
7587 -37 -1 -140 81 122 6 -56 25 16 151 -91 -244 386 190 -83 -103 251 108 -111 -266 19 151 66 -267
7610 -267 66 237 16 -322 -25 -33 -405 -7 -155 244 14 -149 -246 -332 158 -154 -308 -45 37 19 -19 296
7632 296 -18 306 46 -484 -315 -138 -139 -49 -101 55 64 -139 145 -30 228 -157 -184 331 179 184 -200 -73 300
7655 300 217 8 92 24 190 -344 -340 -159 165 -372 322 95 457 95 -258 -95 3 151 -186 -230 206 151 78
7678 78 -241 -230 396 189 -98 -184 292 334 6 25 -77 435 -323 46 -120 206 231 -27 -134 81 321 -290
7700 -290 -329 -19 253 329 -105 3 138 -25 -321 -70 213 -43 28 -469 158 247 169 -199 -13 156 53 108
7722 108 -278 -133 -80 -247 -161 191 96 267 36 -57 24 -37 155 -315 227 461 21 -321 299 108 12 -231
7744 -231 -57 119 -413 130 219 -41 148 93 -444 -44 230 60 -362 -73 28 212 -58 -224 -53 504 -17
7765 -17 -46 -138 221 -64 -71 47 31 59 60 -209 176 87 62 34 141 49 62 -87 -434 -13 405 -61 319 -146 173
7790 173 -136 -299 -75 197 -167 -248 33 257 203 -150 -158 73 212 -134 224 179 213 30 -12 124 0 157
7812 157 142 -233 -140 143 14 -282 31 120 94 -157 -162 68 5 11 140 -62 171 301 -111 203 210 -154 -84 -367
7836 -367 384 420 -409 161 82 294 -225 -230 -75 175 -1 -150 -59 447 250 329 -365 48 203 -269 -133 277
7858 277 148 25 -248 195 231 332 -208 -211 -18 -60 80 -214 55 88 -208 -60 -248 264 447 -286 -152 -201
7880 -201 142 -232 -113 -101 144 110 -91 -170 218 67 151 62 120 1 -433 -294 69 334 179 -187 -53 125
7902 125 48 -144 78 -72 43 34 -137 -11 83 9 -486 45 346 217 -157 -105 208 79 62 -393 -19 300
7924 300 281 -102 143 112 406 -56 -108 -130 182 -350 -66 -212 104 -61 -23 -203 108 445 -295 -163 -189 88
7946 88 53 73 74 307 209 -88 -110 323 26 -322 -214 -205 257 -146 -287 108 -43 -25 -39 70 124 153 -55 -154 -30
7971 -30 492 -11 -98 -117 280 -104 -185 14 162 0 -19 -296 -27 224 -113 -239 50 -28 -64 -59 -294 185 304
7994 304 -200 -376 -210 -123 -114 -358 87 150 -132 -123 -140 202 17 -263 128 89 228 -98 -465 -61 333 87 -54
8017 -54 -67 82 55 -119 -110 -177 302 71 -447 220 -33 193 -148 -197 184 341 84 -111 39 55 -244 -265 272
8040 272 176 22 -261 -31 -15 128 -151 -398 -193 159 334 -269 100 458 -140 -167 228 170 -31 -288 -132
8061 -132 81 96 -13 -276 446 52 175 -89 140 26 62 -19 -263 228 -45 218 -299 -23 127 220 -209
8082 -209 18 101 424 31 -306 -272 298 173 2 -83 233 -204 -87 -37 149 154 -277 14 93 187 -57 -457 -296
8105 -296 -19 -1 -18 -304 86 -51 -148 -273 36 287 155 -308 -89 138 191 -143 -375 -39 137 172 106 177
8127 177 302 -85 -117 -154 153 -22 44 -167 91 -110 -359 -152 25 267 -235 68 -182 23 82 -196 4
8148 4 56 452 246 -45 63 31 260 -3 230 -25 -163 -66 -22 235 207 -162 -251 87 -149 83 -491 250 249
8171 249 2 -35 159 99 46 -11 -229 -138 -35 -180 -248 -296 79 -145 116 -216 210 459 -127 -140
8191a40
##END NTUPLES=NMR FID
##END=
