##TITLE=1H_lac-Jalaric-1
 Py-d5, 8 sc, 
 2.7.2019
##JCAMPDX= 6.0         $$ Bruker NMR JCAMP-DX V2.0
##DATA TYPE= NMR FID
##DATA CLASS= NTUPLES
##ORIGIN= UXNMR, Bruker Analytische Messtechnik GmbH
##OWNER= root
$$ XWIN-NMR		Version 3.5
$$ Tue Jul  2 15:50:20 2019 Russian Standard Time (UT+4h)  she@DPX200
##.OBSERVE FREQUENCY= 200.13155
##.OBSERVE NUCLEUS= ^1H
##.DELAY= (6, 6)
##.ACQUISITION MODE= SIMULTANEOUS
##.ACQUISITION SCHEME= undefined
##.AVERAGES= 8
##.DIGITISER RES= 18
##SPECTROMETER/DATA SYSTEM= spect
##.PULSE SEQUENCE= zg30
##.SOLVENT NAME= Pyr
##.SHIFT REFERENCE= (INTERNAL, Pyr, 0, 15.7039)
##AUDIT TRAIL= $$ (NUMBER, WHEN, WHO, WHERE, WHAT)
$$ ##TITLE= Audit trail, XWIN-NMR		Version 3.5
$$ ##JCAMPDX= 5.01
$$ ##ORIGIN= Bruker BioSpin GmbH
$$ ##OWNER= she
$$ F:/spectra/data/she/nmr/H-F/1/audita.txt
$$ ##AUDIT TRAIL=  $$ (NUMBER, WHEN, WHO, WHERE, WHAT)
(   1,<2019-07-02 15:49:21.73 +0400>,<she>,<DPX200>,
      <created by zg, POWCHK disabled, PULCHK disabled
       configuration hash MD5:
       00 E9 B6 7A A2 85 ED C7 34 08 36 98 17 FE 4E 26
       data hash MD5: 16K
       0A 9E FC 0C 49 0B BE 4C 0E 94 6C 84 75 12 53 6C>)
$$ ##END=
$$ 
$$ hash MD5
$$ 95 01 35 E7 D4 BA 0B A4 E1 EA 57 A5 D8 BC 6D B8
##$RELAX= 
##$RELAX= 
##$RELAX= 
##$RELAX= 
##$RELAX= 
##$RELAX= 
$$ Bruker specific parameters
$$ --------------------------
##$DU= <F:/spectra>
##$EXPNO= 1
##$NAME= <H-F>
##$PROCNO= 1
##$TYPE= <nmr>
##$USER= <she>
##$AMP= (0..31)
100 100 100 100 100 100 100 100 100 100 100 100 100 100 100 100 100 100 
100 100 100 100 100 100 100 100 100 100 100 100 100 100 
##$AQSEQ= 0
##$AQ_mod= 1
##$AUNM= <au_zg>
##$AUTOPOS= <>
##$BF1= 200.13
##$BF2= 200.13
##$BF3= 200.13
##$BF4= 200.13
##$BF5= 200.13
##$BF6= 200.13
##$BF7= 200.13
##$BF8= 200.13
##$BYTORDA= 1
##$CFDGTYP= 0
##$CFRGTYP= 5
##$CHEMSTR= <none>
##$CNST= (0..31)
1 1 145 1 1 1 1 1 1 1 1 1 1 1 1 1 1 1 1 1 1 1 1 1 1 1 1 1 1 1 1 1 
##$CPDPRG= <>
##$CPDPRG1= <>
##$CPDPRG2= <>
##$CPDPRG3= <>
##$CPDPRG4= <mlev>
##$CPDPRG5= <mlev>
##$CPDPRG6= <mlev>
##$CPDPRG7= <mlev>
##$CPDPRG8= <mlev>
##$CPDPRGB= <>
##$CPDPRGT= <>
##$D= (0..31)
0 1.2 0 0 0 0 0 0 0 0 0 0.03 0 0 0 0 0 0 0 0 0 0 0 0 0 0 0 0 0 0 0 0 
##$DATE= 1562068161
##$DBL= (0..7)
120 120 120 120 120 120 120 120 
##$DBP= (0..7)
150 150 150 150 150 150 150 150 
##$DBP07= 0
##$DBPNAM0= <>
##$DBPNAM1= <>
##$DBPNAM2= <>
##$DBPNAM3= <>
##$DBPNAM4= <>
##$DBPNAM5= <>
##$DBPNAM6= <>
##$DBPNAM7= <>
##$DBPOAL= (0..7)
0.5 0.5 0.5 0.5 0.5 0.5 0.5 0.5 
##$DBPOFFS= (0..7)
0 0 0 0 0 0 0 0 
##$DE= 6
##$DECBNUC= <off>
##$DECIM= 24
##$DECNUC= <off>
##$DECSTAT= 4
##$DIGMOD= 1
##$DIGTYP= 9
##$DL= (0..7)
0 120 120 120 120 120 120 120 
##$DP= (0..7)
150 150 150 150 150 150 150 150 
##$DP07= 0
##$DPNAME0= <>
##$DPNAME1= <>
##$DPNAME2= <>
##$DPNAME3= <>
##$DPNAME4= <>
##$DPNAME5= <>
##$DPNAME6= <>
##$DPNAME7= <>
##$DPOAL= (0..7)
0.5 0.5 0.5 0.5 0.5 0.5 0.5 0.5 
##$DPOFFS= (0..7)
0 0 0 0 0 0 0 0 
##$DQDMODE= 0
##$DR= 18
##$DS= 0
##$DSLIST= <SSSSSSSSSSSSSSS>
##$DSPFIRM= 0
$$ [...]
##$SUBNAM2= <"">
##$SUBNAM3= <"">
##$SUBNAM4= <"">
##$SUBNAM5= <"">
##$SUBNAM6= <"">
##$SUBNAM7= <"">
##$SUBNAM8= <"">
##$SUBNAM9= <"">
##$SW= 24.9336996594482
##$SWIBOX= (0..15)
0 0 2 0 0 0 0 0 0 0 0 0 0 0 0 0 
##$SW_h= 4990.01996007984
##$TD= 16384
##$TD0= 1
##$TE= 0
##$TE2= 300
##$TE3= 300
##$TEG= 300
##$TL= (0..7)
0 120 120 120 120 120 120 120 
##$TP= (0..7)
150 150 150 150 150 150 150 150 
##$TP07= 0
##$TPNAME0= <>
##$TPNAME1= <>
##$TPNAME2= <>
##$TPNAME3= <>
##$TPNAME4= <>
##$TPNAME5= <>
##$TPNAME6= <>
##$TPNAME7= <>
##$TPOAL= (0..7)
0.5 0.5 0.5 0.5 0.5 0.5 0.5 0.5 
##$TPOFFS= (0..7)
0 0 0 0 0 0 0 0 
##$TUNHIN= 0
##$TUNHOUT= 0
##$TUNXOUT= 0
##$USERA1= <user>
##$USERA2= <user>
##$USERA3= <user>
##$USERA4= <user>
##$USERA5= <user>
##$V9= 5
##$VALIST= <valist>
##$VCLIST= <CCCCCCCCCCCCCCC>
##$VD= 0
##$VDLIST= <DDDDDDDDDDDDDDD>
##$VPLIST= <PPPPPPPPPPPPPPP>
##$VTLIST= <TTTTTTTTTTTTTTT>
##$WBST= 1024
##$WBSW= 4
##$XGAIN= (0..3)
0 0 0 0 
##$XL= 0
##$YL= 0
##$YMAX_a= 106784
##$YMIN_a= -97602
##$ZGOPTNS= <>
##$ZL1= 120
##$ZL2= 120
##$ZL3= 120
##$ZL4= 120
##$ABSF1= 10
##$ABSF2= 0
##$ABSG= 5
##$ABSL= 3
##$ALPHA= 0
##$AQORDER= 0
##$ASSFAC= 0
##$ASSFACI= 0
##$ASSFACX= 0
##$ASSWID= 0
##$AUNMP= <proc_1d>
##$AZFE= 0.1
##$AZFW= 0.1
##$BCFW= 1
##$BC_mod= 2
##$BYTORDP= 1
##$COROFFS= 0
##$CY= 11.3945322036743
##$DATMOD= 1
##$DC= 2
##$DFILT= <>
##$DTYPP= 0
##$F1P= 18.9103706918063
##$F2P= -1.10871071338519
##$FCOR= 0.5
##$FTSIZE= 0
##$FT_mod= 4
##$GAMMA= 1
##$GB= 0.15
##$INTBC= 1
##$INTSCL= 1
##$ISEN= 128
##$LB= 0.24
##$LEV0= 0
##$LPBIN= 0
##$MAXI= 10000
##$MC2= 0
##$MEAN= 0
##$ME_mod= 0
##$MI= 1.114404
##$NCOEF= 0
##$NC_proc= 0
##$NLEV= 6
##$NOISF1= 3.799351
##$NOISF2= 2.8
##$NSP= 1
##$NTH_PI= 0
##$NZP= 0
##$OFFSET= 15.70392
##$PC= 1
##$PHC0= -8663.093
##$PHC1= 20.60097
##$PH_mod= 1
##$PKNL= yes
##$PPARMOD= 0
##$PSCAL= 0
##$PSIGN= 0
##$REVERSE= no
##$SF= 200.130013532006
##$SI= 16384
##$SIGF1= 3
##$SIGF2= 2
##$SINO= 400
##$SIOLD= 16384
##$SREGLST= <1H.CDCl3>
##$SSB= 0
##$STSI= 0
##$STSR= 0
##$SW_p= 3612.71676300578
##$SYMM= 0
##$S_DEV= 0
##$TDeff= 0
##$TDoff= 0
##$TI= <>
##$TILT= no
##$TM1= 0
##$TM2= 0
##$TOPLEV= 0
##$USERP1= <user>
##$USERP2= <user>
##$USERP3= <user>
##$USERP4= <user>
##$USERP5= <user>
##$WDW= 1
##$XDIM= 8192
##$YMAX_p= 0
##$YMIN_p= 0
$$ End of Bruker specific parameters
$$ ---------------------------------
##NTUPLES= NMR FID
##VAR_NAME=  TIME,          FID/REAL,        FID/IMAG
##SYMBOL=    X,             R,               I
##VAR_TYPE=  INDEPENDENT,   DEPENDENT,       DEPENDENT
##VAR_FORM=  AFFN,          ASDF,            ASDF
##VAR_DIM=   8192,          8192,            8192
##UNITS=     SECONDS,       ARBITRARY UNITS, ARBITRARY UNITS
##FACTOR=    0.0002004,     1,               1
##FIRST=     0,             0,               0
##LAST=      1.6414764,     0,               0
##MIN=       0,             -97602,          0
##MAX=       1.6414764,     106784,          0
$$ Real data points
##PAGE= N=1
##DATA TABLE= (X++(R..R)), XYDATA
0@%%%%%%%%qJ6j6J6k4L2l2M0n6O4p2Q8j04J20j36J60j86K10k40K74l12L52l96
31b10M47n03N64o28P00p81Q67r63J068j185J313j451J607j783J977k192K440k722
49a435L048l432L886m439N128o013P199q886J1491j6083K6576r2854k1788J51218
63E3616m5496p2496J7994Q7696p276l7758J3483L9517l6955n2164P000M4933k135
76I959k2996J6J6276n430k687J4676J3981o900l543L754l831j1412O680J3147
90B1690j1045l0574o607K3487J8529n989r243M629J2446R803L021j3162k5470
103h485r314K0451J3236k6286l1149J4823L7389K015k4998L83J8647j0637k4249
116b8174J6669L7048r811m1364J862M1758R800k6099l846J6492j2153k3856J8290
$$ plain form
0 0 0 0 0 0 0 0 0 0 -8 8 -8 8 -16 16 -16 24 -32 32 -40 48 -56 64 -72 88 -98 112 -128 146 -166 186 -210
31 -210 237 -266 298 -330 370 -411 456 -507 561 -624 689 -762 845 -938 1039 -1153 1287 -1435
49 -1435 1613 -1819 2067 -2372 2756 -3257 3942 -4944 6547 -9536 17040 -75814 -97602 53616
63 53616 8120 -64376 -46382 41314 34038 -3720 9763 49280 12325 -39839 -32839 12094 9959
76 9959 -13037 -13021 3255 -2175 -4862 9814 23795 16895 13352 17106 13275 1863 8543 21690
90 21690 10645 -19929 -26536 -3049 15480 9491 248 4877 17323 27126 30147 16985 -8485
103 -8485 -17799 2652 15888 -10398 -41547 -26724 10665 12680 -12318 -11935 6712 -3925 -28174
116 -28174 -11505 25543 15732 -25632 -23770 17988 27788 1689 -2157 14335 2182 -21674 -3384
129c384L5589r971l4784L281K6255n337k0438Q560J2401k3672k3962K1817L2679
142A9034o171k0455N382J1633p700l585J4530k33k4476p195K2193J0328j3718
155d33l43J6682q379k9540L473L6267M186m0648j7276L6320L1444j6238k3965
168h450R471J6480q729j1000J1686J0181j3089q997J7659J5839j2615j6521N607
181G522P495j1255j0735N326J810r964K390J5924l486k2062M09K3871q37k9775
195b3367o471K7260J0382k0292o868J9196O196j4686j602J0665j0388j9714J1420
208a8269K6888o755k8454K448K8793N719j8879n174Q628m564p398J5605J8804
221A7392r470j7259J0685K1837l570j7826k21R572m792r124O936R715n771o990
$$ plain form
129 -3384 32205 22234 -12550 -9269 16986 11649 -8789 -229 12172 -11500 -35462 -13645 19034
142 19034 12863 -7592 -2210 9423 1723 -1862 12668 12435 -12041 -19236 2957 13285 -433
155 -433 -776 15906 7527 -22013 -18540 17727 21913 -18735 -36011 309 31753 15515 -8450
168 -8450 1021 17501 8772 -2228 9458 19639 6550 -2447 15212 31051 18436 1915 7522
181 7522 15017 3762 -6973 -1647 163 -9801 -7411 8513 5027 -17035 -16626 7245 6408 -23367
195 -23367 -29838 -2578 7804 -12488 -19356 -160 6036 -8650 -10252 413 -9975 -29689 -18269
208 -18269 8619 1864 -26590 -24142 4651 10370 -8509 -13683 -5055 -9619 -17017 -1412 17392
221 17392 7922 -9337 1348 23185 19615 1789 1568 11140 6348 -2776 4160 13875 8104 1114
235A114P081K853j5367r969J2936J0197j4363j3968J2392J7039m482r415O787
248B835M740j4054q172J6062J0906j6494j3166J7354J7789j2517j6840R008J0840
261H291j3972j3745J2136J2756j1247q622J6913J3359j4162j3054J2172J1361
273A2186j1957j0484J0977R930o739k290J1440O37j5633m122J2336j12j6719l701
287a4251J3919L653r907J367J0879n028j4338N196J5841n504j7619N712K2120
300A2040J582j5535J802J5985k227j6457J034J4161l511j5361M746J8259j795
313A4723j6916J160J6031j815j7464k204J3121J761q800L689J1256l480j0330
326G32N284J0337q736j5927L394J3258l122j1569K562Q473n049q676L977K817
$$ plain form
235 1114 8195 11048 -4319 -14288 -1352 8845 -5518 -19486 -7094 9945 5463 -3952 2835
248 2835 7575 -6479 -14651 1411 12317 -4177 -17343 11 17800 5283 -11557 -2549 8291
261 8291 -5681 -19426 -7290 5466 -5781 -14403 2510 15869 1707 -11347 825 12186
273 12186 229 -10255 722 10652 3913 1623 13063 13700 -1933 -6055 6281 6169 -10550 -14251
287 -14251 -332 3321 -6586 -5219 5660 632 -13706 -8510 7331 1827 -15792 -10080 12040
300 12040 13622 -1913 -111 15874 13647 -2810 -1776 12385 8874 -6487 -1741 16518 14723
313 14723 -2193 -1033 14998 13183 -4281 -6485 6636 8397 -403 3286 14542 11062 732
326 732 6016 16353 7617 -8310 -4916 8342 5220 -6349 -3787 4686 -363 -9039 -5062 -2245
340b245j2072p958J2083J0131j0314q620J2200J0968r256p557J0861N565j4345
353a0559o340J8152J2144j4215j0783J4547J1962j3068j2218J0617R151j2579
365c189j0570J1840J2254o359o443P950L615j0480l476J1929M037j2077m767J1220
379E484N584o873k47P668n336j5897j02J4501Q78j4449l612J0391K139p099K500
394d470P743p192j2863N607J4769k653j1809N724J4970l368j3271M591J4214m649
408G343j6077J471J3303j966j1386M870J3469n135j6029J733J4167j175j3859
421i271j125J0539J693n002M418O801n965p774O869P704r593j1459Q191J3722
435I748m293j1642K330Q065l426n990L937K134r828m195J2985J0128p556p143
$$ plain form
340 -2245 -14317 -22275 -10192 -61 -10375 -18995 -6795 4173 -5083 -12640 -1779 3786 -10559
353 -10559 -16899 1253 13397 -818 -11601 2946 14908 1840 -10378 239 9390 -3189
365 -3189 -13759 -1919 10335 3976 -2467 5483 9098 -1382 -4858 7071 11108 -969 -5736 5484
379 5484 11068 4195 3948 11616 6280 -9617 -9719 4782 5660 -8789 -12401 -2010 129 -6970 -4470
394 -4470 3273 -3919 -16782 -11175 3594 941 -10868 -5144 9826 6458 -6813 -2222 11992 7343
408 7343 -8734 -7263 6040 4074 -7312 -2442 11027 5892 -10137 -8404 5763 4588 -9271
421 -9271 -10396 143 1836 -3166 1252 8053 2088 -5686 1183 8887 -706 -12165 -3974 9748
435 9748 5455 -6187 -3857 4208 782 -5208 -1271 863 -8965 -13160 -175 9953 2397 -4746
449d746P935O295p277l559R755L907j1017l976J2576O556r176l557R962L89j6455
464b388o404J4219Q637j1730j0377N929O935k527L05M773n736j3533J213J5332
478D648L415j1827l194R877J704r314J64R779k816j5137k453J2592M101q633j182
493h276Q460m93r866M31J0535P91r268q30Q956K933l340L457O283m011p394L814
509B182P562m721q785M066R538l008r194J944P496k964p889J325M460m711n491
524h190O340Q124l743o030M225M239o714m815Q811O050j1078j0165R682J2763
538I499m940j0273K894M453q436o194J0778R288j0609j1962Q553J4015k502q499
552c935K954M434o493m154R206P196o821n997N915M013o019k132P018o63j2105
$$ plain form
449 -4746 3189 9484 2207 -1352 8403 12310 1293 -2683 9893 16449 7273 3716 13678 14067 -2388
464 -2388 -8792 5427 14064 2334 -8043 -2114 4821 2294 2599 7372 1636 -11897 -10684 4648
478 4648 8063 -3764 -6958 2919 4623 -4691 -4527 5252 2436 -12701 -15154 -2562 1539 -7094 -8276
493 -8276 184 -309 -10175 -9744 791 1582 -7686 -8516 440 3373 33 3490 9773 5762 -1632 2182
509 2182 9744 5023 -3762 304 9842 6834 -2360 -416 7080 4116 -3773 -2448 2012 -2699 -8190
524 -8190 -1850 6274 2531 -3499 726 4965 -1749 -6564 2247 8297 -2781 -12946 -3264 9499
538 9499 4559 -5714 -2820 1633 -6803 -12997 -2219 7069 -3540 -15502 -6949 7066 4564 -3935
552 -3935 -981 3453 -3040 -7194 2012 9208 2387 -3610 2305 6318 299 -1833 5185 4522 -7583
567g583m110R808N660o067l092L904r75m945M043P918m753j1096K912J2975J447
582F046q692K92Q439q36q317J264P664k758r248K375J0674m20j0149K7J0429J087
598G877j0244k676Q632L111o666r43Q286K492o315j361N984K5o893PN795k453
614D658q319J699Q836p76q842j538L950k991m142N395M307q816o887R979J0667
629G180o129q559N663N678q048m919J0960P240j0686p894R996Q353q014o499P880
644B202L596j1231n899J1530R019p136p370N319N667l541k457M816J532o233k470
659b656O348M172l169k420K204n3m405j572K793j97l988o82L053o80l464J806
675b910N260j981p579P5P770P56o917J003R398P48r177n18R729O37j0498j224
$$ plain form
567 -7583 -11693 -1885 3775 -2292 -5384 -1480 -2455 -7400 -3357 4561 -192 -11288 -8376 4599 6046
582 6046 -2646 -2354 6085 5249 -3068 -1804 5860 3102 -6146 -3771 6903 6483 -3666 -3639 6790 7877
598 7877 -2367 -5043 3589 6700 34 -909 7377 9869 3554 2193 8177 8202 1309 1316 7111 4658
614 4658 -3661 -1962 6874 6098 -2744 -4282 -332 -3323 -7465 -2070 2237 -6579 -13466 -3487 7180
629 7180 1051 -7508 -1845 3833 -4215 -9134 1826 9066 -1620 -9514 482 8835 821 -5678 2202
644 2202 5798 -5433 -11332 198 9217 2081 -5289 30 5697 2156 -301 4515 6047 -186 -2656
659 -2656 3692 7864 4695 2275 4479 4426 21 -1551 1242 1045 -2943 -3625 -572 -1252 -4716 -2910
675 -2910 2350 369 -7210 -7135 635 1391 -5526 -4523 4875 5623 -3554 -4072 5657 6294 -4204 -5428
691e428R606k85j0746O48J2417P24j2211k249R452O74q812Q29Q813j328p957K779
707c074Q707j794o784K675M895n252n750N175N919m758m918L963K661n522k282
722f139N861J169p453k449O973L405m630p43O320J535o009j175O621K481n456
737C11k145N872L004m782k649N430L123o263n534M351M755m615n386M789O213
752F474l845o089K925N160l233m349M010L603n097l562O114M317n205l789M039
767A473J56o866j85P798j58q996o53P924j19o686K637P702m215r916M141J1713
783E750p92q496J983P746k468o566M496P823m404r229J838P789j60n437k8L538
799C383j282l610M5K340j0j089J12j42m15J484K446m37k877m15K567M7l396q76
$$ plain form
691 -5428 4178 3893 -6853 -6205 6212 6936 -5275 -7524 1928 2602 -6210 -5381 3432 2104 -5853 -3074
707 -3074 5633 3839 -2945 -270 4625 -627 -6377 -1202 4717 -41 -4959 -996 1665 -3857 -6139
722 -6139 -278 891 -6562 -9011 -2038 1367 -3263 -4006 2314 3849 -2160 -3335 3286 5767 311
737 311 -1834 4038 7042 2260 -389 5041 8164 1901 -3633 718 5473 858 -4528 261 6474
752 6474 2629 -3460 -535 4625 1392 -2957 1053 4656 -441 -4003 2111 6428 1223 -2566 1473
767 1473 1629 -5237 -5422 2376 2218 -6778 -7431 493 374 -6312 -3675 4027 -188 -10104 -5963 5750
783 5750 4958 -3538 -1555 6191 3723 -2843 1653 9476 5072 -4157 -2319 5470 5310 -127 -155 3383
799 3383 2101 -1509 -1464 876 866 -223 -111 -253 -668 816 3262 2825 -52 -467 2100 2147 -1249 -2125
817b125M155J938m705l910L616M052l886n175L219N048l978o049M383P987k126
832B444o515K002N353k451l722N020M566o149n479O467O410n204o150M150L505
847D247o243m237O275M138o244m953M645M379k935k505K123L37k256J134K984
862H89j075k029K781K215l882k675M910L364o078n328M683O149l267n774K466
877b651N159k202m861K690N810j981o074J432P487J223n736j162N487J023n387
892B57j055N551P48o700j950O254J860o831k735N769K283o547l579N006L645l186
908a210k261K340R83j391J136K047j998j958K875J520l922j189N635J845o745
923b293l075O337L040o740l051P090L413p360l964P491N900n052m935L729L624
$$ plain form
817 -2125 2030 3968 -737 -4647 -1031 3021 -865 -6040 -2821 2227 -1751 -7800 -3417 4570 2444
832 2444 -4071 -2069 3284 833 -2889 2131 6697 548 -4931 1536 7946 2742 -3408 742 4247
847 4247 -1996 -6233 42 4180 -2064 -7017 -2372 2007 -928 -3433 -1310 -973 -3229 -2095 889
862 889 -186 -2215 566 2781 -1101 -3776 1134 4498 -1580 -6908 -2225 3924 657 -5117 -2651
877 -2651 2508 306 -4555 -1865 3945 1964 -4110 -2678 4809 6032 296 -866 4621 5644 257
892 257 -798 4753 5501 -1199 -3149 3105 4965 -1866 -4601 1168 3451 -3096 -6675 -1669 1976 -1210
908 -1210 -3471 -1131 -148 -1539 -403 1644 -354 -2312 563 2083 -1839 -3028 2607 4452 -2293
923 -2293 -5368 969 4009 -2731 -5782 1308 4721 -2639 -6603 888 6788 1736 -3199 530 4154
938D154l119j503M738J862n288k836M532L014l853l037K563J141m191k172L994
953aK779l387l332J838K258j542j022K651J277k778j537K692K142p19j16Q35j992
970D6k768K529M574k034n747O83N116q77m965J536N641j940o773J360P294P6o265
987b514N29O023o13n815J071O337o60o268m17M741l09m309O72L588k031m791J117
1004c649M402p70m041M52K855m29j650J753J703j593p83K879R52l290o26M290
1020B455J734m440k335L883K058l917j703M214J048n675k115O127L621n277m480
1035d802M139M377k926l057L405K988l600k976L314L133k859k540K172J162l485
1050a555j536L684J614m014k596K219J683j410J1K042j114l075J641M830N3m082
$$ plain form
938 4154 1035 -468 4270 6132 844 -1992 2540 5554 1701 -1336 1227 2368 -1823 -3995 -1
953 -1 2778 -609 -3941 -2103 155 -1387 -2409 242 1519 -1259 -2796 -104 2038 1319 1203 2038 46
970 46 -2722 -193 4381 2347 -3400 -2717 2399 1522 -3443 -1907 3734 1794 -4979 -3619 3675 3751 -2514
987 -2514 -1985 4038 3425 -2390 -1319 5018 4358 -1910 -2327 2414 2105 -2204 -1532 2056 25 -4766 -3649
1004 -3649 753 -17 -4058 -3606 -751 -1180 -2830 -1077 626 -967 -1750 1129 2081 -1209 -1835 2455
1020 2455 4189 -251 -2586 1297 3355 -562 -2265 1949 2997 -2678 -4793 1334 4955 -322 -4802
1035 -4802 -663 3714 788 -2269 1136 4124 524 -2452 862 3995 1136 -1404 768 1930 -1555
1050 -1555 -3091 593 2207 -1807 -4403 -2184 -501 -1911 -1900 142 -972 -4047 -2406 2424 2477 -1605
1066a605q1L606R5k549J439L198k200m168J976M749j936n317J109M904j317n222
1082c319R60N173n29m672K69M395j97l743P15L945p26l819P45L712n73l374J10
1099i28K470r46k419O05J455j508j382J965J195k551j631L018K316k496j832K621
1115d8J924k132n24L611J082m284j669M545K574m227l161L175K609l230k449L172
1131I68J987l925k749L458K898l138k766L186K793k633k459K868K648k326k613
1146a803J747J720j576j036J527L36k288o48K015L34k270l84J523l70j396J663
1162i06K324j796k756K385L980j730m008J664M307q91l970R71M042j063m238O03
1178a082L732j113m401N31M195n21m352J15M176K76l684l64L195K28k691O98L079
$$ plain form
1066 -1605 -1686 1920 2015 -534 905 4103 1903 -2265 -289 4460 2524 -2793 -1684 3220 1903 -3319
1082 -3319 -2359 2814 2285 -2387 -2118 2277 2080 -1663 -948 2997 2271 -1548 -803 2909 2336 -1038 -928
1099 -928 1542 596 -1823 -1218 237 -1271 -2653 -688 507 -2044 -3675 -657 1659 -837 -2669 -48
1115 -48 1876 -256 -780 2831 3913 -371 -2040 2505 5079 852 -2309 866 3475 245 -2204 968
1131 968 2955 -970 -3719 -261 2637 -501 -3267 -81 2712 79 -2380 488 3136 810 -1803
1146 -1803 -56 1664 88 -948 579 915 -1373 -2021 -6 328 -1942 -2326 -803 -1173 -2569 -906
1162 -906 1418 -378 -3134 -749 3231 1501 -2507 -843 3464 2573 -1397 -426 3616 2553 -1685 -1082
1178 -1082 2650 1537 -2864 -2333 1862 1341 -3011 -2896 1280 1556 -2128 -2492 703 931 -1760 -1062 2017
1195B017o42l075Q34L260l25l128l29K050k09j534N62P99j359n82K117O35k716
1212a625o89L309J083l405r70M155J777l550j452L990J592m222j977L974K191
1227D181m250k949L325K962k894l104J639K081j807k012J627J310j701o99K495
1242B04J221k429j261K655J604k162j655J731J212j440m96J928K32k604p18K414
1258D36N17k410l39K059j35j964J560L001j341l368J616L946j489m111J876M747
1274D601j472m917J089N046p31n082l68L558m60l276P76K763j299k879J262K787
1290A398r62k336P12J379j007l63K295R96k579j274K437J775k062j913J052Q30
1306C78j238n00J547N18j785p47J609M78j786m21K209Q40k473q67L295K169k555
$$ plain form
1195 2017 1375 -1700 -866 2394 2069 -1059 -1388 662 453 -1081 -519 280 -1079 -1661 456 1091 -1625
1212 -1625 -2314 995 2078 -1327 -2297 1858 3635 85 -1367 2623 4215 -7 -1984 1990 4181
1227 4181 -69 -3018 307 3269 375 -2729 -1090 991 -816 -2828 -1201 109 -1592 -2291 204
1242 204 1425 -1004 -2265 390 1994 -168 -1823 -92 1120 -320 -816 1112 1344 -1260 -1978 436
1258 436 953 -1457 -1796 263 128 -1836 -276 2725 1384 -1984 -368 3578 2089 -2022 -146 4601
1274 4601 3129 -1788 -699 4347 3616 -1466 -1834 1724 1264 -2012 -1236 1527 228 -2651 -1389 1398
1290 1398 436 -1900 -1188 191 -816 -1179 1116 2112 -467 -1741 696 2471 409 -1504 -452 378
1306 378 -860 -1360 187 705 -1080 -1827 -218 260 -1526 -1947 262 1102 -1371 -2238 1057 3226 671
1323F71k251K239K010k782k390L031K828k994l447K564L291k123l438J436K280
1338I25j742j802J875J387j257J72K289n71l190P44L898k21l457L07K848r39k373
1355a107K297K999k986m364J534L736j278k825J546K156k244k270K819K950j981
1370I82k988J127J879j144j153K174K188j978l222L42K733Q38j943j835J55O38
1386a207r4J70J010L76j457j090P90R58j8J83N15m46o39J159J716q12j306J315
1404A123J095k687j890K951K833k634k828K294K133k687k006L436J874m042k321
1419c356L946K602l028j398L655J232m112j728L466J837k842j462J985M46k018
1434g75K0K133j09k337r16N03j2O20J381k53j856r0K151P40j560m99J197kj324
$$ plain form
1323 671 -1580 659 2669 -113 -2503 528 3356 362 -3085 -521 2770 647 -2791 -1355 925
1338 925 -817 -2619 -744 643 -614 -442 1847 1276 -1914 -1170 2728 2507 -950 -643 2205 1266 -1107
1355 -1107 1190 4189 1203 -3161 -1627 2109 831 -1994 -448 1708 -536 -2806 13 2963 982
1370 982 -2006 -879 1000 -144 -1297 877 3065 1087 -2135 -1793 940 1778 -165 -2000 -1845 -1207
1386 -1207 -1301 -1131 -121 255 -1202 -2292 -1502 -544 -562 -379 136 -310 -949 210 1926 1114 -192 1123
1404 1123 2218 -469 -2359 592 3425 791 -2037 257 2390 -297 -2303 1133 3007 -1035 -3356
1419 -3356 590 3192 164 -1234 2421 3653 -459 -2187 1279 3116 274 -1188 797 1243 -775
1434 -775 -755 1378 1269 -1068 -1984 -1481 -1493 -873 508 255 -1601 -1691 460 1200 -360 -859 338 336 -988
1453i88nJ899Q72j372j367P19J021q51j672K66J830l54k252J24L022P52k931q09
1471b096K837P45l022m92L447P98l127l4L672J11l981n48L433L83l276n83K282
1488E49O5j339J166J448j818j817J664J411j718n34K382M49k470K93L149j04l425
1505f49j60K962n68l384J84L555K17l302p18K375M32k328p76J617N21j464o00
1522b086J546J341p13j053N97J020q67j577M69J901L40j575n71J238K82q55J62
1539d01N18j077j405Q74J660ok98Q05j03j497M70K306j33k566J96K668l63k304
1557f56J409L168j652m054Q03L478j140l419J271L255j577l296J771L497j348
1572A510l454P31K556r34j886J291K209p69j688N60J084p72j014K61L52p08l93
$$ plain form
1453 -988 -993 906 1778 406 -961 -242 779 -72 -1744 -1478 352 -2 -2254 -2130 892 1644 -1287 -2096
1471 -2096 741 1486 -1536 -2028 1419 2217 -910 -944 2728 2839 -1142 -1690 1743 2126 -1150 -1733 549
1488 549 614 -725 441 1889 71 -1746 -82 1329 -389 -923 1459 1908 -562 -269 2880 2776 -649
1505 -649 -809 2153 1585 -1799 -1615 1940 2157 -1145 -1863 512 944 -1384 -2160 -543 -22 -1486 -2086
1522 -2086 -540 801 88 -965 -368 652 -215 -1792 -1323 578 918 -657 -1228 10 292 -563 -401
1539 -401 117 -960 -2365 -1491 169 163 -135 670 567 -930 -460 1846 1713 -853 -657 2011 1648 -656
1557 -656 753 3921 2269 -1785 -982 2496 1356 -2063 -792 2463 886 -2410 -639 2858 1510
1572 1510 -1944 -1213 1343 409 -1477 -186 2023 1254 -434 126 1210 438 -576 -315 37 -671 -1064
1589a064M55K00m2K34K98r12j232M34J323L04r94k52J245O08p86k23J309L31k152
1608i16j230K169J669j756j800J958J888k033k196J827K196k063k514J859K595
1623A653j264j791J924J974j719j767J635J384j630j055J525Q98j090j57J038
1638A558m27j405O54R03j581j663J615K104j308j690J518J604j812j795J989J705
1654A969k117k143K036K683j456k299R73K004j297k489N76K030o60k093M87K164
1670C68lj917j5J573O2j646k79J674M78r74N0J371K97r71k50N65k48n31L85L12
1690C01p43j92J272O89j226o66J007P6j710P7K460M16k408l46K904J167k558j216
1708f96K002N66k509o00K803J062k644j472K335J300k011j746J242R17j430q25
$$ plain form
1589 -1064 -609 -409 -451 -217 81 -831 -2063 -1629 -306 -2 -996 -1248 -3 605 -181 -404 905 1236 -916
1608 -916 -2146 23 1692 -64 -1864 94 1982 -51 -2247 -420 1776 -287 -2801 -942 1653
1623 1653 389 -1402 522 2496 777 -990 645 2029 399 -656 869 1767 677 520 1558
1638 1558 1131 -274 380 1283 -298 -1961 -346 1758 450 -1240 278 1882 70 -1725 264 1969
1654 1969 -148 -2291 -255 2428 972 -1327 -354 1650 353 -2136 -1560 470 -190 -2283 -1796 368
1670 368 365 -1552 -1567 6 68 -1578 -1857 -183 295 -679 -629 742 1039 68 -182 383 135 -396 -11 301
1690 301 -442 -634 638 1327 101 -565 442 518 -1192 -1115 1345 1761 -647 -993 1911 3078 520 -696
1708 -696 1306 1872 -637 -1237 1566 2628 -16 -1488 847 2147 136 -1610 -368 549 -881 -1706
1724a706J745J208j118q97P79O30o73m76K86j19l88M08P96k41n62L31J92j092
1742h97o83Q58N29j312q19J784J680j264j719J145J756j217j803J112J919q46
1758B23j612J500K405j002k766L71K292j50k206r3J846o2j423M50J860j17k034
1775e18m28J363N22o23o6N31r8j89O99N69n95o90L0k53o20M90J261n37j741l6
1795i29J915K54j966p29J285M2j725J77K473N66k422q20K225J111k060j320J516
1812d07J028j708o66J831J170j647j259J078J082j172j153P23J047m73l58Q72
1828a2N47n33k31N93J19p15N7N69L4j77P43O67r94j001O91J070j019j309P00J138
1848I37r08q75J543J624j403k322Q27K170n34j825M59J689n27j509J022J916r78
$$ plain form
1724 -1706 39 1247 129 -768 11 641 -32 -508 -222 -341 -729 -321 475 234 -328 3 195 -897
1742 -897 -1580 -722 -193 -1505 -2324 -540 1140 -124 -1843 -698 1058 -159 -1962 -850 1069 223
1758 223 -1389 111 2516 1514 -1252 -881 1411 1261 -945 -1038 808 746 -677 -227 1633 1516 -518
1775 -518 -946 417 939 316 250 781 683 494 1193 1762 1167 477 507 254 -366 124 1385 848 -893 -929
1795 -929 986 1240 -726 -1455 -170 -128 -1853 -1676 797 1363 -1059 -1879 346 1457 -603 -1923 -407
1812 -407 621 -1087 -1753 78 1248 -399 -1658 -580 502 -670 -1823 -1100 -53 -526 -884 -12
1828 -12 535 2 -229 364 483 -232 -175 394 428 251 994 1661 667 -334 357 1427 408 -901 -201 937
1848 937 29 -846 697 2321 918 -1404 -577 1593 1059 -766 -307 1382 855 -654 368 2284 1306
1865A306k447j75J775J52j331q5J000k09q95L26R86l48j160j93N79j3J82O57R8
1884B05p35m3Q78J14r59k51O23n6j084L43J745N5j828l67J758L65j931q00J914
1903e4R38j605n57K118J113j791j088J691J082j746j333J567J400r23j024J071
1919H59P26j004r64P83K95q82m01P72L13k21M33M86q56q89P63P71q82q00R22P07
1939I31r30m61J444P15j845j641J109J318r48j360Q59J232p54j150R98J402r26
1956gj854J08J595L67j048J36J267j8j183j27J377R2j498o10J013O53m31m7O54
1975D39o6p94M0N18j85m35M95M76o28L7J263L32j172l57J262L3j842j14K165J46
1995A613j974k00K177Ok287k01K056Kk421l14K195O89j477k66J376L6j565l28
$$ plain form
1865 1306 -1141 -1316 459 611 -720 -805 195 -14 -909 -583 403 55 -1105 -1298 -719 -732 -550 107 205
1884 205 -530 -573 305 419 -540 -791 -168 -224 -1308 -965 780 835 -993 -1360 398 763 -1168 -1968 -54
1903 -54 884 -721 -1278 840 1953 162 -926 765 1847 101 -1232 335 1735 812 -212 859
1919 859 1585 581 -383 400 695 -187 -588 184 497 276 709 1195 339 -550 213 984 102 -698 224 931
1939 931 1 -460 984 1699 -146 -1787 -678 640 -308 -1668 -809 423 -331 -1481 -483 919 -7
1956 -7 -1861 -1753 -158 209 -839 -703 564 546 -637 -764 613 705 -793 -1403 -390 263 -168 -215 439
1975 439 373 -421 -381 137 -48 -483 12 488 -140 -103 1160 1492 320 -37 1225 1258 -584 -698 1467 1613
1995 1613 -361 -561 1616 1622 -665 -866 1190 1192 -1229 -1543 652 1341 -136 -402 974 1010 -555 -883
2013h83J223M94r87o17L94N89J06r1k63l17k60j04l41P1N48K99m10l65L03N72
2033c9J61n45m61L41M12l28l18P17J055n33j290M09J339m66j706M86J792m31j925
2052a330O10K304l10j981K02J793n85j940O53K229k43j653L39J522l58j160M79
2069E71N18q49p02O25M37m11L33O86r05j257O80J134q29j172P13J137q22j008
2087a121J137J309q60j463K12R55l51q01L07R70k0r24l65O80O81n17r85k8P06
2106d78j22n91P96J406n48j489K07J461k76j155L26J221o16j008Q26J485m69j058
2124h2J96J04q12J57J147L2j067K61J191o15j121J128J223j546j744J453J945
2141A850j208j416J513J429j794j681J367J431j315j372J006R38q75o23R14P45
$$ plain form
2013 -883 340 834 -153 -770 -376 213 319 228 -35 -352 -612 -716 -1057 -986 -438 -139 -549 -914 -611 -39
2033 -39 122 -423 -884 -543 -131 -459 -777 -60 995 462 -828 -419 920 454 -1252 -766 1026 595 -1330
2052 -1330 -720 1584 1274 -707 -505 1288 703 -1237 -584 1645 1402 -251 88 1610 1252 92 571
2069 571 1089 240 -462 163 600 189 522 1208 303 -954 -274 860 31 -1141 -428 709 -113 -1121
2087 -1121 16 1325 465 -998 -786 169 -182 -983 -676 294 274 -650 -1015 -335 346 -171 -1156 -1184 -478
2106 -478 -600 -1191 -395 1011 463 -1026 -819 642 366 -789 -463 758 142 -866 -40 1445 976 -82
2124 -82 114 218 -594 -437 710 742 -325 -64 1127 512 -609 519 1742 196 -1548 -95 1850
2141 1850 642 -774 739 2168 374 -1307 60 1491 176 -1196 -190 748 -127 -750 164 909
2157I09p77r87O6L15J68P2P9Q4P7j05k53O1O25p9r00n60N94N47j12l7K99j76n03
2180e93KpJ37L02J24p08l19J278J007j110r48J312Q44j764j111J927J468j692
2198A49j399J812J388j868j330J822J133j859j100J451R11j081k66J430L9j349
2214a17j82R34o1o76M01M21q03l19J143N21j075n95P31j87j238K09J596Pj452
2233g42l27J294K96r74m40Q12K02q90n11R59R52k41j085M3R47K9j178k44J187
2252H9L07j177m01J252O45j003l96R13J96j232k65J287M37o88N4O46k89o00O46
2271D21P09q26o85N76L49p63K45J416j53j797j92J515Q6j512J35J552m82j740
2289a146O10K192o5k165k95J527n6j328L2J326N3j141l12R94M09p08o15J13K48
$$ plain form
2157 909 132 -855 -789 -474 -306 -234 -155 -71 6 -99 -352 -291 334 255 -645 -1205 -611 -64 -176 -213 86 -90 -593
2180 -593 -591 -598 -461 -159 -35 -743 -1062 216 1223 113 -835 477 1321 -443 -1554 373 1841 149
2198 149 -1250 562 1950 82 -1248 574 1707 -152 -1252 199 1110 29 -237 1193 1232 -117
2214 -117 -299 635 574 -102 299 720 -83 -402 741 1262 187 -408 323 136 -1102 -893 703 710 -742
2233 -742 -1069 225 521 -453 -893 -81 121 -769 -1280 -321 631 390 -695 -652 295 324 -854 -1098 89
2252 89 396 -781 -1182 70 715 -288 -684 229 425 -807 -1072 215 652 -36 18 664 375 -225 421
2271 421 1130 304 -381 195 544 -219 26 1442 1289 -508 -700 815 901 -611 -476 1076 594 -1146
2289 -1146 -536 1656 1591 -574 -869 658 602 -726 -694 632 685 -456 -768 226 635 -73 -688 -575 -327
2308c27k01r3R0L68K43k04l71P8K58j7k82LK05J27O4j41J57K93J62o32o95M69
2330d46P70l29o94O45R90p25j135Q32J457p78j714M86J607j96j345O32J479o64
2348H72j648N79J391l18j405M8R78j9n74M32M77n48m65J30K25k50M7L04k49m20
2368d13N67O67n05p37K64O40o29p05N88Q76n55q62M48J029m02j193N3R09L7r41
2388h64o6J093L74j011l40R71M46r85o77P77Q58p42n52P23P58n59o16L61M88m56
2408a9n62L98M46j87j09K71O5j51J70J58m55k94N27L22m69j81P42L61q51o11R28
2429D99M49r53p56P99R22r07p29Q69Q50q44j086N83J036n50j014L38J010k28p81
2448d93K60P29k03q67p9N93J90m72j50L43J46k26k3Q8j4j44Mj47k7L30L07j43
$$ plain form
2308 -327 -528 -621 -531 -163 80 -124 -495 -417 -159 -176 -458 -455 -250 -123 -59 -200 -43 250 412 -220 -915 -446
2330 -446 324 -5 -699 -54 936 211 -924 -92 1365 587 -1127 -641 966 770 -575 57 1536 872
2348 872 -776 -197 1194 876 -529 -481 497 478 -96 336 813 265 -200 -70 155 -95 -48 256 7 -413
2368 -413 154 821 316 -421 -157 483 -146 -851 -263 613 58 -804 -356 673 271 -922 -869 40 77 -864
2388 -864 -930 163 537 -474 -814 157 603 -382 -1059 -282 576 -166 -718 5 763 204 -412 -51 437 -19
2408 -19 -581 -183 263 76 -33 238 303 152 322 480 25 -269 258 580 111 -70 672 1033 182 -429 499
2429 499 948 -5 -761 38 960 53 -676 193 1043 199 -887 -304 732 182 -832 -494 516 288 -493
2448 -493 -233 496 293 -574 -653 -60 130 -342 -492 -149 -3 -229 -252 -164 -178 -322 -318 -465 -492 -162 145 2
2470Bm97L98N75l02p02K13P92l45q31M42J015Lj156p7J200J15j316l09J161M84
2490H65r50m45J034O79j021o73P46N71o49o26M83O17k48m04K82K24k15k95L2n2
2510d5n6N5J46k65K3L71J16n18k78M82J83o47k65P50M24p79l77Q36M94r55o55
2531i60O80P34p01p59P61Q67n37r38N45Q85l73j052J98J046j08p53J72P46M5o43
2551a45J1M26Q1n09p4L91L7o9R9J9j35p0K95j40l67J05M40j53n39L06P60l66q16
2574d13K43R01k62r76R0R47o3j055J97J047Mj187k19J006L12j144k48Q77M07o47
2594a83m56N58N40n48o25L51M72j28l55Q3L31Q2j87j33J5M3N5j33j71J24M84j
2616B18m27k19O93K16o39l82O35M84o65n25Q36P21p78q33P43Q20o70r95O57R82
$$ plain form
2470 2 -495 -97 478 176 -526 -313 479 134 -697 -255 760 763 -393 -470 730 845 -471 -780 381 865
2490 865 -85 -530 504 1183 162 -511 235 806 157 -469 14 631 383 -21 261 485 270 -25 7 -45
2510 -45 -101 -46 100 -165 -142 229 345 -173 -451 31 214 -433 -698 52 476 -303 -680 156 650 -305 -960
2531 -960 -280 454 -247 -1006 -245 622 85 -853 -308 577 204 -848 -650 396 288 -465 -293 453 498 -145
2551 -145 -134 292 373 -136 -210 181 218 149 248 267 132 62 357 217 -150 -45 395 242 -297 9 769 403 -413
2574 -413 -170 731 469 -507 -417 530 467 -588 -391 656 660 -527 -746 260 572 -572 -820 57 464 -183
2594 -183 -639 -81 459 -89 -714 -363 109 -19 -374 -291 40 122 -65 -198 -183 -140 -85 -218 -389 -265 219 218
2616 218 -209 -428 265 481 -158 -540 95 579 -86 -611 225 946 168 -665 78 898 228 -767 -110 872
2636H72n36r38N51R78l84j038K90P48k43p12K29O05j74l39jK82m6j9k2k59j34
2657b90L44Q4l21j33N89J05o29l02M84M11n37m26M33M43l40l80L19N59k02p56
2677e45o1O68L03n76l83O78M04p17l89Q10N43p76q31O31P21m70n17O12N59n73
2697I1p16O14O79m27n33K19K71l33J37M45j46l47K62Lm19j71Q45J57q81l61J062
2718D51K91r61l47J085J88j217m20J119N15q58m01P89K64p63m05O85L62l29n52
2737e04P7M14K56k98j87L02J18m40l76M83O12k62p05J44N57j6m06K49K24l01l90
2758d49J46L57N9M7j7m23o2O06J20n89k16Q66R5j067j24J321L21j432l45J309
2778E23K71j344k27J427K35j302k78J099K60q08j77P23p4o71n3N51L5j57J08k6
$$ plain form
2636 872 336 -602 -51 927 543 -495 -205 543 300 -412 -183 422 248 -91 -92 190 144 125 103 -156 -290
2657 -290 54 138 -183 -316 273 378 -251 -553 -69 342 -195 -621 -188 255 -85 -465 -146 413 211 -545
2677 -545 -606 62 365 -211 -594 84 488 -229 -618 192 735 -41 -872 -241 480 10 -507 105 664 91
2697 91 -625 -11 668 241 -292 -73 198 -135 2 447 301 -46 216 219 -200 -371 474 631 -250 -611 451
2718 451 742 -219 -566 519 707 -510 -930 189 704 -154 -555 234 498 -265 -670 15 377 48 -504
2737 -504 -427 -13 243 -55 -242 60 178 -262 -638 -155 457 195 -510 -366 191 175 -231 18 242 -59 -449
2758 -449 -303 54 113 160 143 -280 -342 264 384 -205 -421 445 540 -527 -651 670 991 -441 -786 523
2778 523 794 -550 -777 650 885 -417 -695 404 664 -144 -321 402 328 -343 -396 155 190 33 141 115
2798A15m18P2N38k42l14L25K37o43l79P70N55n68n62L18L72k79k75L61L01k24
2818F0m45N4K84L79q0n46q3O04k7o71J41R54r3j093k35J162L26j129j05J044j
2839E00j172M2J221J31j048k5P16k16n59M38N23m54l85L55P5m37L30O87l31j038
2859f47L72Q37m08p55O84Q05q98j005Q21J111o45r44M25P33n11n82N90P71m12
2878C42q04%M89K21j50k22OK15m6m00N2P37N1p35l92O13L22m17j96N14R4n54j96
2901d56N61J32k14K3n4l02J62M97j66m23L32L23o51n85P97J001p72j059O42J060
2921H48p85q62J009Q87j089j061Q65R73o87o16O51M09o79m36O38L91l85k05J47
2940A3j52p8L78J91l98j37L09k8m59J98O37j61p59KO85K8n18J09M33n6n25j03
$$ plain form
2798 115 -303 -231 307 65 -249 76 313 -330 -709 61 616 48 -514 -196 176 -103 -378 -17 284 60
2818 60 -385 -331 -47 332 252 -294 -377 227 200 -471 -330 624 531 -562 -797 365 691 -438 -543 501 500
2839 500 -672 -630 591 722 -326 -351 365 149 -410 28 551 97 -288 67 142 -295 35 722 391 -647
2859 -647 -275 562 154 -601 83 888 -10 -1015 -194 917 272 -672 -247 486 -25 -607 -17 754 342
2878 342 -462 -462 27 248 98 -124 -118 97 51 -349 -297 440 491 -244 -636 -23 299 -118 -314 200 294 -260 -456
2901 -456 105 237 23 46 -8 -310 -148 349 183 -240 92 415 -236 -821 -24 977 205 -854 -212 848
2921 848 63 -799 210 1097 8 -1053 -188 785 98 -518 133 542 -137 -573 65 456 71 -134 13
2940 13 -139 -217 161 352 -46 -183 126 98 -361 -163 474 313 -446 -444 241 269 -249 -140 293 237 -288 -391
2962c91M45K49j55l44j06L74J42m33m5M44L25o97m81P29N89n93n61N94N27p83
2982a71m40P35N84o63o42N46L62l86k06M85J31m49j62L10M7o9K57j07m20o3N85
3003B64M6n63J2O39p0r23J57R61n6r16o8Q29O8p51j6P04J45o33l10N38L60l28
3025H9l56J71L18m3m02K4L43J30m09k63L51L46k15m36K71L28k35l61K67K56rk60
3047i5m4J41K6Q4r5j52J19K69j84l64J75N47j73p68J56P92j87o55P3Q14m2j059
3069f22J59Q69L8p78j70P90J17o80n2N28J02m49j41K99K52j91k29R1P2Q9j46r1
3091a43J03J51Qj54j44K42J37j21k88K01K86j09l90M9M36Jm21j62N37J28n03k85
3113d41N02M18n31m11M24N23m08m17J65N89k60n63J71O41j40n89P1N58k5m84p8
$$ plain form
2962 -391 54 303 148 -196 -302 72 214 -219 -264 180 505 -192 -673 56 645 52 -509 85 612 -171
2982 -171 -611 124 708 45 -597 -51 311 -75 -281 204 335 -114 -276 34 81 12 269 162 -258 -321 264
3003 264 310 -253 -241 398 328 -595 -438 523 467 -449 -517 312 380 -371 -387 317 462 -171 -481 57 417 89
3025 89 -267 -96 222 179 -223 -199 144 274 -135 -398 -47 299 84 -352 -81 247 12 -349 -82 174 165 -95
3047 -95 -139 2 28 112 17 -135 -16 253 69 -295 -120 427 254 -514 -358 434 247 -408 -335 479 437 -622
3069 -622 -463 406 444 -334 -504 286 403 -277 -329 199 301 -148 -289 10 262 71 -158 -67 5 94 -52 -143
3091 -143 -40 111 119 -35 -179 63 200 79 -209 -8 278 169 -221 -172 264 265 -156 -318 219 347 -156 -441
3113 -441 61 479 -52 -463 -39 484 76 -341 -176 413 153 -410 -239 402 262 -327 -256 302 277 -207 -285
3134b85L50J00l35l3J96R2q8j34O6R2M2K4k47p9L86J22l62k57M25K74m02l36L87
3157bM52l92n55L08O68j70p60J75O21m4o86K4O88L8n26k14N76K82m15l60L01L53
3179C62k88l43K46L65j36l47Q6J87K4q2k19K6J51O0j65j23J29L22j29l60L3M97
3201B96n7n35m5N93Q9n84j74N38L55p22k78N03M12m39n06M39N55l77n18K68N92
3222D05k49n25J97M13m4l58K3L89L3l24r0J39J89j26j59m1J36J19j3j91K3J82
3244A28N9k86j03L96R8l49j60K63L76k64m25J83M39j94n35K19N75j25o93P8N99
3265B79ln06j35M66K18n59j87N29L29n55k13K69L12k17k33J16K05n2k30Q1J17
3286C1L9l4j56n6J28J26j36k25J80L18j15l56J38M68j51m73m2N83Qm59q9M77J87
$$ plain form
3134 -285 65 165 -170 -203 -7 85 -3 -137 -71 21 63 87 -160 -239 147 269 -93 -350 75 349 -53 -389 -2
3157 -2 450 58 -497 -189 479 309 -451 -276 345 301 -385 -361 327 365 -161 -375 201 483 68 -292 9 362
3179 362 74 -269 -23 342 206 -141 -55 132 156 74 -145 -119 32 92 -73 -196 -67 255 126 -234 -201 296
3201 296 239 -296 -341 252 341 -243 -417 121 476 -246 -524 -21 391 -48 -554 -115 440 63 -455 -187 405
3222 405 156 -369 -172 241 197 -161 -138 251 284 -40 -130 9 198 72 -87 -128 8 127 114 -77 -54 128
3244 128 187 -99 -202 194 292 -57 -217 46 422 158 -267 -84 355 161 -374 -155 420 295 -398 -320 279
3265 279 276 -230 -365 101 319 -240 -427 102 431 -124 -337 -68 244 27 -206 -90 115 63 -167 -86 31
3286 31 70 36 -120 -176 -48 78 -58 -283 -103 215 100 -256 -118 350 199 -274 -316 267 275 -184 -273 204 391
3309C91n07k06M37L43m01m12K71M11j83m00J89M12p7l82j93M83J30l41k57L05
3329A3K79k12k39K00J96j92k33R9J41J8l9j26q6K02J50j88k12J28L60k81m67L23
3351a66N34k42n52J87O88k59o29J73O44q8o77O8O08n5m59L6L98l0l70j25L35J19
3373A38j10r3M0J68Pj54oR5J51j25l23J05L59rl17l2L51o7k79l6K93O6k99m1M1
3398g7K40M7j99j83J69J92k03l36L17N26l71n39J94P14j69p94K88N96l38o70L01
3419b95O72j39o14J57M58k31l06J38L27j77j76J08O7p1J66J64l51j78K28K41m21
3440b33r4O19N5o59j86O42L26o14k17M92J26l89j76M66L36k83l77jL39O1j48j09
3462b4J17K16k85l11K01N38q0o63O8N12p9m76J32M88j56m06j4M31Pk25R6r5j67
$$ plain form
3309 391 -116 -322 115 458 57 -355 -84 327 144 -256 -67 345 268 -114 -307 176 306 -35 -292 13
3329 13 292 80 -159 41 237 45 -188 -89 52 70 31 -95 -181 21 171 -17 -229 -101 259 -22 -489 -166
3351 -166 368 126 -426 -239 449 190 -439 -266 378 290 -387 -319 289 234 -225 -189 209 179 -191 -316 19 138
3373 138 28 -65 -25 143 150 -4 -10 85 236 111 -212 -107 252 243 -74 -106 245 178 -101 -137 156 222 -77 -118 -77
3398 -77 163 210 11 -172 -3 189 -14 -350 -33 493 122 -417 -223 491 322 -472 -184 412 74 -596 -295
3419 -295 377 238 -376 -219 239 8 -298 -160 167 -10 -186 -78 -11 -82 84 248 -103 -281 -53 188 -233
3440 -233 -327 292 347 -312 -498 144 470 -144 -361 131 257 -132 -308 158 494 211 -166 -167 172 233 85 -24
3462 -24 93 309 24 -287 -86 452 372 -291 -223 289 210 -266 -134 354 198 -208 -222 209 216 -9 87 -8 -175
3485a75k5L08Rk25K29K2l87k05N66L71p32l24O64K29o91r2P68K40r42k73P41K83
3507C59n21k15N96J28o16p6M52J51j81q9l2m0M8J41J4j11J08R6l43j49L56K97
3529C73l23k92L60J81l23p1L74J49m71j67J73J83n2O3r8j64J05O9j38j29M16j4
3551B04m73k40O25K90n27k74O40J31p97j48P94K72p44k82O84J01n41PN34k3m95
3572b62kJ61O4l6K32%m10L3M88j93l76L49L12l89n10M17O45l73m69L16L77m07
3594c3l80M03M89l08m33Q2L21J23j29n3K9q8j8k79J74M93R6n39k29N06K25l80
3616G2l36M41J99n52k83N00L05l21k37K79l0k02P2J82n9j60J53r7k28K89M15k91
3638A11m78J37M80k43m67M91N09n09o62M00O28l53m63K66M63l15m38M02M51j85
$$ plain form
3485 -175 -200 108 117 -108 121 143 -244 -449 117 488 -244 -568 96 325 -366 -458 310 550 -392 -665 76 359
3507 359 -162 -377 219 347 -269 -345 107 258 77 -12 -44 -84 -36 105 119 8 116 212 -131 -280 76 373
3529 373 50 -242 118 299 -24 -95 279 428 -43 -210 -37 146 94 157 59 -105 0 69 -69 -198 218 204
3551 204 -269 -509 116 406 -121 -395 245 376 -421 -569 225 497 -247 -529 155 256 -285 -278 256 233 -262
3572 -262 -264 -103 -39 -75 157 157 -253 -220 268 75 -301 48 360 -29 -539 -122 523 150 -319 -3 374 -33
3594 -33 -413 -10 479 171 -262 -180 141 264 135 82 111 23 5 -274 -100 393 489 -50 -279 227 452 72
3616 72 -264 177 376 -176 -459 41 346 25 -212 67 37 -165 -93 89 30 -130 23 -74 -302 -13 402 111
3638 111 -367 -230 250 7 -460 31 540 31 -631 -231 397 44 -419 -153 310 -5 -443 -41 410 225
3658B25l32M9J36k3J4M3j32J12Mk3k07J88L85k69l94J81K88k12j63J61K78j89
3680A20l05J39K10L0k27J4K8K6l0K6p7J59J44l19k52K83L47l34l75L17M58m06
3702b4l94L57M64l69n36K58N23k26m15K29M16k71l06J77K58p1p4r1L1m3L1J26
3724E0j66O2K14r3l14Q6L90q2m17M2M52nl36n2M28O8l95j48K96J60j59k98J97
3747b0L05j37k44m0L05J23l21k61K50L57k34l23K55L33j47m90J69M34j75l09N4
3768a16K61p8j31M3P0p4Mm0o1M8J59p6k18M4J91J11l20l4L10Q9m31l9L69J84l96
3793a31j93N41N0l46k04L34K39k73k92K60K80j38k83J49K13Jk80m3K53R0j80o1
3815a4J35J10r3k29M7K59p1j55j00J09K35j51j09l3J79K1k28n1J96J36k75k03
$$ plain form
3658 225 -107 -58 78 55 69 112 -20 92 96 73 -134 54 439 170 -224 -43 245 33 -130 31 309 120
3680 120 -185 -46 164 194 -33 -19 9 35 5 31 -46 113 257 -62 -314 -31 316 -18 -393 -76 382 -24
3702 -24 -418 -61 403 34 -502 -244 279 53 -362 -133 283 12 -294 -117 141 70 -4 -95 -64 -107 -76 50
3724 50 -116 -54 160 67 -247 -161 229 147 -270 -228 224 219 -117 -169 259 327 -68 -216 80 240 81 -217 -20
3747 -20 285 148 -96 -136 169 292 -29 -290 -40 317 83 -240 15 348 201 -289 -120 314 139 -170 -116
3768 -116 145 67 -64 -21 49 -25 -21 -61 -122 -74 85 9 -209 -165 26 137 -183 -217 93 182 -249 -288 81 265 -131
3793 -131 -324 217 267 -79 -283 51 290 17 -275 -15 265 127 -156 -7 206 207 -73 -116 137 227 47 -14
3815 -14 121 231 138 -91 -44 215 144 -11 -111 -2 233 82 -27 -60 119 140 -88 -139 57 193 -82 -285
3837b85K77K51k66k09J42L45j83l22P3L97r0m01K3L55R8m33p4L45N1k06j58K26
3859d4J49j59j91J02K65J6k28o8Q1J96p6j49J6K53Jk72o2J44K68k41j67J48K09
3882A91r1l35J02L67Pl81j4K97J23l59q8K14K91k46k97J87L10k06k58R0L39m8
3904A95l40J2K67N5k67r0K18K0j01r8R1J61p6j14m6N2Q4Nj98k7J89L2j80j18L36
3929F2N5k70j26K59J84k42k65K44K95q3l93K03K50Jl84J6L89l7k76k4L07Rj38
3952C6j36K04J24j33k71J52J91l4j71k8K71l4j02r6J18Q4k9k08J2J76M3j70j56
3975a57K65Q1j23j74K6K26m9k39M5J95R6l06j53L15K18l59j45K20K56k76k27K14
3997e1L47k18l67J83K19r6k32Q5K09l7j13q1J40M4M0j50n6J25J34n9j90M6K79
$$ plain form
3837 -285 -8 243 -23 -232 -90 255 72 -250 -177 220 130 -271 -248 107 205 -228 -302 43 94 -112 -270 -44
3859 -44 105 -54 -245 -143 122 138 -90 -158 -77 119 43 -106 -90 163 164 -108 -170 -26 242 1 -166 -18 191
3882 191 100 -235 -133 234 241 -140 -154 143 266 -93 -181 33 324 78 -219 -32 278 72 -186 -96 243 195
3904 195 -145 -133 134 189 -78 -168 50 70 -31 -129 -38 123 47 -67 -113 -61 23 28 -170 -197 -8 24 -156 -274 62
3929 62 117 -153 -279 -20 164 -78 -343 -99 196 113 -280 -77 173 174 -210 -194 195 158 -118 -142 165 174 36
3952 36 -100 104 228 95 -176 -24 167 133 -38 -66 205 171 69 -27 91 175 146 -62 -50 126 169 -1 -157
3975 -157 108 189 66 -108 -82 144 95 -144 -99 96 192 -114 -267 48 266 -93 -238 -18 238 -38 -265 -51
3997 -51 296 78 -289 -106 113 17 -215 -130 79 42 -71 -152 -12 32 72 -78 -134 -9 125 66 -124 -78 201
4020B01o8k70Q3K46r2k03K8K51O0k51o0J88J23k22j02O5J45J5k04k6K50N8k59
4043d4j60K64K42k55k81K20L06k77k68K32K77k58j93Q4J64j3j86M7J51j11j08
4064a67P1NP0J5m5j87R4K22N9k93m6L56k6m02J01M15o6m29l5N11j28k22j5L53
4088B11K2k87q4J81R6n8j44L4J30j3o3k5J30J03k03k17J98K71j27k35Q6K03j03
4111A06k98J20L18j08k78R9J38Kr0K2Kk7k6Jp7OL05j11l47P4L29m1l77R9L69j48
4137F2m29J40N10n9m55LL53l3l43J37L45j02l47R5J77n9qP0m6j03J38J5j77j0
4161a26L29m2l77o1M55K7k60j44M03Ql53j6K83J46j95j76J51K1k2j4rN3O1j01
4185D1j88J15K74K6m35j22M37N9m92Q6N08qn53n9N64r1l36P1K04q5j77L5K41j29
$$ plain form
4020 201 133 -137 -54 192 100 -103 -75 176 236 -15 -75 113 236 14 -88 -23 122 137 -67 -93 157 215 -44
4043 -44 -204 60 302 47 -234 -14 292 15 -253 -21 256 -2 -195 -111 53 40 -146 -99 52 -59 -167
4064 -167 -96 -91 -21 -6 -51 -238 -144 78 137 -156 -202 154 128 -274 -173 242 176 -253 -288 223 95 -127 -142 211
4088 211 233 -54 -138 43 139 81 -63 -29 101 88 25 0 130 233 30 -187 11 282 155 -80 6 209 106
4111 106 -192 -72 246 138 -140 -41 97 99 9 31 33 6 -20 -19 -96 -90 215 104 -243 -169 160 119 -258 -159 210 62
4137 62 -367 -227 283 224 -231 -228 125 92 -251 -114 231 129 -218 -123 54 -5 -13 57 11 -92 46 61 -116 -126
4161 -126 203 161 -216 -277 178 205 -55 -199 204 212 -141 -157 126 272 77 -99 52 73 51 37 28 81 142 41
4185 41 -147 -32 242 268 -167 -289 148 207 -285 -199 309 301 -252 -311 253 162 -174 -103 101 16 -161 -126 115 -14
4209a4j39J80j37o7J61J66r5l47K92J49l01k05M85K03m28l03M04K62l67j16L57
4230A40Q3m08p7L77J16k32pO4m2q6Q8P3n8J7L9j79p2L18J08k36k24L24J38k77
4254a3r7L62L3l95j80L50Q4k17M4J22m6j56O1J02l1R2K6j82k10K45K51k00l18
4277b73L63J36l81k18M68K76m67l39M91J32l23j48M80P7k79l09L25J11j97M1J18
4298H4r4m4O4j0l8P6K09l23j63K22K94k88j97K19K12k50k25K82K88k70k76J83
4320d5J28m9m7K2O6k5k7q3q3K99J25l63k31L45K60l00k12K48K49l09l37L43L24
4343B98k54k44J61K62l01j02J96J37k07j08J02n9J14K02j44k28O7J66o5k66J85
4364h8L16k03l94J83M05r9m02K20K44j44l04J97K76p7l16J61J08m1p7j2P6J4R
$$ plain form
4209 -14 -153 27 -110 -177 -16 150 55 -292 0 149 -152 -357 128 331 -97 -400 4 266 -101 -217 140
4230 140 223 -185 -262 115 231 -1 -8 56 14 -72 16 89 31 48 87 -92 -164 154 262 26 -198 126 264 -13
4254 -13 -110 252 285 -110 -290 60 144 -73 -29 93 47 -109 -48 54 23 115 141 -41 -251 -6 245 45 -273
4277 -273 90 226 -155 -373 95 371 -96 -435 56 188 -135 -283 197 274 -5 -314 11 122 -75 -34 84
4298 84 -10 -54 10 0 -38 38 247 -76 -239 -17 277 -11 -208 11 223 -27 -252 30 318 48 -228 -45
4320 -45 83 34 -13 9 75 50 23 -60 -143 156 281 -82 -313 32 292 -8 -220 28 277 -32 -369 -26 298
4343 298 44 -200 -39 223 -78 -180 16 153 -54 -162 -60 -119 -5 197 53 -175 -108 58 -7 -273 -88
4364 -88 228 25 -369 -186 219 120 -282 -62 182 38 -266 -69 207 130 -186 -25 83 42 -35 -47 29 43 52
4387E2j28LJ44J06j42j14P7K20k08k15K30K52j96k26J13K90j99j06J8J44j33o8
4409h6O2R2K0p9k6p0J15R1j39r7J09J72j00l57K38L02j53m03J51M00j84l22R2
4432a72L67l3m29Q6K48P3j94j19J62M9p2n0J27k7Q5j02j35J43K00n0k13l2K65
4455A77q9j63l2K20M9k44nJ51R0o0j93N6J80m5j68j5K28J9j66j75K35J35j43j46
4479a04O5J75n3l41J46L25r0l35N6K45l6j94J8K02K8j81j22J72P0k7k5r9O5M0
4503@k6q2N2R7L8j84k8K21L5k34n4J96J35k67n4J78J49j79j69J40K40j20k70J94
4527HJ43o1j71MJ82K2j59r3J50P5r3r0R5M5L0k05Q4J02j7l3q9J06K7r9p8N5J13
4554E3l2o6j0N3J13j51j42J14J36o6j97J41J45N4l27J3K60J09k38j41K93O7k41
$$ plain form
4387 52 -76 -73 71 177 35 -79 -2 218 10 -205 25 277 81 -145 -32 258 59 -47 -29 115 -18 -86
4409 -86 -24 68 88 9 -17 -87 28 119 -20 -117 -8 164 64 -293 -55 247 94 -309 -158 242 58 -264 -172
4432 -172 195 162 -267 -181 67 140 -54 -173 -11 38 -34 -84 43 16 101 -1 -136 7 207 157 -56 -88 177
4455 177 88 -75 -107 113 162 -82 -87 64 154 94 -99 -43 137 92 -76 -91 137 156 -10 -185 50 185 42 -104
4479 -104 -39 136 83 -258 -112 213 123 -212 -156 89 53 -141 -123 79 107 -74 -196 -24 46 19 -6 -105 -40 0
4503 0 -26 -108 -56 41 79 -105 -133 88 123 -111 -165 31 166 -101 -155 23 172 -7 -176 -36 204 84 -186 8
4527 8 151 90 -81 -77 105 127 -32 -125 25 100 7 -83 12 57 87 -118 -34 68 51 18 -71 35 62 -37 -115 -60 53
4554 53 21 -45 -55 -2 111 -40 -182 -68 68 2 -195 -54 91 145 -182 -169 91 200 -38 -179 114 181 -60
4577f0j42J65J44j04j25O8K19j00p5r9J35L1j06o1J29Q3kj60J2R3Qj30o2J32O8
4602F1J6j56R7J00r6r8lK09k3j52p0J92P8j45j20J27J16n7j36n7K17k9j95P9J39
4627I4M4j83r0J90O2j01j15R1J22j40k0J9R7L9r1q7J53J7o7p0K8R8n7o2o6J07
4653A2P7p2q6R4K2j07r9J09J62p2j40K5K11K8k05j11K18pp6j21J18P2q7j01J44
4678HO6n8j16Q3P6l1o7l4J16R3k08q0J29Q6k5j28Q5Q0o6l7L7k5P3r3poQ6K6j25
4707f2o8J91N5j32k19K65P9j68r8J76J24j07j95J76J41j30j99P9K37m8r8j16J54
4730C7R7j28p2L2J56r1o0k1Q6P3j02j19R7J21k8j58k0K81q4j97O4Q6Q5j33j06
4755a04J46L3m7p3L4J16m9j19j06K07R4q9j95J58J96j49j72Q7K62k07j77J04K21
$$ plain form
4577 -60 -202 -37 107 3 -122 -54 165 65 -10 -109 26 57 -49 -110 19 102 100 -60 -48 45 53 -77 -139 -7 61
4602 61 77 -79 18 118 22 -76 -79 130 107 -45 -115 77 155 10 -110 17 133 76 -60 -117 100 71 -124 -45 94
4627 94 138 -45 -135 55 117 16 -99 -8 114 -26 -46 -27 70 109 18 -69 84 101 34 -36 -8 90 33 -29 -95 12
4653 12 89 17 -69 25 47 -60 -159 -50 112 40 -100 -75 136 164 -41 -152 66 59 -17 -138 -20 52 -35 -136 8
4678 8 74 16 -100 -17 59 28 -39 -73 43 136 -72 -152 -23 63 38 -90 -5 75 9 -28 9 -16 57 -36 -43 -49 37 63 -62
4707 -62 -130 61 116 -16 -235 30 109 -59 -157 19 143 36 -159 17 158 28 -171 -92 145 97 -1 -117 37
4730 37 134 6 -66 -34 122 31 -29 -50 36 109 7 -112 -15 106 78 -80 -100 181 97 -100 -36 50 135 2 -104
4755 -104 42 75 28 -45 -11 105 56 -63 -169 38 132 43 -152 6 202 53 -119 -32 230 23 -154 -50 171
4778A71q6j87M4K46j74j24P6J19l3n3k1k8j6M6Q3j38PJ17k4j90J22J91l7k70N7
4803a02J69qj88j9K98j27r2l0J58M1j63K0Q9n2k6J4J3R4L8j38j36J48K01j18k02
4828a18R3K18p2k87J03K48j21j85N6J93j7j74L3J78j49k9r8J32j5O6p9p5K2J44
4852F7O9j92q4K74k8l28Q1K67J9k92qK65pk77P4K48k4k29k9J80N1j11%P2n6L3
4878C5j4q0N2J39o5k06k3K44O8k90K6K37P3m07O9K23J24k36j43K45Jj07L6J22
4902A23q7p1kK8p8J68P0k55o6K89O9l24J5K92M1l76l7K47J81k70j23K94J0l03
4926a65O3K30k2j45oO6k4m4J09j1j80O5J41j33q0J92J88k90j81K38J66k07j20
4949a50K54J16l20j45L29J08j29q8R2k4j16O9k3J10j00L2p9p8K18Q0q3k19J57
$$ plain form
4778 171 85 -102 -58 188 14 -110 -34 85 52 -1 -22 -50 -66 -20 63 -75 -68 49 25 -165 -43 148 111 -159 -102
4803 -102 67 59 -129 -148 150 23 -69 -99 59 100 -63 -43 46 -6 -32 -18 -5 89 127 -11 -147 1 202 84 -118
4828 -118 -25 193 121 -166 -63 185 64 -121 -65 128 111 -63 -30 148 -1 -30 -128 4 -11 55 -24 -99 -77 67
4852 67 136 -56 -140 134 106 -222 -141 126 145 -147 -155 110 103 -174 -100 148 124 -105 -134 46 97 -14 -14 58 2 35
4878 35 21 -59 -7 132 67 -139 -162 82 150 -140 -114 123 196 -211 -142 81 205 -31 -174 71 72 -35 1 123
4902 123 36 -35 -37 -9 -87 81 151 -104 -170 119 188 -136 -121 171 212 -164 -201 46 227 -43 -166 128 138 -165
4926 -165 -102 128 106 -39 -45 21 -3 -47 62 51 -129 -64 77 -56 -136 56 244 -46 -227 11 177 -30 -150
4949 -150 104 220 -100 -245 84 192 63 -25 67 43 -73 -4 -27 83 -17 15 -64 -142 76 156 73 -146 11
4972A1J84l18p3L67N7k59j72K80J65l54J5J65O6k50L2J48k2o4K3k3j10P3J99p0
4996G0j69Q1J93k29j39K07K26k57k59K48K12k05j32K12J87l37r2J38K01j06p7
5017b7K3K6o9ON4J3l8P6j60jJ06J62r2j96J48Q8j21j56J64J27p5j92J20Q7q7j16
5043a30K07q8M4l8n8P7Q5Lm5k24J27J85j33j56J69J18j97j77K35K02j55j62J60
5066D9J44k00j35J33J90j45j58Q9O6j7k4N3Ol2K8m0l6R3R6j44j02L3J23qk14J29
5092b3J87j51j33N7J92j1k11J8M0Q6j24O0O4l5l7k9M6J8R3q5r2L2J43j43o2J17
5118A7J29j29j53P4J16j2j77J19R3j42n9J29R2qq3l0O1kP3j02lNN0lj30P1J43
5145A39l8j77j0J77j1j61K1K25q4j96L1J57L7j67n3J79o8m2L4LlKj18M6O4L1J7
$$ plain form
4972 11 195 -123 -196 171 228 -31 -203 77 242 -112 -97 68 134 -116 -84 64 42 -22 1 -22 -132 -59 140 70
4996 70 -99 -18 175 -54 -193 14 240 -17 -276 -28 184 -21 -153 59 246 -91 -183 -45 156 50 -27
5017 -27 -4 22 -47 -41 13 26 -12 64 -96 -97 9 171 79 -117 31 119 -2 -158 6 133 58 -134 -14 73 -14 -130
5043 -130 77 -11 33 -5 -63 14 99 102 57 -167 -40 145 12 -144 25 143 -54 -231 4 206 51 -111 49
5066 49 193 -7 -142 -9 181 36 -122 -33 33 16 -8 45 51 19 47 7 -29 64 160 16 -86 -53 70 62 -152 -23
5092 -23 164 13 -120 -63 129 118 -93 -75 -35 51 -73 -13 51 16 -21 -50 -4 14 107 22 -70 -38 105 -38 -100 17
5118 17 146 17 -136 -62 54 42 -135 -16 77 -65 -124 5 97 89 6 -24 37 35 108 6 3 8 58 55 -75 -4 139
5145 139 101 -76 -86 91 80 -81 -60 165 81 -115 -84 73 110 -57 -110 69 1 -41 -7 -4 -7 -5 -123 -77 -13 18 35
5172C5p1lP9l2j27Q8J70n2q5o6J04J1j11O7l5M4m2j8K8L9K4j42rJ25N5q9o6O9
5200a0J31m9j09j7J53k1q6l3J24K6j81L4J32M2j59l1K0M5M0j07K8O4o1K5l0ML0
5227DRm1lL4Om8l5J80j9r0j08R3J04p2r6N0R2k8j39L6J45oj48KJ37M6j16m1O4
5256A2J06r7l6M0J22j17q2M0J24o7p7K3K7N0o9r5J03L4k4q6L5Q7k3j9l9J8L7l1
5284dm3K4P7l6p1RR1M2j19n5J30O0r2j15J27P5q4j11P3J20r3n0l9J15Nq0N1J5
5312B2L9oj27Q1N4ro9q2J11j2j8n7Q1NJ0o5RN1K1m2k7M7L0r6j4M5J00p0q3M1J29
5343I9m1j38l0J40k2o5L8N6R8j12o9M0J12q2p5N5P1k8j08R1k6N2o3k3J3R9j20
5370c8pj8J7P1m6m1J59q1n6p4R7J28r8m5P2k6J1j12L4Q9N3n7q8P2L1o8r4M0R3
$$ plain form
5172 35 -36 -39 40 8 -119 -31 139 87 2 -64 40 51 -60 7 -28 16 -26 -44 -16 23 47 -95 -104 21 76 -13 -79 -10
5200 -10 121 72 -37 -54 99 78 -8 -41 83 109 -72 -38 94 136 -23 -54 -34 11 51 -56 -28 36 -25 0 -30 -26 4
5227 4 13 -28 -31 3 9 -39 -74 106 87 -3 -111 -18 86 14 -82 -32 60 32 -107 -71 74 68 -80 -78 59 105 -11 -52 12
5256 12 118 21 -15 25 147 30 -52 -12 112 45 -32 -9 18 68 -1 -96 7 41 17 -69 -34 53 30 11 -28 -10 27 -4
5284 -4 -47 -23 54 18 -53 -44 47 89 -30 -85 45 105 13 -102 25 100 16 -95 -22 98 5 -45 -84 31 36 -44 7 22
5312 22 61 55 -72 9 63 54 -15 -97 14 2 -16 -73 8 13 23 -42 -33 18 39 -3 -30 17 47 -49 -63 -18 82 12 -71 -30 99
5343 99 58 -80 -110 30 8 -57 -19 37 135 23 -46 -6 106 24 -51 4 75 47 -61 30 4 56 -7 -30 -17 82 -38
5370 -38 -45 -63 -46 25 -21 -62 97 16 -40 -114 -17 111 13 -32 40 14 25 -87 -53 36 89 32 -56 16 47 -21 -115 -75 18
5399A8O8j98M6P9M6j08o3J75j3j13jP5P6n9j24N5J13j0j20Q5N4j6j31k7N7J6P5
5426E5j48Q3L1P7m7j32J05O0r9j10J05J60j22j02J05J09n8j94Q0J10j1j22p2J24
5450a3Qk3l4N5N8p1qmL8Om0j47J21J02jj69J57J4M4j65K2R5kj21L1J06n2j0ll
5480iN2l3k9L5j8Q5l4q3L2N9%j44P9P7M0j70RJ65k8j61K0J64o1r8j8K10kj76j3
5509e0Q1Mk9M6N6j43O6j1p7R5P0l3j67KJ82p4r6k9J95o6p5l3J32O1j21L0J7m5
5537a2n4O0n4Q4Km2lk2J01L5k08O8J55m7k07P9K22o8j75j6J58L1j03L7L6l5j01
5564g9L4J02j3K4o5K2mJ0Jo0k8J19J3j91K7J72N7k04n8J96O8k53k4K64j0j34j04
5591a18J62M3j03j3K4j3J4K0K0p5R3m6j5q7J00J50j88j05J56O2j32OJ33L8j81
$$ plain form
5399 18 86 -112 -66 13 59 -49 -112 63 50 -63 -64 11 87 28 -96 -41 72 62 -58 27 81 65 -66 -93 -36 -20 55
5426 55 -93 -10 21 98 51 -81 24 84 -15 -125 -20 140 18 -84 21 130 72 -122 -42 68 57 -65 -137 -13
5450 -13 -5 -28 -62 -7 51 -20 -28 -32 6 12 -28 -175 -54 48 47 -122 35 49 93 -72 -50 45 43 -78 -47 59 7 -3 -6 -9
5480 -9 43 10 -19 16 -2 83 49 -34 -2 57 57 -87 -8 69 109 -61 -52 113 85 -76 -56 108 47 -51 -69 141 139 -37 -50
5509 -50 31 35 6 52 108 -35 31 20 -57 38 108 75 -92 -90 92 18 -78 -107 88 22 -53 -86 46 107 -14 16 33 -12
5537 -12 -66 -6 -60 24 26 -16 -19 -41 60 95 -113 -45 110 63 -144 -65 157 89 -86 -102 56 87 -16 21 57 22 -79
5564 -79 -45 57 44 68 3 25 21 31 32 -28 -56 63 76 -115 -88 84 141 -63 -121 75 143 -110 -134 130 120 -14 -118
5591 -118 44 87 -16 -29 -5 -18 -4 16 36 -39 54 8 -7 -94 6 156 -32 -137 19 81 -51 -45 88 126 -55
5616e5o8J16P2j29L9J18j07o5M9L0K0J5J8p6o4N4J13j10n0J73L0j38j30K05L9
5641I9j15r8J87O7k14J0J39K9j53o9J66j7p4RO2j2k5K2j5l2l6J29k6j48J13J26
5667A24p3r1J24O4j24r6M7J77j80k8P2O6j51J8P2jo0L2l8O2oM0Nj25Q5Q6j44J6
5695b7Q3P5j06j99J67J15j47k7J32K3j55l4J84k6k4q8P6k8m5J02k1m8M8M8o7o7
5721e6N6J56j38j08kK29j48p0P9R2n4j60J09J31n9j11L9O9j35K8M6NM8J2o4j2
5747a8k0J08l6q4o6J63p4p8O3J66q8j58J53n5M5j11Q1L3m4KmM7pPl3Pj1L4Lq1
5777e6Q5oj2j09N2J67j32r8M7J44q7l1L5J19o5j63J30pM5q3J5J00n7j03O1J4K1
5804B6L0k7o6K6Q0k3p6jQ6n4p3j0J37jj07nJ13j1j32M7P8j1r7M2J01o9j9k2k8
$$ plain form
5616 -55 -123 -7 65 -64 -25 93 -14 -79 -30 0 20 35 53 -23 -87 -33 80 -30 -80 93 123 -15 -145 60 99
5641 99 -16 -114 73 140 -74 -64 75 104 -49 -118 48 31 -43 -34 28 16 -9 13 -2 -34 -70 59 33 -115 -2 124
5667 124 51 -40 84 148 24 -72 -25 152 -28 -56 16 82 -69 -51 21 20 -40 -8 -46 16 10 50 55 -70 15 101 -43 -27
5695 -27 56 131 25 -174 -7 108 -39 -66 66 89 -66 -100 84 58 34 -54 22 -6 -51 51 30 -18 30 78 11 -56
5721 -56 0 156 18 -90 -92 137 -11 -81 -2 90 36 -124 -15 116 57 -54 -15 54 -81 -53 -7 -2 46 58 -6 -18
5747 -18 -38 70 34 -50 -116 47 -27 -105 -42 124 36 -122 31 -24 21 -90 -9 24 -20 -18 -22 25 18 25 -8 -1 -12 22 25 -56
5777 -56 29 23 11 -98 -46 121 -11 -109 -62 82 -5 -36 -1 118 53 -110 20 13 58 -25 -10 90 33 -70 -9 5 26
5804 26 56 29 -37 -11 69 46 -30 -31 55 1 -72 -82 55 54 -53 -58 55 44 -88 -41 37 26 -71 -29 72 3 -16 -38 -66
5833f6O4M2o2q0J48PK4k06Q7J22l7j60R3R8l4q7J6Q1Rm8p0J08Mr2pR1l1L9j09
5862e6P6n7J06p8o2O4O4K6r9nJ33Jj23MJ28m5m2j12Q1J3j7m3J8N9p5J8JL6Pqr3
5893h0R6P8q6r3M4J40q6o1K9N9j9o7k0Q4j1%o5O1l0j7n9L9R4n4P7j42J08n2L7
5922DK1n3R0Pj16j6J06L9j43j3J38n2j02PQ9J4m4Pj0O9m4l8l8J43l4j3l2j0P1
5951D7Jn3M0J0l5k1n8P1J5J8q5N0K9k3p9L7J27j43mpJ05j1k7j02O4L2M8j28N0
5980c2J11r9p5j4J39k3k0n1J33Kp4k1P1J1p8o1N7J43q3n8j4J20q8QKO0k8qq9J36
6010G7o8O1j69P8QM7o4p6O0L3O9j42P8P3o5j2k2P5L2j14P9l3K9k2q9M6N2N1n3
6039A9K3Mj1l8n7J9J02m7o4L5Q8o5j9nJ44k5r1m9mQ3l2j20J09R3n9n4jO1l4l2
$$ plain form
5833 -66 -2 40 -22 -102 46 53 77 -129 -42 80 43 -117 -24 74 40 -47 -31 50 59 11 -59 49 53 -39 -46 45 14 53 -56
5862 -56 20 -37 69 -9 -71 -7 57 83 -16 -21 112 113 -10 -6 122 77 35 -77 4 17 0 -43 -25 34 -41 -23 -22 14 21 13 -80
5893 -80 16 94 8 -85 -41 99 13 -48 -19 40 21 -46 -66 18 7 7 -58 3 -27 -44 -103 -64 30 -24 53 -89 19 -33 4
5922 4 25 -28 62 69 -47 -63 43 82 -61 -74 64 12 -90 -83 6 20 -24 -17 -27 42 -2 -40 -78 65 31 18 -14 -24 47
5951 47 48 -5 35 45 10 -11 -69 2 17 35 -50 0 29 6 -73 -36 91 -52 -56 -63 42 31 4 -98 -34 -2 46 -82 -32
5980 -32 79 -20 -95 -109 30 7 -13 -64 69 71 -3 -24 47 58 -20 -81 -24 119 36 -22 -36 84 -4 4 6 66 38 30 -59 77
6010 77 9 70 -99 -21 -13 34 -30 -106 -46 -13 56 -86 -8 65 0 -12 -34 41 73 -41 38 5 34 12 -77 -31 21 72 19
6039 19 42 46 35 -3 -60 -41 61 14 -50 -15 73 8 -11 -16 128 103 12 -37 -41 42 10 -110 -1 92 33 -21 -22 39 5 -27
6069b7J3L0OM4p7K8K8J6j46P6M5j3j19O1J17j01rKK5L0k6j8l2J03j9n7J2j0Q3
6098F5o5l0R1q5Mn2R8R9j49J9OO8n6p8L0O9lm6jM9J4qJ0j02P7N1j36M1rQ8p3j07
6130a21O3J04l8j36J64oJ1p7J8K3L3j25L7K9Lm2K7L7K7%m0M4j4R4j52KL8O7K1
6159I1j90J13J19J3k06n2K03q5n1N1N4k0l8Pl5KM8o1L2L8L7q6o1Q2L7Jj02R4l1
6188DN5j35L0J45o0r4K8O7l2q1O8M5J2p6k4J3K6M2J7p9l1J18j5l5k2Q5q8Om5M2
6218a4J9j0n3J16l0n8RO0J9j09O3K0j9n5J21o1J0l5P0p4N1n5L0j0r8J61J4r5J5
6247BN8l5n9k6J35n6p0kN4Ol6K9M7j06Q4k4R%o2J01l8Ro5O9r3N3L0k6n8K0P1L6
6279E7j70N3J62j1k27Q7J25q1l5k2N0P2q6K2Ol0jL3j29J3J68N0r6p2J10k8J5o4
$$ plain form
6069 -27 -14 16 22 66 -11 17 45 61 -85 -9 36 23 -96 -35 82 -19 -28 -26 -1 29 3 -15 -47 56 37 -20 -8 -18 65
6098 65 0 -30 61 -24 -20 -72 26 125 -24 -5 1 69 13 -65 -35 34 31 -15 -16 33 47 39 49 -53 24 75 -61 -20 -29 59 -14 -121
6130 -121 -58 46 8 -128 36 30 41 -36 -18 5 38 -87 -50 -21 -18 -60 -33 4 31 31 -9 35 21 115 -37 -35 3 70 91
6159 91 -99 14 133 146 -60 -112 91 6 -45 6 60 40 2 9 -26 -24 24 -37 -5 33 70 -16 -77 5 42 43 -59 35 4
6188 4 59 -76 -46 99 39 -55 -27 40 8 -73 -5 40 52 -24 -48 -35 -9 33 50 -29 -60 58 43 8 -14 71 -17 -11 -56 -14
6218 -14 5 -5 -58 58 28 -30 -21 39 58 -51 12 32 13 -42 79 18 28 -7 63 -11 40 -15 15 5 -93 68 82 -13 2
6247 2 60 25 -34 -60 75 19 -51 -53 1 7 -29 0 47 -59 25 1 10 10 -52 49 11 20 -45 24 -69 -16 14 -12 -70 -50 21 57
6279 57 -113 -60 102 91 -136 -49 76 -5 -40 -62 -12 60 -26 -4 2 -28 -29 4 -125 -112 56 106 10 -62 48 20 35 -29
6307b9M8P8j70O1O7J0l5m9j7J31j35J7N5p8M1OK5j20P6K5K1r2L3N6l6m3Q3P9p6
6336C2r0J11k5l4RP9m3p7K1K6J0j5MOk0J2K7K5j25Q4M6n9j08J06M7j4j04J43L0
6365A04j40J4J2L1r4N8oO3q7J2P2n7J7Rk0j8k8k2J02n1kR1p7j2L2%l5r5J03P2
6395D8r5l3R7L0j08K4P2o3oK2P0k0q4L6O6q5J1j2J20j08K2P8j63N4M4Q8q6n0R
6424b2O7o3n3O0J68j61j12R9P7n2o7J31j4J0n3M2m9l5P3Oj00J6R8l9n0N6R1j31
6452gm0oJ01l6o6M5M2o0N0Mj3Qo3J07Jr1N3L6l4lkn7n3J07N2o1q7P6M4r1L3LO6
6485E8m5lRk5jj9M2lL0o5JJ2K0oj8k2M3M1Np7K5L2j4p3J15j1l2p6N9L4K0j39Q0
6518cP0k1j17P0kJ7o2J7j7N2M5p2N1jl4L0q7R5Q5o6o3J0Q7m2ol2M5j4j10J10j4
$$ plain form
6307 -29 19 97 -73 -12 55 65 30 -19 -36 95 -40 -23 32 -46 -5 1 26 -94 -18 7 28 -64 -31 25 -11 -54 29 108 32
6336 32 -58 53 28 -6 3 82 39 -38 -17 9 19 4 8 14 -6 6 33 58 -67 17 63 4 -104 2 49 35 -69 74 104
6365 104 -36 -22 -10 21 -73 -15 -21 42 -45 -33 39 -18 -1 8 -12 -30 -58 -80 22 -29 -31 60 -17 -29 3 3 -32 -127 -24 48
6395 48 -47 -80 17 47 -61 -37 35 -28 -34 -12 58 38 -46 -10 56 -29 -18 -30 90 -18 4 82 -81 -27 17 105 19 -31 -22
6424 -22 45 -18 -71 -11 157 -4 -116 -17 60 8 -59 72 58 68 15 57 8 -27 46 52 -48 -32 66 27 -23 33 124 -7
6452 -7 -47 -53 48 12 -54 -9 33 -27 23 27 14 22 -41 66 67 -24 29 65 31 28 26 -31 -84 23 75 14 -73 3 47 -44 -11 -8 58
6485 58 13 10 19 -6 -7 -26 16 13 43 -22 -21 -9 11 5 -13 -35 8 49 54 -23 2 34 20 -53 62 51 19 -57 2 36 56 -83 -3
6518 -3 67 46 -71 -1 -3 14 -48 -31 -48 4 49 -23 28 27 -7 23 -64 31 116 50 -13 -3 84 42 36 4 49 35 -75 35 21
6549B1l1M4k8l7j5K3J09j11j9M5m2P6q4J21o3l0K6K3M0p5q7J77o5k9J7P0q3K5
6577A8mJ4L6p4K6l6L7N4j05k7J06K2l2o8M1K7n7k8P2J2l9J5l4%O8n0llQ4o6o0
6608e4N5O3j12L7k3N8j9k0jk2O6n6K1k9M1Qj4o3P6L4j48J00j2J5pJ9j3K9l0k9
6638c0N6k9L6O7l1o3O7m7Jq6K7M5l2n3J36k0p8k4Q8j7j7k7QO2k0m0%N9K2n9j0
6669iP1m3n1n4R2n0Q5l9p0L4LQ5q6K5j3j9K1jL4JJ2p9N4lRo9L0M7J8p8L3Q7n8
6702A9j1n7O6K6or2N9K2k8l7J5P8J9j11P7j3J9j7p8J39n0q1K9M6J8j25O5L3P3
6731I7k8j01P9L5n8Ol3mM8Jn6OJ15p7q7L6O9m8j2nrO3o5K9j0l1M5q2J09K2k4p6
6763d6%J22r2N0l7j2J30j04J1n9M2N2o6N3jM8n2r0P2J9Jl9m8J39q9m6l6Q2J8k8
$$ plain form
6549 21 -10 34 6 -31 -46 -23 86 -25 -44 1 -41 35 -49 72 9 -21 5 28 68 -7 -94 83 18 -11 6 76 -7 18
6577 18 14 28 64 -10 16 -20 17 71 -34 -61 45 67 35 -33 8 35 -22 -50 22 34 -5 10 -24 -24 44 -6 -9 -12 72 6 -54
6608 -54 1 64 -48 -11 -34 24 5 -15 -16 -38 28 -28 -7 -36 5 13 -1 -64 12 46 -102 -2 -14 1 -6 13 0 29 -1 -30
6638 -30 26 -3 33 100 69 6 73 26 27 -59 -32 13 -19 -72 64 44 -34 -58 30 13 -4 -31 -23 39 19 -21 -21 38 60 1 -9
6669 -9 62 19 -32 -86 6 -44 41 2 -68 -34 -31 54 -32 -7 -20 -39 -18 -19 15 16 28 -51 3 0 9 -60 -30 17 35 -43 -10 77 19
6702 19 8 -49 17 43 37 -55 4 26 -2 -39 -24 54 73 -38 39 26 45 28 -50 89 39 -42 -13 33 51 -74 -9 24 97
6731 97 69 -32 47 82 24 30 -3 -7 41 42 -14 -8 107 30 -57 -21 48 0 -12 -17 -26 37 -28 1 -9 -40 5 -77 32 54 30 -46
6763 -46 -46 76 -16 34 -3 -15 115 11 22 -37 5 57 -9 44 43 91 39 -51 21 40 41 2 -46 93 4 -42 -78 4 22 -6
6793fK9o1N8M2j31Q8rK6k8Ok9Q2p0OK8n4Pl4L5L5q9P7l5N3J2p9k6O9M1n5K6l8
6825b4PO8n3m6K5oo0R5J7K6q0PK4O3n2o7M1N3q0O6n2J0L1KJ1m4M2kj28J55o6m
6857b1qP0j4ol0K0PJ1l4pP1o0kK4JJ8L6r9M3k9K4jq4MJ02o5L7j5L9P0k08K4J36
6890E4n7l4M5j5j5m7N3Ll0O3lJ9l9J5K8r6QlK0N5n5O6Pn9k4O1K9r5P5mpRn3K5
6924aJj2l7R3l2k9N3k6k4k6N1L2n9M1Rm8k3O0q8M7MN2L7n4o0J03m1o2n0P7j4l4
6956f0M8L1nl7J5M3r7Q7p2P1l0Q7r6k6k0Q3J6j13Q7M5J1r2k8Q1j3m1M4l2jl8P6
6987B4q0P3m6M6mk2J0O5p8r8J70Ko8j1O4K2j45L3O6K9o4K7J1p5P8n0K2R0q6L8
7017D3ro6L2OJ2lj8K3l2k7L5Q5o3j59J44P5m8l9M4k3l7pJ4J0o1P2K6n2L9L3o5
$$ plain form
6793 -6 23 -38 20 62 -69 19 10 36 8 14 -15 67 -3 3 31 -23 -16 -50 -15 20 -69 8 -27 26 38 -41 -67 2 43 -12 14 -24
6825 -24 -17 51 -2 -48 -23 -29 -89 6 23 49 -31 -24 0 63 11 -56 -15 38 -42 24 -28 -18 13 15 26 -18 24 22 -106 49 -17 -21
6857 -21 -29 41 27 21 -9 11 18 29 -5 -12 59 -1 -3 21 22 40 76 -23 20 -9 15 14 -70 -66 36 -29 8 -7 32 102 -106 -82 54
6890 54 -3 -37 8 -7 -22 -69 -16 -13 -43 20 17 36 -3 12 40 -56 -48 -51 -31 24 -31 35 42 -17 -41 20 49 -46 29 25 18 27 -26 -1
6924 -1 0 -12 -49 44 12 -17 36 10 -14 -40 11 43 -16 25 34 -14 -37 23 -65 -18 -14 38 75 21 -39 64 23 -39 -89 -12 -26 -60
6956 -60 -12 19 14 -23 -8 35 -62 25 -47 24 -6 81 -15 -41 -61 22 38 -75 12 57 68 -24 -52 29 16 -25 19 -13 -14 -52 24
6987 24 -56 17 -29 17 13 -9 1 66 -12 -110 60 62 -6 -17 47 69 -76 -43 23 52 -12 15 26 -49 29 -21 1 91 5 43
7017 43 34 -32 0 6 18 15 -3 20 -12 -39 -4 81 18 -141 3 78 30 -9 35 12 -25 -32 -18 -8 -69 3 29 -23 16 49 -16
7048a6L8k0J5k7%Q6l4j08KJ25l4l8j9j0J03r2qP4q0L5k8P2J7l7Pn6L8j8%O6j58
7079a05Q1P8j18K3qR5Jm5mJ17o8p6K5Q7o8k3OJ06j19K4l7N5L6n3Pq2Q2K6j5M4
7109G2m3M3j10J1J4M3l1p8N2K3l5j9J9J09k1q6J17p1QPj9L5j8Kj1o7PJ01r7K6
7139a7K9K5o2L7oNN3j35Q4M7j33N5jJ0M0n8K9O0r4N3o6N8Lm6P8k2j4L7l9j3L1
7170B8K9q1nK7N6L7p4m5Q8nj08R7j2l6o7JJ27q3K9j3l3K8N8m1o1J05Mm1k8rM9
7201B1M6j08M6K9l8MlR3m0n2Mp9O5jK4oj5K5JK2LPl3m5O4J7k9p3P2J4J7l8p4J00
7235D0Oj78R8J7P8o2pM3p6R5k0j1n9K3Q2l5p2J02n8n7l5J08no7J5L4L1p7J1O5
7265B9j0o4N5pN4Mk0L4j04K6K7n2k6O2L2o8kJ21p9L1n9Q6J5l7j04K6P6o9j9k0
$$ plain form
7048 -16 22 2 17 -10 -10 76 42 -66 -64 61 27 -11 -30 -40 63 -29 -37 37 -43 -8 -36 36 53 16 23 -33 5 -13 -13 53 -105
7079 -105 -24 54 -64 -41 -49 46 47 2 -2 115 47 -29 -4 83 15 -8 -2 104 -15 9 -28 27 63 10 17 -65 17 43 28 72
7109 72 29 72 -38 -27 -13 30 -1 -79 -27 -4 -39 -58 -39 70 49 -37 80 9 17 24 5 40 22 24 13 -54 -47 54 -43 -17
7139 -17 12 37 -25 12 6 11 64 -71 13 60 -73 -18 -19 -9 31 -27 2 62 -32 21 -45 13 16 -30 48 26 12 49 10 -3 28
7170 28 57 -24 -29 -2 54 91 17 -28 60 55 -53 44 32 -4 -71 -70 57 -26 3 -10 -43 -15 43 2 -59 46 50 9 -19 -28 21
7201 21 67 -41 5 34 -4 0 -3 90 50 -2 2 -77 -12 -13 11 5 -10 15 16 38 41 48 15 -30 34 51 22 -51 21 35 52 14 -60 40
7235 40 46 -132 -34 -17 61 -1 -8 35 -41 54 34 23 -36 -13 69 34 -38 64 6 -51 -86 22 17 -50 -35 -1 30 -47 -36 29
7265 29 19 -45 10 3 57 61 41 75 -29 -3 24 -28 -54 8 40 -28 -30 91 12 43 -16 70 85 48 -56 -30 46 -23 -42 -62
7295f2Q7m2k6R3l7o3M0O8j1l7J7n7K3J2l8L3l7R2q1K3j6L6K2k7j09P1P0j4M2j04
7325c2J32j32nm8J15l5L0m3%J29m2r9M3K6n4k4O8Ml2L6l2k0j7j2nL9M2m6pJ4L2
7356B5ol2Nl0QMN8Nj9o7J14j38J00nqo4M7j0m0L7J6J5m8K7J0J7p5LO2l0M9K4j6
7389C8l5m0Q5j41N6P0k0k4L3j2rK5j6l0P7r0J7J8M9p7o3P9M2n8oOKJ4Lp6P4qP5
7422E8k4l7rMjn2Q2N7r8M6J0m6nk1K6OK8o0M5j0J2m1K0k0P4j06K3J5KN6n9MN2
7455C1P7q9NM8r1K6J7n8K4N6n5K2l3O6l0j8m6j7J00j0j5o1J19p4m6Q2m6K6p5P9
7485A4k0RQk2N0j23N4N5m3m7K7O3J7m2j5KMJ5j6J6j8Oj7M1%%k6N1k0j3mp0N8L8
7519C2J2j3n3N4m3LL2j6j9P3n7k1M3r3R7p2N1J2j1Ll0rL4J1J8L7o3kMrNJ8j15
$$ plain form
7295 -62 25 -17 -43 50 13 -50 -10 58 47 10 27 -30 -7 5 -33 0 -37 55 -26 -3 -19 17 39 12 -97 -26 44 30 72 -32
7325 -32 100 -32 -37 -85 30 -5 25 -18 -18 111 69 -30 13 39 -15 -39 29 33 1 37 5 -15 -32 -44 -49 -10 32 -14 -21 -7 25
7356 25 19 -13 -8 -38 -30 -26 32 37 18 -49 65 -73 27 22 14 -50 -3 -13 -53 -16 0 15 -33 -6 4 21 -54 -51 11 -19 30 54 38
7389 38 3 -37 48 -93 -37 33 13 -11 22 10 1 26 10 -20 57 -33 -16 2 51 -26 -89 -10 32 -26 -32 -26 -24 -10 -7 -83 -9 -17 58
7422 58 34 -3 -12 -8 -9 -61 21 78 -20 26 36 -10 -15 -36 -10 -4 24 -36 9 -1 11 -30 -10 -30 44 -62 -39 -24 -22 34 -25 -21 31
7455 31 108 19 24 72 -19 7 24 -34 -10 46 -9 13 -20 46 16 -2 -48 -65 35 25 10 -51 68 -6 -52 30 -16 10 -65 14
7485 14 -6 3 11 -11 39 -84 -30 25 -18 -65 -38 25 42 0 -15 -13 -9 6 -10 6 -12 -6 -23 18 18 18 -8 43 23 10 6 -64 -6 32
7519 32 44 31 -22 32 -11 -8 24 8 -11 62 5 -16 27 -66 31 -41 10 22 11 14 -16 -25 9 20 38 75 12 10 14 5 10 28 -87
7552h7L8M6j9L0k8J1K2L6m0jj6lkL6l3l3J08q4kO1m6Lk9J2K1jL3j2n5O4m6Pjq
7586a8m1J28o8o0M3L3k9O%lQKM4o4N1n2K5JK5p6P5l1l9Q4p0O3o5N8k7n8J05r5
7618d5K2M7J8m0k2M0J3r3O6l1NQ8o7j2o7K2J21r4O1m7jj5P8m7l3K6J0m0N8j4L6
7649D3q7K3L0k1K1j6jJ9r9Q1N8r6N3l6l6k3M3O8q4K4L3k5%QM6k9l6k8N3N0p2K8
7681hK1j3l6L5M1n9P9L4j09j8%M0l1l9J15k3o0LN9k4p3L9j5K4J1j2J3K9Mp4P6
7712B9m5M0ll3k2N0j4Om3J08l5n5N3j02J00l2j5R6k6r8N2J0M5n5p1R6jn6%Q8j10
7743d3pJ00o0l1%M3J5j39J21J2o7P7K4n0n0M9J4m4J3k2M7NK1j6j0M4n0LrN6J3
7774E9K2q7J7L3j2l8Ml2N7Nj09M2Q1r9K4PN3k3k6N3Nl0Mqm7K4J03j43P2Qk6L6
$$ plain form
7552 -87 -49 -3 -22 8 -20 -9 13 49 9 8 -8 -11 -13 23 -10 -43 65 -19 -21 40 -6 -3 -32 -20 1 0 33 21 -34 30 -16 -9 -10 -18
7586 -18 -59 69 1 -59 -16 17 -12 -6 -6 -9 -1 1 45 -19 32 -20 5 6 31 -45 30 -1 -40 44 -26 37 -28 30 3 -55 50 -45
7618 -45 -23 24 42 2 -20 20 33 -60 6 -25 -20 68 1 -11 -78 -56 65 -29 32 -15 -16 -31 47 0 -33 -7 3 -37 21 7 43
7649 43 -44 -21 9 -12 9 -7 -8 11 -88 -7 51 -45 8 -28 -64 -87 -44 24 -60 -36 -3 -28 -28 -20 26 -3 -39 -67 -14 36 -36 -8
7681 -8 13 0 -36 -1 40 -19 60 94 -15 -33 -33 7 -24 -63 52 29 -31 -28 31 7 -66 -27 -42 -18 -7 -19 -6 23 27 -47 29
7712 29 -16 24 21 -12 -34 16 2 8 -35 73 38 -17 36 -66 34 2 -13 83 57 -41 11 21 66 11 -60 36 35 -21 -21 67 -43
7743 -43 -50 50 -10 -41 -41 2 17 -122 -1 11 -56 21 45 -5 -55 -6 8 -36 -23 -45 2 7 28 12 2 46 -4 -1 -10 46 59
7774 59 81 -6 11 44 32 -6 -2 -34 23 28 -81 -39 42 -57 -33 -26 27 4 -22 31 36 6 10 2 -45 -21 82 -61 11 19 -7 29
7806B9n6M7l1J01j22j8O8k6j2L5K3m7m4N4lKM9j07Q7Klo5J9KPQ4j09P4ql8K9L1
7838E4J0q9K3MOK6r7J00o2N6k7l4J6J0l5N9N1p8k3N6m4P3ko1Mn6J09m6k1ORoo1
7871g0N9Q0m2oL2ol4n5L9RJ0%J8l4qORn3oRN6n1l5R2N0n3k0L5j6k3kN6%m9O4m8
7907A3Lk7K6l5M1p0lM1O6n6ml6K5O6q6M9l7J2N0l6k7Q3n6J3J3o0K0O1k5l3N2o9
7939b6NN5k7l9M7Nk9KO1p4PO0m6L9k5k0k1K1q9R7J9k4O1n3Mk0Q1p2JM8l1Ml7K7
7973A1l3l1J8J0K5J6KjMk1o9P5k1L0k1JJ4l3M6j9l6Q4q0K1l5Q1n8L9kl5QM7o9
8006c2K2j4M9j6l1J7l9M4L4m9M6l5lM3k3j7K2k3J5o3Mj7N5Pk4K2N1p3o2O0K7N1
8038D8n4Lm2J00l5l7l1O8l7J7l1M4k1J3lk8J7n0P8n8L7L9l5Jj5N7o1l9P9MJ5o
$$ plain form
7806 29 -27 20 -11 90 -32 -50 18 -8 -20 15 38 -9 -53 1 -2 0 49 -58 29 31 28 -37 -18 -16 -9 75 -34 40 32 -6 23 54
7838 54 64 -25 -2 2 8 34 -63 37 -25 31 4 -30 -14 -4 -39 20 71 -7 -30 26 -18 55 53 -8 -4 -60 49 3 -18 -12 -3 -9 -70
7871 -70 -11 69 27 21 53 47 13 -42 -3 6 16 16 34 0 -8 -2 7 -46 -52 -43 13 -38 -73 19 69 16 -4 31 15 -8 -10 46 46 -3 61 13
7907 13 16 -11 15 -20 21 -49 -52 -11 55 -1 -5 -41 -16 50 -36 13 -24 -12 38 2 -25 58 2 15 28 -32 -12 49 24 -9 43 -26
7939 -26 -21 34 7 -32 15 20 -9 -7 54 -20 -13 47 1 40 15 -5 -26 -5 -94 3 22 -2 59 6 10 -10 71 -1 0 48 17 21 -16 11
7973 11 -22 -53 -35 -25 0 16 18 17 21 0 -69 6 -15 15 -6 -5 9 -24 22 3 -33 51 -29 -8 -43 38 -20 19 17 -18 -10 37 -32
8006 -32 -10 -24 25 9 -22 -5 -44 0 34 -15 31 -4 -7 36 13 -4 18 -5 10 -53 -49 -66 -11 -4 -28 -6 45 -28 -90 -30 -3 48
8038 48 -6 -3 -45 55 20 -17 -48 20 -17 0 -31 13 -8 5 2 -26 -9 -59 19 -39 -2 37 2 3 -12 45 -16 -55 24 28 43 37
8070C7l9MM0kKj4m4K5l0OJ7K6o8O5n5N2k7J2kJ0j9oJ6j3M1n8J7N3j1m0m6M2K7
8103A8J3o6L4Qmn4N2O5n0k2j7J0O7j08J3M9m1L0K2j3L5j09P3o7M6K4K2m4LJ0l2
8134c3K8L4k7k3M1J6m2rMJ7J5K0p1oNl3N1m3Q7n5L9rMK7p5L8m9K8Q2j12N5o7N8
8167eM3n0j2P8o1l7K7k7N8m1K6K6Ml9K9j3nJ7K0m3K4m3J4Q8
$$ plain form
8070 37 -2 2 42 40 42 28 -16 9 -21 -15 2 28 -40 25 -30 22 -5 7 5 15 -4 -10 6 -7 34 -24 -7 46 35 -5 -51 -9 18
8103 18 31 -35 -1 7 3 -51 1 66 16 -6 -23 -13 54 -54 -41 8 -33 -3 19 6 41 -68 5 -62 -16 8 30 -14 -11 -1 -33
8134 -33 -5 29 2 -21 20 36 -6 -15 -11 6 21 41 -30 -36 -31 -64 -13 -56 31 -24 15 6 10 37 -38 0 -49 -21 61 -51 4 -63 -5
8167 -5 38 -12 -24 54 -7 -44 -17 -44 14 -27 -1 25 29 -10 19 6 1 18 38 -5 19 -24 -10 78
8191G8
$$ Imaginary data points
##PAGE= N=2
##DATA TABLE= (X++(I..I)), XYDATA
0@%%%%%%%%%%%%%%%%MrJ3j6J6j6J6j7K2k8L1l3L7m2M8n4N9o7P4q1R2j02J11j23
40f5J37j52J68j87K07k30K57k87L22l62M12m72N49o50P85r78J272j774K786n549
60c811K5720Q4875q0476j19352J9655Q6016j856m5094K5141N3341j4187l5726
72e754K7397M9772j0678m4451j2834P382j1354j2817J0123J1722n667k337J1631
85A2135N661m075N499P791j6770l0718n019K1576Q667j7964j5211O816J5310Q050
99A748k81p894j0198O358K6342J1939k5250k4760J8509L2533r018l5373m794K0016
113a23m483j8110J7396L3133j2293l8837O804M2721L942l5899j0064J8814m048
126a047j7424J8903L2442j3067l5116O918L1247m069k4683L865J2632j9032j9412
$$ plain form
0 0 0 0 0 0 0 0 0 0 0 0 0 0 0 0 0 0 4 -5 8 -8 8 -8 8 -9 13 -15 16 -17 20 -22 26 -28 31 -36 38 -43 49 -53 58 -65
40 -65 72 -80 88 -99 108 -122 135 -152 170 -192 220 -252 297 -353 432 -546 726 -1048 1738 -3811
60 -3811 21909 106784 26308 -93044 -73389 12627 10771 -34323 -9182 44159 29972 -5754
72 -5754 21643 71415 60737 16286 3452 10834 -520 -13337 -3214 8508 2841 504 12135
85 12135 17796 13721 19220 27011 10241 -20477 -25496 -3920 4747 -13217 -28428 -21612 -6302 1748
99 1748 1467 -6427 -16625 -10267 16075 28014 2764 -21996 -3487 29046 20028 -15345 -20139 -123
113 -123 -4606 -22716 -5320 27813 15520 -23317 -16513 26208 30150 -5749 -15813 3001 -1047
126 -1047 -18471 432 32874 19807 -15309 -8391 22856 18787 -5896 -2031 10601 -8431 -27843
139b7843K2945K8378j5220k8934M087J6102n011n779J2423K735j7874p05K6827
152A2131J1808j6551n804J3487n356k3211O755L3127o14l9677j0875L9368K4839
165C9427k8040l1122R503J8262r754j3895R863J0661j1548q176J6872J2994j5337
178b90j7030Q451J1612q528r411P841O043p865m52J1351n002k1078O19K1880j504
193c363k7142k067L0428J0738k1825p270K1470Q304j5348k911J3490k716j2383
206a0595J3912K5374q518k7611M875K8916R57k5926q181J1765j0p120J0803J2792
220B1433j3573j8822J0023J9731p415k0478J419J4105r72p783P038J0108o515
233H299r378M667K896j2897p561J3292R219j4708j2688J3248J5639q576j4270
$$ plain form
139 -27843 -4898 23480 8260 -20674 -16587 -485 -5496 -11275 1148 3883 -13991 -14696 12131
152 12131 23939 7388 1584 15071 9715 -13496 -6741 26386 25772 -13905 -24780 14588 39427
165 39427 11387 -19735 -10232 8030 -1724 -15619 -5756 4905 -6643 -14819 2053 15047 -290
178 -290 -17320 -8869 2743 -5785 -15196 -7355 -1312 -9177 -9629 1722 -3280 -24358 -23739 -1859 -3363
193 -3363 -30505 -32572 -2144 8594 -13231 -20501 969 9273 -6075 -8986 4504 1788 -10595
206 -10595 3317 28691 20173 -7438 -2563 26353 27310 1384 -6797 4968 4958 -2162 8641 21433
220 21433 7860 -10962 -939 18792 11377 -9101 -7682 6423 5451 -2332 4706 14814 8299
233 8299 -1079 3588 6484 -6413 -13974 -682 8537 -6171 -18859 -5611 10028 1452 -12818
246a2818M240O331r804m901J7035J1523j4535j0106J8949J7057j4359j7568J0167
259A211J3421j1513j2214J3185J3229j1958j1138J2855R342j7525j4905J2042
271c968J1693j2001j0424J2521J1633p363n195R228J358j3459k071J4394K492
284H838j4037j160J6002M014j2156k374Q667m743j3651M502J4618n518j6253O586
298f665K1123j216j8201M06J5948j613j5617K452J6116j456j3792M774J6788l995
312A5052j9089j71J4491l548j8699j797J4377J457j1423J74R071m403j1435L859
326a2084R958p073j2567P358J6376j607j1337L438J0438l660q795L810N166q086
340h665n061J2659R316j1159r427J1208R746j0637r297J0002P034j1170l979J8315
$$ plain form
246 -12818 -8578 -2247 -12051 -16952 83 11606 -2929 -13035 5914 22971 8612 -8956 1211
259 1211 14632 3119 -9095 4090 17319 5361 -5777 7078 16420 -1105 -16010 -3968
271 -3968 7725 -4276 -14700 -2179 9454 2091 -3104 6124 7482 -5977 -8048 6346 8838
284 8838 -5199 -6359 9643 13657 1501 -873 7794 3051 -10600 -6098 8520 3002 -13251 -6665
298 -6665 14458 13242 -4959 -4553 11395 9782 -5835 -3383 12733 11277 -2515 2259 19047 15052
312 15052 -4037 -4208 10283 6735 -11964 -13761 616 2073 -9350 -9176 -105 -4508 -15943 -12084
326 -12084 -2126 -9199 -21766 -14408 1968 361 -10976 -7538 2900 -760 -9555 -5745 -579 -8665
340 -8665 -13726 -1067 8249 -2910 -12337 -1129 8617 -2020 -11317 -1315 5719 -5451 -9430 8885
354H885J0923j5102j0575J5050J1916j3831j2474J1369J0210j2021j0184J2028
366F194J0874j0192j1208N055L122j0458m338J0735L308j2091m072J2649O217
379E795q144k890O877k839j1301L615J6373J150j4366k340J2616L055r139q04
393b342N948o247j0835O561J4341l594j2881M644J3929m117j3553M479J4259m203
407F389j4605L841J5764n24j1584L528J1787o228j5825K378J4078k405j5052p18
421i176J1974J636p703J058N378n689p164O762Q242p440q234J0732J4172n203
435I345j2219L507R977k712p243K943L316p237k777J1735O947j1181r817O608
449A192O007p918n071Q340L696r973l081J2758O065j0470n350Q646J027j3591
$$ plain form
354 8885 19808 4706 -5869 9181 21097 7266 -5208 6161 16371 4350 -5834 6194
366 6194 17068 6876 -4332 723 3845 -6613 -10951 -216 3092 -8999 -13071 -422 5795
379 5795 -2349 -5239 1638 -1201 -12502 -8887 7486 8636 -5730 -8070 4546 7601 -1538 -2342
393 -2342 3606 -2641 -13476 -6915 7426 3832 -9049 -4405 9524 5407 -8146 -3667 10592 6389
407 6389 -8216 -4375 11389 10865 -719 2809 14596 8368 -7457 -5079 8999 6594 -8458 -9176
421 -9176 2798 4434 -3269 -2211 3167 -2522 -9686 -2924 5318 -2122 -10356 376 14548 9345
435 9345 -2874 633 10610 7898 655 3598 6914 -323 -3100 8635 15582 4401 -5416 1192
449 1192 7199 -719 -5790 2550 6246 -3727 -6808 5950 12015 1545 -3805 4841 5868 -7723
463g723l408J5470P133j4002j0639Q049Q273m728m614J685m723r842M162J5506
477E99K005j3087k964J1595L540q384J02R996j187j1747J386J5361M532r968k834
492a055Q013m17r695m4R782l23j0441r72R444K410n806K28M400l995o762M377
508h56P851l756p672N043R600l477r690J822P558l424q797R73N151l622n196N523
524b969O614n461p758L383N129n177l902Q483N998r184o829J2020J2756o605j1704
539e206L243O975n285m894R798P335j1572j1085R488J3064n948j2259J389N726
553G69m547l530Q654O391p647o283O762N657n404k833O371L21r688j407J1650
568E236N179q324n197L941M86m791K258N768m883r657M479J3077J89j0224k52
$$ plain form
463 -7723 -11131 4339 11472 -2530 -13169 -5120 3153 -1575 -6189 -4504 -9227 -19069 -14907 599
477 599 2604 -10483 -13447 -1852 1688 -6696 -6594 3402 2215 -9532 -8146 7215 11747 1779 -1055
492 -1055 6958 6541 -3154 -3198 6584 6261 -4180 -5152 4292 6702 896 1124 5524 1529 -5233 -856
508 -856 6995 3239 -4433 610 10210 6733 -2957 -1135 6423 2999 -5798 -4825 326 -3296 -8492 -2969
524 -2969 3645 -1816 -9574 -6191 -1062 -6239 -10141 -1658 4340 -4844 -11673 347 13103 6498 -5206
539 -5206 -1963 5012 -273 -5167 4631 11966 394 -10691 -1203 11861 5913 -6346 -4957 769
553 769 -3778 -7308 1346 7737 90 -6193 569 6226 822 -2011 4360 4681 -5007 -6414 5236
568 5236 10415 2091 -3106 835 1321 -3470 -1212 4556 -327 -9984 -5505 7572 7761 -2463 -2715
583b715Q920j26p637J544Q491j578p926L172J0271j523j0893m61R457o20j1459
598c083k941Q777K405q017k370P096J547p649k377N974P92o271K55O617p01o493
614f439K742R091j324r458j050N869q93m104L881L589p374n554R810R168q137
629a83j0042N614P393n947m149J0623O954j0161o785J1118Q944q725p569P338
643D423M435r861m621J1677P159j0161r291N265N749m850m608L503J387n688j448
658f930O881L973m385l262K692J188l115m55L835Q59l396k81L479m7l525P41L761
675B013k722p063P05P810N72o857M88Q518K36q979j45R988J042r726n41J0463
691E802R78r678Q34J1506m57j3116k446J0226Q89r504l12Q329j453q505K074Q356
$$ plain form
583 -2715 6205 6079 -1558 -14 8477 6899 -1027 2145 12416 10893 0 -461 8996 8376 -3083
598 -3083 -6024 2753 5158 -2859 -5229 1867 3414 -4235 -6612 -638 154 -6117 -5862 755 54 -6439
614 -6439 -3697 5394 4070 -5388 -6438 -569 -1462 -5566 -1685 1904 -5470 -11024 -1214 7954 -183
629 -183 -10225 -4611 2782 -3165 -7314 3309 10263 102 -6683 4435 13379 4654 -2915 4423
643 4423 8858 -1003 -5624 6053 13212 3051 -6240 -975 4774 -76 -4684 -1181 206 -5482 -6930
658 -6930 -49 3924 -461 -3723 -1031 157 -2958 -3413 422 1281 -2115 -2396 1083 1036 -2489 -1748 2013
675 2013 -709 -7772 -7067 743 1315 -5542 -5054 3464 3700 -5279 -5424 4564 5606 -4120 -4661 5802
691 5802 6780 -2898 -2064 9442 8985 -4131 -6577 3649 4538 -4966 -5278 3051 1598 -6907 -4833 3523
707C523k290p670K158N977l429m545O201O697m411n066M551M051m727k398N453
722D075J339o997k097P298L048n916k447N066P88o375j343O541K159n620j918
737b399O142L147m852k573N136K582o199m631N079M791m742n514M239N022m949
752B79p057K601N167l526m933L526M045m241k989O272M458n265l845M825K364
767A681m849N53P784J58q376l85Q451L03p441Q82O486l981q926M344J1113k186
783E611j0253J245Q225j826o564L878P184m431q287L556Q948o99o695l91L863
798C364j276m124R3K395n32k196m93K15m24P57J372j137k586J18K993P57k275
815b979K47M403J810m137k742M399M053l771m917L254M870l898n639M142O776
$$ plain form
707 3523 1233 -6437 -4279 1698 -1731 -6276 -75 6622 2211 -2855 1696 5747 1020 -1378 4075
722 4075 5414 -1583 -3680 3618 6666 750 -1697 3369 4157 -2218 -3561 2980 5139 -481 -2399
737 -2399 3743 6890 2038 -535 4601 7183 984 -3647 1432 6223 1481 -4033 206 5228 279
752 279 -6778 -4177 990 -2536 -7469 -3943 102 -4139 -7128 -856 3602 -1663 -5508 -683 1681
767 1681 -3168 -2615 5169 5327 -3049 -3434 5017 5320 -2121 -1239 5247 1266 -7660 -3316 7797 5611
783 5611 -4642 -3397 4828 3002 -3562 316 7500 3069 -5218 -1662 7286 6587 -108 -499 3364
798 3364 2088 -2036 -1943 452 -80 -2276 -2769 -2554 -2978 -2221 -849 -1986 -4572 -4454 -1461 -704 -2979
815 -2979 -2732 1671 3481 -656 -3398 1001 5054 1283 -3634 -380 4490 592 -5047 -905 5871
830E871l615p841J524N980k175m246L867M298n345m503O843O536n641o408M586
845b69M681n173l743O274M016o684m936N184M338m190l918J966J213k131O62L081
861C71p15k135K333K620k883j810M811L290n185m112N801O087l954o134K486N078
877E949k769n289J908M765k809o245J644O824j45o745j252N624J230n153q59N742
893B420J031n853j091O586J864o548k672N911K136o661l211N603L560m427l202
908d554K445J724j718K85J831j270j559K892K402k690p78N205J806o097k392O593
924D125L072o624l269O608K783p639m069P241M661o790n958L967M225l124k288
939c079M043J704m922k078N296L294m047l045L036K043l357j609M178K240m141
$$ plain form
830 5871 2256 -5585 -4061 1919 -256 -4502 -635 3663 -1682 -6185 658 7194 1553 -4855 -269
845 -269 4412 -761 -4504 1770 5786 -898 -5834 -650 3688 -502 -4420 -2454 -1241 -3372 -2710 371
861 371 -344 -2479 -146 2474 -409 -2219 2592 5882 697 -3415 2386 8473 4519 -1615 871 5949
877 5949 3180 -2109 -201 4564 1755 -4490 -2846 3978 3833 -2912 -4164 1460 2690 -2463 -3322 2420
893 2420 3451 -2402 -3493 3093 4957 -1591 -4263 1648 3784 -2877 -6088 -485 3075 -1352 -4554
908 -4554 -2109 -385 -2103 -1818 13 -1257 -2816 76 2478 -212 -990 4215 6021 -76 -2468 4125
924 4125 7197 573 -2696 3912 6695 -944 -5013 2228 6889 99 -5859 -1892 2333 -791 -3079
939 -3079 964 2668 -2254 -4332 964 4258 211 -2834 202 2245 -1112 -2721 1457 3697 -444
954d44l599K260K545j888j618J764Q79k622j204L109K355j213r29Q30o89j231
970a695K954L949k139n247J207N474q60n137Q13M801k389o687J377O933q85o976
986d507j12N942n11n754J093O318p17o062L74N821N27m158O47L948j542m314J679
1003a328M573j261m582M01L238n12k324R34J674j647j240K339J161k699m13M328
1019B642J463m242j679M389K359l742j919L761J040n206j759N656K563o315m542
1034e531M288M251l674l866L097K848l425k676L790L365k742k619K743K057k524
1049f18j049L806J435l879k291L025K216j927j088J291r09k684J441M065q86m523
1065b575n4M115M49k676R73L071j730l515K436M603j965n163J323M964j430n327
$$ plain form
954 -444 -4043 -1783 762 -1126 -2744 -980 -101 -2723 -3927 -818 1537 324 -605 225 -464 -1695
970 -1695 1259 5208 3069 -2178 -971 4503 3643 -1494 -681 4120 1731 -4956 -3579 3354 2469 -4507
986 -4507 -4619 1323 812 -4942 -3849 2469 1752 -4310 -3936 1885 2412 -1746 -1099 2849 1307 -3007 -1328
1003 -1328 3245 1984 -2598 -2197 1041 529 -1795 -861 813 -834 -2074 265 1426 -1273 -1686 2642
1019 2642 4105 -137 -1816 2573 4932 1190 -729 3032 4072 -1134 -2893 2763 5326 -989 -5531
1034 -5531 -1243 3008 -666 -4532 -1435 1413 -2012 -4688 -898 2467 -275 -2894 -151 1906 -618
1049 -618 -1667 2139 3574 -305 -2596 429 2645 718 -370 921 12 -2672 -1231 2834 1948 -2575
1065 -2575 -2629 1486 1935 -741 232 3303 1573 -1942 494 5097 3132 -2031 -708 4256 2826 -2501
1081b501P19M877j102n420O9M306m05m191M63L828n76l753J061M024l12l291O03
1098a601L178j18k304Q85K054j110j429J654J089k584j625K618J743k915k262
1113b727K468J950k248j129K901R38l866j150M800K396m226k940L896K983l153
1128H93k569K901J893l894k721L463K508l609l071K901K716l077k580K743K682
1143A179k474k413K251K563j199j048J787R27j793l45K270M43k248n50J704k5
1159A029j566Q07J548j949k698K078L216k054l925J682M444r57l964J163M181
1174C035p78m082P40M151r30m119Q02M129o63m592J62L924j37m279n00L329K04
1191C96k803M56K861m20k716R66L420l84k989K11K874K33j582M37J046j049p32
$$ plain form
1081 -2501 -1782 3095 1993 -3427 -3358 948 543 -3648 -3185 643 67 -3686 -2625 1399 1087 -2204 -1601
1098 -1601 1577 1459 -845 40 2094 984 -445 1209 2298 -286 -1911 707 2450 -465 -2727
1113 -2727 -259 1691 -557 -1686 1215 2153 -1713 -2863 1937 4333 107 -2833 1063 4046 893
1128 893 -1676 1225 3118 -776 -3497 -34 2474 -1135 -4206 -1305 1411 -1666 -4246 -1503 1179
1143 1179 -1295 -3708 -1457 1106 -93 -1141 646 1573 -220 -565 1705 2148 -100 -650 1054 1029
1159 1029 -537 270 1818 -131 -2829 -751 2465 411 -3514 -1832 2612 1655 -2309 -1146 3035
1174 3035 2257 -1825 -1085 3066 2136 -1983 -1181 2948 2285 -2307 -2145 1779 1642 -2637 -3137 192 396
1191 396 -2407 -1951 910 490 -2226 -1260 2160 1776 -1213 -1002 1872 2105 523 960 2006 957 225
1208B25J563K91k752r53K731O80l567j010L778J375l878j642L842J530l959j591
1224c337M299K365l976k487L940L032l253l246K087K403j981k171J516J460j673
1239a022j053J975R36k546j091K607J575k083j407K265J817j159n67J878L40k293
1255A72m51K461N80k467o35K050o1k138O34K158j737l474J330L598j416l976J786
1272a586M609j459m721J350N173q99n129J36M386j2l312N06K800j192l020R68
1288a402K694j418k860P57J873q09o39J892P17k326q96K769J792k100j810J727
1304c9J693r07n35J471L48j880r01J520L18j898o36J890M70k386p44K963J560
1321B307k972k289K402K294k266j806L157K822k839l018K729L324k362l604J533
$$ plain form
1208 225 1788 2079 -673 -1626 1105 1785 -1782 -2792 986 2361 -1517 -3159 683 2213 -1746 -3337
1224 -3337 962 3327 -649 -3136 804 3836 583 -2663 -576 1827 -154 -2325 -809 651 -1022
1239 -1022 -2075 -100 836 -1710 -2801 -194 1381 -702 -2109 156 1973 814 247 2125 2465 172
1255 172 -279 2182 2762 295 -340 1710 1649 -489 145 2303 566 -2908 -1578 2020 604 -3372 -1586
1272 -1586 3023 1564 -3157 -1807 3366 2467 -2662 -2526 1860 1848 -1464 -958 1842 650 -2370 -1402
1288 -1402 1292 -126 -2986 -2229 -356 -1165 -1804 88 805 -1521 -2417 352 2144 44 -1766 -39
1304 -39 1654 747 212 1683 2031 151 -750 770 1088 -810 -1446 444 914 -1472 -2216 747 2307
1321 2307 -665 -2954 -552 1742 -524 -2330 827 3649 810 -2208 521 3845 1483 -2121 -588
1336e88K706j728k059J716J577j666p30J598o45k772P80L739l84l591M31L439
1352A823k33k377J648K543k755l834K210M107j341l407J085K221k221k218K407
1367c42K358k745l231J524K432p69j109J913J740k195k490J317L223M81k317j331
1383a541J052J460P8j54L71k31j564r27R68J124k79m58J59k13m42J095J310r03
1401I05j461J109J102j647j293L023K535k761l007K254K328k728k213K818J466
1416B430l954k257M029K467l507k075L192J154l964j390M040K049l065j463K650
1431C36J069j866j22K026l18k472n88J351O39J63M64n45j836r5K028L48j887o80
1449a985J439N04r31K84J938N58j500j092R71J221p33j285O43J627k57k194J72
$$ plain form
1336 -588 2118 390 -1669 47 1624 -42 -772 826 181 -2591 -1811 1928 1544 -2047 -1616 1823
1352 1823 1590 -787 861 3404 649 -3185 -975 3132 1791 -1616 -531 1690 -531 -2749 -342
1367 -342 2016 -729 -3960 -2436 -4 -773 -1882 31 1771 -424 -2914 -1597 1626 2107 -210 -1541
1383 -1541 -489 971 1049 895 1266 1035 -529 -1456 -488 636 357 -101 58 -155 -597 498 1808 905
1401 905 -556 553 1655 8 -1285 1738 4273 1512 -1495 759 3087 359 -1854 964 2430
1416 2430 -1524 -3781 248 2715 -792 -2867 325 1479 -2485 -3875 165 2214 -851 -2314 336
1431 336 1405 -461 -583 1443 1125 -1347 -1935 -584 55 218 682 137 -1699 -1794 234 582 -1305 -1985
1449 -1985 -546 -42 -973 -689 1249 1807 307 -785 186 1407 674 -611 32 1659 1402 -792 -620
1466f20K515J19l239j031K838O38k878m84L433Q56l106l31L528J19l808l39L955
1483B165N25l280n48K941M15j886K65J122j941j923J594J578j766j008J999N70
1499H22k334j04K816k64l225j07L250L8k953N99L610l7l483o78K755M02k495p90
1517b178J888O24j534n40J611R33j116j354O17J033n84j070R48K267K17j662k79
1534a79J508M85j100j56M91o97r89J123J692m79j252J18q1j314K08J861l49k337
1552a447J86K851o8k227R16K627j705l744J350L794r23l473J213L127j533l338
1568b394J441L205j921l664Q59K907o85k080J300K195j048j922O82J433n79r18
1584a189O90P62l58j53P11L17k68k29o1r42q17O83J337n2j185k08J133M85r00
$$ plain form
1466 -620 1895 2014 -1225 -2256 582 1220 -1658 -2142 1291 2147 -959 -1290 2238 2357 -1451 -1790 2165
1483 2165 2690 -590 -1138 1803 2218 332 597 1719 -222 -2145 -551 1027 -739 -1747 252 822
1499 822 -1512 -1616 1200 936 -2289 -2396 854 892 -2061 -1462 2148 2111 -1372 -2050 705 1107 -1388 -2178
1517 -2178 -290 334 -1200 -1740 -129 804 -312 -1666 -1049 -16 -600 -1670 -722 1545 1762 100 -179
1534 -179 1329 1814 714 558 1049 352 -637 486 2178 1699 447 565 484 -830 -622 1239 890 -1447
1552 -1447 -1261 1590 1522 -705 211 2838 1133 -2611 -1261 2533 1610 -1863 -650 2477 944 -2394
1568 -2394 -953 2252 331 -3333 -2474 433 -252 -2332 -1032 1163 115 -1807 -1125 308 -271 -1189
1584 -1189 -499 263 -95 -248 463 780 512 283 222 -720 -1537 -854 483 431 -754 -962 171 656 -244
1603b44m06J116K36j689m09K356J724j788j676J866J830k099k255J860K183k126
1619D79k528K023K611j561k290J372J796j977j950J668J605j411j073J676J198
1634A638j158n12R55k80j322L99J068j181j329J670J819j494k147J206J375j810
1650a103j802J761J821j858j792K327K625j622k480J154K216j149k187J101K438
1665A450n63j972O97J987l64k127k20J544l3j617n5J768N40j174l6J189J60j207
1683c3k09P15J42l03M54O25n17k01J057K35j556q73Q56K43j468Q8K017K08k514
1702a034n07K664O47k765j345K230J067k065l93K823Q90k784j265K420J278k355
1718d94j728J494J297j320p28J492R37j466j186P19O80o65n37N54L76J4N62O68
$$ plain form
1603 -244 -650 466 702 -987 -1396 960 2684 896 -780 1086 2916 817 -1438 422 2605 479
1619 479 -2049 -26 2585 1024 -1266 106 1902 -75 -2025 -357 1248 -163 -1236 440 1638
1634 1638 480 -32 923 643 -679 -280 788 -393 -1722 -52 1767 273 -1874 -668 707 -1103
1650 -1103 -2905 -1144 677 -1181 -2973 -646 1979 357 -2123 -969 1247 98 -2089 -988 1450
1665 1450 887 -1085 -388 1599 1235 -892 -1112 432 399 -1218 -1273 495 1035 -139 -175 1014 1174 -33
1683 -33 -242 473 615 312 766 1391 874 673 1730 1965 409 -464 392 635 -833 -745 1272 1480 -1034
1702 -1034 -1541 1123 1770 -995 -2340 -110 957 -1108 -1501 1322 2212 -572 -1837 583 1861 -494
1718 -494 -2222 -728 569 -751 -1479 13 950 -516 -1702 -983 -303 -968 -1505 -951 -575 -561 1 669
1736F69k37o58K11L58o70n15J055Q18j135n86J674J235j827j918J107J624j129
1753G6j728J163K088p34j638J344K007j325k727P64K641k05k202K05K038Q3j578
1770B72jJ436p10k117k96J662M36r48l18O04j8l64L92K57p40p38K59L71l2N98
1790ER54n68j588J56J815j4k145o62J555L90j446J34K283R5k548p70K288J072
1808A006k093j102J977J349j317m70J709J017j751j357J306J184j143j046R96
1823B65J105n64o89O42K66q39m83N04Q3n60J21Q02J74k77M88K87r88q54Q04R93
1843A280q71j218R24J222q84j056J095J052j792k217J018K215m68k053N76J781
1859F04m01j550Q27J654j154k225M48K321L55j448j53J185j12r53Q2P86n14j135
$$ plain form
1736 669 432 -226 -15 343 -327 -842 213 1031 -104 -690 984 2219 392 -1526 -419 1205 76
1753 76 -1652 -489 1599 865 -773 571 2578 1253 -1474 -710 1931 1726 -476 -271 1767 1850 272
1770 272 271 1707 997 -1120 -1416 246 682 -266 -584 20 2 -362 30 287 -453 -1191 -932 -561 -593 5
1790 5 959 391 -1197 -1041 774 760 -1385 -2047 -492 -102 -1548 -1414 869 964 -1584 -2354 -66 1006
1808 1006 -1087 -2189 -212 1137 -180 -650 1059 2076 325 -1032 274 1458 315 -731 265
1823 265 1370 806 117 759 1025 186 -297 207 290 -270 -149 653 827 550 1038 1325 337 -517 287 1280
1843 1280 409 -809 115 1337 453 -603 492 1544 -248 -2465 -1447 768 300 -1753 -1177 604
1859 604 203 -1347 -520 1134 -20 -2245 -1797 524 879 -569 -722 463 351 -602 -520 266 -248 -1383
1877a383J21Q17K72k5L34l4o82q5Q19J38q71K4R52K49p63M46J522k31j821l36
1897e37J634K44j909m77J937Q76j680o86J746O15j946j269J725J096j639j034
1913a304J829J548j171j264R20P17j163r50Q64N44q15l83Q23L04m98j33J26q55
1931h61q61P85R85q02p12R95R63p94o70J151N78j748j176J562J660r97j245J007
1949a80J201r16j263Q81J139j160j642O22K000J84j262R6J136q1j228lJ384R8
1967A006j366k49J471Q09p09m03M89j92q72NN78j94n66M82N16o76k44Q88K22j395
1987d00m59J247J97j432%K089K45k088k43J977J4k313j68K031J05k336k29K358
2005E95N80j905o31J300Qj445j73J496N32j095l37Q16O62j25m06j78j86qJ82J4
$$ plain form
1877 -1383 -1262 -445 -173 -198 136 102 -580 -665 154 292 -579 -555 397 646 -117 329 1851 1620 -201 -537
1897 -537 1097 1341 -568 -1045 892 1768 88 -598 1148 1763 -183 -1452 273 1369 -270 -1304
1913 -1304 525 2073 902 -362 558 1275 112 -838 26 570 -245 -628 195 499 1 -132 -6 -861
1931 -861 -1722 -937 48 -754 -1466 -471 492 -302 -972 179 757 -991 -2167 -605 1055 58 -1187 -180
1949 -180 1021 105 -1158 -277 862 -298 -1940 -1318 682 866 -396 -300 836 755 -473 -476 908 1006
1967 1006 -360 -609 862 1671 962 559 1048 856 -16 -11 567 373 -193 289 805 129 -115 773 995 -400
1987 -400 -859 388 585 -847 -847 1242 1487 -601 -844 1133 1147 -1166 -1334 697 802 -1534 -1763 595
2005 595 1175 -730 -1361 -61 -53 -1498 -1671 -175 357 -738 -1075 -259 403 278 -128 -306 -492 -500 -318 -304
2025c04K63N16N1n48l78K95M21j14o88k18N12N27j41k40O70O62o33j108M00J281
2045A226l69j408N24J785l94j819M45J924m64k351L1J882l77j866O18K206o03
2062I90j941K86J569l84j394L32R19o19o21Q53O44n09j53M10p88j112P33J223
2080D38p11j279Q00J188q02r91R50J150j099j428O22J349j43o70M15R03j50q99
2098c57j62Q19N76p27q77L59Q49L3n89N02Q78p03j599L03J556n2j339M06J227
2117A103m57j001Q38J223p46j312J59O66n06J12J018q6j296J26J083o88j208Q29
2135a43J081j444j401J614J831j221j669J353J225j710j548J620J709j375j323
2150a401J118J206r47r11R59N84j086r51M27P44J01l1N6r0k2j05n7N7N13m1q11
$$ plain form
2025 -304 -41 475 526 -22 -400 -105 316 202 -486 -704 -192 335 194 -46 624 1286 653 -455 -55 1226
2045 1226 857 -551 -27 1758 1364 -455 -10 1914 1450 -901 -870 1012 635 -1231 -613 1593 990
2062 990 -951 -665 904 520 -874 -542 377 -242 -863 -10 634 125 -28 382 -406 -1518 -785 438
2080 438 -273 -1552 -752 436 -366 -1357 -407 743 -356 -1784 -1162 187 44 -626 -211 692 542 -357
2098 -357 -519 300 876 149 -728 -369 480 513 -76 426 1304 601 -998 -695 861 809 -530 -124 1103
2117 1103 646 -355 483 1706 960 -352 -193 473 -33 79 1097 1011 -285 -159 924 236 -972 -143
2135 -143 938 -506 -1907 -293 1538 317 -1352 1 1226 -484 -2032 -412 1297 -78 -1401
2150 -1401 -283 923 -24 -935 24 608 -478 -1429 -1002 -258 -157 -188 -132 -222 -244 -349 -406 -349 164 123 -688
2171f88j33J085N96l01l16J93j43n06M4L08J19J99M1n78k54J104O03j231j017
2190h75J123R34j440r14J915J417j819j451J797J330j965j380J868J072j777j135
2206a300J593J059j340o20J089L9j563o9J197P4q08K65M80n56k45R53L57j175
2224e70n11Q17K23r12K96J495j90j590l09J364L42j158l85R09K55p28k21J020
2242A47P57n60j026J44R91l1q30r9J260L84j127m55J188O61j203o95R22L14j069
2261c27k05J268M56r02l66O18k42o25M89P07p32p02O22O36n75l6J020l47j756
2280i99n2J722N3j576L8J538l91j704N84J940m93k231n3J734K30j212K6J370k
2299E22j293j78J109L43q37m70L06M88J3j12J5L01M6l92l53R0M21M7k20K8L11
$$ plain form
2171 -688 -821 264 860 559 243 436 293 -213 -169 139 258 457 498 -80 -334 770 1373 142 -875
2190 -875 248 1182 -258 -1172 743 2160 341 -1110 687 2017 52 -1328 540 1612 -165 -1300
2206 -1300 293 1352 12 -608 481 520 -1043 -1112 85 159 -649 -384 96 -460 -705 248 605 -570
2224 -570 -1081 -264 -41 -953 -657 838 648 -942 -1251 113 455 -703 -1088 -179 76 -652 -873 147
2242 147 904 344 -682 -538 453 422 -408 -507 753 1137 10 -445 743 1404 201 -494 428 742 -327
2261 -327 -532 736 1192 290 -76 542 300 -325 164 871 139 -563 59 695 120 84 1104 757 -999
2280 -999 -1051 671 724 -852 -814 724 333 -1371 -787 1153 660 -1571 -1624 110 340 -872 -846 524 522
2299 522 -771 -949 160 503 -334 -804 -498 -10 3 -109 -94 207 253 -139 -492 -402 19 66 -154 -126 185
2320A85J32K8q3M2K20l5n28m11O52P77l53o77L78Q35p04j170P19J287q90j513
2340a109N52J807l14j497M09J250o69j602O13J616m21j421J95J217j44o99J11
2357a06M38m56n53K80K66j38oK25k27l16M44M78o77o40M65P00m56n68O97Q15o02
2378F3q15N40R08m63j166K81J042L6r53M8J061J74j116l72J004M33r33o29J086
2397B29P47p18o52O63Q41q09o37M20N76m04n29M73M56k45l29J31J29k41p9Q1k59
2418a56j53L98L39m52k82N58L12q25n40Q52N67r87o13R75Q52q74q63Q05P60r62
2438b89j009P31J139o20r22M07J018k50q11J25P29j75p65J12P47J87m84j04L49
2457A15J68k14j25M0nk5K4N2j6K26K25l21k95J85M89j92p12K45P80j05p34K24
$$ plain form
2320 185 317 345 262 304 524 489 -39 -450 202 979 626 -51 327 1162 458 -712 7 1294 404 -1109
2340 -1109 -557 1250 936 -561 -152 1098 429 -1173 -560 1056 635 -786 -591 626 482 -217 -106
2357 -106 332 -124 -677 -397 -131 -269 -275 -50 -277 -593 -149 329 -348 -988 -523 177 -279 -847 -150 665 63
2378 63 -752 -212 696 233 -933 -652 390 426 -527 -479 582 756 -360 -732 272 705 -228 -857 229
2397 229 976 258 -394 269 1110 301 -336 84 660 256 -273 200 656 411 82 213 342 101 22 103 -156
2418 -156 -309 89 428 -24 -306 252 564 -261 -801 51 618 -369 -982 -7 845 -29 -892 -87 673 -289
2438 -289 -1298 -567 572 -48 -970 -563 455 205 -606 -481 248 73 -692 -580 167 354 -130 -234 115
2457 115 283 69 -56 -16 -21 -46 -22 30 14 240 465 144 -151 34 523 331 -381 -136 644 539 -195 29
2479B9J018l03j099r8J241O3j247k28J192M04j151l77R17M27r94o81Q46O00o75
2498a16o10O22O23l88m82J65K97k19k83R8J06k0M4Q6j10k1K61L6n04j87M59K30
2520H7n10j93P74L46p12l99P58N00r27n82Q40P93o52q09Q36P72o22q74N10R19
2540H55n44r59L44J037r1r15J64P10m2o33j38N13K8m00l6M12R7j97j9L4j88QJ31
2563A71j06l53O0N51k15m85K24O07m02p67K91Q70l68q18K19R38o1j016J83R98
2583E21j50j120q4J073K82j091k39J036L73q17m36O68M02n37n33M57M86j15l83
2602b07P4L55K7k60j04Q3J37j1o8o2J62L88j35m87l2N06J38o49k37M86N48o34
2624A8m83P34N64p80p56P49Q25p61q81O02J104o47r98N59R14n34r89L06R12k10
$$ plain form
2479 29 1047 744 -355 -453 788 851 -396 -624 568 972 -179 -556 361 788 -206 -887 -41 559 -116
2498 -116 -726 -104 519 131 -351 -186 111 -108 -391 -293 -187 -207 -163 -77 -187 -208 53 89 -415 -602 -143 87
2520 87 -423 -616 158 504 -208 -607 151 651 -276 -858 -18 775 123 -686 150 922 300 -574 -64 855
2540 855 311 -648 -304 733 642 -273 -109 601 559 -74 -212 301 329 -71 -107 305 402 205 186 220 32 40 171
2563 171 65 -288 -228 323 108 -377 -153 454 52 -715 -424 446 78 -740 -521 417 356 -660 -477 521
2583 521 371 -749 -833 240 522 -569 -808 228 601 -216 -652 16 418 -119 -652 -195 291 176 -207
2602 -207 -133 222 249 -11 -115 -32 105 94 26 -36 126 514 379 -108 -140 366 504 -145 -382 104 652 18
2624 18 -465 269 833 53 -703 46 871 110 -771 -169 935 288 -710 -151 763 229 -760 -454 458 248
2644B48q15K88N73j02n03j6L20k2o5j37l2LK37J22l52k1M79M3o08k15O22L79n41
2667a15m64N00M16l10l91L14N13k88p03Q7P76K26n80l44N88K82n73l59P22M91
2687G88q04p40Q01P78n01p15N28O78o89p55O45P20n08o68L30M75l32K7K18q8m10
2708b22P9K84l01r7O26J15q55l10R72L31r92l68J034K06j103m03J358M62j082
2727b66m49P22L87p56k69P00M14n62m67L08M38J51l95j54K25J26k93k53L84N24
2747E15k52p50J50P68j06m30J16K51j92l69K12M24L0j26j27l07Q8M55P3n50k04
2768c31P56O5r75jJ222J71j461l55J350L57j327k81J373K77j412k75J213L62j099
2787c71j55P79l7p03J66N35q5k01K5m3k61J52L94j17m46K90K93m41k37N98N02
$$ plain form
2644 248 -567 -279 294 192 -311 -327 -7 -29 -94 -231 -263 -260 -23 99 -253 -274 205 248 -360 -575 47 426 -115
2667 -115 -579 -79 337 27 -364 -50 463 175 -528 -441 335 561 -19 -363 225 507 -66 -425 297 788
2687 788 -16 -756 45 823 322 -393 135 813 124 -631 14 734 226 -442 -112 363 31 58 276 188 -222
2708 -222 -143 141 -160 -257 369 484 -371 -681 291 622 -370 -738 296 502 -601 -1004 354 816 -266
2727 -266 -715 7 394 -362 -631 69 483 -79 -546 -238 200 351 -44 -198 27 153 -140 -393 -9 515
2747 515 263 -487 -337 431 325 -105 11 262 70 -299 -87 337 367 241 114 -193 -105 350 423 -127 -331
2768 -331 425 490 -485 -486 736 907 -554 -909 441 798 -529 -810 563 840 -572 -847 366 728 -371
2787 -371 -526 253 216 -487 -321 214 129 -72 -47 -90 -351 -199 195 78 -368 -78 215 -226 -463 135 637
2808F37o17p08N00M86k64k56L44K08k85l74N0M79K69l14n23Q5N11J38o46J70P39
2829F29j15j126o3J228K38j145k44J165n6j086O1J244P2j198j24P87m6n86L25
2848d0N93n04m87M25K37l74J04N14l62r24M82R51l75p78M97P23q75q21R26J115
2868A027p56j069M37R08m80o17N36O60n04p75J80O16J81l08k62N2L15j04k62P9
2888a46N61m3p52k45P16L37l86l12M40J34n70q2O00J22l16j10k0m8O4L57j17m18
2910b34J88M59n37n04P40R01q76j079O98J035p54q78R41Q71j045j011R83J030
2928I28q01q23P23M80o10m67O45M66m70m43K92P2j10K39J33l26k73M08N9m39K02
2949a15N96k31p18J24P12l1n39k3M57p7n00N8M31K83l56l39M7L06P2k68j29M33
$$ plain form
2808 637 20 -688 -188 298 34 -222 122 330 45 -329 -279 200 469 155 -368 -283 228 366 -280 -110 629
2829 629 514 -612 -675 553 791 -354 -598 567 511 -575 -514 730 802 -396 -520 267 221 -365 -40
2848 -40 553 49 -438 -13 224 -150 -46 468 106 -818 -336 615 240 -538 -41 682 -193 -1014 -88 1027
2868 1027 271 -798 -361 547 67 -550 -14 646 142 -633 -453 163 344 36 -226 -174 141 37 -225 -146
2888 -146 415 372 -380 -625 91 428 42 -270 170 304 -266 -348 252 374 58 -52 -72 -120 -56 301 184 -234
2910 -234 -46 413 -124 -628 112 1013 137 -942 -244 791 37 -841 100 971 -74 -1085 -102 928
2928 928 127 -696 27 507 -103 -570 75 541 71 -372 -80 -8 -118 121 254 -72 -345 63 122 -317 -115
2949 -115 481 250 -468 -344 368 337 -202 -225 232 155 -345 -287 144 427 71 -268 -221 85 157 -111 -240 193
2971A93K37o45l84P19N50o18n86N19N66o23m69P49M79p02o31N94M88m39k27M23
2991A93M8m23j95M38J45k44R7Q4m34P7N01J03o15p0O80j31p28J24R06o9r44q0
3013e37Q89J61q16r3P02R4o78k61O60L15l94l80K20K98n3m12J22M10O2m64k22
3034c77M04L76l72m25L12L50k78l20K97K71j97j68l5Q7J14M9o0j66R3K04j51l50
3056c42K81M85k13o18J98O46q6q77J83Q05j46q46J37P97L3r10k9Q32J04o84j38
3077c88O51J18n81p9L61J94k21k42J85J47l0j60k7nJ33R0k27n6J73J17k26j71
3099b44K05K44j83l14J11M28p1l81N1L33J08m54j56M52K66m16m20L71N20l93n11
3120d54L07N69l37n53K59O17j84n74R2O22j40m55n2M91J08m91oK15J52j95l4M2
$$ plain form
2971 193 430 -215 -599 120 670 52 -534 -15 551 -72 -541 208 687 -15 -646 -52 436 -3 -230 193
2991 193 241 -182 -377 61 206 -38 59 143 -291 -214 287 390 -225 -295 385 254 -474 -350 556 487 -457 -537
3013 -537 352 513 -303 -396 306 400 -278 -539 121 436 42 -338 -118 180 127 -285 -163 247 309 -155 -377
3034 -377 27 403 31 -394 -82 268 -10 -330 -33 238 41 -127 -162 -75 39 88 28 -138 -45 159 8 -342
3056 -342 -61 424 211 -407 -209 437 351 -526 -343 462 316 -530 -393 404 437 -473 -502 330 434 -250 -388
3077 -388 263 381 -200 -279 82 276 55 -187 -2 145 115 -45 -72 -77 56 146 -81 -137 36 153 -73 -244
3099 -244 -39 205 22 -292 -181 247 176 -205 -154 179 287 -167 -323 129 395 -21 -441 -70 450 57 -454
3120 -454 -147 422 85 -468 -209 408 224 -350 -258 364 224 -231 -283 208 316 -175 -181 34 186 -9 -43 -1
3142aPO9r0r3L9K70Kl43q0L19J94l60l37M14M30l54m59L31N68k82o82J90O59q9
3166C22o77K9O30K5o31j36O53K02m82l98M42L82l45l04K61K63j12l37R9L46p2
3187A60l03j01J80J39j6j27q3MK83j70k61J23L77j29l52K8M90Q9n73q0M75K71
3209D24o09k53N36L97n54m38N10M75l80n19K66N07j80n10J72M54m6m35K3M12%
3230B52l19n1K25R0q8j95M9J61Q5j60j51K4K10q3j85o3K80Q6k54j88K84L40l17
3253C2m38L04L49j47m58K58M35j49n85J10N60R3o65r8N50J28m92j77N11K11l59
3274b7m17M17L71l80k13J60K93j66j61J24J28J5j46n6J8J21Q1j51k12K45K45j31
3296A58m13K23L43r7n14O2O04j05m36o9N16P8n14k10N19K50l21m61L84M08k76
$$ plain form
3142 -1 6 75 -15 -108 -69 201 203 -140 -220 99 293 -67 -404 10 440 86 -373 -42 526 244 -438 -248 411 322
3166 322 -355 -326 304 329 -302 -438 215 417 -65 -463 -21 361 16 -288 -27 236 124 -213 -114 232 160
3187 160 -143 -244 -64 75 59 -68 -151 -147 136 -34 -295 -172 205 76 -276 -248 242 331 -242 -322 153 424
3209 424 -185 -438 98 495 -59 -497 13 488 108 -411 -145 362 182 -328 -156 298 252 -183 -160 252 252
3230 252 -67 -118 107 197 109 -86 -37 124 209 49 -102 -78 132 49 -136 -199 81 167 -87 -275 9 349 32
3253 32 -406 -102 247 100 -358 -100 335 186 -399 -289 271 364 -301 -399 151 279 -213 -390 121 332 -27
3274 -27 -444 -27 344 -36 -249 -89 204 38 -123 1 129 144 -2 -58 -40 81 162 11 -201 44 289 158
3296 158 -255 -32 311 214 -300 -238 366 261 -175 -244 272 350 -164 -374 145 395 74 -387 -3 405 129
3317A29l88J73M08j35m87m6M69J25l84k63M40K14k76k19J85K50k86j33K6K61R4
3338A57j88o5kJ88P5j81k90K43K27k20m22L95M60k08o15K32N98j09p14K20O49
3359D30r1o81K4P31On69o2M59J8m16m1L21R2j94q4P7J34k4q7j21J6J93j9l21J29
3384h0L72k9l90l5L90o8l14L1K27J3k13j15J54J97oj61k63J93K34k15l01K65N01
$$ plain form
3317 129 -259 -86 322 187 -300 -346 123 248 -136 -399 41 255 -21 -240 -55 195 -91 -224 -198 63 157
3338 157 -31 -96 -98 90 165 -16 -306 -63 164 -56 -478 -83 377 169 -446 -214 384 275 -439 -219 430
3359 430 339 -342 -318 413 419 -150 -212 247 265 -151 -192 129 221 27 -57 20 154 130 43 -78 -62 131 112 -209 -80
3384 -80 292 263 -127 -162 228 160 -154 -123 104 117 -96 -211 -57 140 134 -27 -290 -97 137 -78 -379 -114 387
$$ [...]
8191G4
##END NTUPLES=NMR FID
##END=
