##TITLE=1H_hO2AdNHNH2-10-12
 200.13Hz,CDCl3.
 8 sc
 3.6.2026
##JCAMPDX= 6.0         $$ Bruker NMR JCAMP-DX V2.0
##DATA TYPE= NMR FID
##DATA CLASS= NTUPLES
##ORIGIN= UXNMR, Bruker Analytische Messtechnik GmbH
##OWNER= pz
$$ XWIN-NMR		Version 3.5
$$ Wed Jun  3 16:20:06 2026 Russian Standard Time (UT+4h)  she@DPX200
##.OBSERVE FREQUENCY= 200.131
##.OBSERVE NUCLEUS= ^1H
##.DELAY= (6, 6)
##.ACQUISITION MODE= SIMULTANEOUS
##.ACQUISITION SCHEME= undefined
##.AVERAGES= 8
##.DIGITISER RES= 18
##SPECTROMETER/DATA SYSTEM= spect
##.PULSE SEQUENCE= zg30
##.SOLVENT NAME= CDCl3
##.SHIFT REFERENCE= (INTERNAL, CDCl3, 0, 14.3821)
##AUDIT TRAIL= $$ (NUMBER, WHEN, WHO, WHERE, WHAT)
$$ ##TITLE= Audit trail, XWIN-NMR		Version 3.5
$$ ##JCAMPDX= 5.01
$$ ##ORIGIN= Bruker BioSpin GmbH
$$ ##OWNER= she
$$ F:/spectra/data/she/nmr/H-C/1/audita.txt
$$ ##AUDIT TRAIL=  $$ (NUMBER, WHEN, WHO, WHERE, WHAT)
(   1,<2026-06-03 16:18:52.50 +0400>,<she>,<DPX200>,
      <created by zg, POWCHK disabled, PULCHK disabled
       configuration hash MD5:
       00 E9 B6 7A A2 85 ED C7 34 08 36 98 17 FE 4E 26
       data hash MD5: 16K
       C6 34 4E F8 9A 21 AE 98 B2 B0 4A 19 26 B8 F2 0A>)
$$ ##END=
$$ 
$$ hash MD5
$$ 2D B8 8B 67 E7 9C 01 40 0D 03 3E C4 DB D7 E7 5D
##$RELAX= 
##$RELAX= 
##$RELAX= 
##$RELAX= 
##$RELAX= 
##$RELAX= 
$$ Bruker specific parameters
$$ --------------------------
##$DU= <F:/spectra>
##$EXPNO= 1
##$NAME= <H-C>
##$PROCNO= 1
##$TYPE= <nmr>
##$USER= <she>
##$AMP= (0..31)
100 100 100 100 100 100 100 100 100 100 100 100 100 100 100 100 100 100 
100 100 100 100 100 100 100 100 100 100 100 100 100 100 
##$AQSEQ= 0
##$AQ_mod= 1
##$AUNM= <au_zg>
##$AUTOPOS= <>
##$BF1= 200.13
##$BF2= 200.13
##$BF3= 200.13
##$BF4= 200.13
##$BF5= 200.13
##$BF6= 200.13
##$BF7= 200.13
##$BF8= 200.13
##$BYTORDA= 1
##$CFDGTYP= 0
##$CFRGTYP= 5
##$CHEMSTR= <none>
##$CNST= (0..31)
1 1 145 1 1 1 1 1 1 1 1 1 1 1 1 1 1 1 1 1 1 1 1 1 1 1 1 1 1 1 1 1 
##$CPDPRG= <>
##$CPDPRG1= <>
##$CPDPRG2= <>
##$CPDPRG3= <>
##$CPDPRG4= <mlev>
##$CPDPRG5= <mlev>
##$CPDPRG6= <mlev>
##$CPDPRG7= <mlev>
##$CPDPRG8= <mlev>
##$CPDPRGB= <>
##$CPDPRGT= <>
##$D= (0..31)
0 0.7 0 0 0 0 0 0 0 0 0 0.03 0 0 0 0 0 0 0 0 0 0 0 0 0 0 0 0 0 0 0 0 
##$DATE= 1780489131
##$DBL= (0..7)
120 120 120 120 120 120 120 120 
##$DBP= (0..7)
150 150 150 150 150 150 150 150 
##$DBP07= 0
##$DBPNAM0= <>
##$DBPNAM1= <>
##$DBPNAM2= <>
##$DBPNAM3= <>
##$DBPNAM4= <>
##$DBPNAM5= <>
##$DBPNAM6= <>
##$DBPNAM7= <>
##$DBPOAL= (0..7)
0.5 0.5 0.5 0.5 0.5 0.5 0.5 0.5 
##$DBPOFFS= (0..7)
0 0 0 0 0 0 0 0 
##$DE= 6
##$DECBNUC= <off>
##$DECIM= 32
##$DECNUC= <off>
##$DECSTAT= 4
##$DIGMOD= 1
##$DIGTYP= 9
##$DL= (0..7)
0 120 120 120 120 120 120 120 
##$DP= (0..7)
150 150 150 150 150 150 150 150 
##$DP07= 0
##$DPNAME0= <>
##$DPNAME1= <>
##$DPNAME2= <>
##$DPNAME3= <>
##$DPNAME4= <>
##$DPNAME5= <>
##$DPNAME6= <>
##$DPNAME7= <>
##$DPOAL= (0..7)
0.5 0.5 0.5 0.5 0.5 0.5 0.5 0.5 
##$DPOFFS= (0..7)
0 0 0 0 0 0 0 0 
##$DQDMODE= 0
##$DR= 18
##$DS= 0
##$DSLIST= <SSSSSSSSSSSSSSS>
$$ [...]
##$SUBNAM0= <"">
##$SUBNAM1= <"">
##$SUBNAM2= <"">
##$SUBNAM3= <"">
##$SUBNAM4= <"">
##$SUBNAM5= <"">
##$SUBNAM6= <"">
##$SUBNAM7= <"">
##$SUBNAM8= <"">
##$SUBNAM9= <"">
##$SW= 18.0517599122864
##$SWIBOX= (0..15)
0 0 2 0 0 0 0 0 0 0 0 0 0 0 0 0 
##$SW_h= 3612.71676300578
##$TD= 16384
##$TD0= 1
##$TE= 0
##$TE2= 300
##$TE3= 300
##$TEG= 300
##$TL= (0..7)
0 120 120 120 120 120 120 120 
##$TP= (0..7)
150 150 150 150 150 150 150 150 
##$TP07= 0
##$TPNAME0= <>
##$TPNAME1= <>
##$TPNAME2= <>
##$TPNAME3= <>
##$TPNAME4= <>
##$TPNAME5= <>
##$TPNAME6= <>
##$TPNAME7= <>
##$TPOAL= (0..7)
0.5 0.5 0.5 0.5 0.5 0.5 0.5 0.5 
##$TPOFFS= (0..7)
0 0 0 0 0 0 0 0 
##$TUNHIN= 0
##$TUNHOUT= 0
##$TUNXOUT= 0
##$USERA1= <user>
##$USERA2= <user>
##$USERA3= <user>
##$USERA4= <user>
##$USERA5= <user>
##$V9= 5
##$VALIST= <valist>
##$VCLIST= <CCCCCCCCCCCCCCC>
##$VD= 0
##$VDLIST= <DDDDDDDDDDDDDDD>
##$VPLIST= <PPPPPPPPPPPPPPP>
##$VTLIST= <TTTTTTTTTTTTTTT>
##$WBST= 1024
##$WBSW= 4
##$XGAIN= (0..3)
0 0 0 0 
##$XL= 0
##$YL= 0
##$YMAX_a= 30940
##$YMIN_a= -25208
##$ZGOPTNS= <>
##$ZL1= 120
##$ZL2= 120
##$ZL3= 120
##$ZL4= 120
##$ABSF1= 10
##$ABSF2= 0
##$ABSG= 5
##$ABSL= 3
##$ALPHA= 0
##$AQORDER= 0
##$ASSFAC= 0
##$ASSFACI= 0
##$ASSFACX= 0
##$ASSWID= 0
##$AUNMP= <proc_1d>
##$AZFE= 0.1
##$AZFW= 0.1
##$BCFW= 1
##$BC_mod= 2
##$BYTORDP= 1
##$COROFFS= 0
##$CY= -3
##$DATMOD= 1
##$DC= 2
##$DFILT= <>
##$DTYPP= 0
##$F1P= 0
##$F2P= 0
##$FCOR= 0.5
##$FTSIZE= 0
##$FT_mod= 4
##$GAMMA= 1
##$GB= 0.15
##$INTBC= 1
##$INTSCL= 1
##$ISEN= 128
##$LB= 0.25
##$LEV0= 0
##$LPBIN= 0
##$MAXI= 10000
##$MC2= 0
##$MEAN= 0
##$ME_mod= 0
##$MI= 1.114404
##$NCOEF= 0
##$NC_proc= 0
##$NLEV= 6
##$NOISF1= 3.799351
##$NOISF2= 2.8
##$NSP= 1
##$NTH_PI= 0
##$NZP= 0
##$OFFSET= 14.38212
##$PC= 1
##$PHC0= -4218.789
##$PHC1= 11.39229
##$PH_mod= 1
##$PKNL= yes
##$PPARMOD= 0
##$PSCAL= 0
##$PSIGN= 0
##$REVERSE= no
##$SF= 200.129724274929
##$SI= 16384
##$SIGF1= 3
##$SIGF2= 2
##$SINO= 400
##$SIOLD= 16384
##$SREGLST= <1H.CDCl3>
##$SSB= 0
##$STSI= 0
##$STSR= 0
##$SW_p= 3205.1282051282
##$SYMM= 0
##$S_DEV= 0
##$TDeff= 0
##$TDoff= 0
##$TI= <>
##$TILT= no
##$TM1= 0
##$TM2= 0
##$TOPLEV= 0
##$USERP1= <user>
##$USERP2= <user>
##$USERP3= <user>
##$USERP4= <user>
##$USERP5= <user>
##$WDW= 1
##$XDIM= 8192
##$YMAX_p= 0
##$YMIN_p= 0
$$ End of Bruker specific parameters
$$ ---------------------------------
##NTUPLES= NMR FID
##VAR_NAME=  TIME,          FID/REAL,        FID/IMAG
##SYMBOL=    X,             R,               I
##VAR_TYPE=  INDEPENDENT,   DEPENDENT,       DEPENDENT
##VAR_FORM=  AFFN,          ASDF,            ASDF
##VAR_DIM=   8192,          8192,            8192
##UNITS=     SECONDS,       ARBITRARY UNITS, ARBITRARY UNITS
##FACTOR=    0.0002768,     1,               1
##FIRST=     0,             0,               0
##LAST=      2.2672688,     0,               0
##MIN=       0,             -25208,          0
##MAX=       2.2672688,     30940,           0
$$ Real data points
##PAGE= N=1
##DATA TABLE= (X++(R..R)), XYDATA
0@%%%%%%%%%%%%%%%%%%%%%%%%%jOj3J6j6J6j6J7j8K2k9L2l3L7m1M6n3N8o5P3p9
46d1Q7r7J06j18J30j42J58j74J91k11K34k60K89l24L65m14M75n50O51p89R91j331
68g74K031o295J5748J0454k0070j6273N679K0876N013j6238j8979J646J6641J3654
82A3113j759q573o306n26o40N34K924M627J356j440j432Q93j401m405k521M974
98e82P698J118o818o706K465P505K189n789m179L242N462k591q205l033Q376J0478
114A0630J86j0101q678N85O093L059j831N27M228J200n388r136j963O644Q626
129D681K939l996n548k233Q16J141J653J018J367J89p51k140j703r39J567K847
145I08L226l9l482m336j316K833M953K702j235m021m123j093J943K873K454J147
$$ plain form
0 0 0 0 0 0 0 0 0 0 0 0 0 0 0 0 0 0 0 0 0 0 0 0 0 0 0 -1 5 -8 8 -8 8 -8 9 -9 13 -16 16 -17 20 -21 25 -28 30 -35 38 -41
46 -41 46 -51 55 -63 67 -75 83 -91 100 -111 123 -137 152 -172 193 -221 254 -296 355 -434 557 -774
68 -774 1257 -5038 10710 21164 1094 -15179 -9500 11376 16389 151 -18828 -17182 -541 13113
82 13113 11354 2781 -3525 -4051 -4691 -4157 -1233 3394 4750 3310 1878 2771 1370 -3035 -5556 -582
98 -582 7116 8234 1416 -5290 -2825 4680 6869 1080 -3099 143 5605 3014 -5191 -8224 152 10630
114 10630 10816 715 -7963 -7378 -1285 1774 -57 470 4698 5898 510 -8626 -10589 -3945 4681
129 4681 7620 3624 -1924 -4157 -3341 -2200 -547 471 1838 2027 1276 -864 -2567 -3506 -1939 908
145 908 4134 4095 613 -3723 -5039 -2206 2747 5449 4214 193 -3930 -5023 -3080 -207 2247 3394
161C394k51j351l423l765p94L184M364K034m14j414j419k102l307r29M162P460
177E429K873n744q856j999O941P437j80o360m590K999M847M26m357j546L924N047
193F291k71n367n323p91L199M730L446P71k557n512l840R13M484K807p93j789
209C98J428J904k147o359l008N279Q433J441o519p156Q20N413L798j926l088L44
225i45K962j371m480j637M116N511J401k999l978j723p5K22J711M529L612j697
241E159o113n239J293M316L306k97j117K81k05k353k847L9L895L001q07k384j162
258a234K96m33j369O20L447L048j761n779l239J947N649L444j226k743j680p18
274a731j198o97K050M407K662j462m725k763K46J919J375J177K045J311j728m725
$$ plain form
161 3394 3143 1792 -1631 -5396 -6190 -3006 1358 3392 2978 1564 145 -1957 -5264 -6193 -2031 5429
177 5429 8302 2558 -6298 -8297 -1356 6081 5901 -459 -5049 -2050 2797 3223 -1134 -2680 1244 6291
193 6291 6020 653 -4670 -5461 -2262 2468 5914 6685 4128 -1384 -5224 -4311 173 2980 2187 398
209 398 1826 3730 1583 -4776 -7784 -2505 5928 7369 850 -6306 -5486 -73 3725 1799 -1289 -945
225 -945 2017 646 -3834 -5471 -1355 4156 5557 2558 -1420 -3143 -3218 -2996 -1285 3244 6856 5159
241 5159 -954 -6193 -4900 -584 2722 2425 1308 1589 1384 -969 -3816 -3777 118 3119 2312 -72 -1234
258 -1234 -938 -1371 -2740 -2120 1327 4375 2614 -3165 -6404 -4457 1192 4636 3410 667 -1013 -1731
274 -1731 -2929 -3626 -1576 2831 5493 4031 -694 -3457 -3211 -1292 83 1260 3305 4616 2888 -1837
290a837l275J726N404L306j684l927k171O12J961K40m93P13J415J12k225k663
306b786r91J757L686K465o30k565l855k200N69M299M038R65k854l605r62J290
322a379K99l80M56L274K821j020n137m481Q34N018M120N7l284k885m53N14J484
339a42J498J073Q5j574k228j392M72J830R42J347N56p31k534l253r97K917M760
356B629K379j991l464k504K0P82P15J631J996J158j449l402k051O55K174K283
372A561R92l48j224k001j507j76K582L371O19k078l287k056R26K325K244P90m11
389B322q96k066k038j039J470L357K679j64k230k558k077l82J476K835K068R68
405C725j989l533k373J160K952K113j47j433o97j7n33j188O79K174K368L5l215
$$ plain form
290 -1837 -5112 -3386 2018 5324 3640 -287 -2458 -1846 115 355 -138 575 1990 2102 -123 -2786
306 -2786 -3777 -2020 1666 4131 3501 936 -2919 -5119 -4550 -251 3787 4752 1898 -1707 -2669 -1379
322 -1379 -1080 -1460 -1004 2270 5091 4071 -1066 -5547 -4713 305 4425 4482 1198 -1687 -2140 -1626 -142
339 -142 1356 2429 2514 940 -1288 -2680 -2208 -378 564 1911 2467 1736 -798 -4051 -5048 -2131 2629
356 2629 5008 3017 -447 -2951 -2931 -2149 -1434 197 2193 3351 1902 -1500 -3551 -2896 -722 1561
372 1561 2553 2205 981 -1020 -2527 -2703 -121 3250 3869 1791 -1496 -3552 -2626 -301 1943 2733 2322
389 2322 1426 -640 -2678 -3717 -2247 1110 3789 3625 1395 -1163 -3240 -3622 -2146 689 2757 3725
405 3725 1736 -1797 -4170 -3010 -58 2055 1908 475 -222 -239 -772 -1960 -1281 893 3261 3296 81
422H1l130l49K040K681J467L34q59k193l146j633K394L994K837j510k346k270
438a608J53l13l45P81L272L028j418n040l354J334L786K244r88j229N4m84j563
455a690j076J444L421J377j919k998o52O91R74k28J271K381J056l092m707j543
471e290L243M740J258j540k106k79l95j970j038K710L825J383k663l767r57Q68
487a978J270L40J112J877ll044l734L88L558L277m41k511j679N53p2n52Q2K579
505A022K250L25l702l091m61K341K008R50O24r7j110k934k013J091L641K696n38
522C002j834j871r39k48J44J512J816J261r46k616j758J74J513J577J014Q50j348
539A303k164j665l02K079K957J226j344k283k142l76J013J512J906Q56m52j809
$$ plain form
422 81 -3049 -3398 -1358 1323 2790 3124 2265 72 -3074 -4707 -2313 1681 4518 3008 662 -1608
438 -1608 -1455 -1768 -2113 -1332 1940 4968 3550 -1490 -4844 -3510 276 2520 1532 303 357 -127 -1690
455 -1690 -2766 -1322 2099 3476 1557 -1441 -2093 -1402 -428 -656 615 2996 4052 960 -3747 -5290
471 -5290 -2047 2693 3951 2411 305 26 -369 -2339 -3377 -667 3158 4541 1878 -1889 -2846 -1978
487 -1978 -708 -368 744 2621 2618 -426 -4160 -3772 -214 3063 2622 111 -1568 -1015 -1087 -1639 -1557 1022
505 1022 3272 3597 -105 -3196 -3657 -1316 692 1642 2266 2169 1059 -1875 -3888 -2797 844 3540 3002
522 3002 1168 -703 -1642 -1890 -1746 -234 1582 2843 1897 -719 -2477 -2303 -790 787 1801 2651 1303
539 1303 -861 -2526 -2828 -749 2208 3434 2090 -193 -2335 -2711 -1698 -186 1720 2576 2124 315
555C15j690j753N06J806K918J297j243k588k040mJ953J293O83N00j45j249k398
572a839r99J242K399J762n96j318j271p40n93MK399K342J058k565l834j396J555
589b390K686J258K35jl68k342k195n20K919L238O68j888k299o42L59jj08K292
607I01J942R5k835l375P8K623K345P7j450J28Q4j414k104J76L427L391p47l092
625B50k573N6J315M59K89J610J783q54l829k647Q98L774J996n62j458k34j64j203
643a094j707O43L582K423j542l368k120J302J907L44K19Q80O16j208l192j790
659d105K417L369J551j218k320o24j89l28l14J301K826J175k108k899j464J138
675a792J757J293q9j54P67j486k477r18J914L000R07j128j819j380J69K44N51
$$ plain form
555 315 -1375 -3128 -2622 -816 2102 3399 2156 -432 -2472 -2476 -523 770 1453 1953 1808 559 -1839
572 -1839 -2838 -1596 803 2565 1969 651 -620 -1360 -1953 -1949 450 2792 3850 1285 -2549 -3945 -2390
589 -2390 296 1554 1789 1788 1420 -922 -3117 -3637 -718 2520 3188 1300 -999 -1641 -1282 -1283 -1391 901
607 901 2843 2938 103 -3272 -3194 -571 1774 1851 401 529 613 -801 -2905 -2729 698 4089 3342 250
625 250 -2323 -2267 -952 -493 -204 1406 3189 2335 -1494 -4141 -3243 531 2527 1965 507 273 109 -1094
643 -1094 -2801 -2158 1424 3847 2305 -1063 -3183 -1881 26 370 589 1469 2085 877 -2315 -4105
659 -4105 -1688 1681 3232 2014 -306 -930 -1119 -1447 -1761 -460 2366 3541 1433 -1466 -2930 -1792
675 -1792 -35 1258 1169 1015 1782 296 -2181 -3099 -1185 1815 2722 1594 -225 -1605 -1436 -1192 -641
692f41J276J559L37j926k941r27J692K715J395l18j062j324j208r36pK246K386
709B316Q69j835k783j150O53J337J078O26P57l71j471j941o01J475K505J420q74
726B010j949j292k56M24K78J255J549K46j323k616j497J360K280J647k89p61p95
743B71j288j282rJ618K719J311j677k945j185N21J247J338M18Q62m28j455k250
760b214o11J713K656Q25j123j231m88n29l73J75J399K258M17k086k725o42J065
777a514K143J060n8k56m92j520j601l22K039K646O90j319k337n90O1J52R01Q28
795E11J749j74k083k125l46J387K351O25n80j094p44j014n02P05J554J928M18
812B566j748k389r17P38J685J350K97K43r36j653j613k7J888K417R81j429j803
$$ plain form
692 -641 635 2194 2531 605 -2336 -3263 -1571 1144 2539 2221 1159 -165 -1373 -2309 -2316 -70 2316
709 2316 3185 1350 -1433 -2583 -1930 -593 485 1111 1868 1497 26 -1915 -2516 -1041 1464 2884 2010
726 2010 61 -1231 -1487 -1063 -785 470 2019 2265 942 -1674 -3171 -1811 469 2116 1827 1066 271
743 271 -1017 -2299 -2308 -690 2029 3340 1663 -1282 -2467 -1946 -699 639 1057 1919 1491 36 -2214
760 -2214 -2825 -1112 1544 2369 1246 15 -473 -1002 -1375 -1200 199 2457 2874 788 -1937 -2579 -1514
777 -1514 629 1689 1631 1375 883 -637 -2238 -2560 -521 2125 2815 1496 -841 -1431 -1370 -1218 -317 511
795 511 2260 2086 3 -2122 -2468 -1081 1270 1895 1315 221 -523 -1537 -2039 -1334 220 2148 2566
812 2566 818 -1571 -2488 -1750 -65 1285 1582 1825 889 -764 -2377 -2404 -516 1901 2882 1453 -350
829c50q43k82N61L36J185J429R0j576j935p13J180J244J203j75o55m29j404r32
847b066L40J842K431j45j916k217k66Q69R14N67Q90Q07n83j816k133j75K281K150
865A774M64r48j393o86o11N8M53J643J681m47j648j590m42R29R29L28M15P27o00
884A036j649j613K12K350J840j25j673j351l10k05N09P83J577R37r96k390j512
901b580R61J443J257J71l7k88q29j458j207J180K692J121k73k165j308r7O75M42
919c00N69J344O8n98k216q82O57J622J299K36q66n52j243j030M20J295J793O69
937B285j139j942r47J43R77J006J229L3p02j398j315l01J377J187J000K60j104
954F49j014j012k74R05J437J190m1j145j795o46L13J233J490O98o44j664r01m54
$$ plain form
829 -350 -1193 -1475 -914 -578 607 2036 2126 550 -1385 -2098 -918 326 1529 1354 699 270 -1134 -2066
847 -2066 -1726 116 2547 2402 486 -1731 -1997 -1128 -214 353 1243 2050 1467 -349 -2482 -2657 -376 1774
865 1774 2238 1290 -103 -789 -1400 -1342 -889 754 2435 1988 340 -1250 -1692 -763 166 494 909 1636 1036
884 1036 -613 -2226 -2014 336 2176 2051 378 -973 -1283 -1488 -979 -196 1381 2318 1322 -1068 -2580
901 -2580 -1619 -176 1081 1252 1215 927 98 -1360 -2567 -1387 1305 2426 2153 -12 -1320 -1417 -742 -300
919 -300 269 1613 1681 1083 -1133 -2015 -1358 264 1563 1799 933 381 -862 -1892 -1472 -177 1616 2285
937 2285 1146 -796 -1743 -1600 -623 383 1612 1645 943 -455 -1770 -2071 -694 493 1493 1753 649
954 649 -365 -1377 -1651 -746 691 1881 1840 695 -1100 -1746 -1433 -200 1290 1988 1344 -320 -1221 -1675
972a675P79J009Q28Q58j60j381j825n27R49J835Q20Qj034q28j067n1L10J080J378
991A306M34r86j831n62M38P50Q56P74M24m36j923j519K62K032J689L77j154r76
1009d5q04Pk17M29J631J104m20j860j577J11J177J047Q9K76N28q25j760j093O17
1028a585K186J492k61j618j274J00j83K52Q49J235R51r56k089j293P14J504J136
1045A160N9j36k20r25j332m50J134K264P00j113j488o72RL97K65P09J083L10j286
1064D68j652o92N12J948N77J10o70n37r75n30K17J234J498K87j229j494m38K60
1082a106P81P17N43M35l66j433j140j89J048J457O67j39o28j567m70K34R32J286
1100A062N53k94r42j110j117Q03J158O76N64l94q84q67m88K06P52J576O45r39
$$ plain form
972 -1675 -896 113 941 1799 1639 258 -1567 -2094 -1145 690 1510 1518 484 -344 -1411 -1462 -1152 -72 1306
991 1306 1740 754 -1077 -1639 -1201 -451 405 1179 1603 1167 -756 -2275 -2013 19 1708 2085 931 -45
1009 -45 -849 -842 -1059 -630 1001 2105 1685 -175 -1752 -1641 -464 583 672 948 1476 651 -1109 -2202 -1585
1028 -1585 601 2093 1832 214 -1060 -960 -1143 -891 -42 1193 2144 1188 -901 -2194 -1480 24 1160
1045 1160 1219 1083 863 -62 -1394 -1844 -710 1554 2254 1141 -347 -1019 -1010 -613 -348 361 1444 1754 468
1064 468 -1184 -1876 -1364 584 1161 1271 601 64 -911 -1441 -1224 10 1508 1795 566 -928 -1366 -1106
1082 -1106 -325 392 935 1370 1004 -429 -1569 -1758 -710 747 1414 1275 647 -920 -1390 -1156 -224 1062
1100 1062 1615 1321 379 -731 -1848 -1045 113 789 1353 959 75 -792 -1280 -1074 -322 1254 1899 960
1118I60j296j359j73J482J011N01K9p18p50r73k15M74J769P22K90j475j234k83
1136a238K67M96P18Q74M47r57j420r90M01J398J337j10o52n95m37n50k94R75J297
1155I67J014r15j419j154R4P82Q44O86L62l74o64j741n27P76K269K50m39q77m02
1174d68k76j05O1P66J291O40j277j482r00O03J071R12Q7r9n6p95j292R8P34J926
1194A439K72q78j231o49K66J74J78J049P74l38q62j504j75R55J154L65M1o66m34
1213g0n55p17J33J080J719p0j290j200l17M34P07K46Q10J95k53j319q79j53J322
1232a77J387J73p79r34k62l79p4O03R53P60J40j258j437k35J000R57M12j35Q5
1251H00p34r33o90M33J474O85J41o34j264k76J30L08N86Q33J01p6j124j285J98
$$ plain form
1118 960 -336 -1695 -1868 -386 625 1126 1155 437 -313 -1286 -1501 -1027 742 1464 1754 279 -955 -1238
1136 -1238 -971 -475 243 1117 1564 607 -813 -1803 -1402 -4 1333 1223 571 -24 -461 -1011 -1305 -330 967
1155 967 1981 1066 -353 -1507 -1413 -631 213 899 1261 887 223 -1518 -2045 -1269 1000 1250 811 -66 -468
1174 -468 -744 -849 -788 -22 1269 1909 632 -850 -1750 -1147 -76 836 923 824 768 -27 -1319 -1221 -487 1439
1194 1439 1711 833 -398 -1047 -781 -607 -429 620 1394 1056 194 -1310 -1485 -530 624 989 1030 364 -70
1213 -70 -625 -1342 -1209 -129 1590 1520 230 -970 -1287 -853 -146 100 910 1105 852 -467 -1346 -1499 -177
1232 -177 1210 1383 604 -330 -592 -971 -1045 -442 511 1271 1411 153 -1284 -1519 -519 438 850 715 800
1251 800 66 -867 -1557 -1124 350 1035 1176 542 -722 -998 -868 -560 26 859 960 884 -240 -1525 -1327
1270a327Q95J014M59m45j91q37p51m39P57J564J090n69j109j195o6O40O20M56
1288E66L74j06n99j103p89N73J591J016o35n67p29k67k86J53P65J243J85n66j216
1307c97j244P11N47Q59M30j79k86o08j112j52P09J540Q85o36j225p05n6M76L25
1326a18N16O12J11p13j429m78P21J197M51Q4l74m05p82k22j64Q84J158L82n58
1345H73j224q99J70P01P80N75l82K63j097q62K8M44J305N88l89q30o22n07K81
1364h04L33Q46N61Op34j041j56p4Q34J066K62n43o69m82k55k2O24J068M74l93
1384I01r32p91l41N81P31M55L13q1r18q76j19L36J432L84k15o42o17m34J78L13
1404c42M19P62K51o80p60j074N55O66O44M13L9n26o01q10N7Q38Q67O85p79q55
$$ plain form
1270 -1327 -432 582 1041 596 405 -432 -1183 -1622 -865 699 1789 1220 111 -1084 -1150 -510 110 566
1288 566 940 834 235 -868 -1657 -1084 507 1523 888 321 -408 -675 -961 -808 -43 1200 1385 819 -397
1307 -397 -1641 -930 -383 476 906 727 441 -167 -1279 -1431 -722 818 1703 1067 -158 -863 -919 -443 -118
1326 -118 398 1010 1121 408 -1021 -1499 -778 419 870 954 580 175 -607 -829 -993 -109 1049 1431 873
1345 873 -351 -1250 -1080 -379 401 976 594 857 -240 -1102 -1074 -630 675 1263 874 44 -578 -1085 -804
1364 -804 -471 375 936 942 208 -833 -989 -1063 -229 837 1099 556 -113 -595 -850 -872 -248 820 1294 901
1384 901 -31 -822 -1163 -582 149 604 917 836 -82 -958 -1077 -741 691 1075 860 218 -399 -833 -655 -342
1404 -342 77 839 1090 410 -350 -1424 -869 -203 441 854 893 367 -234 -1044 -987 -149 718 1403 624 -231
1424b31l10l09L36L64N98K34M21r72j024k16N71J215L72k63o79k19k01l12K12
1443d13Q35P52L6r99p65k34J69O76J77L06K76l92o35j188K59P31J037K27l92n82
1463a19n76J33j95P56M93J101q19j054p91p8O78M93N11J0K1k07j013n23N62R29
1483C12Q46k41n03q22j01r4j71Q51Q66L3m40q96o52K34P03Q83k92L84m99q13n77
1504i89O5P93R35K79m33n82n65k45m9N68N80O88m22n36q59j90N82K25Q91J43n18
1525C61l98p76j69L78R40K01L32p05n36m81K5L34P94Q10q4o38r90k42J69M83P02
1546E10L7k88k12p81j62R9M70P89M24k04p19k26m50O8O61P10L8j33q31m71j79
1567h50L17N38O02J84k46o25o94K9K92Q73M04k24k86j001j82J06Q6J059N83q1
$$ plain form
1424 -231 -541 -850 -514 -150 448 682 1103 131 -893 -1109 -538 677 1049 786 107 -112 -313 -625 -413
1443 -413 422 1174 1210 211 -554 -788 -619 57 234 540 816 424 -211 -1399 -1140 -409 628 855 463 -119
1463 -119 -695 -562 -757 -1 492 1593 774 -280 -1071 -1149 -471 22 533 543 564 357 -656 -1179 -617 312
1483 312 1158 917 414 -408 -509 -603 -774 77 943 976 536 -360 -1012 -778 -75 808 516 900 401 -412 -989
1504 -989 -924 -131 804 1083 650 68 -497 -742 -791 -223 357 1045 623 87 -772 -962 -380 -155 736 879 361
1525 361 -37 -813 -982 -604 336 537 869 164 -372 -853 -828 -494 300 1110 1026 388 -602 -844 -675 -192 510
1546 510 547 259 47 -734 -896 -797 -327 462 886 682 -37 -263 -713 -645 16 726 764 631 -200 -671 -850
1567 -850 -533 5 607 791 545 -80 -774 -745 -453 420 824 600 314 -687 -869 -763 -677 382 965 884
1587H84m22j130l39K17N73K47Q30l04k48p95k49K52K90J106k68k32l10p41J8K7
1607e94O54O69L95n17r75k20j43O17K57L20K62k59q33l17k43M30N72O70Q1m03
1627D23o89m80K06J60N68M35k9n45o07l14N33J89N09K36ql55p20k56K87K48Q79
1648F70r0l44m02n57j22L03P36M33K6m14o09k09J32l6N11M86m4j10o57m02l1N51
1670a79P25pJ17m77m34l50q2L68O46N91K6j152j37j66l2M97M63L08j81k30p97
1691d83j27J96N55M91pj67p06m16l3j3P75L92K41n79l86p6j86J69N38J13N7j4
1713C34p22k40K7N90M25J38k21k05m76k89j71M25P12O94n43n71l48j19J60L65
1733c5L41L00k12m86l59k88M46M01M94J29k37n02n98N3l8O59K42P2p7m82k06k31
$$ plain form
1587 884 462 -668 -1007 -790 -217 30 860 556 308 -487 -736 -484 -194 912 644 412 102 -639 -621 -594
1607 -594 60 729 1124 607 -368 -588 -731 -114 143 463 725 466 -367 -684 -927 -497 75 745 826 423
1627 423 -266 -746 -540 -380 188 623 594 49 -558 -872 -339 -150 359 595 587 232 -488 -744 -457 -209 670
1648 670 580 236 -166 -723 -845 -542 194 627 653 239 -370 -579 -447 -483 28 514 470 360 -297 -699 -730 -179
1670 -179 546 539 656 179 -255 -605 -687 -319 327 918 944 -208 -345 -511 -543 -46 417 725 544 314 -483
1691 -483 -610 -414 141 632 625 458 -248 -664 -697 -710 65 457 698 119 -267 -343 -529 -360 178 291 348 334
1713 334 -388 -628 -601 -11 414 552 331 126 -350 -639 -810 -385 327 1021 478 -93 -441 -560 -400 -35
1733 -35 306 606 394 -92 -451 -739 -293 108 602 731 494 -8 -606 -553 -591 68 310 382 305 -177 -383 -614
1755f14N89L54l0M4k82o1n81k45N92M36M84p9o97l42k22K96Q0K71N24J48n30n63
1777d28n20L79O58M06Km3k89m84j69q4L08O56J39k32p84k17J12K62M46K52J6o6
1799C20l88m44k76K90J126J59l07l59m24k60K86K01K78J00M10l10p93l98M40M74
1819A25J35J49lk75k80m28J64L50P65Ol13m61m41R2L01J56L27P7K12o50n86j34
1841g12M48M30K04j88l2j20k46l22L09L39M31n7l73q83J79K40M37J70l3MO7n99
1863c07m90J83N10P32j80j17n66N9o9pK58J77M80m42k21o31k5M17M88L06j68R4
1885D81o34m53J5n6J072M19k95l56m51k36N0L41J9L29K44j77p06l57L70J93M26
1906B38L76j54m23l13O4k72N38M31L99n06o02n4j80k20P71M95M8j51l63m76k95
$$ plain form
1755 -614 -25 329 299 343 61 0 -581 -826 -234 202 686 607 -90 -432 -654 -358 -278 -7 517 665 135 -428
1777 -428 -948 -569 89 495 497 454 165 -319 -488 -572 -264 392 531 299 -485 -702 -590 -328 118 370 386 320
1799 320 -68 -512 -788 -498 628 787 480 121 -303 -563 -277 -76 202 302 712 402 -391 -789 -349 125
1819 125 260 409 406 131 -149 -577 -413 -63 702 708 395 -66 -507 -415 -114 42 369 446 658 8 -578 -712
1841 -712 -264 166 370 182 150 30 -216 -538 -229 110 541 484 111 -772 -593 -353 84 254 221 225 292 -307
1863 -307 -797 -614 -104 628 448 331 -235 -176 -245 -252 6 183 663 221 0 -631 -656 -239 249 555 387 481
1885 481 -153 -606 -591 -647 425 844 549 193 -258 -494 -444 -103 -84 245 489 312 -394 -751 -381 -188 238
1906 238 614 460 37 -276 -212 -484 54 485 884 378 -224 -278 -458 -678 93 588 636 485 122 -354 -649
1927f49K64N17L63J54m82n03k06L03J95P5M26J63l94m67m30M01j8N55L02l03l81
1948a15j00J48l59K37M86Q2K80p86l37k56J79P81K53m2l96P6l36m12J26P80L47
1969F36p2n07m12k46O7L38J21M18K14k13o90k39L33J29N95m30J86k10k97l40J91
1990d28M18M71J91r6o46l47O0R8K0M39L05k8j93n56j49J89L83K10L40m59m26k47
2012d51N2N28k38M26P2j35n16k92M02l6K80L45l02J62l67j72m03N19N71j22L4
2033C57m11k69mKK26L78M06k57j38o17q8J5M61K95O0j5m98q7m08M31K66l3N16
2056E88m38l29l58J31L61r9O05L5n26q3m48J96J53M79O4j85K24p27n2K1K86M40
2078C38k64L13j76l51j17J97P9N39k28j12l55m10R8J31K53J58L70j90n06l91J4
$$ plain form
1927 -649 -385 132 495 649 167 -336 -542 -239 -44 31 457 620 226 -241 -671 -270 -288 267 569 266 -115
1948 -115 -215 -67 -426 -189 297 379 659 -127 -464 -720 -541 240 493 451 55 131 -205 -617 -491 289 636
1969 636 564 57 -355 -601 -534 -196 -75 343 557 344 -346 -585 -252 -123 472 42 228 18 -279 -619 -428
1990 -428 -10 461 652 556 -90 -437 -377 -279 -259 180 485 457 264 -292 -441 -252 131 341 681 222 -204 -451
2012 -451 -399 129 -109 317 389 254 -262 -554 -152 -188 92 437 135 297 -70 -242 -645 -126 445 323 357
2033 357 -54 -323 -327 -325 -99 279 685 428 290 -327 -415 -400 61 356 416 401 -97 -184 -592 -161 105 72 588
2056 588 150 -179 -537 -406 -45 -144 461 496 -30 -113 -561 -365 -212 267 331 146 370 -357 -409 -388 -102 338
2078 338 74 387 211 -140 -257 -60 19 558 330 218 -137 -547 -449 -318 -65 93 463 273 -233 -624 -610
2099f10Q1L23L53K43j08j11m75J75j72O30K8j3o7n14q2J47L25J25MJ04k51j39
2121dl60K03N0L60J98m28q5k77j35j4M64L96%m0n46o3M9LQ1J42L27r2k61k98o6
2146c96j8M59J14L44j68l68l07J4q0N51J53J5j74m63j00J20K38J99K55%k84l21
2168b17k84j02O43j01L50K05m19j70m57J22M76K15n8j31l15M3k20J94K34L57j03
2189B62k22j34j74J48q3K45qK61o6m66k87q9M30M15J49J60l31l84k79K06L61r4
2211B0oP4J01n15J41J13J09O1J39m3j32Nm15M0L87J21J54k33k88l00j2O46j17
2234E0J92K39m64o3p40M94J56L72R1k51J03l03j99K6M49J11Q5n6k88l20L5J49
2256a32j90M89K6J64m07j96j47J41M21M0q2Q8j61m14P6nL79M28l7m94j87j49J43
$$ plain form
2099 -610 -529 -206 147 390 282 171 -304 -129 -301 329 357 344 277 -237 -319 -172 153 278 282 386 135 -4
2121 -4 -364 -161 -111 249 447 19 -66 -343 -478 -492 -28 368 368 328 -218 -281 -232 -229 -148 -6 321 229 -32 -330 -396
2146 -396 -414 45 159 503 335 -33 -340 -326 -406 145 298 313 139 -324 -424 -304 -66 133 388 388 104 -217
2168 -217 -501 -603 40 -61 289 494 75 -95 -552 -430 46 261 203 72 -243 -200 -420 -226 8 365 262
2189 262 40 -94 -268 -120 -203 42 34 295 229 -237 -524 -613 -183 232 381 541 210 -174 -453 -247 114 20
2211 20 14 88 189 -326 -185 -72 37 98 237 194 62 67 -348 -308 79 200 354 121 -167 -467 -479 167 50
2234 50 242 481 17 -46 -786 -292 -136 236 327 76 179 -124 -323 -297 152 263 348 292 4 -316 -281 -132
2256 -132 -322 167 193 357 -50 -246 -393 -252 169 209 127 215 54 -360 -284 -289 90 518 481 -13 -200 -349 -206
2279b06J08J48J40J02j63m44J1k57L16K68N90n51K28k60n03L0L76K10nj0j50k26
2301b48j58J84K37L46n0m6j91j13j69J5J83R5K91j82k22k45J98l54O85J27j15
2322B68k07k5m11J23k5N81j03K7j56j71K7p5l8L73O8Q3l66l94Q0J35K26lM13l22
2346A08K7j58l09M72j05J65K99l09jn90j9O44k95J77L07k11p5l65o8J80K81K77
2368D32k53K38p40J12nK4Q0M86k13j95k00j59K52j33L98n3L68l16l88M80n28M54
2390A41K00J1k05m90K34k25O9K68K62n2J9k60j38j1o4O5M93J06j46l14k96j0K40
2413a03L09K0Jk56q7q1R3k7Q6M84r6j26n42k13J20K68K77J22j82J04n0m72p4Q7
2437c38M94J01Q0n34p1J19J74r5L56O0m45K47l12j08J91L40q6P5j87j75j73K0
$$ plain form
2279 -206 -98 50 190 292 129 -315 -304 -561 -245 23 613 62 290 30 -473 -443 -67 143 138 128 -22 -248
2301 -248 -406 -222 15 361 311 265 74 -39 -208 -193 -10 85 376 194 -28 -273 -75 -429 256 383 268
2322 268 61 36 -375 -252 -277 304 201 228 72 -99 -72 -147 -185 188 256 339 -27 -421 -341 -206 20 17 430 108
2346 108 135 -23 -332 140 35 200 499 190 189 -401 -420 224 -71 106 413 202 127 -238 -306 -126 155 432
2368 432 179 417 -323 -211 -216 -192 -112 374 161 -34 -234 -393 -141 -274 124 71 439 123 -265 215 -313 141
2390 141 341 352 147 -343 -109 -334 -265 3 265 213 232 -28 -166 -177 -241 -176 317 423 277 -37 -333 -343 -103
2413 -103 206 226 227 -29 -116 -197 -104 -131 -45 439 343 217 -325 -538 -418 -150 127 249 67 171 121 -351 -425 -338
2437 -338 156 257 337 -197 -268 -149 25 -70 286 346 -99 148 -164 -272 -81 259 173 248 61 -114 -287 -267
2459b67kK69J55J49j67k46j07j07K64K59j2q5o9k64J03rN3K82K60k48k42J81l07
2482a57m7L15K1L44k13k84j52l34J58L62Q0K59j94k09k90N2J88N5M66J28k63n23
2504b38l2J17L47l53L82L9j00k37j0k47L25q6L95k12l5l48K13j63J67J16L26J5
2526C81n75mk68J65J97L81J10k14j09L2o06K02M17L4r7k33n3J8J4J53Q4J65kr7
2550I5m4j88j80M34n5L50j48m09q0l4J34P0K20j09K2l30M73k93j69K59j17J80
2572H1j60j45R4j30J16J52k5K35p1m62J73j4J38p9J02N45o06m0j08J16J0%M08
2595C30R2l29m7k31J8K78K04J50k66k10J70m57M52j65Q9J3j31J57j76j18Q3m9
2617a43L83k30Oj63K10O0j53K08o8K95k20k41j68j9J58J93j0k3p4p8j51m1K51
$$ plain form
2459 -267 -269 0 155 304 137 -109 -216 -323 -59 200 188 103 34 -230 -127 -136 -83 199 459 211 -31 150 -157
2482 -157 -204 111 132 476 263 -21 -173 -507 -349 13 93 352 158 -51 -341 -289 -101 -46 420 548 285 -238
2504 -238 -270 -153 194 -159 223 262 162 -75 -85 -332 -7 -93 302 90 55 -293 -80 -243 -76 40 366 381
2526 381 -194 -198 -466 -301 -104 277 387 173 64 96 -510 -308 109 143 46 -187 -240 -222 -208 -55 29 194 192 95
2550 95 51 -137 -317 117 62 412 264 -145 -225 -259 -125 -55 165 56 78 -252 221 -72 -241 18 -99 81
2572 81 -79 -224 -130 -260 -144 8 -17 218 147 -315 -142 -156 -18 -97 5 550 -56 -96 -204 -88 -78 -78 330
2595 330 422 93 46 -185 -167 111 315 465 199 -11 159 -298 154 -11 78 91 -40 117 -59 -177 -94 -143
2617 -143 240 10 16 -147 63 123 -30 178 110 405 185 -56 -224 -243 -85 108 98 75 1 -77 -228 -269 -18
2640a8K8K22j03J14j65j45k80J56M55R2j33l08L7l89L20j63L81P6K35k98k66k80
2662d32L14L24M4l06K12J33k99l37K16l3M51l53L75j91k06j47K33P6m1J21L5n8
2684A31m61K5K9L70J73k75k6J36l19oQ1K38K2O9kl47j08J26K62O4K2Q3k49J97
2708B35m10J40J56KJ25N3k79J00l94J26J66J11j87O7q2q6j97K35K15Q0j51R2p2
2731D5l50K57r6L93l96P7N5j68J02k05K04K33q5n7K2Q0j86Q2J32p7K97l42M2m8
2755A1j14j73K14K49J06L8l27m9j6k35P5K75N9N5l16j53L12P0j10l0p5J54j16
2778i6k64L09k34M53J91j31j11j54o2J27ON7n7m2K4n5j5o3J36P0Q8q4j62n7p5
2803b01K82j41J24o9O1mk71J30j86K66o3K59j56K8j09L9r2M62n22O5P3o6J21k05
$$ plain form
2640 -18 10 232 129 243 78 -67 -347 -191 264 356 223 -85 -48 -437 -117 -280 101 177 412 114 -152 -432
2662 -432 -118 206 250 -56 156 289 -10 -347 -131 -164 287 -66 309 118 -88 -235 -2 74 33 154 189 131
2684 131 -330 -305 -276 94 267 -8 -34 102 -217 -223 -142 96 118 187 185 -162 -270 -144 118 182 204 287 38 235
2708 235 -175 -35 121 123 248 301 22 122 -272 -146 20 131 -56 11 -71 -157 -354 -119 96 176 25 117 45
2731 45 -305 -48 -144 249 -147 -70 -15 -183 -81 -286 -82 151 66 9 31 111 -75 7 139 62 359 17 59 11
2755 11 -103 -276 -62 187 293 331 4 -45 -61 -296 -221 54 113 168 -148 -301 11 81 -29 -59 -134 20 -96
2778 -96 -360 -51 -285 168 359 228 117 -37 -99 28 34 91 34 -8 16 -39 -54 -117 19 89 177 93 -69 -126 -201
2803 -201 81 -60 64 -5 56 52 -219 -89 -275 -9 -72 187 31 59 -50 -11 -103 359 -163 -98 -25 -91 30 -175
2827a75L3K55Q1j6j97N3n18K21J91k6Q9K53l19J57q2p3J76P2K21l82j2K17m23
2850b04L6L09q7N4P4p2k4m09L73K0J75n8k8k35j86K15K03j71J41l1j2L2l86J08
2874a63n7N40n1j66l42J21p3J92j19M26j50j6j30l05J3K71j98J05O8K9k78L73
2896I0q9j72L77J42k05O3J35o20JK36j4J16J24o2n88L86q2K05M1J87J20j37j43
2919A11o3k95J71RJ66J3L0j29k86J66O1K3J81J53k73M0j87L1o9Q4J60L8Q2m83
2943b66J57r5j10M03J46l0k96j98J95oK43q8L70l92r2r8kQ1P9J31J09k70K42j89
2967B4k5L6m0M5j17m6n9J43L3J75j91L49m38J19j39J54j36J25o7L40r6l63J20
2990e4j53L33j80J26J82j56j75n0j01L1J76J98j85R5k68r3Q4L52J50k83M29m42
$$ plain form
2827 -175 -142 113 194 178 -19 34 -484 -263 -72 -98 -9 244 -75 82 0 -73 103 175 396 14 2 219 -204
2850 -204 -168 141 54 108 182 110 86 -323 50 70 245 187 159 -76 -262 -47 156 -15 126 95 83 115 -271 -163
2874 -163 -220 320 269 103 -239 -118 -191 1 -118 308 158 142 12 -293 -280 -9 -207 -102 -34 -5 -283 90
2896 90 1 -171 206 348 143 206 341 -279 -278 -42 -56 60 184 122 -466 -80 -162 43 84 271 391 254 111
2919 111 48 -247 -76 -67 99 112 142 13 -273 -107 -46 -23 158 311 38 78 -109 -78 -147 -63 97 135 217 -266
2943 -266 -109 -204 -314 89 235 205 -91 -289 -94 -100 143 55 425 33 -59 -157 -159 -78 1 132 241 -29 213 24
2967 24 -1 35 -5 40 -77 -123 -182 -39 -6 169 -22 327 -111 8 -131 23 -113 12 -55 285 189 -174 -54
2990 -54 -207 126 -54 72 254 98 -77 -127 -228 -197 -21 177 -8 87 -181 -274 -190 162 312 29 458 16
3012A6R9j56j35K20P8k23l7K19k32j4J76J36j14J42j69k6j40o5R6r8J91M19l66
3035A7j3m2l91M10J5j26k86N86k02k61J62M6Q0R7R5j60r3L3j04J31r9P6J25J8
3059A14l26J06K73k01K01J41j91J11m36mJ09O8k2n1K82m28L97m3j9m3L12l9m28
3082a17J61q5J17m0j63J42Mk4K49n24J75J58m7R6j57J07r0lm3p7Q6R1J27l09j64
3107c30L35j33L18o9J05l13O0k05P8M02k19K01m48L71k74J67j85J36mm9N5J51
3129A50o9M4l31K44j50J27J2L88m05j71J37l12L27j7K79N2m46j51L03l58K90K16
3151A59j36k93K20j25N11m84M02o0k54p0O0L46n35K12K28j17j22l54M00R8Q2J9
3173A87l16Q5N3j17j40J86J76p1jj12r5J35q3J26L30k84m4N8j88P4o6j9J00mn4
$$ plain form
3012 16 115 -41 -176 44 122 -101 -138 81 -151 -165 11 147 33 175 6 -20 -160 -225 -129 -227 -36 383 17
3035 17 4 -38 -429 -19 -4 -130 -416 170 -32 -293 -131 -85 -5 92 187 27 -66 -33 -137 -6 -105 -29 96 114
3059 114 -212 -106 167 -34 167 308 117 228 -208 -212 -103 -35 -57 -108 174 -254 143 100 81 38 350 311 -117
3082 -117 44 -41 76 36 -127 15 19 -5 244 -280 -105 53 6 102 -55 52 -38 -41 -84 -161 -75 16 143 -166 -330
3107 -330 5 -128 190 121 226 -87 -27 -232 -154 248 29 230 -218 153 -121 46 -139 -3 -7 -56 -1 150
3129 150 81 125 -206 38 -112 15 27 415 10 -161 -24 -336 -9 -26 253 305 -141 -292 11 -347 -57 159
3151 159 23 -270 -50 -175 336 -148 254 194 -60 -130 -70 276 -259 -47 181 64 -58 -412 -12 86 168 187
3173 187 -129 -44 9 -108 -248 -62 114 43 42 -70 -165 -30 -113 13 343 59 15 73 -115 -41 -107 -126 -26 -30 -84
3198h4L2P4j50j34K11K21k85K51J10j41P8j78k71J90R5m4j68J47j16J98jK33m47
3221a79K53R9k26M6J07k77M20N6l34L1k5l28K23K77l06M79n08L83j96k38L11N3
3243A21j00R1k2k69K79l2j10r4L54j18j22R3l18K25J3K1J11l1Q1k73J82j2j47
3266g7J4L08j76J7O0j09j57K82K5l2j1j79J80j87J06J09k08J64L9l37J75K36l59
3289a17l3M82k87Q5O9k43m8L15l96L59m2n57K63N9K06J30m03N6J67k90J72rO3
3312AJ54j59J84k63J01j76o0L09j74P4Q9k62N16m12L4J31j66J63J15l3Q6k26N5
3335H1j71J15q2L31j33l14L21o8k07M6%J54K43l20J8l1J20m57K10J59K95m42L87
3358B55k57Q7J66j67k14J01Q4j28M5J82o1m8nj66J62n5J9J03l33J04pM77m30K22
$$ plain form
3198 -84 -52 22 -128 -262 -51 170 -115 136 246 105 183 5 -266 -76 19 -25 -193 -46 -162 36 35 268 -179
3221 -179 74 173 -53 -7 100 -177 243 299 -35 -4 -29 -357 -134 143 -163 316 -192 191 -5 -243 68 121
3243 121 21 112 90 -179 100 68 -42 -136 218 100 -22 71 -247 -22 -9 12 123 92 173 -100 82 70 -77
3266 -77 -63 245 69 86 146 37 -120 162 187 155 144 -35 145 -42 64 173 -35 129 168 -169 6 242 -117
3289 -117 -150 332 45 130 199 -44 -92 223 -173 186 144 -413 -150 -91 115 245 -158 -102 65 -225 -53 -62 1
3312 1 155 -4 180 -83 18 -158 -218 91 -83 -9 80 -182 334 -78 -44 87 -79 84 199 166 252 26 81
3335 81 -90 25 -57 274 141 -173 148 80 -127 -81 -81 73 316 -4 14 -17 103 -354 -144 15 310 -132 255
3358 255 -2 85 251 84 -130 -29 55 -73 -28 154 93 45 40 -126 36 -19 0 103 -230 -126 -133 344 -86 136
3382A36o1j96M64k36j80k6J71qK2l26K67m0k4j73L68m90M25k86J30J45k3M5j64
3405f0J14j22J06K27j04m95M99N2m66J96q1L5L36L2m08K99l77J00J80k76J72Q6
3427D5k6j36J6J39o4J15M2J3q0J8p5L8l0J7J25l55K43k03J42rM8P6j98K85l10
3452a24R6J74j04k09M15j36j62j28J49Oj66R9J20n9J11k7K9qk39O0L2j41J06O
3476a00n1K92K3Or9j39J68j68R4j84R5j25L08j94P5Q1L7pJ18j81j78K38n7k07
3500a55j77L81j27k4L0%j03R2Q5J41j26j13J35j91J4L52k36o5J33Qk56J70K2p
3524a7l0L18q5O3l59Kj2R8j22J56L1J70j46k55L34J0n2p4r1j42M02l01J92k16
3548a26K38Q4r6j15J00O6n4n1k02o7J98j98K0O4K11j69r0K96p4k38L55j13j29
$$ plain form
3382 136 75 -121 343 107 -73 -99 72 64 86 -240 27 -13 -37 -210 158 -332 93 -193 -63 82 59 104 -60
3405 -60 54 -68 38 265 161 -334 165 217 -249 -53 -134 -99 237 269 -139 160 -217 -117 63 -213 -41 45
3427 45 19 -117 -101 38 -26 89 131 144 64 82 7 45 15 32 157 -198 45 -158 -16 -25 23 99 -99 186 -124
3452 -124 -28 146 42 -167 248 112 -50 -178 -29 -23 -189 -90 30 -29 82 55 84 76 -163 -103 -71 -212 -106 -100
3476 -100 -151 141 164 170 71 -68 100 -68 26 -158 -63 -188 120 -74 1 82 119 112 230 49 -129 109 52 -155
3500 -155 -332 49 -78 -102 -72 -72 -175 -83 2 143 17 -96 39 -152 -138 214 -22 -87 46 54 -202 -32 -10 -17
3524 -17 -47 271 186 249 -110 -108 -120 -22 -144 12 43 213 67 -188 146 156 104 30 -61 -203 199 -102 90 -126
3548 -126 112 196 100 -15 85 151 97 46 -156 -223 -25 -223 -203 -139 72 -97 -187 109 35 -203 152 39 -90
3571i0J71K5J5k16K58j75J98k79k75K49K3J94l3j52L18l51J68j3L28m35J51j30
3593e1K01j59J36l6r2p1j26K95j59J81j85J80kk8q0r7K25l30L5J98j48K81j0j21
3617C7jK6p7q0O0o3J19j54Q4R5J80j25K7k2m3k94M24l00L54l99K55j14j86J47
3641e0J90o2J34q0J26m32j35M68q9o0K0k0J6j23j70J80k23L26or2K96n68L22k3
3665e5K31j43J26K0k37Q1M2j22j13j46L08p0k51K92M4r8N33m58N9M1l09p3L24
3688B6O1k12K00j71L8K12l4j79r4R2K40l65J73N7K8r3K8k29R0L38k29L23k38m0
3712B2r0k26O7J80P3j54O9O7J74k6m8l75N8L44j86J27r1O3o9J22O4n2n7k81K33
3737Hk65N21l83L6J5J0J99l5rj84L66l03j66K23J85k99N5j03k4k61L58K08j0k37
$$ plain form
3571 -90 81 106 121 -95 163 -12 186 -93 -368 -119 -96 98 65 -87 231 -120 48 35 363 -72 79 -51
3593 -51 150 -9 127 91 -1 -72 -198 97 -62 119 -66 114 112 84 4 -93 132 -198 -163 35 -113 168 158 37
3617 37 36 62 -15 -95 -35 -98 21 -133 -49 46 226 101 128 106 63 -231 193 -107 247 -152 103 -11 -197 -50
3641 -50 140 78 212 132 258 -174 -309 159 70 10 30 10 26 -97 -267 -87 -310 16 10 -82 214 -354 -32 -55
3665 -55 176 33 159 179 -58 23 65 -57 -170 -316 -8 -78 -329 -37 7 -91 442 -16 43 84 -225 -298 26
3688 26 87 -125 75 -96 -58 154 120 -59 -153 -61 179 -186 -13 44 72 -21 7 -222 -132 206 -23 300 62 22
3712 22 -68 -294 -227 -47 26 -128 -59 8 182 156 108 -267 -209 135 -51 76 -15 48 -21 101 165 113 56 -225 8
3737 8 -257 264 -119 -83 -68 -58 141 106 97 -87 279 -24 -190 33 218 -81 -26 -129 -153 -414 -56 152 142 -95
3761i5q8J51J26j59J59k59J59n3J53K2K02l23Q7j79K49q2J82m9j12LP3k56n2J48
3785Gp0j07J06J48j28K84j06q1j23rLq2M0K86j31O9j01j68M05k01l7k69K87r8
3809g6K72k58K20n3j77J89q9j42j18K56p8LP1j21J70k95K33%l3J30P7k47o8n0
3833a84L22Q3l74K84L8k01p9J58K19n07L53k23n2p3K00k57J02N3L24r2l71L60
3855H3l3KJ20l91K62K10k36J33k19J62k78K12J0J77n8R5j65j07j24J97j39k20
3877c07M01n97N03O1j91K72k03Ok31K05O8O5J27k86K55l19L37l60J92K14k4j28
3899F0K9Kj22O6PoL24n28L56l59l4P1M3M01m11J51p5K3J1l48J39K80m8ll3K12
3925B08k00j30M7P3n7R8K3K6Mj02l0LJ21m4N3k51K46k17L19l23M7M09l90o8M10
$$ plain form
3761 -95 -183 -32 94 -65 94 -165 -6 -59 94 116 318 -5 82 -97 152 70 252 203 91 94 167 -89 -141 7
3785 7 -63 -170 -64 84 -44 240 134 53 -70 -79 -76 -158 -118 168 37 106 5 -163 242 41 4 -265 22 -76
3809 -76 196 -62 158 105 -72 117 28 -114 -232 24 -54 -51 20 -101 69 -226 7 7 -26 104 181 -66 -134 -184
3833 -184 138 221 -153 131 169 -32 -111 47 266 -241 112 -111 -163 -236 -36 -293 -191 -138 186 94 -277 83
3855 83 50 52 172 -219 43 253 17 150 -69 93 -185 27 37 214 156 251 86 -21 -145 52 -87 -307
3877 -307 94 -503 0 61 -130 142 -61 -55 -286 -81 -13 52 179 -107 148 -171 166 -194 -2 212 188 60
3899 60 89 91 -31 35 42 36 360 -168 188 -171 -205 -134 -91 310 -101 50 -25 -2 9 -339 -200 80 32 29 -4 208
3925 208 8 -122 -75 -2 -59 39 62 88 92 -10 -40 -37 84 40 93 -158 88 -129 190 -133 -86 323 -67 -135 275
3950B75l59P0j66M30k01nl4J04r4l8k5m3L03j75J06l80P8J44K4j21K38O5j50J1
3974E7j22l8L70j34J58l09R0Q4l43M72m7l13R3l21K69L41l35O4rK67l02Rk64P0
3998a93%j28L78k42J81N6m2k69M00k02l57M69j99J82l62L90J26j56q2k5J60j41
4020e6j32P6J38o7K57k30l9M9J44l53L6m1L30j42r7ol3N33n15L35p9k60K42o3
4044B7j40j53L82k06J83k94M14m78J79J21L9K2j51J00m0P2j33J91k75J96q5K74
4066B45k56K31j26m7n5k0j21K03n4L36o62J78J62J78j29j50m7J59o6j2m3K75j38
4089D1R9n9j85O1m9J25j77K86j44N5j09P1J5J57k29K8p8p4QJ51J26l11J67j19
4113a44K02j10J67m00K61J6rP6M6p8m8k01K7J52N3o4J3P3Q7q6J3j93L53k7j79
$$ plain form
3950 275 -84 -14 -180 250 49 44 10 114 20 -18 -43 -86 217 42 148 -232 -154 -10 14 -107 131 196 46 57
3974 57 -65 -103 267 133 291 -18 72 156 -187 285 238 -75 18 -303 -34 307 -28 36 27 294 -8 1 -263 -193
3998 -193 -193 -321 57 -185 -4 52 10 -259 141 -61 -418 51 -148 34 -328 62 188 32 -50 -75 85 -56
4020 -56 -188 -112 26 -41 216 -14 -53 -4 140 -213 -177 -218 112 -30 -127 -133 -166 367 -148 187 108 -152 90 27
4044 27 -113 -266 116 -90 93 -201 213 -265 -86 35 74 96 -55 45 5 77 -56 135 -140 56 -29 245
4066 245 -11 220 94 47 -8 -28 -149 54 0 336 -326 -148 14 192 63 -87 -134 25 -41 -53 -96 179 41
4089 41 140 81 -104 -43 -92 33 -144 142 -2 53 -56 15 30 187 -42 -14 -92 -166 -158 -7 119 -192 -25 -144
4113 -144 58 -52 115 -285 -24 -8 -17 59 105 27 -21 -222 -195 -43 10 -54 -41 32 119 33 46 -147 206 179 0
4138@m3L3N7j26J08J04K26m43jJ59r5m34M74j27J46Q2l8k3j11l7Q7J78j75P6j83
4163a06j35J26n0R6j45J54L77k64o4j60Mj8K49k61M51L7j01k02J51K4j26k36K05
4186Fj10K65j3J18l20k7l7j49K97k52Q5K17j06J3J79j16o9j73K34j72K41j93q2
4209a64K57M1k84q6K27N3j5J30j34k07K34K1jk07L47l20J94j60J64j6p5J67K5
4232A91J18m39k12K02k1K25P6J2n6K01k50o8m6l0J49k8k83J47L69m8n5p08J386
4255H32n52j56j19M0o4J31m0j22K54j68k29K82l7k17L54k8r1o3P9j5K21k05p6
4278A1J13n4j52J77J50k56K13q5j65j00n4N2J69l1n7j89J30K23p3j73M4K87j24
4301E6j62K74k56J31J12k04nP5M5Oj63J84j5k64L37j77lq0J43n0P4j95l4K49j84
$$ plain form
4138 0 -43 -10 47 -79 29 133 359 -84 -85 74 -21 -455 19 -108 38 120 82 59 -52 -89 -2 176 1 77 -106
4163 -106 -241 -115 -165 -69 -214 -60 317 53 -11 -171 -167 -185 64 -197 254 291 190 -12 139 163 37 -199 6
4186 6 -104 161 148 266 -54 -81 -118 -267 30 -222 -137 80 -26 -13 166 50 -19 -192 42 -130 111 -82 -164
4209 -164 93 134 -150 -236 -9 44 29 159 25 -182 52 73 72 -135 212 -108 86 -74 90 74 -1 166 191
4232 191 309 -130 -342 -140 -161 64 140 152 96 297 47 -21 -67 -97 52 24 -259 -112 257 209 154 -554 832
4255 832 280 124 5 45 -19 112 72 -50 204 36 -193 89 52 -165 189 161 70 7 86 71 292 87 11
4278 11 124 70 -82 95 245 -11 202 117 -48 -148 -202 -150 19 -12 -69 -258 -128 95 22 -151 -107 180 56
4301 56 -106 168 -88 43 155 -49 -54 21 66 72 -91 93 78 -186 151 -26 -29 -109 34 -16 58 -137 -171 78 -106
4326a06J37r5J93l69qM01l35J15r4J23K63m16J17J52K5k38K69l04P4R1l0k24K74
4349A5J5p9LK50j26k02N8k23M49p8j67K97j02K80l54p2P1j98K82n02O55k59j97
4372a84L02R3O9l06n4K15j90J94j16l3K82k32j6r8ok9OM2Q2j91j3M69l26JJ36
4397I7j24k43L38l13J04J95j8M0j91N9o0J03MJ85k38K0R4k20J09K97l24j85J28
4420a43K17j63L18Q9k74j42O1j45P6K13m9l2M6O7j45k11O4L52l62K80j1q9p3P9
4444B3N8j20l5J48Q7P3L9k28q5lJ10M0k87J52P7J55m5o9o4J5q7j67J15K47j90
4469d1N8M1m8j39J55J57k0j45j87J26Q6j18P4j39N08l60O3l64M56n8k34Q1n6J43
4493C9k25J29K04K4p9j71N8J36r4N3J86k25K4j25J31j40k58M85k76Nj3M8L5J39
$$ plain form
4326 -106 31 -64 129 -240 -248 153 -182 -67 -161 -38 225 -191 -74 78 103 -135 134 -170 -96 -5 -35 -259 15
4349 15 30 -49 -46 204 78 -124 -66 -289 160 82 -85 212 110 390 36 -36 35 -163 119 -383 272 13 -184
4372 -184 118 211 280 -26 -80 135 -55 139 23 -10 272 40 24 -74 -80 -109 -103 -61 21 -170 -183 286 -40 -39 97
4397 97 -27 -270 68 -245 -141 54 36 76 -115 -56 -116 -13 -9 176 -62 -42 52 -168 -59 238 -86 -271 -143
4420 -143 74 -89 229 318 44 -98 -37 -182 -106 107 58 26 72 139 -6 -217 -153 199 -163 117 106 17 -56 23
4444 23 81 -39 -74 74 161 234 273 45 -40 -43 67 107 -180 -28 49 204 159 90 26 41 -46 -213 -98 149 -41
4469 -41 17 58 10 -129 26 183 163 18 -169 -43 43 -75 -1 -140 368 8 71 -293 163 105 -129 -48 -104 39
4493 39 -186 -57 147 171 92 -79 -21 115 21 74 260 35 59 -66 65 -75 -333 152 -124 -119 -132 -84 -49 90
4517I0J68j93j37K23j66K9o0M8Q1k1QM3M5m88J51K63r7r1J38j32J53Q0n9j84R4
4542a4K17k77N9J09j05j50J28N3L1N3q6J75l6r3j93J52k07K81j23J52j6j44Q0
4565D6J62r4m24K57m5k9R6K9k19K14O2k33J33j18Q4J18J76k13j05n3j64L92L3
4588A05k55J55L8L11o30K83k6j10L33j00O7k33K14R1j92o11M14R0n25K47j48O69
4610A87N77p59j56M46j18n27N96j91j5k73O18l10m89R30j03p89M81m55j71P18
4630A97m4j25K67j21M81p63J38L04l14L86k15L03m63k6Rj69J8J25J56N5n02L19
4652A6j26J09J03n0J55k96Q3r0J50j11K73k22L4l50MJ01K71k1p4j08K3M5k52K88
4676d5K12j57j67M05m5l03R1J27j03j76L16o9np7J8j44K10j62K72Oj34%k26L54
$$ plain form
4517 90 258 65 -72 151 -15 14 -46 2 83 62 70 113 158 -330 -179 84 -13 -104 34 -98 55 135 76 -108 -14
4542 -14 203 -74 -15 94 -11 -161 -33 20 51 104 18 193 157 64 -129 23 -184 97 -26 126 110 -34 46
4565 46 208 114 -310 -53 -98 -127 -31 -2 -221 -7 55 -178 -45 -163 -79 39 215 2 -103 -156 -320 72 105
4588 105 -150 5 43 354 -276 7 -19 -129 204 104 171 -62 152 243 51 -560 -146 -56 -581 -334 -482 187
4610 187 764 5 -151 295 177 -350 246 55 40 -233 385 75 -414 516 413 -376 105 -350 -521 197
4630 197 153 28 295 174 655 -108 30 334 20 406 191 494 31 5 14 -155 -137 -12 144 199 -303 16
4652 16 -110 -1 102 52 207 -89 -6 -96 54 -57 216 -6 28 -322 -318 -217 54 33 -41 -149 -126 -81 -333 -45
4676 -45 167 10 -157 248 203 -100 -9 118 15 -161 155 86 81 4 22 -122 88 -74 198 204 70 70 -156 198
4700A98l18J96J40n6j58N8P7k11J08R6N6rm66N6K84m16L14K69kj23k18j4J58K48
4724B67l3m05M19j47k72J71j48p0N98m74L4m2k85M67R9p2k31J91l5m6O7L6k03
4747a14jK61Q5k42K7k61K81K40m43P2p5k04M18J54p4J85l55N2N2k7m6o4J49m72
4771d02L66L5q3K6K73j96M79l20l27L47j81k43J84K2K29l58K06j14J24j62K62
4792A67M1m4j04j29J38j7l95K26K94k47J12l70K85J42q3O5n1K5j08K1r5J59j00
4815f8%P0K69n08K24R3m19K64L6J61L7k45J67J05l11O4n3K76k02K77p4j9j04J77
4839B17l15o0k22M25J74l2k06k78L80k34L25j0Q5j65k64J61J62k86L64k6j8l53
4861a76J71J04k54q4M31j20j45J68k03K45O4o4l80K43J93j91Q3moQ2k18J62l6
$$ plain form
4700 198 -120 76 216 160 2 60 137 -74 34 130 186 177 -289 -233 51 -365 -51 218 216 93 -125 -139 19 267
4724 267 234 -171 248 101 -171 0 -148 -218 380 -94 -60 -102 -387 80 179 107 -124 67 32 -14 53 89 -114
4747 -114 -115 146 231 -11 16 -245 36 276 -167 -95 -170 -374 44 198 124 309 -46 6 58 31 -15 -79 70 -402
4771 -402 -36 -1 -84 -58 215 19 498 178 -149 198 17 -226 -42 -20 209 -149 57 -57 67 -95 167
4792 167 208 164 60 -69 69 52 -343 -117 177 -70 42 -328 -43 99 16 81 30 55 -53 -32 -127 32 -68
4815 -68 -68 2 271 -237 -13 80 -339 -75 -39 122 159 -86 81 186 -125 -61 -114 162 -40 237 163 144 40 217
4839 217 -98 -158 -380 45 219 187 -19 -297 83 -151 174 164 249 84 -180 -19 143 -143 221 195 177 -176
4861 -176 -5 99 -155 -239 192 72 -73 95 -108 137 201 137 -243 0 193 2 85 81 75 157 -61 101 65
4884F5j01O9J32j3m67M43m21K50O5j31J20J64k66n2J85l1M43j48m66K40k21M8
4906i3o7J31r6J98K20m92K99l8J14n6O5l57K72N9n4k19L90l07J5kn8pM0K75N6
4931B88l62K42l2p2j96J77j56K6J64j16L43j74k03K10j12l51O5M40l57Q8J3K88
4953B13j74K00k23jP6j32L2n1J53J58q7l44K25k8J72k06o0J30j35L7J36j58K02
4976A35j33MQ0n7M9j7m2K0J2N1P2j37L24k69N9j56K08l87K26k98K17m2m5K11j93
5001a08J06L0k91J33j54J53K41j6k61J69j20J20P5j84Q1Q4k30L55q8j42j04N1
5023a00l2M95m44J43J14j69j54J66k5J99l7L8k82n1L19k13j26R1K29j99J10R0
5045A62j42pMN5l89J05K15J8q2J85k37J06j49p3J50O5M8m6j20K87q3o6J24j36
$$ plain form
4884 65 -36 33 165 152 -315 128 -293 -43 22 -109 11 175 -91 -143 42 11 454 306 -160 80 -141 -93
4906 -93 -160 -29 -125 73 293 -199 100 62 176 120 185 -172 100 159 105 -114 276 -31 -16 -18 -76 -83 -43 232 288
4931 288 -74 168 136 64 -132 45 -111 -85 79 -37 306 132 -71 139 27 -324 -259 181 -176 -88 -75 213
4953 213 39 239 16 15 91 -41 -9 -60 93 251 164 -180 45 17 189 -17 -77 53 -82 -45 91 -67 135
4976 135 2 6 86 29 78 61 19 39 51 102 174 37 361 92 151 -5 203 -184 42 -256 -39 -81 -126 85 -108
5001 -108 -2 28 -263 -130 -284 -131 110 94 -167 2 -118 2 77 -107 -26 58 -172 183 95 -47 -151 -100
5023 -100 -132 363 -81 62 176 7 -147 19 -6 193 156 194 -88 -139 180 -33 -159 -68 161 -38 72 162
5045 162 20 13 17 72 -317 -212 3 21 -61 124 -113 -7 -156 -229 -79 -14 34 -12 -132 155 72 6 130 -6
5069fK7l3k41M03J0j93K5q0M9o8K37k38lK56J17j03p2j00J57j15JJ15k78K0P2
5094d1k85L91k31J61L5K23j86j13K67j14J10qr9l5K90n80K2L25k44J23k0j4Q8
5117F5q2OQ4j14K30l30J98o8j04R6j22J33j51L77M5k09j52L53j89k51J40P0j1
5140A4N7j80j91L92j70J14K6k14J44m7K08n1j02j63R6N8l12J73M78k29k5j2J23
5163A87o8J76l20J2J12L7o3k88J09J21n3J35k14K04j67j27L26n25N13n7j74L2
5185i2J26q0j48L22k5N8k9k73R1J80l57L71j89P7o0J71j89L24j29K7ml40M11m2
5209B01j30j58O3J0J22j77J5J0k33K75K10J39j05l68K91r2k53K72k88L07o8k88
5231b45L02j79J66k5j28N6o6m6M16m83K33p7J02j32K22k30J32J87j45j36J81j24
$$ plain form
5069 -6 21 -12 -253 150 160 -33 -8 -88 -39 -107 130 -108 -111 145 262 159 87 -13 144 29 30 145 -133 -113 -41
5094 -41 -326 65 -166 -5 30 253 67 -46 221 107 217 209 110 75 365 -215 -193 132 -112 11 -9 -23 65
5117 65 -17 -11 73 -41 189 -141 57 -11 -115 -19 -141 -8 -159 218 263 54 -98 255 66 -185 -45 25 14
5140 14 71 -109 -300 92 -78 36 62 -152 -8 -55 153 102 0 -163 -67 -9 -321 -148 330 101 76 64 187
5163 187 119 295 -25 -13 99 136 73 -215 -106 15 -38 97 -117 87 -80 -207 119 -406 107 50 -124 -92
5185 -92 34 -46 -194 128 103 161 132 -141 -50 130 -227 144 -45 32 -28 143 -46 278 149 176 172 -168 243 201
5209 201 71 -87 -24 -14 108 -69 -54 -44 -277 -2 208 347 242 -126 165 73 -180 92 -196 111 43 -245
5231 -245 57 -122 44 19 -109 -53 -119 -165 251 -232 1 -76 26 -106 116 -114 18 205 60 -76 105 -19
5253a9n1q9K08j16J93j22k17M42k60J99l36L84j10k60Q6l5P1l70M46J63o1l54
5275b08L70k06K22r6j53k9O9n7r4J65o8J57rJ51j60Kr5j44K5K6K59k21M20j56
5299A70l4n34N64k46J79j40j97M49l27K49j94J53L0K01k57m3k95M54k79N9n3J97
5321A06l49K22o9O9R0q4j62o5L29j25J31l2L3k43m5J11L29m86M31k06o8M33k70
5344H0k00K7K59j09j79Q9l8J56K16m3l07R1k36K60J64k95kJ86j37K54k40k12J39
5367g7J68j59P0L9k00L20j78Q1J06k47k02N47j17l02J25k9K55J06m10J64l8r4
5389g2j6M9k5k78N07j35RL0k21J71J25K8r0j82k8J96M8k26o9L36O8j96L8j13L25
5414B79n49L30r9j15J00O0n5k2J99j96N9r6J28l0o8j53L4N16l38m49N58Q5j77
$$ plain form
5253 -19 -70 -159 49 -67 126 4 -213 229 -31 168 -168 216 106 -154 -68 -103 -32 -402 44 207 146 -208
5275 -208 162 -44 178 82 -71 -100 -31 -88 -182 -17 -85 72 63 214 54 56 -39 -183 -158 -132 127 -94 326 170
5299 170 136 -398 166 -80 99 -41 -238 211 -116 133 -61 92 122 323 66 23 -272 182 -97 -38 -91 106
5321 106 -243 -21 -90 -21 69 -15 -177 -242 87 -38 93 61 94 -149 -194 -83 246 -240 191 -15 -83 350 80
5344 80 -120 -93 166 57 -122 -33 -71 85 301 258 -49 42 -194 66 230 -65 -67 119 -18 236 -4 -216 -77
5367 -77 91 -68 2 41 -159 161 -17 64 170 -77 -279 268 151 -151 -26 -55 200 306 -104 60 22 -72
5389 -72 -88 -39 -64 -342 165 30 39 69 -152 19 144 172 82 -100 -128 68 116 -110 -179 157 225 29 67 -46 279
5414 279 -270 60 -39 -154 -54 6 -49 -71 128 -68 -9 -105 23 -7 -75 -228 -194 322 -16 -465 93 178 1
5437Aj87J67J03k28K63l00K39L4j14J55j73L57k21O5J13l09k59K26J8Q2N1j35
5459e2M8o0L75l02L1J74k89J35j28K24k26K31j72M3K48l01M6p2k1J82r7j48J47
5482A6J76l81J55j6O5J3k52M5J03J99j46M3l4j14R6p2j8Q9L9J17o9k43J51mL2
5507a0K7l44L59rj13L82k28j27J48L5k30J59j17J18P8j40Q5p5J08R3l35K11n7
5530A8p5J03J43l31M4P5k46L19k44j14NN32j72K1K23n41L59k18J3K59J54n43N22
5553C06k74j07J78o0k52L61K8pk55OP7j41q0N5m8j81M66P4j46j94L98l65p4J29
5577a06J12o2M29J09n00p1qN71k26k9r4m4M1jK12l28P68n10m50O44l21O01r6j278
5601f37P5L79m63Q66n32j64p1l20J220m82J67O6R6m74N09j30j15J38k68R5k39
$$ plain form
5437 1 -186 -19 84 -144 119 -181 58 92 -22 133 -40 317 96 161 274 -35 -294 -68 -50 32 83 -52
5459 -52 -4 -64 311 9 40 214 -75 60 -68 156 -70 161 -11 32 280 -21 25 -47 -68 114 17 -131 16
5482 16 192 -189 -34 -50 15 28 -224 -179 -76 123 -23 20 -14 -128 -32 -104 -122 -33 6 123 54 -189 -38 -42 -10
5507 -10 17 -327 32 23 -90 292 64 -63 85 120 -110 49 -68 50 128 -12 73 -2 106 199 -136 75 18
5530 18 -57 46 189 -142 -98 -23 -269 50 -194 -308 -303 229 57 78 301 -240 119 -99 -86 173 327 -216 306
5553 306 32 -75 103 43 -209 152 180 173 -82 -76 1 -140 -220 -165 -213 -394 72 146 0 -194 204 -161 -235 -106
5577 -106 6 -56 373 482 -18 -89 -97 474 248 219 125 81 122 121 333 5 773 263 -187 457 136 737 641 -637
5601 -637 -562 -183 -646 220 -312 -476 -547 -867 353 -129 38 104 200 -274 235 105 -10 128 -140 -45 -284
5622b84J95j57P06j52l67k6j37N7J4J26J48j0J3k31J13o0j1M6K20j72j46L27p0
5645A42m3l31J84J51m63J55P5J19J85j11j70M25l98n0k0J03Rp8J82k48J24r7J72
5668A7k43K29P1J6l70K44l0J94m7M2l91K01J30j57J30J13M0m04L30j49l3j35K3
5691a79J53J13k22N5J10l03K26j54J96K11k68J29J34k51M1K13J9O0k07J8j53j34
5713a93L89J01k28j08j30m5R7M30k97j23M2K34j26n2n7j80J93o0R3j69K39k74
5735b24L77o2j22k40M13J8l18J81j23J04J2J59l05K37j55P1k77K1K93l23L35j99
5757a27L31l90j9L76k74j08L47j98L30m11N1q2K17J67p7j34j74M02j06O5k99q
5779a21N5J12j31K07m5k52J14L14j26j62J32k87J49j75M13m39K00K49k04P0k30
$$ plain form
5622 -284 -89 -246 460 308 -59 -85 -222 -165 -151 -25 123 113 126 -105 8 -52 -63 -17 203 31 -115 212 142
5645 142 99 -232 -48 103 -360 -205 -130 -11 174 63 -107 318 -80 -130 -150 -47 -38 -116 66 -182 -58 -155 17
5668 17 -226 3 74 90 -280 -36 -66 128 81 123 -268 -67 63 -94 36 149 189 -215 115 -34 -67 -202 -179
5691 -179 -26 87 -135 -80 30 -273 -47 -201 -5 206 -62 67 201 -50 -9 204 223 283 76 94 -59 -193
5713 -193 196 297 69 -39 -169 -214 -117 313 16 -107 -65 169 43 -9 -66 -246 -53 -113 -20 -189 50 -224
5735 -224 153 91 -31 -271 142 160 -158 23 -100 4 16 175 -130 107 -48 23 -254 -233 60 -263 72 -127
5757 -127 204 -186 -205 171 -103 -211 136 -62 268 -143 -92 -174 43 210 133 -1 -175 227 121 186 -113 -121
5779 -121 -66 46 -85 122 77 -175 -61 253 127 -35 97 -190 -41 -216 197 -242 -42 207 3 73 -157
5800a57L24l01J09l9L83j71j17q5K34q7n1pk2L1Kj06J7L3k8J0m4J12Jj72j24M01
5826A46k75K31l28K39N0k10K50k00J94j23j22Q4J12Q3r7N58n78j05K95l78r7L15
5848D4J28q0j85M23n29R5J45j81L70m38L74j10k46J64M0m5k3n8K37m1J56k63K60
5871B37l61J37m5L32j36m28M57k88K46l12K01m0J5q2oK93k97p4L18K4j36J9o9
5894Ek5P9j46O6oR4k01J47K2N4k85L9L97l15K0J96j79k52L32L55m61k7J84k09
5918a16K6j45M51j00k55K51q6J56k54M04o32N75j48N5j25Kj55K37j5n1m7J16k4
5941A20j46o3j4L78l49J22l9j79L18r8k48oj0J98j73k6M5K37m0N7j62J57j6j6
5965D7q7J2R0o5mj02K13n2j57K7p8J87m08K86J71j27N8J6n2j88K26K6k45K81j07
$$ plain form
5800 -157 167 -134 -25 -64 319 148 31 -54 180 93 42 35 13 44 46 -60 -43 -10 -38 -28 -72 40 41 -131 -255 146
5826 146 -129 102 -226 13 63 -147 103 -97 97 -26 -148 -64 48 131 34 592 14 -91 204 -174 -271 44
5848 44 172 92 -93 330 -199 -104 41 -140 230 -208 166 56 -190 -26 14 -31 -54 -112 125 84 240 -23 237
5871 237 -124 13 -32 300 164 -264 193 -95 151 -161 40 0 15 -67 -73 220 -77 -151 167 191 55 74 5
5894 5 -20 59 -87 -21 -27 67 -134 13 35 89 -196 -157 240 -75 -55 141 -38 -290 42 397 -64 -91 93 -116
5918 -116 -90 -235 216 116 -139 112 26 182 -72 332 -300 275 127 182 57 59 -96 141 126 75 28 144 120
5941 120 -26 -89 -103 275 -74 48 9 -170 148 50 -198 -204 -214 -16 -189 -215 -170 67 27 84 -78 79 63 47
5965 47 -40 -28 62 -3 -7 -109 104 52 -105 -78 -156 31 -377 -91 80 -47 11 27 -25 -213 13 39 -206 75 -32
5990c2j8K98k48j69L1m8L60k05L7J32J7K3k00j31J34K39k43j78L42j4r8j14j50
6013b35J71j38O62o04o5M11k46K9p8oM76o56QK00J24n9p0p1J9k8O2J32j10R8K4
6038E0n9j39K34J07l06P2j27K24j46k70K62L33k15j68r4K98j98J68j10K99l88
6059a73K43k97L14j44P4p8J14Q9m61J56R4K13p5L9M0m24L05j33Jj54K40o6R3O0
6083G0k22J44P2Q4n1j13K6M0r1J84k12l6J36J85k77K07q2k42J99k56N86k57j23
6106b9J60j20mJ22p8K5N7kj90j27L79r8j47j79K84J11j54l4l7J01j30O3J71l1
6130A13R4k80J22k69N19k22k75J02J22o4l8K69k40o2K69j6k2k14l4MK09L2j76
6153e7m3p2L04j25m5K82n1k44j40M22j4L6mk85Q3P9J94m19K22J02m26J91J21j84
$$ plain form
5990 -32 -50 248 0 -169 -138 -186 174 -31 6 138 155 178 -22 -153 -19 220 -23 -201 141 127 29 -85 -235
6013 -235 -64 -202 460 -144 -209 202 -44 -15 -93 -99 377 -279 -271 -71 53 -6 -76 -147 -128 -156 -94 38 -72 26 50
6038 50 -9 -148 86 193 -113 -41 -168 56 -90 -360 -98 235 20 -148 -242 56 -142 26 -84 215 -173
6059 -173 70 -227 87 -57 17 -61 53 142 -319 -163 -69 144 69 108 148 -276 29 -104 -103 -257 -17 -83 10 70
6083 70 -152 -8 64 148 97 -16 10 50 -41 143 -69 -105 31 216 -61 146 64 -178 21 -235 351 94 -29
6106 -29 131 11 7 129 51 76 133 131 -59 -186 193 95 -52 -231 53 164 10 -24 -61 40 -90 -27 144 113
6130 113 207 -73 49 -220 299 77 -198 -96 26 -38 -76 193 -47 -109 160 144 122 -92 -126 -122 87 119 -57
6153 -57 -100 -172 132 7 -38 244 193 -51 -191 231 217 253 249 -36 47 126 320 -99 123 225 -201 -10 111 -73
6177g3J59p2J38l55K33J26k20q6J49J51j84J01J62l27J46l7P6j41k4K56o5O1K8
6200B02l81K59k36O0Q1r9NJ52J67l84J38k8L79m78J54j09J99p9j16J82k6J18j03
6223E7K25q3j50J04m04j4K33J78l27L10k48P0J84j12J93O1l01K10J53j00j96j71
6245a28K36k09J86Ml49K71j43K17O1k81JJ30J20n9p5k0kJ79l23m5P0o4J80Q9Q4
6270A30Om3P2n2j21K0l04L46J9j07P9k05J11J51N4k95QQ4J35l42K43J04j41l0
6294g8l64M15j10L14j55k77L64j42J19k6m30L62Q1j68J42l9J56p5qK26l01J46
6316A52k56J04o6l2n1J47J24m3j93Q4k8J68j94K69j68j70N76m53M6K2j74L13k94
6339a17L94m75M51m18p3M83k81J10p9o2J7J88o8j23J57m10M79j48j06M08l84m7
$$ plain form
6177 -73 86 14 152 -203 30 156 -64 -150 -1 150 -34 67 229 -98 48 11 87 -54 -78 178 113 174 202
6200 202 -179 80 -156 -96 -15 -114 -109 43 210 -174 -36 -64 315 -163 -9 -118 81 2 -114 68 42 160 57
6223 57 282 199 49 153 -251 -265 -32 146 -181 129 -119 -49 135 23 216 277 -24 186 339 239 43 -128
6245 -128 108 -101 85 89 -260 11 -132 85 146 -135 -134 -4 116 57 -18 -38 -40 139 -184 -229 -159 -223 -43 46 130
6270 130 136 93 165 113 -8 12 -292 54 73 -34 45 -160 -49 102 156 -139 -131 -47 88 -254 -11 93 -48 -78
6294 -78 -442 -27 -137 177 22 -255 109 -33 86 60 -370 -8 73 -95 47 8 164 89 81 307 6 152
6316 152 -104 0 -66 -98 -149 -2 122 79 -114 -30 -58 110 -84 185 17 -153 423 -30 16 38 -136 177 -117
6339 -117 277 -198 253 -165 -238 245 -36 74 -5 -67 -50 138 70 -53 104 -306 173 25 -81 327 -57 -104
6361a04J24q1L09l05qM1J53k05P4N6k63K07J42j24j40P1k7j02L17l11p4K98p4
6384b6J52r7o0o2j49L86j36k78K21K06j24N7L1j34K6J8K8j29m0J14n8J45Qk26
6408a27L4k01K11N30l62J6m6l1r3p1J37NJ26j10K1m2j7r5J17k60J91K62l1k82
6432a18K43m18K15L77j24k71p9J5K14J4N0k15j48N40k17R2k31K93j32M2q3k25
6454a66n5K76k3Q0L8j49j31R5K52R8l04J25o2j31j03K87l65J28J63P5j51j48J92
6477B1j38K43k61J28R3q2j86L84k23J74j50p4K36%n8j17j37K08j4J19k65J40K69
6500C10l70P0m9L54n13L36j65M5Lj10K04j04q4Q5n0L1j22K61q8N8j24M2L6r6N1
6525A1j12O3p9J72jNk04o1N6N9n3L58j62j55J9q2L05L6M5j99Pk1j77k8L28n9l7
$$ plain form
6361 -104 20 -61 248 -57 -65 -24 129 -76 -2 54 -209 -2 140 16 -124 -53 -80 -182 135 -176 -250 48 -26
6384 -26 126 29 -31 -93 -242 144 8 -270 -49 157 33 90 121 -13 13 31 59 -70 -110 4 -54 91 99 -127
6408 -127 -93 -294 -83 447 85 101 55 24 -69 -140 -3 2 128 18 39 -3 -20 -115 2 -258 -67 195 164 -118
6432 -118 125 -293 -78 299 175 -96 -175 -160 54 68 118 -97 -245 295 78 170 -61 232 100 142 59 -166
6454 -166 -221 55 32 112 150 1 -130 -35 217 315 11 136 74 -57 -160 127 -238 -110 53 128 -23 -171 21
6477 21 -117 126 -135 -7 86 4 -182 202 -21 153 3 -71 165 165 107 -10 -147 61 47 166 -99 41 310
6500 310 -60 10 -39 315 -198 138 -27 18 21 -89 115 11 -73 12 -38 -7 -129 132 44 102 -22 20 56 -40 11
6525 11 -101 -38 -117 55 54 59 -145 -206 -150 -91 -144 214 52 -103 -84 -166 139 175 220 21 28 7 -170 -198 130 71 34
6552C4J74m08K4L58j90L26l98pJ45k79J82J74k41L1o5M13k33p2j23J80j6R5k37
6575a33l3K51l02J71P8j56N0L03k39n7K14j11M4J62m31lM54j80l51M8M8K61l3
6598E5k19K33k80K57N2k90Q6p9M25j81p8K19j16P9k22K5K34k27m0K14j44K34m13
6621a76J3J40R2k02K1L80l85J57J69k12m8j82L18k33J56l7j45J80j9n0O6n4n8
6644a09J49J51m53N14j81J3j35p7J96l5l1J84j15m5k1J06k32O4j0j1L73m92K24
6667B7M1J21j96MJ54j01j03Q0J38j0n8K43l98L52k71k86K94j21K46O9k66J29J82
6690B70k63J76j28m6J00j55J97j86J57k4l67L98j10Ml4p5J58j12n3r7J07K58k66
6713i1L1q0l4K60k81J92j38L72j68M3j57K26n5j08J5J84p2n2j57J88m9m1j6R1
$$ plain form
6552 34 208 -200 -176 182 -8 318 -80 -87 58 -221 -39 135 -106 -75 -140 273 40 -32 -155 25 9 104 -133
6575 -133 -166 85 -217 -46 32 -124 -74 229 -10 -67 147 36 80 242 -189 -192 262 82 -269 -221 -173 88 55
6598 55 -164 69 -211 46 98 -192 -106 -185 240 59 -19 200 84 163 -59 -34 200 -27 -67 147 3 237 -176
6621 -176 -163 -23 69 -133 -112 268 -117 40 209 -3 -51 -233 85 -148 8 -29 -174 6 -13 -63 3 -51 -109
6644 -109 40 191 -262 252 71 84 -51 -128 68 33 2 186 71 26 5 111 -121 -57 -67 -78 295 -197 27
6667 27 68 189 -7 -3 151 50 -53 27 165 155 97 340 -58 294 23 -263 31 -90 156 225 -41 88 270
6690 270 7 183 55 9 109 -46 151 -35 122 98 -269 129 19 23 -11 -86 72 -40 -93 -190 -83 175 -91
6713 -91 -60 -140 -174 86 -195 -3 -141 231 63 106 -51 175 120 12 27 211 139 87 -70 118 69 28 12 103
6737A03o5N8p7j63j06K55j42J68n4J66k95K02n5R2l42L54L36o09M19l35J65R5
6759A70l35J53K9r9P8p1J66j32J18O4k00K80Q3l55R9j03J69R4n43K82J2j18J32
6782b7j55L15r3j4L56k14j14m6j65m7J44K06k78K24N3m3k68J27J2L12k06k87L90
6805A82l59K05J1J16j83o0K94l71L15J0j11k0m2m8r8L51n3k22j19N35m47K99k3
6828A62j71j25L8J35j3j11PL4J07K56m11PJ05k18j74Q4M03m03L18j49j10J85Q5
6851D1j31Q4K89j33j92J66k9K70o3k11o5%L31k36j3J29k52K98j03j80k26J81N6
6874A1k21L7P0L97k61J13j95J15RJ9J97k15Q3k78N9K4p4J97l08K43j1k5j78O7
6898a25J4L27k40j0J59P1Pj64l2K0J80l18K47k22%R2j7J67l67J64J01J65k24j17
$$ plain form
6737 103 38 96 19 -144 -250 5 -137 31 -23 143 -152 50 -5 87 -255 99 435 -174 245 -90 75 170
6759 170 -165 -12 17 -82 -4 -75 91 -41 77 141 -59 221 304 -51 48 -55 114 208 -335 -53 -41 -159 -27
6782 -27 -182 133 40 26 382 168 54 8 -157 -204 -60 146 -132 92 145 102 -166 -39 -27 285 79 -208 182
6805 182 -177 28 39 155 -28 -88 206 -165 150 160 49 29 -13 -61 -159 192 139 -83 -202 333 -114 185 162
6828 162 -9 -134 -96 39 26 -85 -78 -44 63 319 -92 -85 20 -198 -372 -288 115 -288 30 -119 -229 -44 41
6851 41 -90 -6 283 150 -42 124 95 365 302 91 26 26 357 121 108 237 -15 283 180 0 -226 -45 11
6874 11 -210 -173 -103 294 33 146 -49 66 75 94 291 76 159 -119 -60 -36 -110 87 -221 22 11 -14 -192 -125
6898 -125 -111 216 -24 -34 125 196 203 39 7 27 207 -111 136 -86 -86 6 -11 156 -211 -47 54 219 -5 -122
6922a22p5J53J30k5o9m6P9l3J28M4l19J14L3j95K36L04m34l7K0N0j67M04L5l47
6946a39r9K74j7j3m9J1K98j9q4j09j20J40Q2k38K3L3j00k15J80jJ04Oj3n0L47
6971B32j65k08NM3o9L3P0J26j10L35k83k00L99k82J58Kj72K00l5k04m7J80N3j48
6995h7J17M5j1j12NJ51k19p1J31J40K01J7k85p8p9K7r2M93k47l5RQ1k92K35J3
7020E7r7k74O51M7n99K66J9l8k8L2N9p0k82J77K72L3j07k66K58K5m80P03l48J04
7044A14J93m37J94km5n7J18L9j26j81J92k14K32j04j4J69K06n78N19j59k07M4
7066a04J44k00M11j99l27J80L4J54j23J28j09j02J94p7j41Q3J22Q3j02m60N23
7087A12j90L7J83j34L8J7M9j10k85j5L16J90k51k5J04k10M41l83lM12n57N21k83
$$ plain form
6922 -122 -197 -44 86 61 -8 -54 25 -8 120 164 -155 -41 -8 -203 33 337 -97 -134 -114 -64 -231 173 208 -139
6946 -139 -238 36 19 6 -43 -32 266 247 163 54 -66 74 156 -82 -59 -26 -126 -341 -161 -162 -58 -52 -65 -115 232
6971 232 67 -141 -136 -93 -162 -129 -59 67 -43 292 9 -191 208 -74 84 86 -86 114 79 -125 -172 8 61 -87
6995 -87 30 75 64 -48 -43 108 -111 -182 -51 89 290 307 22 -56 -135 -108 -200 293 46 11 20 101 -191 44 57
7020 57 -40 -314 337 384 -215 51 70 32 4 36 95 25 -257 -80 192 225 118 -148 110 135 -345 358 10 114
7044 114 307 -130 64 62 17 -40 78 117 -9 -190 2 -212 20 -84 -98 71 277 -301 218 59 -148 -104
7066 -104 40 -160 251 52 -275 -95 -61 93 -30 98 -11 -113 81 4 -137 -54 68 151 49 -411 112
7087 112 -78 -41 142 8 46 63 112 2 -283 -298 18 208 -43 -68 36 -174 267 -116 -119 293 -264 257 -26
7110b6J9m1K80O6l98q6K89n7M7q3k2R0j19r2R9O3q4k00N9K43m2JN0P9l24L53m7
7137A17n9m2j48MK11j80K51j43J4J21j18J01k07K82q3n3M7j36j95K48j34J91R6
7160A85j05l9q7J66l20K16J38k3j48J8J93K2k60K12P9l41l7L43j52M1j73K49k57
7183h0j2L39k87K45n19L71J1k94M10k79J81l6j9K29k51J38J42j63j27r4J73l91
7205c13M80L0l37J40K5k59K70l1j37K75q8j09j3J23k6j12J8J06%J05k28J25l00
7228b56M21j43J12J40k62Ok34N1J71M8J90k29rj34j60K07L51k90J98k97J76j29
7250g2J88k78K09q0K93k91p2R5r8M7J27OM5N8l25J02k5L73k74j62J45J6J08j92
7274e7K09l45M75k60nl5J11j61M8o8K11j14q1p4J13KR7K17k97L99n06j2O6j6j69
$$ plain form
7110 -26 -7 -48 232 298 -100 -186 103 46 93 10 -12 78 -41 -133 -34 29 -55 -255 -196 47 5 6 56 135 -189 164 117
7137 117 58 16 -132 -128 83 -97 154 11 25 146 28 129 -78 204 121 68 115 -21 -216 32 -102 89 185
7160 185 80 41 -46 120 -200 16 154 131 -17 1 194 216 -44 168 247 -94 -131 212 60 101 -72 177 -80
7183 -80 -92 247 -40 205 -314 57 68 -226 184 -95 86 50 31 260 9 147 289 126 -1 -95 78 -313
7205 -313 167 197 -140 0 25 -234 36 5 -132 143 55 -54 -67 56 30 -82 -64 42 42 147 -81 44 -256
7228 -256 165 22 134 274 12 18 -216 -165 6 54 244 15 6 -128 -288 -81 270 -20 178 -119 57 -72
7250 -72 116 -162 47 -33 260 -31 -103 -8 -106 -59 68 74 119 177 -148 -46 -71 302 28 -134 11 27 135 -57
7274 -57 152 -193 282 22 17 -18 93 -68 -20 -88 123 9 -72 -146 -33 -31 66 283 -14 385 -121 -133 -67 -83 -252
7299b52N2Q0L49k40M5J6j46J82q9j9j75J55j28K86r7k35J67O4j8jJ59m65N94l73
7323h9R5j50O4J75l83L38q8K20j71n1o4K05m6l26L34j8j6j36J01p7J7O1J2P2K9
7348A08Q0k39L73m06K25k59L48q6m5k90J00J68j55O1L2q2j06J20J11l12M65j76
7370C5j95o8J49K63j62p7L0J02j44j85K64J3m1J15l1p8j89L41j28J05k5k09N3
7393f2J67p8J12j57pM4Pj86K64j53K20J60j61j71O3k19P31n24k77J40K3J9K75
7416B30o38K62J52K20k52m7N3j18K16j94J45J96j60k9M4j61RQP1j06J68K82m81
7439a30L12j84jJ47o9J04j14m5l2P2q1N0QK6J81k70k54J15L78j26L0o2J76k51
7463b0O9R2l06N4q5K28j9l39L97J4n6r2k28K39j00L44N7j74L2M3j11k18L5lj22
$$ plain form
7299 -252 -200 -120 229 -11 34 50 -96 86 -3 -22 -197 -42 -170 116 19 -216 -49 15 -3 -4 155 -310 284 -89
7323 -89 6 -144 -80 95 -288 50 -38 182 11 -40 -104 101 55 -271 63 45 29 -107 -6 -83 -66 -5 7 79 108
7348 108 188 -51 322 -84 141 -118 230 144 99 -191 -91 77 -78 -17 15 -67 -173 -53 58 -254 211 35
7370 35 -160 -228 -79 184 22 -55 -25 77 -67 -252 12 25 -16 99 68 -10 -199 142 14 119 94 -115 -62
7393 -62 105 27 139 -18 -25 19 26 -160 104 -49 171 331 170 -1 62 -157 574 50 -227 -87 -64 -45 230
7416 230 -408 -146 6 226 -26 -73 -20 -138 78 -116 29 225 65 36 80 -81 -72 -64 7 -99 69 351 -130
7439 -130 182 -2 -3 144 75 179 65 20 -12 60 -21 29 37 63 244 -26 -280 -165 213 87 117 55 231 -20
7463 -20 49 141 -165 -111 -196 32 13 -326 71 85 29 -63 -291 -52 -152 192 249 75 107 150 39 -179 -144 -147 -269
7488b69L1N8R8L96k58j27m93O74k05l4J92J8j19j42J80k21mK36m5K8K22l16J29
7511B9Lo5J03o6j04J44O6J9n7J11l10J37J67k59j71%K51n6kN7j12K46P8l98J26
7536f3P7j7j72R0N6j25L71n3j64j69n4k24L87K33k96J28l3J54J28j40Q8k76k10
7559b84j4M93j37RQ0p0k15J0K6m9K4O2r8M2L0K06k48J80K9r8J02J71l21j1j49
7584b30L4J55L0j37l3K62l52L99J36j19j14M6o9l24N08j30k00K65r9N2m36N20
7606A64j56j45J36k05J37J57r0J59o3k28K10j73K78j70j36J72k0Q1j27k08K40
7627A3k3j32K10kK15p2k27O4r6j16j4j50K58k6K1P6J57m57K44L68m75N1P4J85
7651A46j94K12k09j40K22J02r6J9k77L85r3k60K20j01J99j83M3m2j94J64K73j88
$$ plain form
7488 -269 -238 -180 -82 314 56 -71 -564 110 -95 -129 63 81 -38 -180 0 -221 -225 11 -34 -6 216 -100 29
7511 29 32 -33 70 4 -100 44 110 129 72 183 -127 10 177 -82 -253 -253 -2 -58 -60 -3 -115 131 209 -189 -63
7536 -63 14 -3 -175 -85 -29 -154 217 164 0 -169 -223 -447 -60 173 -123 5 -28 126 254 114 202 -74 -284
7559 -284 -298 195 58 67 147 77 -138 -128 -102 -151 -127 -65 -163 -121 -91 115 -133 47 76 -22 80 251 -70 -81 -230
7584 -230 -196 -41 -11 -148 -181 81 -271 128 264 145 31 77 8 -316 192 62 -138 127 28 80 -356 164
7606 164 8 -137 -1 -206 -69 88 -2 157 94 -134 76 -97 181 11 -125 47 27 108 -19 -227 13
7627 13 -10 -142 68 66 281 209 -18 46 -50 -166 -180 -330 -72 -98 -77 -1 156 -301 -57 311 -164 -113 -39 146
7651 146 -48 164 -45 -185 37 139 43 62 -215 170 77 -183 37 -64 135 -48 -5 -47 -241 -77 196 8
7673HK09l46L27l24J50j77M82m42J31k6j96m0K88m41N16n5k49L2M0N0Q5R5j18
7696a%q9K57l88J94K0k8j05J39K4n4K02l3j98J70k41J11j22j30K09O6J29j86Q8
7720C4L49l74N8k09l99P12l30l4K10j2j58O0P6Q9J15m71K26J28PJ33j20o4j00
7743g4J19j70L12m9m0l0p2Lk2j0k50J07K33j82J30L3k94M68l41L30j47j97J64
7766B1M6M28m63J08l25Q1P3O3r1r4k14L04K60j8P4m51Q0P9K01k12R1r3k82M09
7790G5m0j86J79J68k09k58J24R2K5L73l44N9k51K18q0k7k5j83J89J72n0j71j88
7813c38K52L08j13l70K32M09n22L33m42L19k53K08j41J13J10j84p0K64p5N5k6
7834F9j01J20j25q2J97k97J92J47m0j54M29m59J62O5Ll21K70n3m23L75Q5k53J88
$$ plain form
7673 8 217 -129 198 -126 24 -153 329 -113 18 -8 -204 -244 44 -397 119 64 -185 -153 -113 -63 22 117 -1
7696 -1 -1 -90 167 -221 -27 -7 -35 -140 -1 23 -31 171 138 -60 110 -131 -20 -142 -272 -63 3 132 -54 34
7720 34 383 9 67 -142 -541 171 -159 -193 17 5 -153 -93 -17 72 187 -284 -58 70 77 210 90 26 -74
7743 -74 45 -125 187 138 98 68 -4 -1 -23 -33 -283 -176 57 -125 5 38 -256 212 -129 201 54 -143 21
7766 21 67 495 32 140 -185 -104 -31 32 -59 -153 -367 -63 197 179 253 -198 -118 -39 162 -50 41 -52 -334 75
7790 75 35 -151 28 196 -13 -271 -147 -55 -30 343 -1 58 -193 25 -55 -82 -107 -290 -101 71 21 -150 -338
7813 -338 -86 222 109 -261 -29 380 -142 191 -251 68 -185 23 -118 -5 105 -79 -149 115 40 95 69
7834 69 -32 88 -37 -119 78 -219 -27 120 80 -74 355 -104 58 123 126 -195 75 22 -401 -26 59 -194 -6
7857fL0j13j18L28k43K6K42l59K0O13j72k14l9j17J40qo5Rj65K66k41NJ02J85
7881A06n4O0j00J58l14K61K6l11L83m06K39k64J33M4p3K33Mj96J55j31J44j53
7903e6K56k14J97l6k80J54k69K65K67l54N9Ml8m5J11K98m96J89k48K51J69p1k13
7926a00J30n5J07N9j29k65L28j34j96J40J15J20j08j50K91j64R2P3j02J6o9K9
7948B8Q5k07j9J45m1p3O8q1L3m3J92O2j58o2K79l96L7J29j68J18J7K05k88j37
7972b75K93j08j1K11r9J48j70r7j12J21j04J32K97k46o6J11K3Rk51j5J83n0L3
7995d3p9K03r5K14k7j30nl9L2J4q2J8Lj08J65n8J28o2q8O4k31L17p1J99j50m9
8021D0J9pk41j8r4M29j13o6j38J61J63j6J31m54L08J92l25j12J27j01J61o0k52
$$ plain form
7857 -6 24 -89 -207 121 -122 -96 146 -213 -193 420 248 34 -5 -122 18 10 -55 -46 -211 55 -186 -181 -79 106
7881 106 52 112 12 170 -144 117 143 -168 215 -191 48 -216 -83 -39 -112 121 125 -71 84 -47 97 -56
7903 -56 200 -14 183 147 -133 21 -248 17 284 -70 -11 -7 -45 -90 21 319 -177 12 -236 15 184 113 -100
7926 -100 30 -25 82 141 12 -253 75 -59 -255 -115 0 120 12 -138 153 -11 81 154 52 68 -1 28
7948 28 113 -94 -113 32 -9 -82 -14 -95 -62 -105 87 149 -9 -71 208 -188 -151 -22 -190 -72 -55 150 -138 -275
7972 -275 18 -90 -101 110 11 159 -11 -108 -220 -99 -203 -71 226 -20 -86 25 48 57 -194 -209 -26 -76 -43
7995 -43 -122 81 -14 200 173 43 38 -1 31 45 -37 -19 -16 -124 41 -17 111 49 -39 25 -206 111 40 239 89 40
8021 40 59 52 -189 -207 -301 128 15 -51 -189 -28 135 119 250 -204 104 296 -29 -141 -14 -115 46 -14 -266
8044b66J62M6J76l0mm14J58J50m9J76Jk09L8p4K63j89M4J57m08L90k42R1J70J16
8068B53m2J21n75N44m10J68J4m15J41J25J47l13J64q6p8J02K96j1k34kJ89j30
8090c2j15k31L06J44j31K28k24LR7m4r7J66m9j02o8O4Q0R1N4k61J28J91k58m2
8114a02L78r1j34J2N3m8k5k36K87j57k3L29l32q5J93J83j07j37o0j5L13q8j84
8137g6L03k15J4K4J47k01o6j24L31l54L54n5k18L51l17k2k11O00k26N5j34lqQ0
8161B9j66K61J2l45J22L4m8Mj32M01q0k40M0L50k47L7j66K54j57L1l8k31K41m2
8185g6j9K13j65J0j32J54
$$ plain form
8044 -266 -104 -58 118 88 84 -330 -172 -22 -71 105 106 -103 -65 -139 124 -65 -21 136 -272 118 -124 -33 137 253
8068 253 211 332 -243 301 -109 59 73 -342 -201 -76 71 -242 -78 -164 -242 -140 156 145 -89 -91 98 -32
8090 -32 -147 -378 -72 72 -59 169 -55 -52 45 1 -96 70 21 -81 -149 -85 -5 86 140 -121 7 198 -60 -102
8114 -102 276 185 51 63 116 68 43 -193 94 -63 -86 243 -89 -174 19 202 95 -42 -102 -117 196 108 -76
8137 -76 227 12 26 50 197 -4 -70 -194 137 -217 137 82 -136 215 -102 -124 -335 265 39 94 -40 -43 -51 29
8161 29 -137 124 136 -209 -87 -53 -101 -97 -229 172 92 -148 -108 242 -5 32 -134 120 -37 -6 -44 -275 -34 -76
8185 -76 -95 118 -47 -37 -169 -15
8191a5
$$ Imaginary data points
##PAGE= N=2
##DATA TABLE= (X++(I..I)), XYDATA
0@%%%%%%%%%%%%%%%%%%%%mJ2j6J6j6J6j6K1k9L2l3M0m7N2o0O8p6Q4r4J05j16J29
42F8j44J61j78J96k16K37k62K90l18L50l87M27m71N21n78O44p19Q07r12J038j198
63f44J407j688K087k708L827o468K8277O850l9673j6475R760K7097N705j3206
77D148j4881M741J1380L894q877o282K250P089J200l684m395o05P43L102M310
92D133L236k731q845o036L095P814M294j779j736K126J380o339r156j78J1071
107C49J0769o03j0332o902L283N664p67m745L49O407L974n466q211j571O940O652
123E790j201n978l434K498K537j134j621J306L634J510l616m986k807K307M840
138c55M121J022k298n089l209N91L153L696J345o28p63q32j286j762j196J111
$$ plain form
0 0 0 0 0 0 0 0 0 0 0 0 0 0 0 0 0 0 0 0 0 0 -4 8 -8 8 -8 8 -8 13 -16 16 -17 23 -24 28 -32 36 -40 44 -50 55 -61 68
42 68 -76 85 -93 103 -113 124 -138 152 -166 184 -203 224 -247 274 -304 340 -379 428 -484 554 -644
63 -644 763 -925 1162 -1546 2281 -4187 24090 30940 -8733 -25208 -15448 11649 17354 4148
77 4148 -10733 -5992 5388 9282 405 -5877 -3627 3462 4662 978 -3417 -4022 -3279 -177 4133
92 4133 7369 4638 -4207 -10243 -7148 666 4960 3181 1445 3571 4951 -1388 -10544 -10722 349
107 349 11118 10515 183 -6719 -3436 2228 1461 -3284 -2935 3472 7446 1980 -6231 -7802 -862 5790
123 5790 4589 -1389 -4823 -2325 212 -922 -2543 -1237 2397 3907 291 -4695 -7502 -5195 -355
138 -355 3766 4788 2490 -2599 -5808 -5217 -2064 1632 2977 2349 1586 754 -532 -2294 -3490 -2379
154b379L610L606J059l307m542j941J483L549K547J83j741j952j584j005J399
169a015L572L426j108n467n137O68N262L691j128k957N52L023p36o420o131L077
185f828J0873P375l498r593o223K179N632K747q21j330L74J22j007r23l18J047
201a92P65Q80J027m11k791l926O92N987N973j850p465n565J946N716J482k572
217c04l68L397K837m042q283k791N678Q548K456m612n087j020J085kL03K007L074
234B876r6l607l094N81L337J511j225p4J027Q62l008l324L36N308M031n32m317
251E92l162k66P82P74K151L442J357k834n328k946K091M420K307j352j118P82
267A692l19k666l586P83M865M112o08m260l346N6J741J280Q56J811L35k058l890
$$ plain form
154 -2379 1231 4837 5896 2589 -1953 -3894 -2411 1138 3685 3868 2127 175 -1409 -2414 -1015
169 -1015 2557 5983 4875 -592 -5729 -5061 201 3892 2764 -193 359 3382 2646 -3774 -9905 -6828
185 -6828 4045 11420 7922 -1671 -7894 -5715 -83 2664 1843 513 887 1009 2 -921 -1239 -192
201 -192 573 1453 2480 2069 -722 -4648 -3956 2031 8004 6154 -1311 -6876 -4930 786 2268 -304
217 -304 -672 2725 5562 1520 -6763 -9554 -3876 4672 7128 2516 -2571 -3591 -2506 -2508 -2205 -198 2876
234 2876 2780 -827 -3921 -3340 -3 1508 283 209 1236 2098 -910 -4234 -3898 1410 5441 4909 592
251 592 -2570 -2836 -2054 -1280 871 4313 5670 2836 -2492 -5438 -3347 1073 3380 2028 910 1692
267 1692 1373 -1293 -4879 -4096 769 4881 4273 13 -3333 -3277 -1536 -256 600 2411 2746 688 -3202
284c202j930L137M849K198k425l419j151L83N97m19M09L210K905p50m921m422
300d951n50M031M537J428j123k737j680j398J17J296J454J310j10k45j207j435
316a263j368m64K186M076J269l199n201k482L415N425K607k426l736j690R80N80
332a291k25K54K448K814j72l333m229j139K422L217K881N80j477k894k998p25
348c867K426L842J013j289k196o99Q6m5m77N33K177J529j296l515k326J167L287
365C50K411J98j416k025j894j178K48K926L058J467j593l213k472n0J148J528
381e07J850K108J76k556l347j880J464L396K694J19j927k666j183M24J451J799
397A415J307m89j643k401j170J159K175J612L68q87j166j305j643j021J595M061
$$ plain form
284 -3202 -5132 -1995 2854 5052 2627 -792 -1943 -1560 -963 -1382 -973 2237 5142 4392 -529 -4951
300 -4951 -5501 -1470 3067 4495 3372 635 -1045 -2443 -2326 -1030 424 1734 1624 1379 172 -1263
316 -1263 -2631 -3095 -909 3167 4436 1237 -3964 -6446 -3031 2394 5001 2575 -1161 -2851 -1871 -1291
332 -1291 -1516 -1262 1186 4000 3828 495 -3734 -4873 -2451 766 3647 4227 2750 -144 -3142 -3867
348 -3867 -1441 2401 3414 2125 -71 -770 -684 -729 -1206 -673 1504 3033 1737 -1778 -4104 -2937 350
365 350 2761 2959 1543 -482 -2376 -3554 -3306 -380 2678 4145 2552 -661 -3133 -3183 -2035 -507
381 -507 1343 3451 3627 1071 -2276 -4156 -2692 704 3398 3517 1590 -1076 -2259 -1835 -384 1415
397 1415 2722 2233 590 -1811 -2981 -1822 353 1965 2333 1446 280 -1025 -2668 -3689 -2094 1967
413A967K832p75m000l623q41K486K476J274N54l79p74k681j878L98K859K720l1
430B584j265j454p65p73m28J380L219K023k124m604k411K301L828J728j254j252
446G33j41l23k492j433J337M240L139j478l954k621O8Q92O92J523K825O04k330
463A281m010j840K542L589K67j211n90P32j94k455j464J837M189J788k617l867
479b023j310J485J821O10R80R45k94k891l318J5L607L916j65j805j637m25p86
496a275j783O65K885L530K81l586l774k55K145J679N64L66N55q07k237k084R03
513b228K621J990l50j639j207j10n00j62R44K488J765j288l067k568K18K143K376
530A426J380k42j059k049k211l77K022K702J375k81j868j805j348J06J367J486
$$ plain form
413 1967 4799 4024 24 -3599 -4440 -1954 522 1796 2350 1971 1197 -1484 -3362 -2964 -105 2615 2584
430 2584 1319 -135 -900 -1673 -2101 -721 2498 4521 2397 -2207 -4618 -2317 1511 3239 1985 733
446 733 592 269 -2223 -3656 -2319 1921 5060 3582 -372 -2993 -2925 -2033 -1341 182 3007 3611 1281
463 1281 -2729 -4569 -2027 1562 1829 618 28 760 566 -1889 -3353 -1516 2673 4461 1844 -2023
479 -2023 -3333 -1848 -27 583 1563 2508 2214 -677 -3995 -3980 -373 3543 3378 1573 -64 -489 -1275
496 -1275 -3058 -2393 492 4022 4303 717 -3057 -3312 -1167 512 1076 1442 1997 1190 -1047 -3131 -2228
513 -2228 393 2383 2033 394 -813 -923 -1423 -1585 -641 1847 3612 2324 -743 -3311 -3093 -950 1426
530 1426 2806 2564 1505 -544 -2755 -3132 -1110 1592 2967 2686 818 -987 -2335 -2229 -862 624
546F24J966J74j899k465j546P22J854K409O90j089k273j257J60R60J327J066P28
563B151j02j720k485j287J286L006K207l13j658k067j101k50L61K144K587Q73
579C632j943l282j668J448J772R76K14N22j92j394k493r16K193L610O85j498k133
596d67j334J79J68N54J844K480j96l300l228k38K769K508K19r64l1l18j397k710
614c462o4L836L415P5l333k594M20R19Q3J70J083K417m30l396k845M79L570J958
632B301o30j152r8j58j526j533M98L785K645j598l494k254R87J551J268L48Q62
649A802J037j650l266j840J871L206J756j307j583n41k15n21j038J403K763J598
665C475j946l064j681J505K285J89M7J41K98r25k513p26J865K870J480j491k396
$$ plain form
546 624 2590 2764 865 -1600 -3146 -2424 -570 1839 2529 1440 -833 -2090 -1930 -970 357 1423 2151
563 2151 2049 329 -2156 -3443 -2157 849 3056 2743 1085 -982 -2083 -2333 -1972 172 2759 3632
579 3632 1689 -1593 -3261 -1813 -41 935 1149 1671 1479 85 -2408 -3324 -1131 2479 3164 1666 -467
596 -467 -1801 -1622 -1454 -900 944 3424 3228 -72 -3300 -3538 -769 1739 1958 994 963 645 -752 -3462
614 -3462 -3526 310 3725 3800 467 -2127 -1707 -788 -705 -535 548 2965 2535 -861 -3706 -3227 343 2301
632 2301 1671 519 421 263 -1263 -2796 -2298 1487 4132 2534 -960 -3214 -2227 -676 592 940 1802
649 1802 2839 1189 -2077 -3917 -2046 1160 2916 1609 26 -515 -730 -1251 -2289 -886 1877 3475
665 3475 1529 -1535 -3216 -1711 574 763 810 951 1249 324 -2189 -2915 -1050 1820 3300 1809 -587
682e87r75J73j39N45J613K019M34k198k956j341J662K199J605l81o26n32j222
699g07j475o8J777K680J051k126k162q48J5J250R42R69O66k67j542k461o82J628
717a360K927J203r08j765j138o22k2L56J793J491Q60j412l099j120Q31J899J581
734A495K68m49n32j210j700j83J505K678J155j599k055j684P30Q86J018J063M19
751A805K05j519k530j123J601K840J562j037j287j166p80o72O03J785K193O74
767C154k077k786j346J623J523Q95O0M08n55j191j816n46J852K768N63j122j919
784e12o97K05L4J79J538J390o7j916k557n48K021K055P59l80r67q31r52q85L37
803a794J851K445N18k144k618n00Q22R66J359N97J02l48j810j756mJ658J824R23
$$ plain form
682 -587 -1562 -1389 -1528 -983 630 2649 3083 885 -2071 -3412 -1750 449 2054 1673 1047 515 -707
699 -707 -2182 -2250 -473 2207 3258 1132 -1030 -1878 -1863 -613 329 1298 1964 1697 155 -2306 -2988 -1360
717 -1360 1567 2770 1862 97 -1041 -1663 -1685 -1329 464 1955 2815 1403 -1696 -2816 -1985 -86 1495
734 1495 1763 1314 782 -428 -2128 -2311 -806 1872 3027 1428 -627 -2311 -1581 -695 323 1386 1805
751 1805 2010 491 -2039 -3162 -1561 1279 2841 1804 517 -649 -1429 -2101 -1498 287 2480 3154
767 3154 1077 -1709 -3055 -1432 91 986 1046 1454 899 -292 -2108 -2654 -802 1966 2529 1407 -512
784 -512 -1209 -1004 -970 -791 747 2137 2070 154 -2403 -2951 -930 1125 1884 1504 537 -294 -1246 -2131 -1794
803 -1794 57 2502 3020 876 -1742 -2242 -1420 -454 905 1502 1604 1256 -554 -2310 -2314 -656 1168 2091
821B091j100j003o22n26J6M05J498J521p9k077j776r48J308K184P21l4n21j045
839A3j187j067O38J825J766O14j717j753o38L13K89R41Q95J482p37j737k276l06
857b642J666K342N39r07p70p54n18j61l8J675J686P9j939j906o38J239J568N25
875A046L75J53r96j772j193M22K484J795l43j451j278k97k18K49N01J666J538
892B681n83k159k234K73J257J881J18J09k65r86j581j065J056K602J441p90j797
909d2j523m0P33J59J108J059O18j335j966j185R99J809J034K69l61j064j082j069
927a879L64J419J551P64r54j470r94r0L22R54R95Q78m23j619j448k82J168J357
945F13R83n7o53j654q42j43Q25J723J025k42j328j392p28K98J185J442Q34l86
$$ plain form
821 2091 991 -12 -634 -1160 -1144 -739 759 2280 2201 124 -1652 -2600 -1292 892 1613 1579 1058 13
839 13 -1174 -2241 -1603 222 1988 2602 885 -868 -1506 -1193 -904 37 932 2414 1677 -60 -2336 -2642
857 -2642 -976 1366 1905 998 228 -526 -1044 -1205 -1243 432 2118 2197 258 -1648 -2286 -1047 521 1046
875 1046 1421 1574 578 -1194 -2387 -1965 519 2314 1971 520 -758 -1055 -1273 -1024 -523 1143 2681
892 2681 2098 -61 -2295 -2022 -765 1116 1234 1343 1078 92 -1489 -2554 -1498 1104 2545 1755 -42
909 -42 -1565 -1605 -872 -713 395 1454 2072 737 -1229 -2414 -1415 394 1428 1697 1336 272 -810 -1879
927 -1879 -1515 -96 1455 2219 1265 -205 -1199 -1289 -967 -13 982 1860 1437 -182 -1630 -1912 -744 613
945 613 1596 1539 886 -768 -1610 -1753 -928 795 1820 1578 250 -1142 -1870 -1572 -387 1055 1889 1503
963A503j026j443n91J80J143J278P14Oj312j502r67Q69J483J059J86q29m73j243
981i65j75K1J213J492N07j137j643r40J71R81R53R29J83o01j485j274j11J536
999c45J726J39p50o42l60o33p61L47J663J957l91j531j903o11J358R36P42N13
1017A454qq72j321j308P97J764J589k93j631o67m13L67o36R34J117J279q28j927
1035f03j579N82J251J174K67k90j74p37j384n45J125J613J269q13j458q06N3R4
1053i61L77P02J346L34j134j909r64J058J412J045k70k68q07n72o10r9J097J817
1071A594N08j113j219r66m7Q19M93P09O64j50j345j481JO87J682M90k12r68q03
1090f57n78R4P06J104Q27k7j175j180m03M9J137N75J112k91j096j146o77L47J061
$$ plain form
963 1503 477 -966 -1557 -1377 -234 1044 1758 1764 452 -1050 -2017 -1148 335 1394 1580 751 278 -965
981 -965 -1140 -1119 94 1586 2093 956 -687 -1627 -1456 -475 478 1407 1590 989 -496 -1770 -1881 -345
999 -345 1381 1520 770 128 -232 -865 -1626 -1279 384 2341 1950 419 -1484 -2095 -737 199 941 1454
1017 1454 1446 574 -747 -2055 -1258 506 2095 1802 171 -496 -909 -542 -1178 -244 873 2152 1324 -603
1035 -603 -2182 -1600 -349 825 1092 802 628 -109 -1493 -2038 -913 700 1969 1156 -302 -1108 -1055 -961
1053 -961 -584 118 1464 1798 664 -1245 -2209 -1151 261 1306 1036 768 -39 -611 -1221 -1320 -223 1594
1071 1594 2102 989 -230 -1196 -1243 -424 69 778 1442 1292 -53 -1534 -1533 -846 836 1326 1114 146 -657
1090 -657 -1235 -1141 -435 669 1496 1469 294 -886 -1289 -1240 -103 472 1584 1293 197 -949 -1626 -1279 -218
1109b18J260P56n34j511q26k37N44J009O80L65m47q48j158p70O84J401J496J53
1127A799j348j225m26lP64P66P06M17p39j504j100N59J310R16N27p17l12o16r12
1146a138l97J064J666O12o21j247j321J71N42O71N22Q01J31j200j293n08O88J448
1164E91R28l56q59n60K2r19J19Q65J764J71p13k028o52N69J216O10K76j53l57
1183E34o71r45m86R93J796M08o09j358p43M71k51L13J056Q14J00j047j737k06
1201a568R16J049M82J08k61l11r92p36L46Q86J544l0q69j139k76j45O50O78N70
1220I02O26p04j156j616O0J704J146K48n41o22k85o07m40M46J048J073j12q01
1238C69j418k92O00P99M38L59j37m71j201n58L05J191J624l08n96j250n26K28
$$ plain form
1109 -218 1042 1798 1264 -247 -1073 -1310 -766 243 923 1288 841 -7 -1165 -1935 -1251 150 1646 1799
1127 1799 451 -774 -1200 -1203 -439 327 1033 1450 711 -793 -1893 -1334 -24 892 1419 702 390 -226 -1138
1146 -1138 -1535 -471 1195 1807 1186 -61 -1382 -1211 -669 2 524 1325 1456 256 -1037 -1545 -857 591
1164 591 1519 1163 304 -256 -234 -1153 -1034 -169 1595 1766 1053 -975 -1627 -1058 158 768 1044 891 534
1183 534 -137 -1082 -1568 -575 1221 1629 1020 -338 -1081 -610 -861 -548 508 1322 1422 375 -1362 -1568
1201 -1568 -652 397 879 987 726 415 -577 -1313 -967 -81 1463 1433 564 -575 -851 -996 -346 332 902
1220 902 1528 824 -332 -1948 -1888 -184 962 1210 669 47 -238 -845 -1285 -839 209 1282 1170 369
1238 369 -1049 -1341 -741 58 496 855 718 247 -954 -1512 -1207 -16 1608 1300 704 -546 -1072 -844
1256h44L91K16J052O56m36j396j116K3R01J140P18n75m13p46m27n34P65J342O57
1275A374j62j349q03j75P64K31L52O28J87k44j258j226L57J439J212K56q36q80
1293a33o27L7n4M74J141P91o23j348p72k3J074P68K60nj38n83j417j03M30J629
1313G78P54n37j246p55M48j44M99L94N22P84q75j404o84M90R63O35M00k60p25
1332C7m48p23J11Q70J025P26r64j061o78L00O12M92K92M42j90q94r57k94P13J003
1352D14N57kn55j002j44p6L45P01Q02J89j112p90n20P0J154N56K59J10q88l53
1372b85n97j50J086P36O09m87q54j153L27J98O60O26L66m69l69r69k65J66J193
1391C69N67J59o94n82o96M0N38L83R98L04q02r74r38L26P72R83M0L7n84o57n45
$$ plain form
1256 -844 -453 -237 815 1471 1035 -361 -1477 -1454 -553 587 1305 730 317 -429 -856 -1390 -625 717 1374
1275 1374 1212 -137 -940 -1115 -351 -120 232 860 1047 803 -455 -1681 -1324 115 1327 1583 747 -133
1293 -133 -760 -723 -777 -303 838 1629 1006 -342 -1114 -1137 -63 705 965 960 822 239 -1178 -1281 -851 778
1313 778 1532 995 -251 -1006 -558 -702 -203 191 713 1497 622 -782 -1466 -976 -13 622 1022 762 37
1332 37 -411 -1134 -1023 -153 872 1598 634 -427 -1105 -805 -193 299 591 1033 843 -51 -1008 -1302 -589 414
1352 414 971 969 414 -588 -732 -808 -463 238 1040 1229 117 -673 -1193 -1123 31 587 846 956 68 -285
1372 -285 -882 -1032 54 790 1399 912 58 -1095 -768 -570 90 716 1082 613 244 -725 -990 -824 369
1391 369 936 1095 401 -181 -877 -837 -299 84 1082 1386 584 -390 -1328 -1002 -230 753 793 830 246 -411 -956
1412i56j33P44Q98O17m34p66o37k25Q8P23K18O78l0l83j565l55J126R77J22k40
1432D67k11k21n08l13J01R54Q84j48m24j214p22Q51M28J73M35K92o3q77j218J45
1452a189J193R78P6p10k58m59k71j75K95J176M96j43r89q09l58M22Q12N09L01
1471H97m14k03j283l12O3J414P63N0o31o65o03J84J05R00Q25o1k57j461m14L16
1491g87M26Q03K53J30j61j012l87j88N05Q03O55k88r12l83j27L8P93J79O31j40
1511H31r03p11k42M21P63N98M7l04o75p76O7L06P32R89o3p00m51p68K14K32P84
1532C91J32M97o83p38m93J13M20P37L32J2m84n11l16l90P11J035J54k96o34p00
1552g11K00k38O36Q06K49m92m51p82K07m5Q07O45j91l08n26n12k36M15P03N47
$$ plain form
1412 -956 -1089 -345 553 1170 736 -30 -667 -892 -804 -81 137 815 785 402 -1163 -1518 -392 585 707 467
1432 467 256 35 -473 -786 -685 269 1153 1005 581 -633 -1355 -504 -76 97 532 824 761 -116 -1334 -1189
1452 -1189 4 982 1058 348 90 -369 -640 -815 -520 656 1152 1009 20 -789 -1147 -725 87 596 897
1471 897 483 280 -1003 -1315 -1252 162 925 975 344 -321 -924 -740 -635 265 1090 1029 772 -689 -1103 -787
1491 -787 -361 442 695 825 664 -348 -735 -923 -418 385 1040 752 -160 -543 -670 -632 161 340 971 831
1511 831 -72 -783 -1025 -604 159 757 804 500 -175 -951 -884 -578 154 1143 1080 380 -71 -839 -625 -393 391
1532 391 523 1020 337 -401 -894 -781 -361 376 708 720 236 -275 -591 -981 -270 765 919 623 -11 -711
1552 -711 -511 -749 -113 693 942 450 -1 -783 -576 -621 186 831 640 332 -194 -706 -942 -527 176 723
1572G23l89j25k29n37l4K7N04O98J76o57p15k20pO30M14L38l4l57m92o18K62M80
1594a62O62M0j23n02m85j40L31L08O01M35k51o76p59M0L83K90O17R5k35n44l89
1615d64n37O86N20N56R1n69o89j21l9K80M57O19J44n85r33m95K43R42K60M08j26
1636F48m85o05lk27Q01N46Q3k78p67l69j79M93J69M72K33r7j48j002M1o0R00N91
1658G57j05n83j58l46k44L87P60L11l16m22m69k07r9N20L56P12l43l98n82l62
1678h31L49M75L96L81J65r01o83j54K68O22P8O12j66n34l81l10R1O49L01K05k29
1699D03m22n44l02L39M59N92j22n0m76o82R9M13P64L61l52l41k47m13k24O12N72
1720D39L63Q1p62n76k35L04K52M84L62j14l49q14k51P8O32O80q1Q2n18n43j64
$$ plain form
1572 723 334 209 -20 -557 -591 -564 -60 638 814 157 -558 -778 -785 -155 259 597 563 206 -286 -904 -642 -162
1594 -162 500 540 417 -85 -570 -710 -379 -71 530 965 714 38 -721 -681 -298 -8 609 704 469 -75 -464
1615 -464 -1001 -315 205 761 852 283 -406 -527 -566 -286 171 790 934 349 -584 -1079 -836 106 366 774 648
1636 648 163 -442 -445 -672 129 675 758 480 -287 -656 -835 -342 -173 299 532 435 287 -715 -674 -734 166 757
1658 757 652 69 -89 -435 -679 -292 468 779 463 41 -428 -635 -734 -214 142 854 511 113 -469 -831
1678 -831 -482 -7 389 770 935 34 -649 -803 -535 87 165 777 611 77 -304 -614 -523 126 427 632 403
1699 403 -19 -563 -865 -526 -67 525 403 353 -123 -805 -706 -293 471 832 480 139 -108 -521 -745 -133 439
1720 439 802 883 121 -455 -690 -386 -134 350 712 598 249 -565 -816 -738 -106 574 493 575 57 -486 -650
1741f50l3P79N29J56l77n84q34L29L61M87L70P2j69n02k89l00L65P09L85k64n82
1762d2n37N9K47J52K78K74j97O4p87j62J99N17N42N2l47n20rm84J64M37Q23p2
1784F51j82p63k91r9M31M52K9N94k08m90n41l28K21O23L56n9k63m16Jj54J81P27
1806D72K00K24q58o60K8P7N33M38p7j73j1k47n66l15Q20O74M1l24m72k61J92o9
1828c34L35M41L0J81k24q43n35Q02M41L61k86m0l41l91k85R5O92P10P4p15o33
1849d65j38L69P4N04k49M89l40n43n43K01P38O56L8n72m62J39k46k8K49N58J35
1870E64N4q54j99l48M50O61n9J52J25n52k65l50K85L82P56l87j22m14l97J83K37
1891i8J70N16j82M7n74m66J36L37L55K88l72r5k59o59M36L28M67O4r9l13m00l73
$$ plain form
1741 -650 -683 96 625 781 404 -180 -1014 -685 -324 163 533 605 436 -66 -355 -655 -290 419 804 540 -42
1762 -42 -579 -520 -273 -121 157 431 234 298 -489 -651 -452 65 607 659 312 -208 -217 -701 -537 -100 723 651
1784 651 469 -294 -585 -684 -253 199 228 822 614 124 -417 -745 -524 99 455 396 133 -283 -282 -436 -255 472
1806 472 672 896 38 -622 -594 -517 16 454 377 204 193 -54 -620 -935 -115 559 600 276 -196 -457 -265 -334
1828 -334 1 442 472 653 429 -414 -949 -147 294 655 369 329 -12 -403 -688 -593 99 809 883 168 -465
1849 -465 -603 -234 -160 344 95 584 244 -299 -842 -641 97 753 791 219 -243 -104 -350 -378 -129 429 564
1870 564 618 -236 -435 -783 -333 328 269 421 546 -6 -271 -621 -336 46 802 415 293 -121 -518 -335 -98
1891 -98 72 588 406 453 -121 -587 -451 -114 241 529 157 62 -197 -856 -420 -92 375 439 340 27 -373 -746
1913g46L36N69K98J95l54n49k3l64L50O80L2k69o9n57l3QJ39M03N90j66l44k81
1935a55m81M21Q5K73L95j57l03j63n81M38RP35J20o8o21l93k30M18L40J78J62
1956D22p3j84n49PP2L98K52K51l35m47j85L22k22J04Q44J8m15n29k62N4K24N66
1978C33k87L35j12j11o95p7L9R95m4j04l46n17J27Q2L89K23K47J79p71o1n35M42
2000b69M81J86K57n74j7n07j8J60K71N42k47l0l43k95J1J07L22K87L9j56l88k33
2022d14j50K06M44L99m29j15k33m7j9J62L75K97J38j38o77m60M19L01J9K87j69
2043A96P8m36k79K56J83L77O1m73P5j88k20M10j16O47j12l19k48m87l8L72O15
2064C54N0k9n08p2l48J62p3Q04j20J89n04j92k42K01M89J02N14k50n94j44k62
$$ plain form
1913 -746 -410 159 457 652 298 -251 -274 -638 -288 392 424 155 86 -471 -504 -496 -357 46 636 470 126 -155
1935 -155 -636 -215 -130 143 538 381 78 -85 -666 -228 -219 516 636 568 -53 -446 -676 -258 82 260 422
1956 422 349 165 -384 -377 -305 93 345 596 261 -186 -371 -49 -271 -167 677 695 280 -249 -511 -457 -233 333
1978 333 46 381 269 158 -537 -614 -575 420 376 272 -74 -591 -464 -382 7 230 477 656 -115 -176 -711 -269
2000 -269 212 398 655 81 64 -443 -461 -301 -30 512 265 235 -108 -403 -392 -285 37 324 363 207 -181 -414
2022 -414 -564 -358 86 485 56 -59 -292 -339 -358 -196 179 476 614 476 -201 -661 -242 59 78 365 196
2043 196 274 -162 -441 -185 -2 375 436 -37 38 -150 -370 40 -76 571 459 140 -108 -595 -633 -261 354
2064 354 404 375 -133 -205 -553 -391 -464 340 220 409 -95 -287 -529 -328 161 263 777 527 -67 -211 -473
2085d73R0J40L88M30l09j30o38J60J68J18M65O0j30l39l32m10N10L95L72k66j19
2106A50l96l35K69J86L78N5J49l42m38M4l63N76J88L32k38j83k92p0j43K99O58
2127D84M6l81j62l71Q4pL76L5M50k94j57j81k75K69L46J25J27n32J61o16J87J03
2149a83qN20j80j65j81k89K40K79M7M5L17Po41l48M57k75Q20l28L72j91m77n7
2171b19k24M22M01J63j94l74l33p8rL56L97n4J84p91K84k07J27K77K36K80m45
2192A99m39J4p7M02k05M63j57O8l90k21j92M70K45N56l41m45j69J71k71K98J85
2213A64l7K96k99l64l09M13K04J80o1oj38l02J29L1J74N33p8k06m36k55r1J73
2235b85K42K83k44J23M4m42o6J41L28L46j87j97n17M22l34L77K32K94j94l80j48
$$ plain form
2085 -473 -383 -243 145 575 266 136 -502 -342 -174 -56 409 469 339 0 -332 -742 -232 163 535 269 150
2106 150 -246 -581 -312 -126 252 307 456 114 -324 -280 -643 -67 121 453 215 32 -260 -330 -473 -174 484
2127 484 530 149 -13 -384 -300 -307 69 104 554 260 103 -78 -353 -84 262 387 514 -18 143 -473 -286 -183
2149 -183 -191 329 149 -16 -197 -486 -246 33 80 125 442 449 -192 -540 -83 -358 462 134 506 315 -162 -219
2171 -219 -443 -21 380 543 349 -25 -358 -436 -445 -89 308 254 438 -353 -69 -276 -149 128 364 644 199
2192 199 -240 -226 -303 99 -106 357 200 268 -122 -343 -535 -65 180 736 395 -50 -219 -48 -319 -21 164
2213 164 127 423 124 -240 -549 -136 68 248 187 181 43 -259 -130 -99 75 608 530 324 -112 -367 -458 -285
2235 -285 -43 240 -4 119 163 -279 -345 -204 124 470 283 86 -431 -9 -343 34 266 560 366 -14 -162
2256a62n56N23K09K16R8j73r9l59R7k27M28M32P7l75p0m49l9L15J44O0K02n6l48
2279a12k79K1K94J12L64j92J1l82j30M3J61q5M23n4j89k19k47K28R2L32O7l9k73
2302e3l02j73L56J66L5M88k85j51m34J07K54M9L70J77l01k99p7l51J83K64M06
2323D29k13j17j93rm98L92K16R6K45l27k99p6K59L03j90L01l6j77j50j19jP2M42
2346C50J85l34m16K27j20J49j20J53K54l6j08l93k15J30L41J50L3R9m41j60K9
2367b43n0J89M53q9k0k89l33R7J13K35L15j83M5o70K84k24M45N9K18k03j28o2
2389d1k00K36j78M6L62K51p10Kk9kM03J50k55K29j67l21k91K25L80K04Ml53k52
2412c07n0K67k19R2M10o0L01n66l14L40K29o4J14j14L49n37Q7l51O07P5N5j78
$$ plain form
2256 -162 -718 -195 14 230 328 155 56 -303 -206 -433 -5 427 504 129 59 -390 -429 -114 30 90 292 236 -112
2279 -112 -391 -370 -76 36 400 208 219 -163 -293 -250 -89 -174 249 195 6 -213 -460 -232 -140 192 259 220 -53
2302 -53 -355 -528 -172 -6 29 517 232 81 -353 -246 8 57 427 604 303 4 -73 -424 -241 23 429
2323 429 216 99 -94 -103 -601 -209 7 103 348 21 -278 -354 -95 208 18 319 283 106 -44 -163 -164 -92 350
2346 350 535 201 -215 12 -108 41 -79 74 328 292 184 -209 -424 -294 47 197 230 329 -112 -272 -243
2367 -243 -293 -104 349 260 240 -49 -382 -285 -172 63 378 195 240 -430 -146 -370 75 134 352 149 21 -41
2389 -41 -241 -5 -183 -137 225 476 -234 -232 -261 -263 140 290 35 264 97 -224 -515 -290 90 294 298 -55 -307
2412 -307 -357 -90 -309 -217 193 133 434 -132 -446 -106 123 59 173 59 408 -129 -42 -393 214 289 344 166
2434A66k91j3j92L79Q5J27J79m65J69j16l11r5J16L22l34L61L4k30k18K03K08
2455H4j33K12n5j45j13j0L17q0M50l19Rn01r1L5L87j66M30r8k80J22m42K65l9
2478a61J05L07R3j51k23l01L6M72J14q6P7j90m4l13J17L1M74j15k51k93K55l40
2500c87J08M22q8L24l18k07k5O4j08L02q2K00Q6m79l3J7J3L08L63Jk78k71Lj12
2524a77J62Q8J06P0l4k29j19j24J04N24j15nl68j15n5J52L22K34k04J03m39j3
2546a32J38l28K95K94m3ql10k5j19j1J44K91O0j8l32k17K02j65N95P0q2k78k15
2569a94l21J87L84J23N5k06j4K78n74m7R1M69R2l4p19K63j25J61Q2N2J43j32K
2592A6l08k5J76L66J68k58pl83K36l4K0J29P6j43l3k3k03K82j38J83M6o9J46k64
$$ plain form
2434 166 -125 -138 -330 49 134 261 440 -25 144 28 -283 -378 -262 60 -274 87 121 -109 -327 -124 84
2455 84 -49 163 108 -37 -150 -160 157 77 527 208 217 -284 -375 -340 47 -119 311 213 -67 55 -387 -122 -161
2478 -161 -56 251 344 193 -30 -331 -295 177 291 205 282 92 48 -265 -148 -117 357 242 -9 -302 -47 -387
2500 -387 -279 143 55 379 61 -146 -171 -107 -215 87 5 205 291 -188 -221 -204 -191 117 480 481 203 -68 -65 -177
2524 -177 -15 73 179 249 215 -14 -133 -257 -153 371 256 251 -117 -232 -287 -135 187 421 217 320 -119 -132
2546 -132 6 -322 -27 267 224 216 -94 -119 -238 -249 -105 186 246 228 -104 -321 -119 -284 311 381 299 21 -194
2569 -194 -515 -328 56 179 234 28 14 292 -282 -329 -238 231 323 289 -430 -167 -292 -131 -49 3 146 14 16
2592 16 -292 -317 -141 225 393 135 128 -255 -19 -53 -33 96 172 29 -4 -27 -230 52 -86 97 143 74 220 -44
2616d4j52j99J76N43k03J11l25O1P6l51L11J53Q4nl17Q2j76j79K91J25o7K51l19
2639g3L7l31M53L9k6L9K14n45R9l8K0L12Or1R0j4l96p4J83o0M74q0l60k19M07
2664F6m29M36L7l2L11l98j93k29M42P8J82Pk02k74Qr9J43P6K19J51j64k56J85
2687F5k54m6K7N21l19n9P3j9l32K71K35J20K15l66l94J38j12J32L71J60l81j22
2709g6k27L86P7l01K36p9K85m73L8q2L53M0K5Lm3j10j57k20Q9K18J11K01J69m83
2733b0k42j8L1M08J16j30r7j65J52l96K39m5L76j3k96J60k79K79k2KJ35Kj45o6
2757c4PJ53k65K81qk0r5J57k76l75N36Q2J23km22j76O6J37L28K0l10r9J41p4N
2782a20O5L63j18P5k15q8j10j09J14L42J19j54R9o10M23k7m9L93k32J02m5m12
$$ plain form
2616 -44 -196 -395 -219 324 121 232 -93 -32 44 -307 4 157 241 236 -81 1 -175 -354 -63 62 -5 246 -73
2639 -73 -36 -367 86 125 99 138 352 -193 -94 -132 -112 200 206 115 205 191 -205 -279 -96 -156 318 238 -122 -341 66
2664 66 -363 73 110 78 389 -9 -202 -431 11 89 271 278 76 -198 -190 -289 -146 -70 149 300 136 -120 65
2687 65 -189 -235 -208 313 -6 -65 8 -11 -343 -72 163 283 498 132 -262 -124 -236 -104 267 427 46 -76
2709 -76 -303 83 160 -141 95 16 301 -172 -134 -216 137 177 202 205 162 52 -105 -325 -236 -18 93 294 463 -20
2733 -20 -262 -280 -249 159 275 145 48 -117 35 -361 -122 -167 209 196 -100 60 -219 60 38 40 175 177 32 -34
2757 -34 -27 126 -139 142 134 114 19 176 -100 -475 61 143 266 264 -158 -334 -268 -131 197 217 -93 -192 -51 -125 -120
2782 -120 -55 308 190 265 50 -38 -148 -257 -143 199 318 164 263 -347 76 49 0 393 161 263 218 -194
2804a94Kj34K75J02J66K17n55j0ll1K28j23L27o00J44n6J26l4J29L80j16l31j16
2827b07j08K61K19L5j88O7N9k70J09m25L92J68J21j30n7j39l97O70l43L11j18
2848C0K33k50k65k49M00J98M8j40n0j16l23J62J89K4K10R2k2l61p1K47j96N09
2870B99l32K54l80J80j29Q1q5K58J70k4n17N3K7J78l2J49J0N7l71r1J29j37N84
2893C31j56r3r4ll42K89L5q7Q7K9K83j13n84O40k06L3K04J08l67q6j25LQ8J90
2917F4L66k64j21l11J06J52J23r0K27j6j93k2k05R7L2J57m5j07j1j0j10J92n3
2940d2J09J58qk61l68L17P0N7j51J50j3J60n01j4L57j97K86J38k56mj88J01K76
2963A76M0k42K59k22k21Q5j7J48P3K55l54Q2J40m24K46o0kJ28q1l99L54k3R1J32
$$ plain form
2804 -194 -192 -326 -51 51 217 434 -121 -131 -134 -165 63 -60 267 -333 -189 -245 -119 -153 -24 356 240 -91 -207
2827 -207 -315 -54 165 200 12 79 138 -132 -23 -448 -56 112 233 103 46 -93 -490 180 -163 148 30
2848 30 263 13 -252 -501 -101 97 145 5 -45 -161 -484 -322 -133 -109 101 193 171 -190 -261 -14 -210 299
2870 299 -33 221 -159 21 -108 -27 -112 146 316 292 -225 -172 -145 33 1 150 160 217 -154 -245 -116 -253 331
2893 331 175 82 -12 -15 -357 -68 -33 -120 -33 -4 279 166 -418 222 16 49 253 361 -6 -92 -217 -214 -126 64
2917 64 430 166 45 -266 -160 -8 115 25 252 236 43 21 -184 -87 -55 102 57 -50 -61 -71 -181 11 -42
2940 -42 67 225 217 -44 -412 -95 -25 32 -119 31 18 178 -323 -337 20 -177 109 247 -9 -13 -201 -100 176
2963 176 216 -26 233 11 -210 -125 -142 6 79 334 -20 62 202 -222 24 -36 -38 90 9 -390 -36 -59 32 164
2987A64m91L56L6k7k43J51k78M93r3J28j59J1P9j96K0j3J69m8l04k3J80j14M04
3010B02l51K38L16j92k53n3L10J69k99m6j20K32k87j85L39l89K81K88M6j30m06
3031b90K94k45K22N15m47KK4k10K55l07L87R7n2q0l47J1j51K48n3rM51j83k34
3054a02K09l63K93K41j72J04k25l7l81N68p9mJ42k94R3k03oK59K45m40M5O9R8
3077F0j26Mq7K29k48J92J68o8M9j07j74K39j84L23q4l86K76j91K07r7J60p9m2
3100C4k62P0J14K22o7O1J24Q4l96O6k45K65j64L00k16K67l01l5j78J02K40r6k7
3123c8k79L87J29l90J20O5j28K04j49q0nJ57k29M82k29J0J89l24J09j2j47L42
3145A84j12n8p9N9k7O4K63n4k70j86J91j95K61Np7R5r2QJ9j45R3J31j33J89p3
$$ plain form
2987 164 -327 29 65 38 -205 -54 -332 161 68 196 37 48 127 -69 -49 -62 107 59 -245 -268 -88 -202 202
3010 202 -149 89 405 213 -40 -93 217 386 87 41 -79 153 -134 -319 20 -369 -88 200 246 116 -290
3031 -290 4 -241 -19 496 49 51 75 -135 120 -187 200 297 245 165 -182 -171 -322 -74 -127 -136 315 132 -102
3054 -102 107 -256 37 278 106 210 -15 -52 -433 135 56 52 194 -100 -7 -210 -216 43 288 -152 -107 -38 60
3077 60 -66 -62 -149 80 -168 24 192 124 173 66 -108 131 -53 270 186 -200 76 -115 92 -5 155 76 34
3100 34 -228 -158 -44 178 111 172 296 380 -16 50 -195 70 -94 206 -10 257 -44 -79 -257 -155 85 -11 -38
3123 -38 -317 70 199 -191 -71 -6 -134 70 -79 -159 -164 -7 -236 246 17 27 216 -108 1 -11 -158 184
3145 184 72 14 -65 -6 -33 31 294 240 -30 -216 -25 -220 41 46 -31 64 -28 -20 -1 -146 -53 78 -55 134 61
3170F1j9n1M7j07K3K53j01k44J83k39K77j53K99n8j52L0k49N3K33r5q3K51N0j85
3194B4l1Oo0P2k9K6J12k21n6L17l69P4K76k05n1k03M67o00Q34m66R6nj01J16k00
3219a77j3N4j4K44k14m1J80J10j91ro7J25L05j41k84J06p1O9K0J54l0pK89l98
3243aL5L2o8N8j80K53k06p0J53K0p9J9l8n4J51J20m12L17j40K02m16K64L7j25
3267a28m1J56K2J5L9j13K2q9K27J61l11J14k44J77l57J74K86k43J82L13m89n4
3289a81J02n4J81k76L68j32L82l99j17Q8k0K86j30j55J03j14L07k75N5J76k80
3310h5J22j24J31J27o5J09j25K4j03Nj98rL86j96R5j96j44M02K2j47j2K6j49J72
3334F8Q7r3J66l68K9J97j53j63K98j14J16p7k09M82j53K31k92k1l29J40N02k04
$$ plain form
3170 61 42 -9 38 -69 -46 207 106 -138 45 -194 83 -70 229 171 19 49 -200 -147 86 -9 -92 159 209 24
3194 24 -7 -1 -61 11 -18 8 120 -101 -157 160 -209 -135 141 -64 -115 -318 149 -451 383 -83 13 8 -93 23 -177
3219 -177 -190 -136 -150 94 -120 -161 19 129 -62 -71 -138 -13 292 151 -133 -27 -98 -29 -9 145 115 108 397 -1
3243 -1 34 66 -2 56 -124 129 -77 -147 6 26 -53 -34 -72 -126 25 145 -267 50 -90 112 -304 -40 -3 -128
3267 -128 -169 -13 9 24 63 -50 -28 -117 110 271 -40 74 -170 7 -350 -176 110 -133 49 362 -127 -181
3289 -181 -79 -133 48 -228 140 8 390 -9 -126 -38 -58 228 98 -57 46 -68 239 -36 19 195 -85
3310 -85 37 -87 44 171 106 215 90 114 11 16 -182 -191 195 -1 94 -102 -246 156 178 31 19 45 -104 68
3334 68 155 62 228 -140 -111 86 -67 -230 68 -46 70 -7 -216 266 113 344 52 31 -298 -158 344 140
3356A40k30j03m3K63q8J38j98K92J19j24j33j28J38k37J12Q7K45j97P3j95J41
3377G2J45k65J03m65L77q5nP7J23J3k07P7m6J16O5j25K42j49j05K7k9r9K74r6
3401C5L8J03l70j46L78J13m3k24J07K01l75K54kj94r8L02l0L9J69r4k10J03k92
3424b36L49k64L95k46l2j99J54O2k21K49m3j79J25K8K48k86K91r7j73P2O8J40
3446B05m47M89m23L34k74O5ojk3L18k72L9J35j71o3L00k9k57M2J29l84K03l8l0
3470a59J61r1R7K30j07J33j14k26N4k1P7R5j05K2O9J01j81o4K20k8k86J82j69
3493a10J68p8qK22k64L82l44Q5M0J5k32K59j28j87L95l42L8j87K71L3O5k23j05
3516b35K69l7q1K10l37K62j30j12Q0j06J91j81M01n8j86P8J02Q3j62M1k78K25
$$ plain form
3356 140 -90 -193 -236 27 -61 77 -121 171 290 166 33 -95 43 -194 -82 5 250 53 126 -69 72
3377 72 217 -48 55 -410 -33 -118 -123 -46 77 90 -117 -40 -86 30 95 -30 212 63 -42 -15 -44 -143 131 35
3401 35 73 176 -194 -340 38 151 108 -116 -9 192 -183 71 69 -125 -223 79 49 88 257 163 -47 56 -236
3424 -236 113 -151 244 -2 -34 -233 -79 -17 -238 11 -32 -211 -86 -58 190 -96 195 98 -75 -3 65 205
3446 205 -242 247 -176 158 -116 -51 -57 -58 -81 237 -35 4 139 -32 -95 205 176 -81 -39 90 -294 -91 -129 -159
3470 -159 2 -89 8 238 131 264 150 -76 -22 -43 34 129 24 46 115 216 35 -29 191 163 -123 59 -110
3493 -110 58 -20 -28 194 -70 312 -32 53 93 108 -124 135 7 -180 215 -127 -89 -276 -5 28 93 -130 -235
3516 -235 34 -3 -84 126 -211 51 -79 -191 -111 -217 -26 -207 194 136 -50 28 130 213 51 92 -186 39
3538C9k65L9K68j32L16j23k3j7j59j10L9L21O5n9p8j83J53K66k11k58N8Q5K07
3561B38l57J74j15j38N59l52j17K24o3o3J13N6k63J03N2j60M17k07k10j03L90
3582A78j86k25J1J80r0k44M22o5J19M1o0p4j87K68K0J05l27K16j33l8J35j72N45
3605D39m00J50j03k08j76K59K75j67J01j21j56J70l08K56J40l62M03k09K75k40
3625A8rl8K2Qn4q3J13J54m32L11o2O0J19j12Q1l20J23K60k34K96m81L57J49k82
3649c6P8O4j06J2p0J62R2K7j58k09Q1J89j45K17j15j55J9J67Lp0J26q1l6k41M46
3674B61k01Q4j83n9J29K22j13l26N74k39k6k9o0Q0k7l9J0q5J36q6N2k4k07P6j90
3699b70J44N3L8j40J65k18N56l65J46J42j29J77l06j2k4J15n8j70j87q6K51K58
$$ plain form
3538 39 -226 -187 81 -51 265 142 119 102 -57 -167 -128 193 258 199 121 -62 91 357 146 -112 -54 31 238
3561 238 -119 55 -60 -198 361 9 -108 116 53 -10 103 159 -104 -1 51 -109 308 101 -109 -212 178
3582 178 -8 -233 -222 -42 -132 -376 46 -19 100 141 81 7 -180 88 108 213 -114 102 -31 -69 66 -106 439
3605 439 39 189 86 -122 -298 -39 236 69 170 49 -107 63 -245 11 151 -211 192 -17 258 18
3625 18 9 -29 -7 1 -53 -136 -23 131 -301 10 -52 8 127 15 96 -224 -101 159 -75 221 -260 97 246 -36
3649 -36 42 106 0 12 -58 104 196 223 65 -144 -63 126 -19 198 83 -72 -53 114 117 47 173 92 56 -185 261
3674 261 60 144 -39 -98 31 253 140 -186 388 149 123 94 34 114 87 48 58 -27 109 23 75 51 -156 -80 -270
3699 -270 -126 -73 -35 -175 -10 -228 328 -37 109 251 122 299 -7 -19 -43 72 14 -156 -343 -429 -178 80
$$ [...]
8191a44
##END NTUPLES=NMR FID
##END=
