##TITLE=1H_fd=0(bat2-aceton)-f12-f5
 CDCl3
 8 sc, 
 24.1.2023
##JCAMPDX= 6.0         $$ Bruker NMR JCAMP-DX V2.0
##DATA TYPE= NMR FID
##DATA CLASS= NTUPLES
##ORIGIN= UXNMR, Bruker Analytische Messtechnik GmbH
##OWNER= root
$$ XWIN-NMR		Version 3.5
$$ Tue Jan 24 13:55:59 2023 Russian Standard Time (UT+4h)  she@DPX200
##.OBSERVE FREQUENCY= 200.13135
##.OBSERVE NUCLEUS= ^1H
##.DELAY= (6, 6)
##.ACQUISITION MODE= SIMULTANEOUS
##.ACQUISITION SCHEME= undefined
##.AVERAGES= 8
##.DIGITISER RES= 18
##SPECTROMETER/DATA SYSTEM= spect
##.PULSE SEQUENCE= zg30
##.SOLVENT NAME= CDCl3
##.SHIFT REFERENCE= (INTERNAL, CDCl3, 0, 15.7039)
##AUDIT TRAIL= $$ (NUMBER, WHEN, WHO, WHERE, WHAT)
$$ ##TITLE= Audit trail, XWIN-NMR		Version 3.5
$$ ##JCAMPDX= 5.01
$$ ##ORIGIN= Bruker BioSpin GmbH
$$ ##OWNER= she
$$ F:/spectra/data/she/nmr/H-F/1/audita.txt
$$ ##AUDIT TRAIL=  $$ (NUMBER, WHEN, WHO, WHERE, WHAT)
(   1,<2023-01-24 13:54:21.01 +0400>,<she>,<DPX200>,
      <created by zg, POWCHK disabled, PULCHK disabled
       configuration hash MD5:
       00 E9 B6 7A A2 85 ED C7 34 08 36 98 17 FE 4E 26
       data hash MD5: 16K
       5E 2E 37 C7 A7 93 19 DC 94 67 DE B6 20 F6 32 F4>)
$$ ##END=
$$ 
$$ hash MD5
$$ C2 C3 37 16 0F 22 A1 5E F6 0D 88 BB AE 29 26 8E
##$RELAX= 
##$RELAX= 
##$RELAX= 
##$RELAX= 
##$RELAX= 
##$RELAX= 
$$ Bruker specific parameters
$$ --------------------------
##$DU= <F:/spectra>
##$EXPNO= 1
##$NAME= <H-F>
##$PROCNO= 1
##$TYPE= <nmr>
##$USER= <she>
##$AMP= (0..31)
100 100 100 100 100 100 100 100 100 100 100 100 100 100 100 100 100 100 
100 100 100 100 100 100 100 100 100 100 100 100 100 100 
##$AQSEQ= 0
##$AQ_mod= 1
##$AUNM= <au_zg>
##$AUTOPOS= <>
##$BF1= 200.13
##$BF2= 200.13
##$BF3= 200.13
##$BF4= 200.13
##$BF5= 200.13
##$BF6= 200.13
##$BF7= 200.13
##$BF8= 200.13
##$BYTORDA= 1
##$CFDGTYP= 0
##$CFRGTYP= 5
##$CHEMSTR= <none>
##$CNST= (0..31)
1 1 145 1 1 1 1 1 1 1 1 1 1 1 1 1 1 1 1 1 1 1 1 1 1 1 1 1 1 1 1 1 
##$CPDPRG= <>
##$CPDPRG1= <>
##$CPDPRG2= <>
##$CPDPRG3= <>
##$CPDPRG4= <mlev>
##$CPDPRG5= <mlev>
##$CPDPRG6= <mlev>
##$CPDPRG7= <mlev>
##$CPDPRG8= <mlev>
##$CPDPRGB= <>
##$CPDPRGT= <>
##$D= (0..31)
0 1.2 0 0 0 0 0 0 0 0.06 0 0.03 0 0 0 0 0.0002 0 0 0 0 0 0 0 0 0 0 0 0 
0 0 0 
##$DATE= 1674554060
##$DBL= (0..7)
120 120 120 120 120 120 120 120 
##$DBP= (0..7)
150 150 150 150 150 150 150 150 
##$DBP07= 0
##$DBPNAM0= <>
##$DBPNAM1= <>
##$DBPNAM2= <>
##$DBPNAM3= <>
##$DBPNAM4= <>
##$DBPNAM5= <>
##$DBPNAM6= <>
##$DBPNAM7= <>
##$DBPOAL= (0..7)
0.5 0.5 0.5 0.5 0.5 0.5 0.5 0.5 
##$DBPOFFS= (0..7)
0 0 0 0 0 0 0 0 
##$DE= 6
##$DECBNUC= <off>
##$DECIM= 32
##$DECNUC= <off>
##$DECSTAT= 4
##$DIGMOD= 1
##$DIGTYP= 9
##$DL= (0..7)
0 120 120 120 120 120 120 120 
##$DP= (0..7)
150 150 150 150 150 150 150 150 
##$DP07= 0
##$DPNAME0= <>
##$DPNAME1= <>
##$DPNAME2= <>
##$DPNAME3= <>
##$DPNAME4= <>
##$DPNAME5= <>
##$DPNAME6= <>
##$DPNAME7= <>
##$DPOAL= (0..7)
0.5 0.5 0.5 0.5 0.5 0.5 0.5 0.5 
##$DPOFFS= (0..7)
0 0 0 0 0 0 0 0 
##$DQDMODE= 0
##$DR= 18
##$DS= 0
$$ [...]
##$SUBNAM2= <"">
##$SUBNAM3= <"">
##$SUBNAM4= <"">
##$SUBNAM5= <"">
##$SUBNAM6= <"">
##$SUBNAM7= <"">
##$SUBNAM8= <"">
##$SUBNAM9= <"">
##$SW= 18.05172834244
##$SWIBOX= (0..15)
0 0 2 0 0 0 0 0 0 0 0 0 0 0 0 0 
##$SW_h= 3612.71676300578
##$TD= 16384
##$TD0= 1
##$TE= 0
##$TE2= 300
##$TE3= 300
##$TEG= 300
##$TL= (0..7)
0 120 120 120 120 120 120 120 
##$TP= (0..7)
150 150 150 150 150 150 150 150 
##$TP07= 0
##$TPNAME0= <>
##$TPNAME1= <>
##$TPNAME2= <>
##$TPNAME3= <>
##$TPNAME4= <>
##$TPNAME5= <>
##$TPNAME6= <>
##$TPNAME7= <>
##$TPOAL= (0..7)
0.5 0.5 0.5 0.5 0.5 0.5 0.5 0.5 
##$TPOFFS= (0..7)
0 0 0 0 0 0 0 0 
##$TUNHIN= 0
##$TUNHOUT= 0
##$TUNXOUT= 0
##$USERA1= <user>
##$USERA2= <user>
##$USERA3= <user>
##$USERA4= <user>
##$USERA5= <user>
##$V9= 5
##$VALIST= <valist>
##$VCLIST= <CCCCCCCCCCCCCCC>
##$VD= 0
##$VDLIST= <DDDDDDDDDDDDDDD>
##$VPLIST= <PPPPPPPPPPPPPPP>
##$VTLIST= <TTTTTTTTTTTTTTT>
##$WBST= 1024
##$WBSW= 4
##$XGAIN= (0..3)
0 0 0 0 
##$XL= 0
##$YL= 0
##$YMAX_a= 247360
##$YMIN_a= -322962
##$ZGOPTNS= <>
##$ZL1= 120
##$ZL2= 120
##$ZL3= 120
##$ZL4= 120
##$ABSF1= 10
##$ABSF2= 0
##$ABSG= 5
##$ABSL= 3
##$ALPHA= 0
##$AQORDER= 0
##$ASSFAC= 0
##$ASSFACI= 0
##$ASSFACX= 0
##$ASSWID= 0
##$AUNMP= <proc_1d>
##$AZFE= 0.1
##$AZFW= 0.1
##$BCFW= 1
##$BC_mod= 2
##$BYTORDP= 1
##$COROFFS= 0
##$CY= 11.3945322036743
##$DATMOD= 1
##$DC= 2
##$DFILT= <>
##$DTYPP= 0
##$F1P= 2.36226072786647
##$F2P= -0.459571619588291
##$FCOR= 0.5
##$FTSIZE= 0
##$FT_mod= 4
##$GAMMA= 1
##$GB= 0.15
##$INTBC= 1
##$INTSCL= 1
##$ISEN= 128
##$LB= 0.24
##$LEV0= 0
##$LPBIN= 0
##$MAXI= 10000
##$MC2= 0
##$MEAN= 0
##$ME_mod= 0
##$MI= 1.114404
##$NCOEF= 0
##$NC_proc= 0
##$NLEV= 6
##$NOISF1= 3.799351
##$NOISF2= 2.8
##$NSP= 1
##$NTH_PI= 0
##$NZP= 0
##$OFFSET= 15.70392
##$PC= 1
##$PHC0= -19113.63
##$PHC1= 13.80079
##$PH_mod= 1
##$PKNL= yes
##$PPARMOD= 0
##$PSCAL= 0
##$PSIGN= 0
##$REVERSE= no
##$SF= 200.130013532006
##$SI= 16384
##$SIGF1= 3
##$SIGF2= 2
##$SINO= 400
##$SIOLD= 16384
##$SREGLST= <1H.CDCl3>
##$SSB= 0
##$STSI= 0
##$STSR= 0
##$SW_p= 3612.71676300578
##$SYMM= 0
##$S_DEV= 0
##$TDeff= 0
##$TDoff= 0
##$TI= <>
##$TILT= no
##$TM1= 0
##$TM2= 0
##$TOPLEV= 0
##$USERP1= <user>
##$USERP2= <user>
##$USERP3= <user>
##$USERP4= <user>
##$USERP5= <user>
##$WDW= 1
##$XDIM= 8192
##$YMAX_p= 0
##$YMIN_p= 0
$$ End of Bruker specific parameters
$$ ---------------------------------
##NTUPLES= NMR FID
##VAR_NAME=  TIME,          FID/REAL,        FID/IMAG
##SYMBOL=    X,             R,               I
##VAR_TYPE=  INDEPENDENT,   DEPENDENT,       DEPENDENT
##VAR_FORM=  AFFN,          ASDF,            ASDF
##VAR_DIM=   8192,          8192,            8192
##UNITS=     SECONDS,       ARBITRARY UNITS, ARBITRARY UNITS
##FACTOR=    0.0002768,     1,               1
##FIRST=     0,             0,               0
##LAST=      2.2672688,     0,               0
##MIN=       0,             -322962,         0
##MAX=       2.2672688,     247360,          0
$$ Real data points
##PAGE= N=1
##DATA TABLE= (X++(R..R)), XYDATA
$$ [...]
1825F5j66k05K22j83l02K59J05j06k3j78P27m77p8K36J14k96K06Kj25K70r2K42
1847B17o6J20LJ35j52K06j38j13L9k57j03L95l70J08jQ8l24j56L41m63K95j37
1869c33J31m8J34ml0K94o9O2J12j39o0O0l7K26Kj45J34Q9l11k01M11l07l4j82
1893b45J13r5L9j41K75j33m6P2P8j13Q3k10J19m3K96j86J97K58k83K06j77r8J7
1916a7K92j54j09l5N27m94k2j92K23k29r3K27P0j41RK0j64Q4K00o25M58kJ83k15
1940a99R7L4j7J91M55l54k91N10Nk99nR4n4K2l66M56o36K50L09k68j33J7P7l3
1964a38O3l25M25q7j54j9O32l96j87K87O8j59m2L45Q4j23r4j06j3j29L30k10J00
1987A52j80j20j53L67j09j26j32M37m22O6K60m85L15J38j10k18J64L09m00M02
$$ plain form
1825 65 -101 -306 -84 -267 -569 -310 -205 -311 -334 -512 215 -262 -340 -104 10 -286 -80 -78 -203 67 -25 217
1847 217 151 271 274 409 257 463 325 212 251 -6 -109 286 -84 24 23 111 -213 -369 -28 -491 -196 -333
1869 -333 -202 -250 -116 -120 -150 144 75 137 249 110 50 110 73 299 301 156 290 379 68 -133 278 -29 -63 -245
1893 -245 -132 -227 -188 -329 -54 -187 -233 -161 -83 -196 -113 -323 -204 -247 49 -137 60 318 35 241 64 -34 -17
1916 -17 275 121 12 -23 504 10 -12 -204 19 -210 -303 -76 -6 -147 -138 -118 -282 -198 2 -623 -165 -167 16 -199
1940 -199 -102 -68 -85 106 561 207 -84 426 431 132 127 221 167 189 -177 279 -357 -107 202 -66 -199 -182 -105 -138
1964 -138 -75 -400 25 -62 -216 -235 397 1 -186 101 169 10 -32 313 397 274 180 74 61 -68 262 52 152
1987 152 -28 -148 -301 66 -43 -169 -301 136 -286 -220 40 -445 -130 8 -102 -320 -156 153 -247 155
2007A55m6j24K63K5k07J83K45k99o1K64nm60L6L55o53L30m5j01O3q3K9j79J58
2030a57L00j45l70J40j8J31L77j49k81k1K62K59l37L06m56K40rK48k14l6M6J71
2052B87j75k35p2K1k7J43P5l28L37n74K88J18Q1k06N2K57r3J7M80l69J51j4p6
2075A38P3k8L1k08J01k1j07O7J32m83J54P1j1j18k0L19n01L05j77n5Q9N5J97l02
2099b99K65r7k04M32r8J09j79J24q7N09l66L8r8j13L13p2l51L74j73M4K1j97N4
2122e1p8p0J04Qll80K32J21n0RL19j00N9j78K57k28m4J34P5j15m9J89j26Q4K12
2147C31l37J23Lj11R0k67JL33l66J54P3o96K90K37k0N0P5K07j00k41K14K0L3r
2171H7k23K07l0O6J74o4j1k5l2P6k60K70k36m84K25J74j72K25M2m81L05j76L69
$$ plain form
2007 155 109 -15 248 273 66 249 494 195 134 398 393 -67 -31 324 -329 1 -44 -145 -82 -165 -136 -315 -157
2030 -157 143 -2 -372 -232 -250 -119 258 109 -172 -193 69 328 -9 297 -159 81 72 320 106 70 116 287
2052 287 112 -123 -195 -174 -201 -58 17 -311 26 -548 -260 -142 -61 -267 -215 42 -51 -34 446 77 228 214 138
2075 138 211 183 214 6 107 86 -21 46 178 -305 -151 -80 -91 -209 -229 90 -411 -106 -283 -338 -249 -194 3 -299
2099 -299 -34 -131 -335 97 -1 108 -71 53 -34 475 109 147 49 -64 249 177 -174 200 27 71 92 -105 -51
2122 -51 -129 -199 -95 -87 -90 -470 -238 -117 -167 -158 161 61 120 -58 199 -29 -73 61 136 21 -28 161 35 119 331
2147 331 -6 117 120 9 99 -168 -167 166 -200 -46 27 -669 -379 -142 -162 -112 -37 170 70 -171 43 63 96 87
2171 87 -136 71 41 107 281 217 206 181 149 225 -35 235 -1 -485 -260 -86 -258 -33 9 -472 -167 -343 26
2194B6qJ03l33J44L08k89P6k02P5J92j16N5JP7L11k02O1l3j82k60K78j54j40m5
2218b57J45K21l60K06k05J32k23K63J82j94m8J84k22R0N4Q1j13L78r9J29m16N
2240f7K03j5o9J86J66k81k91J27k51L08j32J44m99M96j77k12R5O5L7J0K98j29
2262A2j2m3K31q8q3j10K54j8j53J13O6O7j19q8M3O1k03K28r9j3M9j79J27q7J81
2287A37k97K4K00l39K03k2O4K9O6j82K90o8J93k65oL04k66L76m77K84j9k62L26
2310B93j88j10J18k1j31L48m33n9K23Q6j30l33q6JM34j52j31N60o57M81k78N40
2332C75o24J58K02J73k36n2K91k20j06J31J94K2l46j06L3L14l19k21K90J29p4
2353Hj59J60j97q8J14K21l56L19l37J40L84l22L86k81j4m3J76k57O2Q0l3j27L30
$$ plain form
2194 26 18 121 -212 -68 240 -49 27 -175 -100 92 -24 31 32 109 420 218 279 246 64 -196 82 -72 -212 -257
2218 -257 -112 109 -251 -45 -250 -118 -341 -78 104 -90 -138 46 -176 -86 -32 49 -64 314 215 344 -72 -67
2240 -67 136 121 52 238 404 123 -168 -41 -292 16 -116 28 -471 25 -152 -364 -269 -204 -167 -157 141 12
2262 12 0 -43 188 100 17 -93 161 143 -10 103 169 236 117 29 72 133 -70 158 59 46 95 -84 43 -44 137
2287 137 -160 -136 64 -275 -72 -94 -30 -1 65 -117 173 105 298 33 27 331 65 441 -36 248 229 -33 293
2310 293 105 -5 113 92 -39 309 -124 -183 40 126 -4 -337 -423 -422 12 -140 -271 289 -368 113 -165 375
2332 375 -249 -91 111 284 48 -4 287 67 -39 92 286 308 -38 -144 -111 203 -116 -337 -47 82 8
2353 8 -151 9 -188 -276 -162 59 -297 22 -315 -175 209 -113 273 -8 -22 -65 111 -146 -84 -4 -37 -164 166
2376A66n4k66K70k17K53j46r0Q7M8j07p1j9O2o0p2j91K41O9J66J36j1m9J37j77
2400A05K27J29m23J9l6j22K4j1j01J83q8L87l01q4pP8j20J61j23q8L7l9J79p8
2424i2J36k50M1K47K45m87J37L78j5q8k07m2M8j11J63o6M2Pj73J20k86K8J56j03
2448a72J90l33O22n48P1J11J56j3K1k11L34k55O4m9K34j3k49J14j10J40M6o4K2
2471A08k45M3P9O5j09N0N3l5k87L03j75K0J20n6l90K92J70Q7m8p1j66K17N2l3
2495D4j05K35o0j96J17j37K16j92J93J5r9K37m49J13O5o1J40nk9k7k49R0J19j34
2519a59o2J39J25M0n4Q0q0J57o9N3j79M5q0K25j48J0O4l9j25k0L38j14j66Q1J52
2544B14p3k40P7k31n0J47K8J78K0k17O7O9J3k14L46r1q0O5n9J36k3k34L48j68
$$ plain form
2376 166 112 -154 116 -101 152 6 -84 3 51 -56 -127 -146 -84 -144 -216 -407 -166 -97 69 205 194 145 282 105
2400 105 332 461 38 57 21 -101 -77 -88 -189 -6 -94 293 -8 -92 -99 -21 -141 20 -103 -191 -154 -193 -14 -92
2424 -92 44 -206 -165 82 327 -160 -23 355 340 252 45 3 51 -60 103 37 79 86 -87 33 -253 -225 -69 -172
2448 -172 18 -315 307 -241 -170 -59 97 84 105 -106 228 -27 37 -12 222 209 -40 74 -36 104 150 86 108
2471 108 -137 -94 -15 50 -59 -9 44 9 -278 25 -150 -130 -10 -66 -456 -164 6 93 45 -26 -192 25 77 44
2495 44 -61 174 114 -82 35 -102 114 -78 115 130 31 268 -181 -68 -3 -64 76 71 42 15 -234 -144 -25 -159
2519 -159 -221 -82 43 83 29 109 29 186 117 170 -9 36 -44 181 33 43 107 68 -57 -77 261 147 -19 62 214
2544 214 141 -99 -22 -253 -303 -156 -128 50 70 -147 -80 -11 2 -212 134 43 -37 28 -31 105 82 -152 196 28
2568B8p4K01r0j74L31m00J20j31K49k34K61k01LnJ05j06l3J77j16Lk26J36O9L80
2592B73k28q5K49l01M4K67o4j19K80k02j82K94q1l02K79k38O6K1R3j72R1K99n94
2615c12K49P4J21j08N0J19m37L55p1l54L15K28m6r4k03J54J05r5mN9l5j86N1m0
2639a05p3K58j48N7j07J14l0nL5O6m69M07K94j53L4M6j47j53N5k1M19l71j09J54
2663D8K70j32j72j35J08N6J06k94K83l16K30J78l11j24J8L32o4m47M44p9k20J82
2685c9R5j75K79k42M6n0Q0P6l8m1L70k77j26L59k03p0K23j02m59M42%k00O5k05
2709a92j02L20K1j0k44K54j25K4R2J9q2R7j0Kq4r4L1L64o10J82J90j80J50q5N6
2734a6KJ00J06q5j80L6K74l87r8N7M44m23K18k8k3j9q8K8M77l21l71L40j73J98
$$ plain form
2568 28 -46 155 65 -109 222 -178 -58 -189 60 -174 87 -114 -111 -116 -11 -117 -150 27 -89 -86 -312 -176 -107 273
2592 273 45 -40 209 -92 -48 219 155 36 316 114 -68 226 145 -157 122 -116 -50 -29 64 -108 -17 282 -312
2615 -312 -63 11 132 24 74 193 -244 111 40 -314 1 229 183 89 -114 40 145 50 46 105 70 -116 -65 -105
2639 -105 -178 80 -68 -11 -118 -4 -34 -39 -4 62 -407 0 294 141 175 221 74 -79 -24 -45 374 3 -106 48
2663 48 318 186 14 -121 -13 43 149 -145 138 -178 52 230 -81 -205 -187 145 81 -366 78 -1 -221 -39
2685 -39 56 -119 160 -82 -36 -86 -6 70 32 -9 361 84 -42 317 114 44 267 165 -294 148 148 -52 13 -192
2709 -192 -294 26 47 37 -207 47 -78 -54 38 57 -25 72 62 64 -20 -114 -83 281 -329 -147 43 -137 13 -72 -16
2734 -16 -14 86 192 107 -73 -37 237 -150 -248 -191 253 -170 48 20 -3 -22 -110 -82 395 74 -297 43 -130 68
2758F8l92N12j67j8r2r9L08M9r6J14rj55k45K11J50pm73K49j54M2L93l75M5J30
2782a1P1M0J75l68J22j2J74m2k51K67j85q9k6R6O6K3oJ08l68M73j72j7k01j0Q9
2807e4j06K32M5k24n5O2P2n2m5j9J76Q1pk6j35Q0R9m3k95L17n5Qk08K65k36N0
2833g3J42K6k25K17j8K14q28L68K56k23K18j71J6j34L31j35J49k77J14L10n19
2854b42L25j30J19J12k78K28j76K24l18K78j06j0k30K27k11j03P4j40N54j65j61
2875a29J43j99J63j46R5o8qj8J74k68K53J81j0j02j50K97j69O8j64M7P0J03j52
2898A1p7p1K3J00l03L82O4l27J69o0P3p1j33L81j83j44L04j17n0P2J69k07q3K24
2922A46J46m07J93j09M4LkK94k86K9J26o3p1l3j14P0n3J78j72l4L38l96M40j2
$$ plain form
2758 68 -324 188 21 3 -89 -188 120 169 73 187 178 23 -222 -11 139 132 -341 -92 -246 -204 189 -186 -141 -11
2782 -11 60 100 275 -93 29 17 191 149 -102 165 -20 -109 -135 -39 27 50 44 152 -216 257 85 68 -133 -143 -54
2807 -54 -160 72 117 -107 -162 -100 -28 -80 -125 -144 32 113 106 80 -55 25 124 81 -214 103 48 56 -152 113 -123 -73
2833 -73 69 95 -130 87 69 283 -545 -177 79 -144 74 -97 -81 -215 116 -19 130 -147 -33 277 -242
2854 -242 83 -47 72 184 -94 134 -42 182 -136 142 36 26 -204 23 -188 -291 -217 -357 197 32 -129
2875 -129 14 -185 -22 -168 -73 -141 -149 -167 7 -261 -8 173 163 61 -89 208 39 107 -57 -10 60 163 11
2898 11 -66 -137 -114 -14 -317 65 129 -198 -29 -89 -16 -87 -220 161 -22 -166 138 21 -29 43 212 5 -78 146
2922 146 292 -115 78 -31 13 16 14 308 22 51 177 114 43 10 -104 -34 -87 91 -81 -115 223 -173 267 255
2946B55k69K1J38k43J91K18k04qj26M6k4J12L6L3l49L62j93J7l7J20r2J60N4j71
2970D7L1j22r1K24l51K97P0J51l98M5O63n95K5N1J33o4q3K81k94O3NJ50l6L2l04
2995g0j87p6J91J66k34k9N1L1J68k32K10N6J1n3q5J39l5M8l31L83l5L8k29K26
3019A22j17M0K3r1J9L9o6J28J6ml26K97J5l43K18N0K62k23M2r6Q9j92pk79O84
3044C00l43l7J18R9n9p6j33K00N4Q5j33r9J03n27P55k05q7k49R0Q5K38k34j47
3067b02J72L2l18K53PR6j04M4J10k08K10j41N0q5L46j5j77lJ57k55J21j30J13
3090G3r4J12l6N4n8K5m8PK5k72O4j12K61N7J86l22K47k43K0L65l33J20p6L30m57
3115a05m9K27m0N7j10N7j33J74K34k27k23L1J27R8j22%r8ol4J62K12J54l62J3
$$ plain form
2946 255 -14 7 145 -98 93 311 107 99 -27 19 -5 107 143 176 -173 189 -4 13 -24 96 4 164 218 47
2970 47 78 -44 -135 89 -262 35 105 256 -142 -97 566 -29 -4 47 180 116 33 314 20 83 88 238 202 234 -70
2995 -70 -257 -333 -142 24 -210 -239 -188 -157 11 -221 -11 45 56 3 -82 57 22 70 -261 122 87 125 -104 122
3019 122 5 45 68 -23 -4 35 -31 97 113 109 -217 80 95 -248 -30 20 282 59 101 5 94 -98 -105 -384 300
3044 300 -43 -80 38 137 78 2 -131 69 123 208 75 -24 79 -448 307 102 15 -234 -144 -59 179 -55 -202
3067 -202 -30 2 -316 -63 -56 40 -64 -20 90 -118 92 -49 1 -84 262 247 70 67 224 -31 90 -40 73
3090 73 -21 91 55 109 51 76 28 35 60 -212 -148 -260 1 58 244 -78 169 -74 -54 311 -22 98 22 352 -105
3115 -105 -154 73 33 90 -20 37 -96 78 312 85 -138 -107 20 118 -4 -4 -102 -108 -142 20 232 386 24 37
3139C7j16N2j78J67j7K64l66J70K06k06J05m0j42J06K82l74J21m5k79M24l30J5
3161a44j7J15m34N04j59J63O4k54R0R7J48k22j73M52k49J14J2K38k94j69K16k24
3183a26K7N26k09j80M1K4Rj94j4K26j70R9M0k8J12K30m46R4m3j63j55N19m6q8
3207H5P5k62J42K95m80J65J40j09J81r8Q1j9n8Q4l80N7N8R5M8l51L70j3j60j23
3231a77J22N8K09m10p8K27j35j03L67l4M7r3j4K95O9j82r0j42K05j7k07K08r6
3254B9K0m5l05N6r5K45K50j94Q8k21j78M16k6j46J78j20J7k8m2M31l14k2j18k36
3278c60M36l7l6j59L25Ok50J87k7j12k54L05Q3J6J5L4j33n6j93K82p5K03l21K28
3302A07r1n8m1o1o7L71k74L24l27J78J14o4J62j53Rq3p1K34j53k89K68j51K50
$$ plain form
3139 37 -79 -27 -205 -38 -55 209 -157 13 219 13 118 78 -64 42 324 -50 71 26 -253 171 -159 -144
3161 -144 -161 -46 -480 24 -135 28 92 -162 -72 25 173 -49 -222 230 -19 95 107 345 51 -118 98 -126
3183 -126 -99 427 218 38 79 103 112 -82 -96 130 -40 59 99 71 183 413 -33 61 18 -145 -300 219 173 85
3207 85 160 -102 40 335 -145 20 160 51 232 134 215 196 138 222 -158 -101 -43 52 100 -251 119 106 -54 -177
3231 -177 -55 3 212 -198 -276 -49 -184 -287 80 46 93 0 -14 281 350 168 78 -64 141 124 -83 125 29
3254 29 49 4 -301 -245 -340 -95 155 -39 49 -172 -350 66 40 -106 72 -48 -31 -59 -101 330 16 -6 -124 -360
3278 -360 76 39 3 -156 169 175 -75 112 85 -27 -281 24 107 123 138 172 39 -17 -210 72 -3 200 -121 107
3302 107 16 -42 -83 -144 -211 160 -114 210 -117 61 175 111 273 120 129 46 -25 209 56 -233 35 -116 134
3325A34j4l0J4k98O6P2J34J34l65jQ0Q6J5q3n8k38M54qk65K53j32J45n6m14O28
3350B53j68M%j38j3KQ5p1Kj49K50m7k8j3n9K37j42R2n6K9k85L35j94j13J59J21
3376I3k3j06N7k56L49j05J29O2j95L1J25m5Rk19J01l19L92R1k4k22J56k07M5l0
3400a11j21L65k21J13p4Q2J08o4J2o5K1O0K04n88K71K02m00J20J05K1k6Q2k21
3423a25J67N0j03J28k26K62p8Kp6m9P4Lp5r8K56j8J91l17k2J38k52K12r6K46m62
3448b68L76j35K16l72K57J93k10j37r4N1J88k36j07K89m00M48l40K52k3L3N3j91
3470a57J80M2j1l53L78j5k97K84j65J79j11M1l3l8N8J07l1j45JL2J84J92o09K87
3494@qQj44K21N6k43K00j82K04k31J93r6K21j62R5J07j85R6l59J75J95j83j55
$$ plain form
3325 134 120 90 104 -194 -128 -56 78 212 -153 -154 -74 12 27 -56 -114 -352 102 94 -171 82 -50 95 39 -375 253
3350 253 85 89 89 -49 -62 -60 25 -46 -44 -193 57 10 -18 -31 -90 147 5 97 41 70 -215 120 -74 -187 -28 93
3376 93 70 -36 21 -235 114 9 138 200 5 36 161 116 125 -94 7 -312 80 171 147 -75 81 -126 -81 -111
3400 -111 -232 133 -88 25 -49 33 141 77 89 24 45 105 309 -279 -8 194 -206 -86 19 40 14 96 -125
3423 -125 42 92 -11 117 -109 153 75 77 1 -48 26 29 -46 -144 112 94 285 -32 -54 84 -168 44 -52 194 -268
3448 -268 108 -27 189 -183 74 267 57 -80 -174 -123 65 -171 -278 11 -389 59 -281 -29 -52 -19 34 -157
3470 -157 23 65 54 -299 79 64 -233 51 -114 65 -46 -5 -38 -76 -18 89 58 -87 -86 -54 130 322 -287 0
3494 0 -8 0 -144 77 133 -110 90 -92 112 -119 74 -22 199 37 132 239 54 150 -209 -34 161 -22 -177
3517a77R9K0L6J02r2J62j46R7oJ5j79R3Oj49J23M2j37K5N6j9l6j01L2L20l78Q5
3543a07J50j14J70J95j81O8j38m5O4l17J71L02k99J74j9k6k10r2L1L08j91p5J02
3566g9J53l18K05K37k4l88L69j54R7J7j57K57l80K63j86J87k2l03L72O7l41R3
3588c5n8L2Q9l68O3M39pk84K49N5q2LJ00P0k57L26m45J10J3n6R7K8k23R8k7J26
3614E6j70o4K31k59J89l3J28j33n7j0l29N66q1r9M42m50J41r6lJ13J65k60j31
3637a44K23J90k04l4P2j94Q3Q2J2j10p3j81J51N3p4J41K5k9R6o9P5l3l35K68q6
3662i5Q8J11J1k66O9j08q7K81j02J97J00j46Q2P2j97p6p2N4K40l31P2l2KQ5l7
3687h5J07j49K91qr3J68k50q0M02m24Q2J15k6L5q4r8j7L33k51K64l07J4O1j0L2
$$ plain form
3517 -177 -78 -58 -22 80 -12 150 4 101 95 110 -69 24 30 -119 4 46 -91 -66 -10 -29 -65 -166 -134 186 -192 -107
3543 -107 43 -71 99 294 113 181 43 -2 62 -255 -84 218 -81 93 74 48 -162 -254 -223 85 -106 -181 -79
3566 -79 74 -244 -39 198 174 -214 155 1 98 115 -42 215 -165 98 -88 99 77 -226 146 213 -128 -35
3588 -35 -93 -61 28 -340 -277 162 155 -129 120 175 93 96 196 266 9 335 -110 0 13 -43 54 82 -141 -43 -70 56
3614 56 -114 -178 53 -206 -17 -50 78 -55 -112 -122 -451 115 34 -65 377 -73 68 -28 -31 82 247 -13 -144
3637 -144 79 269 65 31 103 -91 -8 74 86 -24 -97 -278 -127 -74 -148 -7 18 -11 85 16 91 58 -277 -9 -95
3662 -95 -7 104 115 -151 -82 -190 -277 4 -98 99 199 53 135 207 10 -66 -138 -84 156 -175 -103 -135 -133 -48 -85
3687 -85 22 -127 164 156 63 231 -19 -99 303 -121 -39 76 50 85 1 -97 -114 219 -32 232 -75 -61 0 -10 22
3712B2J96l98J46p7P1j40P8L12j81o0K8k43K31P4k51K71k93J89j83L01R9p6J43
3735B59m53K27k3j19K42m8j72l0O0O5Pm6p1Jj0J14m1j7r4J70kJ0k53K34j06K3
3761g3J97k06J7N6o4K0j63j1L38n1J14p7k5n8j98L10k08J37k12N0o2lJ66j43L36
3786A87j00M5P0j23j59L6P7j28R3J17K2l7j84PP6K62nk79J71j61j45q2K83R4j09
3811B8k7K92n24L80k60n9k3K07J5k12J0M35l91J57K07j98m2j7o9j9J28K72l21
3834c1k20K10nQ8q1K7O9p2Q2k58J72k23J59L1q3M82k01m60K51ko6K82k50J56j02
3859d5o6J60O4j49J33l2k86N29l71j65R0J48k10K6L45o4r0n9K55k20Q4p4j49K03
3883E7m6L3J71l38K5J19l9l9j69J33JL56l59O4K7J01j17K40k53L50k23k09K21
$$ plain form
3712 22 218 -180 -34 -111 -40 -180 -102 210 29 -31 -3 -246 -15 59 -192 79 -214 -25 -208 93 192 116 259
3735 259 -194 33 10 -109 133 85 -87 -117 -57 8 15 -31 -102 -101 -111 3 -38 -55 -149 21 19 29 -224 10 -96 -73
3761 -73 124 -82 -65 -9 -73 -53 -216 -227 111 60 174 97 72 14 -184 126 -82 55 -157 -107 -169 -172 -6 -149 187
3786 187 87 132 202 79 -80 -44 33 -95 -2 115 137 100 -84 -77 -1 261 256 -23 148 -13 -158 -240 43 137 28
3811 28 1 293 -231 149 -111 -170 -193 14 29 -183 -173 262 -129 28 235 37 -5 -22 -91 -110 18 290 -31
3834 -31 -251 -41 -46 42 -39 -12 57 -15 67 -191 -19 -242 -83 -52 -135 347 146 -314 -63 -65 -131 151 -99 57 -45
3859 -45 -111 49 113 -36 97 65 -221 308 -63 -228 -138 10 -200 -174 171 107 17 -42 213 -7 77 3 -146 57
3883 57 11 44 215 -123 -98 21 -18 -57 -226 -93 -92 264 -95 -31 -4 97 -20 220 -33 317 94 -115 106
3906A06j76K33j18j63P2j30L28n42N96k97j20l6R5J55J9JK5K05n0k63O0N0J65
3929B15N3k23J21k64M59l19j43J12J84l87J63Mn0qR7j29K65j32p2J92ok05j40
3952b13K63j13K54r2O8l71N18l30q0J77rJ14j49O4n3j7M03n45q8K63k37K76j15
3975a2J16j71M3o4J55k05p6K29l53L32J99k61L98n29J65N5j01M2pL40r9k08J86
3998A74r4j24P6j84J48J02k38J19J16K8k47L57n47J66j32K55j05N7l8J42j92J21
4020d0k6J63l7j11j85K69l3P2J87n2j51j55K27k97J78L52m36n2K32k43j21K65
4042Fn2Q0n5oO2j56K81j68j6J75O1k29J57j57L26p0j98j26L29j48k53K56J28p9
4066A48O0K17n20K9K49l43k9M15l39K15r0j41P9J88k57J72M8k59Q4M4r1L13j35
$$ plain form
3906 106 -70 163 45 -118 -46 -176 152 -390 206 -91 -211 -247 -152 3 22 23 48 253 203 -60 0 50 215
3929 215 268 45 166 -98 361 42 -101 11 195 -192 -29 -25 -75 -83 14 -115 150 18 -54 138 132 -73 -213
3952 -213 50 -63 191 99 167 -204 314 -16 -96 81 72 186 37 101 48 31 434 -111 -199 64 -173 103 -12
3975 -12 104 -67 -24 -88 67 -138 -214 15 -338 -6 193 -68 330 -199 -34 21 -80 -38 -45 295 196 -12 174
3998 174 80 -44 32 -152 -4 98 -140 -21 95 123 -124 233 -314 -148 -280 -25 -130 -73 -111 31 -161 -40
4020 -40 -66 97 60 -51 -236 33 0 72 259 207 56 -99 128 -169 9 361 -75 -127 105 -138 -259 6
4042 6 -46 34 -21 -27 35 -121 160 -8 -24 151 212 -17 140 -17 309 239 41 -85 244 96 -157 99 227 148
4066 148 208 425 -95 -66 183 -160 -189 226 -113 102 12 -129 -50 138 -119 53 101 -158 -74 -30 -121 192 57
4089E7j59K29r6L6P6l5k08K62ln0l46N28l89l1j9J36m4j6n7L2J25j88K66j74O3
4114ek41P8J97l0M3k48K64n0J72r0j8k16K96n3R8l27K80j55p3R5n0O8N2nN1j99
4140f6R2J64j98P5J0l95J55K32J73j04l62J54n5K1k6K08o6j28J25K60l27Q7lj4
4164A2K66l67J29q6K2Jr3M9p9K94j94p2K51m99J96N0K63p1j19j10J46j59L89k21
4188bJ35J17m75K12K1K25j10j83l0n8K1P4j90P2PlK2j69K13J89L2j20k79K73J13
4213A07j84k0K9J08j32J02P3j44J10J55k62J17k72L35Q3j53R7n8n9k41K8L77l18
4236a22K0k30N01j61m12J70L63O4m87J46L28j68M9k81L91l2qr8jK83k33r0m0J55
4260A07o4K5l52J53K81k76o4O5O6J94k67J70jk31J07J76r8P6L95p25J25L11j54
$$ plain form
4089 57 -102 127 31 67 143 108 -100 162 159 109 -237 291 -98 -129 -148 -12 -56 -72 -129 -97 28 -160 106 -68 -5
4114 -5 -246 -168 29 -1 42 -206 58 8 180 90 72 -144 152 99 197 -130 150 -5 -78 17 -33 35 87 82 133 -66
4140 -66 26 190 -8 67 77 -318 -163 69 242 138 -224 -70 -125 -104 -130 78 12 -116 9 269 -58 29 26 12
4164 12 278 -89 40 -46 -24 -23 -116 -67 -146 148 -46 -118 133 -366 -170 -120 143 72 -47 -157 -11 -170 219 -2
4188 -2 133 250 -225 -13 8 233 123 -60 -90 -148 -127 -53 -243 -171 -164 -167 -145 -314 -101 88 120 0 -279 -6 107
4213 107 -77 -97 -68 40 -92 10 83 -61 49 204 -58 59 -213 122 205 52 149 91 32 -209 -181 196 -122
4236 -122 -102 -332 169 8 -404 -234 129 193 -294 -148 180 12 61 -220 171 139 131 33 32 315 82 -8 -48 107
4260 107 43 68 -284 -131 150 -126 -190 -125 -59 135 -132 38 37 -194 -87 89 -9 67 462 -263 -138 173 19
4283A9j60P8K6j52M4K81k90L1J97L1n3kj41j49K42j34J46r1M1j73K36l94L52j37
4307a52J55N2K6M1m7r2L2n8l5Q8J86j32m7O6P5k5m30M38J12k16k5K25l73J17J49
4332A30j46o3r7O0j54j6L21j0l1k02J04J02L52k96m08J39L73J01j94Q4j12J38
4354A75k58O7K65l81NO9j00K70M1j42n6P8j54K05J66l91j45Q2J97K1K1k36K28
4377B7K1K6j13o3J27J61P6k04k12K86p7q8J95l15O4j43J87j7pL20j78j12o2J34
4401C3n1j29J62k26K09q0P6l16L81m8P5J92k31j37K38Ql58L85j58O4q8J89k61
4424g1q6L42j38P3k14K37R4l61K73m95J29j05M25k93K21K13j89q9O8J28j03K1
4446H0k53K45O7K8j24J35j21jP2j06r4K58k29j08P7q1j79K07N4K87k46M0J33r9
$$ plain form
4283 19 -141 -63 -37 -189 -145 136 -154 -123 74 105 52 50 -91 -240 2 -132 14 -77 -36 -209 27 -367 -15 -152
4307 -152 3 55 81 122 75 -17 15 -43 -78 10 196 64 17 83 158 133 -297 141 253 37 12 237 -136 -19 130
4332 130 -16 -79 -176 -116 -270 -286 35 25 -6 -208 -104 -2 350 54 -354 -215 158 259 65 149 37 175
4354 175 -83 -16 249 -132 -127 -58 -158 112 153 11 -45 33 -121 84 250 -141 -286 -204 -7 14 35 -201 27
4377 27 48 74 -39 -102 25 186 262 58 -154 132 55 -33 162 -153 -89 -232 -45 -62 -69 251 73 -39 -101 33
4401 33 -18 -147 15 -211 -2 -82 -6 -322 59 11 86 278 47 -90 148 156 -202 183 25 89 1 190 -71
4424 -71 -157 185 47 120 -94 143 237 -124 149 -346 -217 -322 103 -190 31 244 55 -34 34 162 59 80
4446 80 -173 72 139 167 43 178 57 56 128 22 -72 186 -43 -151 -74 -155 -334 -127 -73 214 -32 8 141 42
4470D2j47j23J90J5j49J60P4k50J65K73j67p8m1K61l78K64Mk70J83J34m54J05
4492a87L27k56J4j66M28m10L39k33N5R0k3l5L13l13K04lnj52P4J39k79L03p0k28
4516g4J22k58K80k9q7J41R1r6j69l7M6J26O3j29l5J15j02Q5k44L7J70K6L8l24
4540b44K95k04l3K67j98J16j92K86k45J86k33J09N1O7j71R6J75k66J57J19k17
4561g9P9Q9j02K72k88J63j44Lr6O9M1J56k01j9j2J09j47R5J66o9j47L6N4L3j18
4586e7Ono4J49p4O7J72k82k76K34O3P2J35j61J32J9J8o8k61N24j81o5k1j57K69
4611A88l92J45o5K02J64l13K74j65p4K2J96k16J34j17R4j50R8k08J00N0k85M59
4633A41k56K99n1k45q3L72J53m12M5j67K69k5o3k2mK56l30j69M49j78p2l2j6M44
$$ plain form
4470 42 -105 -228 -38 -23 -172 -12 62 -188 -23 250 83 5 -36 225 -153 111 115 -155 28 162 -292 -187
4492 -187 140 -116 -102 -268 160 -250 89 -144 -89 1 -22 -57 256 -57 147 144 139 -13 61 200 -79 224 154 -74
4516 -74 48 -210 70 41 -46 95 186 90 -79 -116 -70 56 119 -10 -45 70 -32 53 -191 -154 16 42 80 -244
4540 -244 51 -153 -186 81 -117 -1 -193 93 -152 34 -199 -90 -39 28 -143 -47 128 -138 19 138 -79
4561 -79 0 89 -13 259 -29 134 -10 -7 -103 -34 7 163 -38 -57 -69 40 -107 -12 154 85 -62 -26 28 61 -57
4586 -57 -51 -56 -120 29 -45 22 194 -88 -364 -130 -67 5 140 -21 111 130 148 80 -181 343 162 97 76 -81 188
4611 188 -204 -59 -124 78 242 -71 203 38 -36 -14 182 -34 100 -17 77 -73 25 -183 -83 -33 -318 141
4633 141 -115 184 133 -112 -195 177 330 -82 -37 -204 65 40 -23 -45 -49 207 -123 -292 157 -21 -93 -125 -141 303
4657C03l06qj65L46l07J20K0J00L87n48J28j10Q8j58L34l33K1l2J08K18r0R7k29
4680a6Q0K68j63j37l6k07L36j11J90j93K8J64j46N3j72M3J85j31K3j11j34K48
4702F1k57M0J69j19K44l55J48L0o7J98k34J63j79K72Q0j10k12J47k31L75j91o6
4724i4L14j94k92O8L63j45j65J74M0j49m4N3p1L38j42J61k37J20m7l8K45l39J06
4747B5J16j10Q0l33J24j10J57o8J77j24M0J17m6k9j33K41l23K28k32L3K53%L%
4771H6k9J0J1N1o9l1m3n4j00K45n8j15O9K18p8k33K78q9k71K48k17K25m28L46
4795b8L39k45k75O3J73r0J04m4J90j0j25j03J39r1k9P4P8nj64K36l3k12J39M9
4819A30j41m4m9r3K05j68j86L65j42K8j02M04J11p5k85J75o5J47j29K4j02J00
$$ plain form
4657 303 -3 -11 -176 170 -137 -17 3 103 490 -58 70 -40 48 -110 224 -109 -88 -120 -12 206 116 213 -16
4680 -16 64 332 169 32 -4 -211 125 14 204 11 39 203 57 110 -62 -19 166 35 58 -53 -187 61
4702 61 -196 -156 13 -106 138 -217 -69 -39 -106 92 -142 21 -158 114 194 84 -128 19 -212 163 -28 -94
4724 -94 220 26 -266 -198 165 20 -145 29 69 -80 -124 -71 -142 196 54 215 -22 98 51 13 258 -81 25
4747 25 141 31 111 -222 -98 -208 -51 -119 58 -66 -26 91 45 16 -117 124 -199 29 -203 -170 83 83 86 86
4771 86 57 67 78 129 60 29 -14 -68 -168 77 19 -96 -27 191 113 -120 158 69 -202 46 -171 54 -374 -28
4795 -28 311 66 -209 -146 27 -63 41 -3 187 177 52 -51 88 -3 -32 42 120 115 -49 187 154 -58 81 130
4819 130 -11 -55 -104 -197 8 -160 -346 19 -123 -95 -197 207 318 243 -42 133 68 215 86 110 8 108
4841A08l1R3N8j09j24J47k84Jj20J67J00j01J33o8M5j11K08k23K73n03M44k32
4863a29J71j14K9l5J54J78q8p0Q6k01j55J23K37k33j2K24j78J16k51J78j93J19
4885d4j44N8L3Q5O2o5m6kK10n4o2R2K3j21m5K41m03J53j89J07L62m44L9K56J5
4910A17l6J64l27K05k24%N7m4J02j60K29J61j5l00j12M5Q1k02K08L6K11m33J74
4933f3QJ2l20K90J75j76J49j70Q0p5l3M9K21o3N9qj97J83j35o3O0k2K91l15K21
4958A58j95N4J60m09M56k73m7L06l08J56l08K70O3K18o3j52r7J56p4L9k58J10
4980c8p7J27k4N3k03p5J24k4J82k93J87K78k70j18K26J49k28O9k1J33j65N0J00
5003A42j92K89l77R6p9K45j18k41K66J46k47K19j16j07l0k1j1R1l61K31K72K33
$$ plain form
4841 108 77 170 228 119 -5 142 -142 -141 -261 -94 6 -95 38 -30 15 -96 112 -111 162 -341 103 -129
4863 -129 42 -72 -43 -78 76 254 166 96 182 -19 -174 -51 186 -47 -59 165 -13 103 -148 30 -163 -44
4885 -44 -188 -130 -97 -12 50 -15 -61 -63 147 93 31 123 146 25 -20 221 -182 -29 -218 -111 251 -193 -154 102 117
4910 117 81 245 -82 123 -101 -101 -44 -88 14 -146 83 244 229 -71 -183 -138 -57 -259 -51 -15 196 -237 -63
4933 -63 -55 -43 -363 -73 102 -74 75 -95 -15 -90 -123 -74 147 84 143 135 -62 121 -14 -77 -17 -39 252 -63 158
4958 158 -37 17 177 -232 224 -49 -96 210 -98 58 -250 20 83 301 238 86 -11 145 71 110 -148 -38
4980 -38 -115 12 -12 41 -162 -237 -113 -137 45 -248 -61 217 -53 -171 55 204 -24 45 24 157 -8 42 142
5003 142 -50 239 -138 -42 -121 124 6 -235 31 177 -70 149 33 -74 -104 -125 -136 -45 -406 -175 97 330
5025C30k19j70J96k03K08j42K95k41m2o4L51k17K38m58kL17j77M0L6k1j67M7K80
5048B15l02K11J0k57r0K35q1j97R7m7M27j44Q5j33k06L22r4L0J26l14j68K66L0
5071B1l01K38nJ74j5k27j83M10n8j48m0K68m3j30k50N5Q0L37l13K26Pm16L82Q
5095G7m8J19l04N29m72J25k31O3J50j0L92k87J78k59r3k45L42k19M40j65j75m1
5117a34M1J28j11q3P2J22L51k49L6l70L0K32j87L16p1K38k14l16R8L69j72j11
5139A5K02j26j42J24j18j86O7K33k1j52LK64M2k83K6j02J22Q0r5R4J6kq4M3k8
5164ho3K99j32j77K7K06j85L6k99M78j87J67j59Q3Ol22lL01k92P2J41K57l12Q2
5188A6j31K89m12L16p7p8Q8J55k77j60J14K39L01j61J26n53J53J48m7j49k8J61
$$ plain form
5025 330 111 -59 137 -66 142 0 295 54 12 -52 299 82 320 -138 -140 177 0 40 76 55 -112 -65 215
5048 215 -87 124 134 -123 -213 22 -59 -256 -159 -206 221 77 162 29 -177 145 51 81 207 -107 -275 -9 21
5071 21 -280 -42 -47 127 112 -115 -298 112 54 -94 -134 134 91 -39 -289 -234 -154 183 -130 96 103 -313 69 77
5095 77 29 148 -156 373 -99 26 -205 -142 8 -2 390 103 281 22 -71 -316 26 -193 247 82 -93 -134
5117 -134 -93 35 -76 -159 -87 35 386 137 173 -197 -167 65 -122 194 123 361 147 -169 -71 298 126 15
5139 15 217 91 -51 73 -45 -231 -164 69 48 -104 -101 163 205 -78 -52 -154 -32 48 -47 47 63 61 -23 20 -8
5164 -8 -71 228 96 -81 -54 152 -33 3 -296 182 -5 162 3 86 92 -230 -233 68 -224 -152 -11 246 -66 16
5188 16 -115 174 -238 78 1 -77 11 166 -111 -271 -157 82 383 222 348 -205 -52 96 49 -100 -128 33
5210C3j29J38m9J34O5r5o7k36L20MQ7l81J22N0j2PM2j68L40k85m7M09l03K31M7
5235B57l38O7MJ12k9q1j08K39k99J62k31L50N5j19m6kL6j05m4q1L71n9J09j21
5259I9N6k80jK42n5j55N0q3K14k49J62K5k77K84j19k4J1l9Q7R4j86k41N47k66
5283a04RJ75k13Q4l30K81m2m1O1M63m7l06k00L51j03R8j13r2PL9J36q8J9l4J59
5308A69l23Q8J27l01K87N3o0k1P2k39N9L0J5N3K02k02nk56L80l3L7j57J31L2J27
5333B65j71k64j9Q4J82N3l19J27J53k11p6K26K27p2o3J67j98N2o6q9n3J26m7J07
5357A21k5q7J39k27P7M0j19J62j25n6Lj46L68l27J96L6K2J16j05j9Q6p4j68J54
5381D2J87j87L0K8L0r8K90k89n9J52M7M0m0n7j50K01j86J7k9l9j34J88O5J17M5
$$ plain form
5210 33 -96 42 -7 127 192 97 30 -206 114 118 205 -176 -54 -4 -16 -9 33 -135 205 -80 -127 282 -21 210 257
5235 257 -81 -14 -10 102 73 -8 -116 123 -176 -14 -245 105 160 41 -5 -7 29 -76 -120 -201 170 111 220 99
5259 99 155 -125 -126 116 61 -94 -44 -127 87 -162 0 25 -252 32 -87 -111 -100 -139 -52 42 -144 -385 162 -104
5283 -104 -95 80 -133 -49 -379 -98 -140 -181 -120 343 296 -10 -210 141 38 136 23 -69 -62 -23 113 25 44 10 169
5308 169 -154 -66 61 -240 47 100 40 19 91 -148 -89 -59 -44 9 211 9 4 -252 128 95 132 -25 106 138 265
5333 265 94 -170 -189 -105 77 130 -189 -62 91 -120 -196 30 257 185 122 289 91 143 77 -12 -65 61 14 121
5357 121 96 9 148 -79 -2 38 -81 81 -44 -100 -97 -243 125 -202 -6 30 52 168 63 44 130 56 -112 42
5381 42 229 42 72 100 130 32 322 33 -26 126 173 213 173 116 -34 167 -19 -2 -31 -70 -204 -16 49 166 211
5406B11k34j62J62n3J15M7m9p9k35L75l14K93j59J75j41k5J62k45J85R4K1k60
5428a16m7L35k96RK00m1j55J98n7J48k05m4K33k38N0j54K48j45J07J82j44j19
5450e1K4J80l16K6J90L7j6M20m79K53l45j66J12k6J67j78K15K2k50M08l29K19
5472A17p2j69K11l03K57l4o3OJ30p9J70m16L10K14l27K52j43k88QK31j23J75k07
5495a43j45R9P6J80R7j66l9j63K86j47j18M3mn4J03K36k62L7k40J03M27j94K2
5518C4M9j51N2J0Q5J0j74J23l26L91kJ45k75K4rP2l8k09R3R6p2r3K1L29m0l37
5544a92j9J62jO4J96j38j40Q0k25K61n9J7P2k72K60j61M4o0J62q4n7R2J02k91
5568a87J83K9j12l6J97j51K9Q1J3k16Q3J76Kp5k03J94q0Q2J60j54j61K94l45J60
$$ plain form
5406 211 -23 -185 -23 -76 39 86 37 -42 -277 98 -216 77 -82 93 -48 -73 89 -156 29 123 144 -116
5428 -116 -163 172 -124 -115 85 44 -111 87 30 178 -27 -71 162 -76 -26 -180 68 -77 30 212 68 -51
5450 -51 -27 153 -163 -137 53 90 74 494 15 268 -77 -243 -131 -157 10 -168 47 69 -181 227 -102 117
5472 117 45 -124 87 -216 41 7 -56 -50 80 1 171 -245 65 279 -48 204 61 -227 -219 12 -111 64 -143
5495 -143 -288 -189 -113 67 164 -2 -41 -204 82 -65 -183 -140 -144 -198 -95 141 -121 -84 -324 -221 206 12 34
5518 34 83 -68 -16 -6 79 89 -85 38 -288 103 101 246 -29 -5 -14 58 20 -189 -96 0 -72 -165 -144 185 145 -192
5544 -192 -211 -49 -50 14 210 72 -68 12 -213 48 -11 6 78 -194 66 -95 -51 -111 51 -33 -90 2 104 -187
5568 -187 -4 25 -87 -123 74 -77 -48 33 46 -170 -87 89 91 16 -187 7 -73 9 169 15 -146 148 -197 -37
5592c7J13o6O9q7J07k15L47l20J47P0l09J12K20mJ32l87k1J67N6MJ30j28m3O6
5616A23k71K52j59J45j46k77L38r1L2L01m16M17j45j62K21m79L09L8p9j04J62
5637IJ54k95L63o35N86L8o3l94L60m3l5K37l10K25k58O3K16l22L07k00N4P2p4
5660E5L9j89K24N4l26M7L7P4R8o9P5l66J29q3P0J80j5Q5j48k47K26O2J88k01Q7
5685H6j28R0q1m38K15M06k86p7K19L8M2j69l1J33j16J26p6L65m94M4J2nM00j80
5709I5J05k77j10P3K84l5k25R9k93K83k6J14l5Q0l16K05j28K90j64P7l94M34k36
5732a00lO3Q3j27J96K0k73L69k64J29M9l56K98J39j73k0L14m31L96n38L52k76
5754a53%l6P2J44p1oR2l79K90K14l56N0RO1j10k14N77l76L40n5k58K54l01L38
$$ plain form
5592 -37 76 10 79 -8 99 -116 231 -89 58 128 -181 -69 151 147 279 -108 -129 38 94 98 228 100 57 123
5616 123 -148 104 -55 90 -56 -333 5 -86 -54 247 -169 248 103 -59 162 -317 -8 30 -49 -153 9
5637 9 163 -132 231 -404 182 220 157 -237 123 80 45 282 -28 197 -61 2 218 -104 203 3 57 129 55
5660 55 94 -95 129 183 -143 -96 -59 15 113 44 119 -247 -118 -201 -131 49 34 119 -29 -276 -50 12 200 -1 86
5685 86 -42 48 -33 -471 -256 150 -136 -213 6 44 86 -83 -114 19 -97 29 -47 318 -176 -132 -120 -125 275 95
5709 95 200 -77 -187 -114 170 135 -90 9 -284 -1 -27 87 52 132 -184 21 -107 183 19 96 -298 136 -100
5732 -100 -103 -40 43 -84 112 132 -141 228 -36 93 142 -214 84 223 50 30 344 -87 309 -229 123 -153
5754 -153 -153 -189 -117 27 -44 -50 42 -337 -47 167 -189 -139 -130 -69 -179 -393 184 -192 148 93 -165 89 -212 126
5778A26j37q9J10L0r6J86R4l98K09j06j03O5J0Q5j57J95j77K44j32p9K39j95J04
5801B8j22j11m2L35k47K13k0j11K21k33Q9m4j17M7o6K74k38J42q5M0n5M3O4m4
5825c9K5Q2k86M31k66m6J87j48J73j75j13K4J77k07J00j13L65k39L55m01J47R6
5847A29j85J03j59J41JJj62n5R5j04jL13j25l5k61K23K00l00J48r9l6K64J30j04
5871A22k39K10R9k65K30n3j09k30M1K60K0n8j13j39K65m30L85o6k6o9P3K81j36
5894E3m14M62j80J24K62n27J80J08J26n60L43o5K86l47K42Lj05OJ44k44K49J96
5916C42l08M4K2j08J15j32n0k1l63M84J34j25o3k55J47L14j82n6J52m8q6j3P4
5939A8k90n0M86j59K50n34N18n10L98Oj83N3l3O11o57P3R6k55J85K5l67J94q9
$$ plain form
5778 126 -11 -100 10 40 -56 130 224 -174 35 -71 -174 -109 -99 -14 -171 24 -153 91 -41 -120 119 -76 28
5801 28 -94 -205 -247 88 -159 54 34 -77 144 -89 0 -44 -161 -114 -180 94 -144 -2 -87 -47 -102 -59 5 -39
5825 -39 -14 68 -218 213 -53 -99 88 -60 113 -62 -175 -151 26 -181 -81 -194 171 -68 287 -114 33 129
5847 129 -56 47 -112 29 30 31 -131 -186 -91 -195 -196 117 -8 -43 -304 -81 119 -181 -33 -132 -168 96 226 122
5871 122 -117 93 192 -73 157 104 -5 -235 -194 66 86 28 -85 -224 41 -389 -4 -70 -96 -165 -92 189 53
5894 53 -361 101 -79 45 307 -220 -40 68 194 -366 -23 -88 198 -149 93 96 -9 -3 141 -103 146 342
5916 342 34 78 100 -8 107 -25 -75 -96 -459 25 159 34 -29 -284 -137 177 -5 -61 91 43 -43 -56 18
5939 18 -272 -322 164 5 255 -279 239 -271 127 133 -50 3 -30 581 -76 -3 93 -162 23 48 -319 -125 -214
5962b14K71p4K49j64M5l0k14l3J97r0l2K58lj17k9j83j23L00J32k11N6K7j13j4
5986a09j22O5P1M20l77J5j61J91k39J94L6j9j98J67o3M40l06p5J45j43J12P2K4
6009A40P5j77j16n8k4K64M5k72J99l%K51l30j05o1Lj2j2QR6J17k54M9K61R5k00
6035b1jJ04k40R4K75O7n33J81p0j22K88k3k58K15p1RJ22Q0R5j21P9n9J14j49j67
6060a12L18l79J47j22J49k8k01L50k20J6J14N8n2J02j0j34j56K70j27l5N7M2j14
6083f7M1K25j86p2J13q0K69j82lj43n2K12M2k26J90j8k39J44k43L23J19N8k91
6106f6L79k06K08k69%O5k83J56J61j01l5q0K23k63j50L75Oj74K1Pk16L28k05L6
6130h3j2j25o7M86q5j79M72m67rJ64mj11L10rk55k36J57M6l45M60k1q0K24k02
$$ plain form
5962 -214 57 -17 232 68 113 83 -131 -164 33 -57 -89 169 166 49 20 -163 -286 14 146 -65 -9 18 -95 -109
5986 -109 -231 -166 -95 325 -52 -37 -198 -7 -246 -52 -16 -35 -233 -66 -129 311 5 -70 75 -68 44 116 140
6009 140 215 38 -78 -136 -160 104 149 -123 76 73 73 324 -6 -111 -172 -169 -181 -193 -185 -89 28 -226 -177 84 179 -21
6035 -21 -22 82 -158 -64 211 278 -255 -74 -144 -266 22 -1 -259 -44 -115 -106 16 96 191 70 149 90 204 55 -112
6060 -112 206 -173 -26 -148 1 -27 -228 122 -98 -82 32 90 38 140 130 -4 -160 110 -17 -52 5 47 -67
6083 -67 -26 199 13 -59 54 -26 243 61 58 -85 -137 75 117 -109 81 63 -176 -32 -275 48 167 225 -66
6106 -66 313 107 315 46 46 111 -172 -16 145 44 9 -71 152 -111 -261 114 120 -54 -33 -26 -242 86 -119 -83
6130 -83 -95 -220 -287 199 114 -65 407 -60 -69 95 91 -20 290 281 26 -210 -53 -7 -352 108 87 7 231 29
6154B9p6J15O1j86N7j37R7J94l5j83J30j71P5l5j38K71j36j13J73L7O2j68o9J35
6178a1j22O2j6j2O3rj18J35k3j9Nm7N0M7N7j85K92o4l92M06p0o5j32Q9K70l32
6204a41J38k28L68j25k51Q2N6L08l39K11o3J11j04L17m82M40j82j50k9j15J62
6225a6J29j19J08l0k69L89j49J0N1j60O4p3P5L62m42K7KJ82k50J42J0p1J26k02
6249a04j26K91j41J08k05J14J59J09r9P2r3Kj4P3L13m11o1o7J74J6l86M9N37n12
6273b02P1K33k37j28R1k0K43k53J54K72k32k9j17j80K22J31J53k58j4P5K50j1
6295B14m74N97l03J12k86J41M5J44J40k96P5J14l11J19j2j14L7P7j63k4O2J06
6317@O4J40l59J54m3K17m9l58M80k86K62j63j15Q1Nm4NO9P7r9M1o6J2L1j32k65
$$ plain form
6154 29 -47 68 129 -57 0 -137 -40 154 119 -64 66 -105 -30 -65 -203 68 -68 -181 -8 29 91 -77 -146 -11
6178 -11 -133 -71 -87 -99 -36 -45 -163 -28 -51 -70 -65 -112 -62 -15 42 -143 149 85 -307 99 29 -36 -168 -79 191 -141
6204 -141 -3 -231 137 12 -239 -157 -101 207 -132 79 16 127 23 340 -142 298 116 -34 -63 -178 -16
6225 -16 113 -6 102 72 -197 192 43 53 104 -56 8 -65 10 372 -70 -43 -41 141 -109 33 43 -28 98 -104
6249 -104 -230 61 -80 28 -177 -63 96 205 106 178 85 87 73 146 459 48 -13 -80 94 110 -276 -227 310 -202
6273 -202 -131 102 -135 -263 -172 -192 51 -202 -48 224 -8 -37 -154 -334 -112 19 172 -86 -100 -25 225 214
6295 214 -260 337 34 146 -140 1 46 190 330 34 109 223 -88 31 19 -95 -58 19 -144 -168 -106 0
6317 0 64 204 -155 -1 -44 173 124 -234 246 -40 222 59 -56 25 30 -14 -9 60 137 38 79 13 25 56 -76 -341
6343c41K75K01j97j29K26J43R4k36J98n97L05QJ60k74L69l23j07L67o3m8N2q5
6365bk08K25K22o9k77K93l49L03l97L80j53P1rpK67j58J57k04m41M71J97m10K56
6388A58k38J64J70j56Q5j13q3J19J3l18K58r3J5J84k37J11k64P1K93j48K52j62
6410H1j34J49j06j64J30Q1Q1n9o3r9m6J68P4j30N5n6J6j09K06l2l17Q6O8j53J81
6435i2q7J07j46J75M3j20l8K58k27J90j79M2N3M6n5OO9q0qL6K22k52J57ok43J81
6461E2J9P4k74Q6kR8n3R7j37k3K3l7J9M8J81j18p9l1P1p5k5j25K08J22qk33J64
6488D2J44m89J93L18j44L7q5n4J12k7J24r4m8j10j29K88j9k6K20l39n6j93L64
6511B9p8J64k31j3K32j70J07j00J7k71K30J18J56j66J9j22K88r4l3K0p0j69j81
$$ plain form
6343 -341 -66 135 -62 -191 35 178 272 36 234 -363 -58 -50 110 -164 205 -118 -225 142 79 31 83 -2
6365 -2 -210 15 237 168 -109 184 -165 138 -259 121 -32 39 30 23 290 132 289 85 -356 115 312 -98 158
6388 158 -80 84 254 98 183 70 -13 106 119 -199 59 -34 -19 165 -72 39 -225 -154 139 -9 243 81
6410 81 -53 96 -10 -174 -44 37 118 59 -4 -103 -149 19 93 -37 18 -38 -22 -131 75 43 -274 -188 -120 -273 -92
6435 -92 -179 -72 -218 -43 0 -120 -158 100 -127 63 -116 -74 -21 25 -30 -24 45 -35 -43 -7 215 -37 120 114 -129 52
6461 52 71 145 -129 -43 -45 53 0 97 -40 -63 -40 -77 -58 -10 171 53 -26 -57 14 -61 -86 -211 -3 119 111 -122 42
6488 42 186 -303 -110 208 64 101 16 -38 74 47 171 77 29 -81 -210 78 59 33 253 -86 -142 -335 29
6511 29 -49 115 -116 -129 103 -67 40 -60 -43 -314 -84 34 190 24 43 -79 209 115 82 102 32 -137 -318
6534c18K00J73j07m7K75o4k49O5j71J52M1j35J49n1M6k20J67o7J55K42j59M5O
6557A28p8m59L01N4J00mrJ0j14J37m4jK89k38k65K47j29P8N3J70k65o3J68r3n
6582c2K63k85J63j27J43j8j43M08l86j74J72j23J61j48J48M5k6N4j42n5K43j30
6604A1J14m03J40J45K01m12L04M0k3q5j56K73k56J37N6j2k27K19k20K44j10K05
6626A85n7n7k00J53K81l39J02n5n1K23m68K48j23M94n55M05j34j24J34R9k17K3
6648c3J20r9K23k87L54m56J17K42k15J8J67j55J07k50r7L03j24J16j58K19l1j51
6670g0L7P6K6j0o2qm1j5J36j1k02R8Op5Kk11K58J43N1ql55L00j65J48k76J93l2
6697f7j68N38m60J88j23j07M93k85R2r7j00L5L60l57k40K2K33L13l63K80k14J33
$$ plain form
6534 -318 -118 55 -52 -99 176 112 -137 -72 -243 -91 -50 -185 -36 -87 -41 -261 -94 -161 -6 236 77 122 128
6557 128 50 -409 -108 -54 46 42 33 43 -71 66 22 21 310 72 -193 54 -75 3 56 226 -39 -102 66 -27 -32
6582 -32 231 -54 109 -18 125 107 -36 372 -14 -188 -16 -139 22 -126 22 67 41 95 -47 -102 141 11
6604 11 125 -278 -138 7 208 -204 100 140 117 32 -124 149 -107 30 86 74 -153 66 -154 90 -20 185
6626 185 128 71 -129 24 305 -34 68 13 -38 185 -283 -35 -158 336 -219 186 52 -72 62 161 -56 -33
6648 -33 87 -12 211 -76 278 -178 -61 181 -34 -16 151 -4 103 -147 -244 59 -65 51 -107 112 81 -70
6670 -70 -33 43 69 59 -3 -11 -52 -67 69 58 -144 -46 -40 -115 -113 -324 -66 77 128 120 -235 65 -100 48 -228 -35 -67
6697 -67 -235 303 -157 31 -92 -199 294 9 101 4 -96 -61 299 -58 -298 -276 -43 270 -93 187 -27 106
6719A06j62L63k20j43N1l3J32j3j65p6K65l1r5L54m02j06K85k40J72Q6L7j19j12
6742f6j99K92K6p2P6K15k15j95K48J99l95P5M1n3O2j02K69o8k05j02K47j70o4
6765a56k7J7P8k5K98k41j36K38j42k5R9j10K55l89J79L67j04j31j09J35j27j67
6787b23K93k81N48k53r7K22k03m4K43j96l5K72j88Q8k19K61k63M38k65j09M6J82
6809B17j97Q9j22J55m08n5K27J05j41O0J08J27j85p1J20L7k81l0J57m6k91N19
6831I4k50J49J08K5l76O31o39P3kK2J04K9J34l3J8k8l7k58K34L1J48k48L08l58
6855a21K50j80o5J83M0k26oN8K43r9J08j2j88j20K15j81j66N24k42j60L38k29
6877c6j11J14m8L0j0j13N3qK79j43Rk8k7j9j17J0L14j22k11J38j0j45K98j48j1
$$ plain form
6719 106 -56 307 87 -56 -5 -38 94 81 -84 -160 105 74 -21 333 -69 -175 110 -130 42 128 165 46 -66
6742 -66 -265 27 53 -19 57 272 57 -138 110 309 -86 -11 30 -23 39 -63 206 138 -67 -169 78 -92 -156
6765 -156 -183 -166 -88 -113 185 -56 -192 46 -96 -121 -22 -132 123 -266 -87 280 176 45 -64 71 -56 -223
6787 -223 70 -211 337 84 -13 209 6 -38 205 9 -26 246 58 146 -73 188 -75 363 98 -11 35 217
6809 217 20 109 -13 142 -266 -321 -94 11 -130 -70 38 165 -20 -91 29 66 -215 -245 -88 -134 -425 94
6831 94 -156 -7 101 126 -250 381 -258 -185 -187 -165 -61 -32 102 69 87 59 22 -236 -2 29 177 -71 237 -121
6855 -121 129 -51 -116 67 107 -119 -125 -67 176 77 185 173 -15 -135 80 -101 -267 257 15 -145 193 -36
6877 -36 -147 -33 -81 -51 -61 -174 -121 -129 150 7 16 -12 -39 -58 -175 -165 149 27 -184 -46 -56 -201 97 -51 -62
6902f2K2RJ42l7J67j39k1j1J01j45j84K20n3j36O6J0j2K11k48R0J8K5j94J66j52
6927a47J86j72J05j47K22j6J46j67J41q3k9Pj26Q2R2K13k41j00P6L3j00J6j07
6950a16J17L7j33M4o4j5O6k2J33k90J18K26k21O6J26j7j65J38j33K21m5R6n6k63
6974a52J89j57R8p5kL4L9K0O5k9L16r9k81P6J54j35j50J45J70j76L0k48J53p3
6998h8J54r3J15L6J21k43K15j65N2l47J20M5J75k62K81q7r7l1J7j14m3L96j18
7021C9k9J37k81L5o1L19m4R2R1k77j28NL31l50R4Q5N3j34o2J43l44L42J25j07
7045G4L3r1L9J56O0m96M7j38K18K23k77K24k58M64m56N6J54j22L57n28K25J44
7067A08J43j53p1Q9q9J08j98q0J62J62l56M1j0L11k12N5r8j1J63K28l91R7k91
$$ plain form
6902 -62 -40 -31 111 74 241 102 81 70 171 26 -158 62 9 -127 -61 -51 -63 148 -100 -10 8 33 -161 5 -147
6927 -147 39 -133 -28 -175 47 31 177 10 151 68 39 46 -80 2 94 307 66 -34 42 75 -25 -9 -116
6950 -116 1 38 -95 -51 -115 -130 -64 -86 47 -243 -125 101 -120 -54 72 55 -110 28 -105 116 71 167 111 -152
6974 -152 37 -120 -22 -97 -99 -65 -26 -6 59 30 346 247 -34 42 196 61 -89 56 226 50 80 -168 -15 -88
6998 -88 66 -27 88 124 245 2 217 52 104 -243 -123 -78 97 -165 116 29 -68 -99 -82 -196 -239 157 39
7021 39 10 147 -134 -99 -160 159 115 207 298 21 -107 -102 229 -121 -27 58 111 -23 -85 58 -286 56 181 74
7045 74 107 16 55 211 271 -225 -178 -316 -98 125 -152 72 -186 278 -178 -122 32 -90 267 -261 -36 108
7067 108 251 98 27 116 27 135 -63 -143 19 181 -175 -134 -144 167 -45 10 -88 -99 64 292 -99 -2 -293
7090b93J14J42J12j00K7j3j04N5J51q5J50ql54M19k53j23K17j8k35J70l3J93j22
7113Ij38L66j61K8k69K16K0P1Oj6k66N4J32N1p9j27q4k36M04P4j40L14p8k60K87
7138A78P9k24J71k82j1J27j79O3K5j03l71N43J77j62l2J12l46j9L38L7l45J52
7160g2K07j7j37J13j87K4N8k1O6j48L1L18k25O7j56K77k19K01N7j57k21Q0kj02
7184a65N2J95k83L80m3j44k21M67l46J47j82J43J81l90J15J86m35P8K86j45M58
7205C34m55k4K86k69K76j18M6R8k80j2K24j07k0J07L0J81k41o6J07j54J39l03
7227b21K82M6J13m33J12L25l80L90j51k08N2j23J06K49j15k20J50j30J21J84m
7248A45k95J87k31L2O9j32J26m3K71%k49%M48l76j17J08k84M01Q7k92J35P8j02
$$ plain form
7090 -293 -179 -37 75 -25 2 -11 -115 -60 91 6 156 148 -206 213 -40 -163 54 36 -199 -29 -62 131 9
7113 9 -129 237 76 104 -165 51 71 142 148 132 -134 -80 52 103 24 -103 -187 -423 -19 55 -85 229 151 -109 178
7138 178 257 33 204 -78 -89 38 -141 -78 -53 -156 -527 16 193 31 -1 111 -235 -254 84 121 -224 -72
7160 -72 135 118 -19 94 -93 -69 -11 -32 34 -114 -83 235 10 77 -79 198 -21 180 237 80 -141 -61 -63 -165
7184 -165 -113 82 -201 179 136 -8 -229 238 -108 39 -143 0 181 -209 -94 92 -343 -265 21 -124 334
7205 334 -121 -145 141 -128 148 30 76 174 -106 -118 106 -1 -21 86 116 297 56 -10 97 -57 82 -221
7227 -221 61 107 220 -213 -101 224 -156 234 83 -125 -73 -196 -90 159 44 -176 -26 -156 -35 149 145
7248 145 -150 37 -194 -162 -93 -225 -99 -142 129 129 -120 -120 328 -48 -165 -57 -341 60 147 -145 -10 68 -34
7271c4mK37j06n9j55L27j27j87p6K02n3l4L8Kn0Q2O1p8Oj12j11N34k50p7J13r3
7297dj38J87q7k26K77M2j79K40j64q5L13k92K62m60L70OQ8m5k90J41o9Q1Lj2j15
7322a56M6K13m41M12n7L9k12Q9N7K3Oj17M3L20k62o2M9q5j8K74p7q4n2j79J36
7347i5J34Np8J3R2l18J70P0mj09l8Q1M5N9j78K44j66J52j39J12J60q2m51L01j6
7372c6o1J17j1j59J76j9L3J00j21k16M26j97m7j32n1L58j83R5j3l4k77K50j68
7395a70P8Q3J43n9j71J28j48M8j3J94k3r1m6n9K28l01K34q9K5L02m42j23J33O0
7419g9j53M01j05M17o04K8K9K95l11j37K33k0o5m4K72l74K26P5j10M0k01j52J71
7442a68J49J00j14K35n10L02K15l48J79j69K79k70j1J43q9J44l74M01J47k12m5
$$ plain form
7271 -34 -38 199 93 34 -121 206 79 -108 -184 18 -35 -69 -31 -29 -79 3 64 -14 -8 -120 -231 303 53 -24 89 -4
7297 -4 -142 45 -42 -268 9 51 -128 112 -52 -137 176 -116 146 -314 56 62 150 105 -185 -44 -113 -32 -29 -41 -156
7322 -156 -110 103 -338 74 17 56 -156 -67 -10 13 19 -98 -55 265 3 -59 -10 -95 -113 161 84 0 -52 -231 -95
7347 -95 39 44 -34 -21 71 -247 -77 -7 -11 -120 -158 -77 -32 27 -151 93 -73 79 -60 52 212 130 -321 -20 -36
7372 -36 -97 20 9 -150 26 7 40 140 19 -197 229 32 -15 -147 -198 160 -23 72 59 25 -252 -2 -170
7395 -170 -92 -9 134 75 -96 32 -116 -68 -81 113 90 -1 -47 -106 122 -179 55 -34 -9 293 -149 -272 -139 -79
7419 -79 -232 169 64 481 -123 -95 -66 229 -82 -219 14 -6 -71 -115 157 -217 9 84 -26 14 -187 -339 -168
7442 -168 -19 81 -33 202 -308 -6 209 -139 40 -129 150 -120 -131 12 -77 67 -307 94 241 29 -16
7463a6K44m39L47n6k28O5J76n7k25L14j70l42O36j06k86J88k26L66j40o3P6k89
7485b31L40k23m2K04j3O0n2p8K39k07p0J97j45R2l9R2q0K2j11J94o4k02K19j24
7509b2J6P6K03n61J91L2j55K14j83K75l0R9m10M39k60K42j45k0O5R0n2j3j45J09
7533E5j23J22j8Q7l19J0K61k70J47m3N6k00J74J22j99L82m92L75K9j39j61K61
7555A17k20Q1N9O1l25L03o1O2k30O7K71l5r0J30k97R8K76k81m4K23m2k05J85r3
7579A0j14m9P7K11k87R8J10n0R1j82Q9n5K77k60J44k28J52M3J57j69nk77J39L04
7603B26l96N43m26oj73K89J57k57m5N8m6K44j78N5j44Q9p8K1K15m0j40R4j91M2
7627h7nl6J04k83L34J9k56K73j79K96p0k6j48K01m4j00K25k86K41k74rQ1j60K08
$$ plain form
7463 -16 228 -211 136 80 -148 -83 93 36 -189 125 -45 -387 249 143 -143 45 -181 185 45 -18 58 -231
7485 -231 109 -114 -156 48 35 95 43 -35 204 -3 -73 124 -21 71 32 124 44 66 -45 149 85 -117 102 -22
7509 -22 -6 70 273 -288 -97 -65 -220 -6 -189 86 56 155 -255 184 -76 166 21 1 66 156 104 91 -54 55
7533 55 -68 54 36 123 -196 -186 75 -195 -48 -91 -35 -235 -61 61 -138 244 -248 127 156 17 -144 117
7555 117 -103 -22 37 98 -227 76 15 77 -153 -86 185 150 60 190 -107 -9 267 -14 -58 165 123 -82 103 10
7579 10 -104 -153 -76 135 -152 -54 56 6 97 -85 4 -51 226 -34 110 -118 34 77 234 65 60 -217 -78 226
7603 226 -170 373 -53 -59 -232 57 214 -43 -88 -30 -76 168 -10 45 -99 -10 -88 -67 148 108 -32 62 -129 -87
7627 -87 -92 -128 -24 -307 27 46 -210 63 -116 180 110 84 -64 137 93 -7 218 -68 173 -101 -110 -29 -189 19
7651A9J02k47K93k39J93j37J04j76J41k93K94j74K93kj42J6O7m9J4m5l1J53j11
7674D3O1K84l60M0l6R2k01j5p7R0p5K62j10j7J79Q8k56o3l6oK0m1K04k76K64j6
7700D2j63J99j34J33j02J18m5l2J95K3k93M92l38j85p2K2J47m5R0r3n7Q0K52j09
7724A25r3o6q9l7L58k81J54L7k15L82j61kj76K87l20LK97%k51J37L6m39N78j49
7748A15k20q0J27J97k2j85o8J58Q5r6P9K31n13K81J10k2j69j19j79L49j40K07
7770A26m20K80L0j25N3K28j44K3L65n93K82J21j57l58L20J22p2O1j61J66n5J10
7792B02j93k00M6K33o7O4R4k12J66J94m38L49qj64o1J83K1o6j14M2j06J79k3m5
7816G6q0Q3j65J34j96M8K9J58o6j31P7k6j9j15L5L27J38m04N6M3k98L61j11O0
$$ plain form
7651 19 121 -126 167 -72 121 -16 88 -88 53 -240 54 -120 173 171 29 45 112 63 77 32 1 154 43
7674 43 104 388 28 68 32 124 -77 -92 -169 -79 -154 108 -2 -19 160 248 -8 -71 -107 -113 -93 -134 70 -206 58 42
7700 42 -121 78 -56 77 -25 93 48 16 211 234 -59 433 95 -90 -162 -140 7 -38 52 -41 -98 -18 234 125
7724 125 32 -34 -123 -160 198 -83 71 108 -107 275 114 112 -64 223 -97 -94 203 203 -48 89 125 -314 264 115
7748 115 -105 -185 -58 139 117 -68 -136 22 107 11 90 321 -192 89 199 177 8 -111 -290 59 -81 126
7770 126 -294 -14 16 -109 -56 172 28 51 416 -177 105 226 69 -289 31 153 81 142 -19 147 92 202
7792 202 9 -191 -145 88 21 85 179 -33 133 327 -111 238 230 66 5 188 209 143 29 71 -35 144 121 76
7816 76 -4 79 -86 48 -148 -100 -71 87 21 -110 -33 -59 -78 -193 -158 169 307 -97 -41 2 -296 65 -46 14
7840A4J53m11q6N42j38j55J14K40l94K55l76O44m51J50j94k20L54M4k71K34q3
7861c5j45K32J1P6j02k3J58l33J43j05K23J00k86J68k24j58K97j26J60o7J21L1
7883A16j84J06M9l3l27N07j87p3k3K00j54O0M5j1K0q2p3M6J29j75J7J82p6j02
7907b3o2P3o8J88Q4nq0k88P6J30J5L4O0r7K10k65J92j81m4J67l68J31J79K15O8
7932C41l48j06J15K48r6k6j3j72P7O9j32m0j92M90J9j11j35j51M1R6lK8K91l06
7956a6J07j90N7J03k16J32L5k02K64j47M1L54k82P4l1j9J41j12k61L2R8J75j71
7979c4j61K16m1Q6j71q3m2K18L9J41k48N3k01J66J15j12J92l00M09r6k8kk12l0
8003a26J18K20l66r0L9R9L17l54K01Q1L9Q9l88J29J39K17k96k73M4o3K87j42J94
$$ plain form
7840 14 167 -244 -330 212 74 -81 33 273 -121 134 -242 402 -49 101 -93 -313 41 85 -186 48 -35
7861 -35 -180 52 63 139 37 14 172 -161 -18 -123 100 200 -86 82 -142 -300 -3 -129 31 -36 85 116
7883 116 -68 38 87 54 -273 234 47 -26 -49 151 -3 57 102 91 111 29 -44 2 131 -44 -27 155 79 -23
7907 -23 -85 -12 -80 108 192 187 107 -181 -105 25 40 74 134 37 247 -18 174 -7 -51 116 -252 -121 58 273 341
7932 341 -7 -113 2 250 154 128 115 -57 20 89 -43 -83 -275 215 234 123 -12 -163 -122 -26 -29 -1 290 -16
7956 -16 91 -99 -42 61 -155 -23 12 -190 74 -73 -32 322 40 114 83 64 205 93 -168 -136 -38 137 -34
7979 -34 -195 21 -20 66 -105 -188 -230 -12 27 168 -80 -27 -228 -62 53 -59 133 -167 242 146 118 116 -96 -126
8003 -126 -8 212 -154 -244 -205 -106 211 -143 58 139 178 267 -121 8 147 364 68 -205 -161 -224 63 -79 115
8026A15j29o7L20m23k8M49j85j24Q9j09M7o1K23n0l40J67K36N3K39o14K89r3J54
8049A58m11N93m14J65l53M19j23j3q3M42n25J33J81m00K86r6q5J4O5j42J61K36
8071B08j26j74j2J5L9n0p0K94L1j01n8o1J40k87L16k53K92o2j56J76j2m6J04O9
8095B16k18j24J42M4k6l66L21k7k29P5J08j11L41l7o8J02n2j32l3j29L15j18p3
8118g9K37l50J05Q2k5P8k03Q3m0K12j13j37M34k73j67K74j74L6Q1k97J80l53K91
8141a18J29r3KJ31k05L35k69M37n61L00m77M23l6q1Q6M6p0j0Q4m1K04k06o6J28
8165G2L7k19KJ01k3L3J04k32J63j44K07j04j21J56J25k10K4p0Ok56K70k3O2JJ01
8190F2j38
$$ plain form
8026 115 -14 -81 239 -184 -212 237 52 -72 17 -92 -45 -106 117 67 -273 -106 130 183 422 -192 97 4 158
8049 158 -253 340 -74 91 -262 157 34 21 -62 380 -145 -12 169 -231 55 -41 -126 -112 -47 -189 -28 208
8071 208 82 -92 -104 -89 -50 -100 -170 124 155 54 -4 -65 75 -212 104 -149 143 81 -75 101 89 43 147 216
8095 216 -2 -126 16 60 34 -332 -11 -38 -267 -192 -84 -195 146 109 41 143 91 -41 -74 -203 112 -6 -79
8118 -79 158 -192 -87 -5 -30 48 -155 -72 -112 100 -13 -150 284 11 -156 118 -56 -20 61 -236 -56 -409 -118
8141 -118 11 -82 -80 51 -154 181 -88 349 -212 88 -389 34 -2 -83 3 49 -21 -31 53 12 216 10 -56 72
8165 72 109 -110 -108 -7 -30 3 107 -125 38 -106 101 -3 -124 32 157 -53 -29 -99 -93 -349 -79 -102 -40 -39 62
8190 62 -76
8191g6
$$ Imaginary data points
##PAGE= N=2
##DATA TABLE= (X++(I..I)), XYDATA
0@%%%%%%%%%%%%%oJ4j6J6j6K4l2L2m0M8n6O9p7Q8j04J20j36J56j79K03k30K59
35A37k91L27l66M07m52N02n57O18o83P56q37R22j015J119j232J356j493J646j819
54i55K012k228K477k768L105l505L990m590N357o372P780r870J3273j9704L5768
69B3770j42797k03935M97609N6671m45763O7872L90619j78878k87373K31188J94529
80B03512k52975r0150K35553R061k13669N2257J70085q6513j27365J03367P3631
91G6794j06563l1826R9662j355q2735J6447O2177k4422l6385K9511J6086l1715
103a4324R43K7635r307j4507J9191L15k6363J1901L0648j8285k5462K0898J3845
116A7128k2467n095K2111Q96k0998l223J5293J929j1860J663J0188j0521j2501
$$ plain form
0 0 0 0 0 0 0 0 0 0 0 0 0 0 0 -6 8 -8 8 -8 16 -16 16 -24 24 -32 37 -40 48 -56 64 -72 84 -95 108 -122 137
35 137 -154 173 -193 214 -238 264 -293 325 -358 398 -439 483 -532 587 -645 711 -782 864 -955
54 -955 1057 -1171 1306 -1462 1643 -1862 2128 -2462 2895 -3477 4303 -5567 7706 -11998 23770
69 23770 -119027 -322962 174647 231318 -214445 -146573 244046 65168 -222205 8983 203512
80 203512 -49463 -139613 95940 105001 -108668 -56411 113674 27161 -100204 3163 76794
91 76794 -29769 -61595 38067 36712 -46023 -29576 32601 8179 -28206 1305 17391 -14324
103 -14324 -13381 14254 4947 -9560 9631 9946 -16417 -4516 26132 7847 -17615 3283 17128
116 17128 -5339 -10434 11677 12573 -8425 -11648 3645 5574 -6286 -4623 5565 -4956 -17457
129a7457J7652J3309k0720p471K4364m497k5259J8005K8146k2291k2905K2123
141B999J3444k1463J619K2167j2135j9000J4483P107j4889O678J3890j8789j3910
154a7799K1441N394j9835M842J6003j3977j2971J5988P443j1785k33Q562o842
167c769m952J3669M646j4374l72J3369m255j1152J1495J2056j5287j2935J5574
180C713Q713j4312k730J2939n559j4119P806J1793r687o025J0080k960j1958R684
194b622J1688j1100p942J0996L017j0903K999J2989m904j0941N645Q112m321k104
208F09N611p93r943K387J1096l353j0394N788N110j2211l525J5787J674j8128
222a0285J375J4201q009r609J4567O390j6550j786J4477l631r403J1800O054j5857
$$ plain form
129 -17457 195 13504 -7216 -14687 9677 5180 -20079 -2074 26072 3781 -19124 2999
141 2999 16443 -5020 -3401 18766 6631 -12369 2114 9221 -5668 1010 14900 -3889 -17799
154 -17799 3642 9036 -10799 -5957 10046 -3931 -16902 -914 6529 -5256 -5489 3073 -3769
167 -3769 -8721 4948 9594 -4780 -5152 8217 3962 -7190 4305 16361 1074 -11861 3713
180 3713 12426 -1886 -4616 8323 2764 -11355 -3549 8244 -1443 -7468 2612 -348 -12306 -2622
194 -2622 9066 -2034 -9976 1020 4037 -6866 -3867 9122 4218 -6723 -1078 7034 2713 609
208 609 6220 5427 -4516 -2129 8967 5614 -4780 1008 6118 -6093 -9618 6169 7843 -10285
222 -10285 -8910 5291 -2718 -12327 2240 8630 -7920 -9706 4771 1140 -8263 3537 9591 -6266
236f266o49J6182k900j1669Q094P877j2019n215J3706K982j2793p43P861l507
250I41o185N473M787p066n645N511L405n533Q03O699l054q464L730R695l082o498
266d483N742M238q230j963J1233K016j1195p9R510l448p825Q041N849j1825n278
281g697J2750L46j3027M285J2248j1271j2841J6121R471j8017l710J8629l233
294D054j8542J1065J8171j4449j3895J8076O262j8282K821J8684q063j5940J0307
307B69J1754j2264n330J2290m31j1902J540Q906k205o167P08K543j134j645M06
322b662J974R64l273k936M810M541m484k455N621Q28o354J951Q400k625p649M217
338H68N315o083k303P591P01j0093N16Q060k676o818M539M051o928k831O526J716
$$ plain form
236 -6266 -6915 9267 6367 -5302 2792 10669 -1350 -6565 7141 10123 -2670 -3413 4448 941
250 941 -5244 229 5016 -2050 -7695 -2184 1221 -4312 -3509 3190 136 -8328 -4598 5097 2015 -4483
266 -4483 1259 5497 -2733 -4696 6537 8553 -2642 -2721 6789 3341 -4484 3557 9406 -2419 -7697
281 -7697 5053 5399 -7628 -3343 8905 -2366 -15207 914 10385 -7632 -11342 7287 4054
294 4054 -14488 -3423 14748 299 -13596 4480 10742 -7540 -4719 13965 5902 -10038 269
307 269 12023 -241 -5571 6719 6288 -5614 -4074 4832 2627 -3540 -2832 -289 -1423 -3068 -2662
322 -2662 -688 276 -2997 -5933 -1123 3418 -1066 -3521 2100 2928 -3426 -1475 6925 4300 -3349 868
338 868 6183 100 -2203 5388 6089 -4004 -3488 4572 1896 -4922 -383 3668 -3260 -6091 435 2151
354B151n914P8M412k076k374M117J168k997K52J428l28O92J714r3j026p26O38
371A116J573K06j487r4J147k817j968L644J483n291q67M171j445m799M081M675
387C328o777l592Q204J497p896K212Q346m411p276P168O421p695l375Q238J118
402E510r118J919R196l389q352M353N620o752l045P483K07q799J134P036l121
417a18n858N175L375o676q89O067l90l584K580J963k757m8L592n33k132K142O09
434B518k425R63K353k166j412J369P39j503n30R81n96j561o57R33J179j234j715
451b764J368L38j525N04K347m18j918J100J719q27J16K215o14j509L69J373m10
468A464J06j72m31p2m44l53L45J114j858j912J492L75j971N83J747j498j450J260
$$ plain form
354 2151 -3763 -3685 727 -1349 -3723 394 1562 -1435 -1183 245 -83 609 2323 2230 1204 478 1116
371 1116 2689 2895 1408 1314 2461 -356 -2324 1320 2803 -2488 -3355 816 -629 -5428 -1347 3328
387 3328 -3449 -7041 1163 2660 -5236 -3024 5322 911 -6365 803 7224 -471 -3846 4392 5510
402 5510 -3608 -1689 7507 4118 -4234 119 5739 -1013 -4058 3425 3632 -5167 -4033 3003 -118
417 -118 -5976 -801 2574 -4102 -4991 1076 686 -2898 -318 1645 -1112 -1160 2432 1899 -233 1909 2518
434 2518 93 1056 3409 1243 -169 1200 1939 436 -94 887 291 -1270 -1927 -994 185 -1049 -2764
451 -2764 -1396 -1058 -2583 -2079 268 -150 -2068 -968 751 -76 40 2255 1641 132 501 1874 1464
468 1464 1570 1398 967 895 451 98 443 1557 -301 -2213 -721 -346 -2317 -1734 13 -1485 -2935 -1675
486a675P65l29L73L79K05J39k30L27J784K57j876P66K390k154j539K879P42l255
504e2m09K994j596k867J918J292k417p20J347j06j195k0O23M07J38p23J54Q96
522c36J35r39J906P47j473m45K006l22p80J559L20j489k97R74j137l76J505j248
540C10j819J382l40j477Q41J550j989j064J515J94j327J336J634j485o18J399
556D2L8k55P45Q71j60l89j14L92O33l01m14N48j34j740K63J473j150j083N11k44
576d68j356L27J068p92n79J025p04o98J548J93r92J673P73j589K25K177m66j424
594e9J589J420k568l26K135p96j334R11L49j079o37m1M59J27p72o46L43n8j392
613b375O41J978j020j513J471R47j285J9K132N51j713K73J710n05q30N97J201
$$ plain form
486 -1675 -910 -1239 -866 -487 -282 -143 -373 -46 1738 1995 119 885 3275 1121 -418 2461 3203 -52
504 -52 -461 2533 937 -1930 -12 1280 -1137 -1857 -510 -616 -1811 -1831 -1208 -801 -663 -1386 -1232 -336
522 -336 -201 -1140 766 1513 40 -405 1601 1279 499 2058 2378 889 592 1566 429 53 1558 310
540 310 -1509 -127 -467 -1944 -1103 447 -1542 -2606 -1091 -897 -2224 -888 746 -739 -1357 42
556 42 80 -175 570 1441 1281 892 778 1170 1803 1502 1088 1636 1502 -238 25 1498 348 -735 -224 -468
576 -468 -1824 -1497 -429 -1221 -1800 -775 -1479 -2177 -629 -436 -1428 245 1018 -571 -346 1831 1365 -59
594 -59 1530 2950 382 56 2191 1395 61 972 1321 242 -395 -436 23 150 -622 -1268 -925 -983 -2375
613 -2375 -1734 244 -776 -2289 -818 129 -1156 -1137 995 1546 -167 106 1816 1311 481 1078 2279
630B279p28j169r7R60l1j638N61O31r46j743J339Q08j438q84J975l78j881J128
648a252J031o47M9P21l82j74P59K97N53M51k7q33J080op35L59L36p11j077Q25
668F17l94l99j14K92q66N3K46k87l02N82m20n83R01J57j113Q43J432p50n48Q27
688A74J245j151M4J460l51m88k69M78O24j010m95R06j82j660K8J046p33j147N40
707i41R35j377o43J302L00m99l62J057K51p11M60P47k6o2J65K42N53q96K74J273
727B042o36j134M42O36q77q85N51N54r68o23N50j93n03l20K87N86p74l12P83M89
747c05o90J88J036J99n40L47P20p9l62J55O94k88o08O24L58p40k88J06L48j077
767b02Q2j93J15n55m84Q23m92l41L31R3pl3L50J08K32j0N02j25M14K17o61P04
$$ plain form
630 2279 1551 382 285 1245 1214 -424 137 768 -178 -1921 -582 226 -1212 -2096 -121 -499 -2380 -1252
648 -1252 -221 -868 -819 -98 -480 -654 105 402 955 1406 1379 546 1626 1620 885 1244 1580 869 -208 617
668 617 223 -176 -290 2 -864 -811 -565 -852 -1154 -572 -992 -1575 -674 -517 -1630 -787 645 -105 -653 174
688 174 1419 268 312 1772 1421 933 664 1142 1766 756 261 1167 985 -675 -647 399 -334 -1481 -941
707 -941 -6 -1383 -2026 -724 -424 -923 -1285 -228 23 -688 -228 519 493 431 596 838 1391 495 769 2042
727 2042 1406 272 714 1350 473 -412 139 693 -275 -898 -348 -541 -1044 -1364 -1077 -491 -1265 -1577 -794 -305
747 -305 -995 -807 229 428 -112 235 955 876 514 669 1363 1075 467 1091 1449 709 421 527 875 -202
767 -202 -120 -313 -198 -753 -1237 -414 -906 -1247 -916 -823 -830 -863 -513 -405 -173 -183 319 194 608 825 164 868
789H68L48m73k94O49K00j003j50O08k72j111O96K15r83p37O83O31r68l17O85J71
809e54p88J83Q50l1k59L44J194l32p16O30Q24m46l95L25O36p08o5K00j62l60j6
830C54K5j35m05m08O4K00q60q6O87k71l41M2N36K53m36N96J69n5J19L66K68j37
852E45J22J59J70k7j45Q0m19J74l27R7K46q54m59M07J30q79K44J46j40n06J43
873a093O52j66l71L30J66N46m91N73L00M42n78N53j43K79m60J68M41m99n34K63
893C78K04o71k63O52k00q63j52M98R0n14l41O86j17k78J23P61k04o80O47R88k37
914E07n50N44O74n75k58P76J2n91m8K17k94k86J86O97j105m45L5L66k35m71K75
935e69J07p82K30N00R9l4j54J69L8L77M39K7r6K1M1m33Q58L69n76j82O32j07p77
$$ plain form
789 868 1216 743 449 1098 1298 295 145 753 481 -630 66 281 -702 -1439 -756 -125 -1093 -1410 -725 -554
809 -554 -1342 -1159 -309 -340 -599 -255 939 607 -109 521 1345 899 504 829 1465 757 692 892 730 370 354
830 354 379 244 -161 -569 -505 -305 -1165 -1251 -564 -835 -1176 -1134 -598 -345 -781 -185 -16 -71 48 414 682 545
852 545 667 826 996 969 824 904 485 659 332 429 675 -179 -638 -231 -101 -980 -736 -590 -730 -1236 -1093
873 -1093 -441 -607 -978 -648 -482 64 -427 146 446 888 310 863 720 999 539 707 1148 649 115 378
893 378 582 -89 -352 300 100 -763 -915 -417 -327 -841 -1182 -496 -613 -891 -768 -7 -211 -891 -244 744 507
914 507 -43 501 1175 600 342 1118 1130 539 491 708 414 128 314 1011 -94 -539 -504 -138 -373 -844 -569
935 -569 -462 -1244 -1014 -514 -415 -449 -603 -434 -396 -19 420 447 351 372 413 -20 838 1207 631 449 1081 974 197
958A97J83M01q98p67P74%p78M10J33n09j48M30L29m69l62L93O16r4j30L29L50
979C90J15l28P03K11o00k36O70j83m21J69M59k67j186O37K88p54j21K13j36o39
999a016l23K48N95q5l39J90O30l21K16L35N24n54j59N90l2J23K68L03l53l62N9
1020E37J01L4j96l62q1R8j117M38R94o17r81M33L93o19k50P63J33o23K69O27o
1041c2k00N03L18k36J51j33J33K86j39j83k9P25r63j63M97j04j218Q10L52o71
1061b96m08j38J66K03M9m7j62J10n17L11J025j46m62L84L23n08K46N76L92r63
1081A38J49N64l49j45O95n35n38K1p0R6L5k97l21j3J43m90K1Q77m31o21N78L58
1103a35o21K53Q13k94j05M2L59j49N66j73j63N41l10n18K83M43m87l93K38o8o76
$$ plain form
958 197 380 781 -117 -884 -110 -110 -888 -478 -345 -854 -1002 -572 -243 -712 -1074 -681 -65 -159 -289 40 390
979 390 505 177 880 1091 491 255 925 742 321 490 949 682 -504 133 421 -333 -454 -241 -377 -1016
999 -1016 -1339 -1091 -496 -581 -920 -730 -100 -421 -205 130 654 100 -59 531 499 622 890 1193 840 478 537
1020 537 638 672 476 114 33 131 -986 -548 446 -171 -1152 -719 -326 -945 -1195 -432 -299 -922 -653 -26 -32
1041 -32 -232 271 589 353 504 371 504 790 651 468 439 1164 201 38 535 431 -787 23 375 -296
1061 -296 -704 -842 -676 -473 -424 -471 -633 -523 -1040 -729 296 150 -312 72 395 -113 133 709 1101 138
1081 138 287 851 502 357 1052 517 -21 0 -70 26 61 -236 -557 -570 -427 -917 -896 -19 -450 -1071 -493 -135
1103 -135 -756 -503 310 16 -89 -47 312 163 729 556 393 934 624 106 389 832 345 -48 190 122 -554
1124e54R2M44l81l30K18J41m53K7L05k06N56l50L37L35l26q4N20N40l66n60P46
1145F51J80o44P2J036n02j271J014J78o67k08N28j68m23m87K84j37M08l29J9k91
1165g57KL0L24N02m01r4N82j41n7K53K06J1r8j19L71L45o20m2K97l01l70k4J48
1188D7k65m53M20J63o77o4L69n5l82M03K73j64rl1M49M8l55L40J81K81M4k85K83
1211E61N57p24k19M30pm71m10J016n89n46L21R0p06l6N25l2m96k97P10J25l48
1232e46j7N04J47m70J40Q47j62k14K18L26m10p9L74j6j62j53Q0J68n31j24K62
1253A82k22j74m04L49r0k77j47L16r5p2L16L42n10j2K86L02J32mL0N8K53k32J35
1276D62j6J73n28M03P8j34k97j88K12l52l15J9K97j65n03N33K29p37J90M79Q8
$$ plain form
1124 -554 -462 -18 -399 -729 -511 -370 -823 -796 -491 -697 -141 -491 -154 181 -145 -229 291 831 465 -95 651
1145 651 831 187 259 1295 793 -478 536 714 47 -161 367 199 -224 -711 -427 -564 -156 -485 -466 -757
1165 -757 -755 -725 -401 101 -300 -394 188 47 -10 243 449 460 362 243 614 959 339 297 594 293 -77 -101 47
1188 47 -218 -671 -251 -88 -765 -829 -460 -515 -897 -494 -221 -385 -394 -425 24 72 -283 57 238 519 563 278 561
1211 561 1118 394 175 605 598 127 -283 733 144 -402 -81 9 -697 -733 -208 -240 -736 -1033 -323 -198 -546
1232 -546 -563 -59 88 -382 -242 605 443 229 447 773 363 284 658 642 480 327 407 575 44 -80 182
1253 182 -40 -214 -618 -269 -359 -636 -783 -467 -562 -634 -318 24 -486 -498 -212 90 222 218 248 306 559 327 462
1276 462 446 619 91 494 572 438 141 -47 165 -187 -502 -483 -186 -351 -854 -321 -92 -829 -639 -160 -72
1297g2p0n46P21M26o01L20M06k3o02L10L60p8l69L77o0p2o02M46O5n46LQ0J98
1320G1m79l10K56J73k96j77L66L17m62m3L71j5j05L03M05J74p01M52M30k06j98
1341C26J84K2k24j78L73r6l57j29J74k46k43R9r7K67o34O6M52j05O0r3m9K91j49
1364b86p6P86k79l45M39m4J44o4O0L8Q0K2j75L31m00n54M41K19o18m3L02Q9o06
1387e39J91K02k65p3j99M06J65j15J67Q5K38m44K07L92l37j26M40K09l47K04J46
1408F07j60p0l83M01p6m73J40J25l04l07mK48l66j99L33L71j16n2J39J78l13L44
1430F3J86j15KJ21l7M66j94q0J45O0k62o16N58N8m65l0K93l2m44J33J84m06p7
1453d89k4J20J29k07K96L6j73K19P6M91k76r1M4L90k46l53N49K67n23J56l17J04
$$ plain form
1297 -72 -142 -688 33 459 -142 178 584 561 -41 269 629 551 182 559 499 427 -175 271 336 -210 -207 -127 71
1320 71 -408 -718 -462 -289 -585 -762 -396 -79 -541 -584 -213 -228 -333 -30 375 549 -152 300 730 524 326
1341 326 510 532 308 130 503 407 50 -79 95 -151 -394 -295 -392 -125 -759 -693 -241 -346 -286 -379 -428 -137 -286
1364 -286 -362 424 145 -200 239 195 339 275 335 373 453 475 300 631 231 -323 118 337 -281 -324 -22 67 -539
1387 -539 -348 -146 -411 -484 -683 -277 -112 -227 -60 25 263 -181 26 418 81 -45 395 604 257 461 607
1408 607 447 377 -6 395 319 -154 -14 111 -193 -500 -504 -256 -622 -821 -488 -117 -233 -285 -146 32 -281 63
1430 63 249 134 136 257 220 686 492 412 557 617 355 -261 297 355 -110 -140 153 121 -323 -190 -6 -412 -489
1453 -489 -513 -393 -264 -471 -175 -139 -312 -93 -17 474 198 107 151 541 295 -58 491 758 235 391 74 178
1475A78k1Jl8r6k48J76j86m0l70K28L59k45k96j23P39m41p8M89M74o33J24R4R9
1498A46M2P6L17k18k24J24k25M91l86J4M19k88l97q2J62R5k90k42K47k84j14J80
1520d37L15LJ08k50o5M92L1k14N12l29j44Q1M60j13n52K89L50o22M68K03l97m20
1542b31M53N4n41j08j29K36K3j50n2l7P7k44L83K74Pl42L99J44l89R4P40r5o12
1565d6K39K81k09k05J90k06K64j98l02L57j14j41P2k00P8j27p2K69j92m08O71
1586AJ71n96LK56K60J16k84J11K55j6j42J63K54k35q2m9L62n14L7K44j15m01R2
1609a09K83m06j21J60l05K05J7o7o6L50l29O0J34r1J7L46L55m99j07O01k55r4
1631G9R4K29k2l28P0j40L16j73l5k48J45k15j97K95n1k3R6J74m89j42O32o4j9
$$ plain form
1475 178 157 158 120 24 -224 -48 -234 -274 -644 -416 -57 -302 -598 -721 18 -423 -501 -12 462 -171 -47 47 146
1498 146 188 264 581 363 139 263 38 529 143 157 576 288 -109 -191 -29 66 -224 -466 -219 -503 -617 -437
1520 -437 -122 -119 -11 -261 -326 166 197 -17 495 166 22 103 563 450 -102 187 537 -85 383 586 189 -231
1542 -231 222 276 -265 -373 -502 -266 -243 -393 -445 -482 -405 -649 -266 8 15 -327 72 216 -173 -79 661 566 -46
1565 -46 193 474 265 60 250 44 308 110 -192 165 51 -90 -18 -218 -140 -267 -339 -70 -262 -670 1
1586 1 172 -424 -421 -165 95 211 -73 38 293 277 135 298 552 317 235 186 548 34 71 315 200 -201 -109
1609 -109 174 -232 -353 -193 -498 -293 -276 -343 -409 -59 -388 -328 -194 -285 -268 78 433 -66 -173 428 173 79
1631 79 173 402 380 52 122 -18 298 125 90 -158 -13 -228 -425 -130 -181 -204 -108 66 -423 -565 67 3 -16
1654a6l62M10j87O2K06K46q2j66R6j08K27j60J36j7R9k81p0L5q6m28L53m9l43
1677d85K03rN9j47P5R9K05j90p8J51J52j20j08L20L48l47mQ0K61m12J77J63n8
1700C35q2q8j8Nl17J40%K2k53J03M1j65l12M78O9j84K3j14M80k55l02O35m25J42
1724d2J37L59m7l88K40K83k35l64M6p2J02j79L1J35p6O6j69K2l56l1N18k43L8
1747b25j51q5J57K80l34M38J06k29J67J87p0nk55L72kk61M35j5n1k68k40K00J4
1770A65k44k21K09K3j97J5K78l12j04K85Q4l22m0M70o5M6Q8l82K22j19J78K77
1792C34j3l5k77J30K9Q3j12r5K09l41o9K31l54K70k24O0J17j19kJ68k85j75N34
1815F4j61k0jK71o5L9K20j08l61K66n0J08l3N1N4j07J48j44m8J15m59j07K69j50
$$ plain form
1654 -16 -378 32 -155 -93 113 359 277 111 207 99 326 166 302 285 384 103 33 68 -18 -446 -93 -142 -485
1677 -485 -282 -291 -232 -379 -304 -205 0 -190 -268 -117 35 -85 -193 127 475 128 124 204 465 53 230 393 335
1700 335 253 165 147 152 -165 -25 -25 -3 -256 -153 -112 -277 -589 -111 -42 -226 -203 -317 163 -92 -394 241 -184 -42
1724 -42 95 454 407 19 259 542 307 -57 -11 -83 19 -160 -129 6 -70 -4 -173 -151 -507 -538 -20 -263 -225
1747 -225 -376 -461 -304 -24 -358 80 186 -43 124 311 241 236 -19 353 351 90 525 510 459 191 -49 151 165
1770 165 -79 -300 -91 -68 -265 -250 28 -284 -388 -103 -19 -341 -381 89 24 70 158 -224 -2 -121 57 334
1792 334 321 286 9 139 168 251 139 44 253 -88 -157 74 -280 -10 -234 -174 -57 -176 -178 -10 -295 -470 64
1815 64 -97 -117 -118 153 88 127 347 239 -122 144 94 202 169 220 274 167 315 171 123 238 -221 -328 -59 -209
1839b09k50L52k8J68m25P8J82N3NP6K8K45o59J03N68j0k17j40N19k19p5J93Q4
1862D22l22J33p6j11l53M5K61k2k04L0q6K32l01Q3L8q0K04j0M3J91k34P1J47J66
1886B67j72k1J76m7l09L41J60j57j74QPk0j10J82j23r3k75K53J77n61P4J95j59
1909c81N0O6J83l1PJ29J69K7m94L11N4L64l55k08N19k03k86K46J1j40j38J35O8
1932A03l16Q8J79k75r6n8J08K48k44J72l19K62K02j86J01n0l9K99Q3k17m0L50
1954C55j74Kj7J82j44j22Mk20L58m25J14L22l00j44pKk56M5K34lM6l33K11O0J04
1979a06j44J24J32q1m9L5M92j93k17j86N97j90N0q3K11m48J29Q9l30J12M5N6k90
2002b45K4p4Q8k5k5R3K9J19m4j72K92o0q1J96O8j65J42J24n4k87M48m1l37kr1
$$ plain form
1839 -209 -459 -107 -135 33 -392 -314 -132 -79 -74 2 30 275 -384 -281 287 277 60 -80 439 220 145 338 422
1862 422 100 233 157 46 -307 -262 -1 -23 -227 -197 -283 -51 -352 -269 -231 -311 -107 -117 -74 117 -117 -46 101 267
1886 267 95 74 250 203 -106 235 395 238 64 72 79 59 -51 131 8 -85 -360 -107 70 -491 -417 -222 -381
1909 -381 -331 -265 -82 -113 -106 23 192 219 -275 36 90 454 99 -109 410 207 -79 167 178 38 -100 35 103
1932 103 -213 -125 54 -221 -317 -375 -267 -19 -263 -91 -410 -148 54 -132 -31 -81 -120 179 262 45 5 355
1954 355 181 183 166 348 204 82 86 -134 224 -201 -87 235 -65 -209 -216 -214 -470 -425 -191 -194 -148 -481 -270 -210 -106
1979 -106 -250 -126 6 -75 -124 -89 403 210 -7 -193 404 214 264 181 392 -56 73 162 -168 -56 -11 45 -245
2002 -245 -221 -295 -207 -232 -257 -164 -135 -16 -60 -232 60 0 -81 115 183 18 160 284 230 -57 391 350 13 11 -80
2027h0L04k69m2P2m3rj96j89J96p2m1l1K12l1K37m5o6k23M66N1k54J29L4J02j11
2052A01J20j16O9L73l05l56K49Qk09j37J37K43m28lL42n33L55k50K18N5k53K57
2074f3K14n41L55J08L9oj25k48M67j81l10M94P9o3j75L6l8j08J81R7k58J2J92
2097A58r2R1j93k3J00J5o0k05M23k96k06L11J99q3k21K71j38l14N52o5J34j70
2119A88P5j95lL1n7J12k9L9l69L00j23o9j77K40j31P8kk45K6J36L9J32j77L05
2143A24o7k72K92JJ97O9m4k57J90k16J81k04J84K08o59K43J72l64N2J86j65j1
2165a60K34l32J09l1M8k60J94J61K62j00K5j63J15K50r7l30J67rl9M7K4R2n83
2188c76N63k88J90k36J26K8r9r2J14k99M4J62k9o9L91l64j4L7J33J14K30q3k17
$$ plain form
2027 -80 224 -45 -87 -15 -58 -67 -263 -452 -256 -328 -369 -400 -188 -219 18 -27 -93 -316 150 201 -53 76 110 212 101
2052 101 221 105 174 547 242 -114 135 143 -66 -203 -66 177 -251 -254 88 -445 -90 -340 -122 -67 -320 -63
2074 -63 151 -390 -35 73 112 106 -19 -267 200 19 -291 203 282 219 44 80 42 -66 115 212 -46 -34 158
2097 158 66 157 -36 -59 41 56 -4 -209 214 -82 -288 23 222 139 -82 189 51 -263 289 224 358 188
2119 188 263 68 65 96 39 151 122 161 -208 92 -31 -100 -277 -37 -168 -90 -92 -337 -311 -175 -136 -4 -181 124
2143 124 57 -215 77 78 275 344 300 43 233 17 198 -6 178 386 -273 -30 142 -222 -170 16 -149 -160
2165 -160 74 -258 -149 -180 -132 -392 -198 -37 225 125 150 -13 102 352 255 -75 92 83 44 91 115 207 -376
2188 -376 187 -101 89 -147 -21 7 -92 -184 -70 -369 -325 -163 -192 -261 130 -234 -248 -211 -78 36 266 183 -34
2211c4J64p4K44l18K81k12J05K7k89Q4J84j14q2rK71l02k30L83j36j84N7J26k5
2234h3N1k02J4K63k04K83J3o0j7J1j8K23o5k68K23j48j91J79K66l42l3J49Pq4
2258c3Q3k24J84k31j8j40K38k94K95L0J85k63K13K6P8k4k21J59Q3J27j93J72O7
2281B99j09P2n2j76L7O3j02R4k38K88pn8k9l71J42l53J94K36j67Q9m2K46J69k23
2305Bj0J86l71M46M8k37L6p7J36K17m13M66l45J12r8j11J35q2Mk11J33j71L2J96
2329B3r5j22L3J51n0Q4j08jK78m18J49L4L64j17k4J03j97l0R4N2J65k91O2k56
2353a17K17r3m1mJ23k92j6N0K29j89K47K0k5k92L1L22j27K7j91j96M06j01L40
2376C28k46J42j16j97J06K02j53j14p1J37nJ21j24k24J89j59J37q1pJ37o2j32
$$ plain form
2211 -34 130 56 300 -18 263 51 156 183 -106 -22 162 48 -34 -43 228 -74 -304 79 -57 -241 -184 -58 -83
2234 -83 -32 -234 -220 43 -161 122 135 75 58 69 51 274 209 -59 164 16 -175 4 270 -72 -105 44 51 -33
2258 -33 50 -174 10 -221 -239 -379 -141 -435 -140 -110 75 -188 25 51 129 105 -116 43 126 253 60 232 299
2281 299 190 262 210 34 71 134 32 126 -112 176 169 111 82 -289 -147 -500 -306 -70 -237 -148 -190 56 225 2
2305 2 -8 178 -193 253 301 64 100 23 159 376 -37 429 84 196 98 -13 122 40 44 -167 -34 -205 -173 23
2329 23 -72 -194 -161 -10 -60 24 -84 -85 193 -225 -76 -42 322 205 181 284 87 57 151 203 368 77 139 -117
2353 -117 100 7 -34 -38 85 -207 -223 -173 56 -133 114 134 109 -183 -152 170 43 70 -121 -317 89 -12 328
2376 328 82 224 108 -89 17 219 66 -48 -119 18 13 134 10 -214 -25 -184 -47 -128 -135 2 -60 -192
2398a92j47J39J71j86M4L66m76J91J82O6K7p7O9J98l60j2P5R9l70J10J00o3J46
2421A00l52K75n2j06l2J58Ll53L54m3m3m6P2J54m2j22K58l08R6K89j83L5p0J9
2445F1j23J60J6j84J60qj08j01J92l35K41nl31L57k63J89j21N6L34m96K43j20
2467a86M7K53j88L12l59J24K99o9n9l01L01k86K3J98k29L53l68J83j62J63o7p6
2489i4j41j7J29k61L38k24L86m9j37J03j0O5k20j20N81l01m1M02l05K38l90J88
2511A20L33m23k67J3M03j75o2K30m03L48n44L33J75j34J3N3P8k1j37k10O72j69
2533B26k44j32K07P7j11j72M00k01k15M11j70p5l9J09k28P3M5O7K31k84l8J14
2555E1r5p0J22J17l0N7l31O4n8J18M88o26J1K51qj71K04n4l3j8K58k29K04k25
$$ plain form
2398 -192 -339 -200 -29 -215 -171 195 -281 -90 92 158 185 108 177 375 15 3 78 177 -193 -83 17 -46 100
2421 100 -252 23 -29 -135 -167 -9 -6 -359 -5 -48 -91 -137 -65 89 47 -75 183 -125 -29 260 77 112 42 61
2445 61 -62 98 114 -70 90 82 -26 -127 65 -270 -29 -34 -365 -8 -271 -82 -203 -147 187 -309 -66 -186
2467 -186 -139 114 -74 238 -121 3 302 233 174 -127 174 -112 -89 109 -120 233 -135 48 -114 49 -18 -94
2489 -94 -235 -252 -123 -384 -46 -270 116 67 -70 33 23 88 -132 -252 329 28 -13 389 84 322 -68 120
2511 120 453 30 -237 -224 179 4 -58 172 -231 117 -427 -94 81 -53 -40 13 91 70 -67 -277 395 226
2533 226 -18 -150 57 134 23 -149 251 50 -165 246 76 1 -38 71 -157 -84 -39 28 259 -25 -63 51
2555 51 -44 -114 8 125 95 152 -179 -115 -173 -55 433 -193 -182 69 61 -110 94 40 7 -11 247 18 222 -3
2579ck28K14k7J26j02k26K4L12J04j39R8m16k13L13K75j88K06J32k54qQ5M0k43
2602a18J42L7k67M14J92j71k8n4k40J20K32k90o8N3J29m41M52Jm23q3J84J04m
2625a27K19k72R4M4R2j65J57qj36O2K61l8p6o3J27k77M13J7l60L80k50N6j52l4
2649c6J98k06K17l25j88K97K5R4J8l33L44k34K4K74k64J71K05j07o2J27n1m4m4
2672A00J42j22Q5l14j7K18J36j37n9L2k81J22N1O6j04L6k06K22j22m0J89r2J76
2695H1Q6j43k75J92K80L6j21k52O8M4l0L46k99J47M0k17J26j09l0k20N6M57m04
2718a41J21J42k17J64r9k6M7M3l99L47J17k33J81K0r2j14J71j24L61k17L1l9Q5
2741A29k00j2R5j40J08k8K8p6k6k8k9P8J83o2k63K35M0O3k59J14j8L6L02j69O9
$$ plain form
2579 -3 -231 -17 -44 82 -20 -246 -222 90 194 55 153 -263 -476 -163 112 -76 130 262 8 0 85 125 -118
2602 -118 24 61 -206 208 400 229 201 147 -93 27 259 -31 -99 -46 83 -358 94 95 -328 -411 -227 -123 -127
2625 -127 92 -180 -86 -42 50 -115 42 34 -102 -40 221 183 107 44 171 -106 307 324 -36 344 94 150 -2 -36
2649 -36 162 -44 173 -152 -340 -43 -18 76 94 -239 105 -129 -105 169 -95 76 281 174 112 239 188 144 100
2672 100 242 120 205 -109 -126 92 228 91 32 64 -217 -95 -44 22 -82 -46 -252 -30 -152 -192 -3 -95 81
2695 81 167 24 -251 -59 221 257 136 -116 -48 -4 -34 312 13 160 200 -17 109 0 -30 -250 -194 263 -141
2718 -141 -20 122 -95 69 -30 -56 -9 34 -365 -18 99 -134 47 67 -25 -139 32 -92 269 52 83 44 129
2741 129 -71 -83 12 -128 -20 -48 -20 -96 -122 -150 -179 -101 82 20 -243 -8 32 95 -164 -50 -68 -32 270 101 170
2766A70k15R0r3j3j48J21NL10l49K56k36K02O9k63k38K39J87k07K32n38M41j64
2788a42M7l6J29K09j28l11L49p6K11m64L4R2J69J65j40j63q5J43k3J19j51K08
2810A56l30J27j0m6K53j74j28kL5K85m21K37J7k85M13j24p4j23K6K16R5j09K35
2833B69j40k67M58m23n2K3J05K10j17j6j09q6k3l8J60O4Jj04j4J7j27M03j77l96
2857c79N11k55J08j09k48N45P8k78M22k63J32k60Q4k27J52K46o07L18J37L0L8
2878A75m45K95k98J09Q2L93k24o3k02j21M73l71L57k10K50l23L3K9J38j01K86
2899B62l4l12J11P5J94k82J20p3j99J38k07M57l92j5N3K5O5K2k09J11P7j2k16
2922b41M03n3r5J27n4o7J13K18k61K21l86J51l74M03J3P3k69r0J53O3Kl73L29
$$ plain form
2766 170 -45 45 -48 -61 -209 -88 -83 227 -122 134 -102 100 169 -94 -332 -93 94 -113 119 -419 22 -142
2788 -142 -95 -131 -2 207 79 -232 117 41 252 -212 -178 -86 83 248 108 -55 -140 3 -20 99 -52 156
2810 156 -174 -47 -57 -103 150 -24 -152 -154 -119 166 -255 -18 -1 -286 127 3 -71 -194 -168 48 143 34 269
2833 269 129 -138 320 -103 -155 -132 -27 183 66 50 -59 -145 -168 -206 -46 18 19 -85 -99 -82 -209 194 17 -379
2857 -379 132 -123 -15 -124 -372 173 251 -27 395 132 264 4 88 -139 13 259 -348 -30 107 137 175
2878 175 -270 25 -273 -164 -82 311 87 24 -178 -299 174 -197 160 -50 200 -123 -90 -61 77 -24 262
2899 262 228 -84 27 102 296 14 134 61 -138 0 -207 250 -142 -157 -104 -79 -14 8 -201 -90 -13 -25 -241
2922 -241 162 109 14 141 87 20 133 351 90 311 -75 76 -298 105 118 191 -78 -168 -15 48 50 -323 6
2945FP0n2N2K37n19P7J89j05K37k23qj5J40R5j59M0K39k36k56J53K74j64J40j38
2969G4K20m50L38m08J67Q4L7K4M9k74j33n4J55K48j93J53j48J07Q5j9k28Q6J68
2992H8k32L01k85L10j20k21J50J58j14M9o4j01N2j24j7R8k27J65J22j15J15K1
3014IJ00j05j6q4N0K25m12N42ql68J96j80q4L45j14L7j30j96K02j45J41J05j34
3037b4J44k34r6L48l4l5l31q6M02K5l81L14l7R6n0J8K36k56k06J25j46J56J89
3060A37k94N47q3l62oR7oj59j2J76k63K00K06k6j45n0L5o9P8J18j17j49K70oj10
3085GN3r3J58j63j13O6l0N05m39K49j64P1o2k14K55P5k91J21k32L05l30L49j52
3108f9L52l81J2n4J23L9k55K37k87J14K50m4K3Q7n5j27j13K13o5K7L01m61K00
$$ plain form
2945 6 76 24 76 313 -206 -129 60 -45 192 -31 -39 -54 86 181 22 62 301 65 -191 -38 236 72 212 74
2969 74 294 -156 182 -226 -59 25 62 86 135 -139 -272 -326 -171 77 -116 37 -111 -4 81 62 -166 -80 88
2992 88 -144 157 -128 182 62 -159 -9 149 35 84 20 -81 -29 -153 -170 -72 -299 -134 -12 -127 -12 9
3014 9 109 4 -12 -96 -46 179 -233 309 301 -67 129 -51 -135 210 96 133 3 -193 9 -136 5 110 -24
3037 -24 120 -114 -210 138 104 69 -262 -348 54 79 -302 12 -25 71 21 39 275 19 -187 -62 -208 -52 137
3060 137 -157 390 307 -55 -61 36 30 -129 -141 35 -228 -28 178 152 7 -43 -8 -77 1 119 2 -147 123 117 7
3085 7 60 -33 125 -38 -151 -85 -115 390 -49 200 36 107 45 -169 86 161 -130 -9 -241 64 -266 83 -69
3108 -69 283 -98 -86 -140 -17 22 -233 4 -283 -169 81 37 60 147 92 -35 -148 65 0 27 328 -133 67
3131F7j28j59M15j41q1m32M69J96j80j94K86k38k7J40m8K24L9k32Mk99K09j66
3153b76K00J5J29j5M0jP3j79l0L25l50M6Nn8q6L04j6k54J92k83K69j15r2J33k96
3178c20L55R7j71K47k23J72j79l25L51j7j58R5j96J02M35l35k1j04L58l13K7J9
3200a04K68k19j36K33q0K2k99J12O2J98J82l91J21J54p7J8j48r6N48l20l77K68
3222f1K39j69N6Q1l27L42p9k86J48J46j00k84O1K05n2J12j11J56m0l14K59j21
3244a39K66N0l04J65k88K59J65j24p4R2j16M5K6j47K22r1J86j61R9j86J12j56
3266i9j26J88Q8j11r5R4k11K69p6J87k64j23j9J60j53K53l6J80R7j38J9j95J13
3289Bp9O3J1K70l77L46j75k58K03j19K41j18J15P5j46k99N12j02n18K70J55M6
$$ plain form
3131 67 -61 -220 195 54 -27 -459 10 206 26 -168 118 -120 -147 -7 -55 169 208 -24 -20 -319 -110 -276
3153 -276 -76 -61 68 53 93 92 165 -14 -44 281 -69 -23 -18 -76 -162 142 126 -128 64 -219 50 -65 -157 -24 -320
3178 -320 35 132 -39 208 -15 157 -22 -347 4 -13 -171 -76 -272 -170 265 -70 -91 -195 163 -150 -123 -104
3200 -104 164 -55 -191 42 -38 -16 -315 -203 -141 57 239 -152 -31 123 46 64 -84 -180 368 48 -329 -61
3222 -61 178 9 65 146 -181 161 82 -204 -56 90 -10 -294 -233 -28 -80 32 -79 77 37 -277 -18 -139
3244 -139 127 177 -127 38 -250 9 174 50 -24 68 -48 -3 23 -124 98 7 193 32 131 -55 57 -99
3266 -99 -225 -37 51 -60 -155 -61 -272 -3 -79 108 -156 -279 -298 -138 -291 -38 -74 106 203 65 84 -111 2
3289 2 -77 -14 -3 267 -110 236 61 -197 6 -113 128 10 125 200 54 -245 267 165 -353 -83 72 118
3311A18p5K2K10n75J86P7J54j09PJ25k4j63r6J09J78j90J13J75j99RJ0O4l04J02
3335g6J8R2q8m1K22q6N3k47O7L14J9k01Mj5J43k77L48l15M9M4J37j68n3M23j99
3360A67j12j33J00%K14n18P8J7N2K88n9p4p6p9J35r9q9K8K66j29o7N50j32k95
3384C3K46k18j57O5J1J56K3k76K26l0P5j93P6Ko1K79l07O8n0J38j23k9L3l14j18
3409d45L46J08j99J19K00R3j98k6L15k84L36n24q6L23J58k41O5k7j61j59L48n0
3431A1j88K01pm9j17J63r4J12K0j90K10j92L07k31P5k2J8k9p2K69l03K07J76J5
3455B90l38L09k62k41M80k05o5k6J32k24J15j36nJ81j58K0L72k41J40n76K50L49
3477A61m49K34J17P0J68k43j85J19J55k41K82j80l5k63K28K5K24j65j19J05l63
$$ plain form
3311 118 43 65 275 -300 -114 -37 117 8 15 140 116 -47 -143 -34 144 -46 67 242 43 52 62 126 -178 -76
3335 -76 -58 34 -54 -95 127 41 94 -153 -86 228 247 46 50 35 178 -99 249 -66 -17 27 164 -4 -57 366 167
3360 167 55 -78 22 22 236 -282 -204 -187 -135 153 94 20 -56 -135 0 -99 -188 -160 106 -23 -90 460 328 33
3384 33 279 61 -96 -31 -20 136 159 -117 109 79 154 -39 37 39 -22 257 -50 18 -32 106 -17 -46 -13 -327 -445
3409 -445 -99 9 -190 -71 129 222 24 -2 313 29 365 -159 -245 78 236 -5 60 33 -128 -287 61 11
3431 11 -177 24 17 -32 -149 14 -80 32 52 -138 72 -120 187 -44 31 9 27 -2 -74 195 -108 99 275 290
3455 290 -48 261 -1 -242 238 33 -32 -58 74 -150 -35 -171 -176 5 -153 -133 239 -2 138 -438 -188 161
3477 161 -288 -54 63 133 301 58 -127 -8 147 -94 188 8 -27 -290 -62 -37 187 22 -97 8 -355
3498c55J67J04o9J96k35J25p8L2J97N1j33m4N0j19L58j83j40K21pj00n3K08j73
3521B0L15k38m4J65Mk16k8j07J73Pk3O6k01J27Q3k07J58j67l8J05o3PJ31k14J5
3546a70L21j31o1m7j04O4q3L7K27j1p5O4%p7o8L48l1k41K5m06K07J13n9l0O0J01
3572b7j11O5Q2j88L48o5n85L72l6j20K57J99p7O2j09Q3k51j43J24l6J69j49J26
3595a0k82K07O4j8p1K13Q3j77l9J3J85j49M6O1j22K83l54K80k61j57M53k08m3
3618ck1q2P3R1J6n4N7M5l96K30Nj34O1J7M6Q8K2J84l43m8K22J39n7k35K82q5j50
3645c0K7j28j07K37R5o5k03M16p8l7j70Q0R8j65j90Q2K82k0j25q1kk9J45L5j02
3670c5K57o7j99o4j47M62k23M4j62L01k41J26L1l02J73j53j1K38KJ23j97K67k98
$$ plain form
3498 -355 -188 -84 -153 43 -192 -67 -145 -113 84 135 2 -42 8 -111 247 64 -76 145 138 38 -15 193 20
3521 20 335 97 53 218 222 6 -22 -129 44 51 28 94 -107 20 103 -104 54 -113 -151 -46 -109 -102 29 -185 -170
3546 -170 151 20 -41 -88 -192 -128 -211 -174 53 42 -33 31 31 -46 -114 234 203 -38 -13 -419 -212 -99 -158 -188 -128 -27
3572 -27 -138 -73 9 -179 169 104 -481 -109 -145 -265 -8 191 114 176 67 150 -101 -244 -120 -156 13 -136 -10
3595 -10 -292 -85 -21 -39 -110 103 186 9 -30 -17 168 19 65 126 4 287 -67 213 -48 -205 248 40 -3
3618 -3 -24 -106 -33 58 74 20 77 122 -274 -44 -39 -173 -112 -95 -49 39 61 245 -98 -146 76 215 158 -77 205 120 -30
3645 -30 -3 -131 -238 -1 94 29 -174 242 164 127 -43 37 135 -30 -220 -138 144 124 -1 -82 -84 -113 32 67 -35
3670 -35 222 155 -44 -108 -255 207 -16 28 -134 167 -74 52 83 -219 -46 -199 -210 28 30 153 -44 223 -75
3693g5L24k89N9J4j32L13l23R4j5q1J58J18l69r9R9K34J00P0k03o1R0N6j43K73
3717B12k67L1pM8n3J25l2R8l20J20M5M6M2k5q5K3k70M44l69K8J14j24L92p0j15
3742C1j18j16K29K22m7j25l40M02j37J12k38J10J01N2o7j16%J57O4l38P5j28L13
3765I8O5j93L9r2k90N81l23K95j26j0k48K13J77M9l15j39L54m3j75J74j92K97
3787A96Jl62P1J92J11l57LJ80l11K58J1O2j9k48J44r0Q8K60P4m31L24J83l84n9
3811a03K04j88J89j60j40M21q9k21j70L15o0q7kP2k19L04k18o8n0M40j36J25k89
3834a30J62K80k04m2j14j59J86J31j93Q9J15q4j04q0L92k23j69M11k24j16K20
3855A44L4j88k1JR3p6n7L4j04r9K76k03n0K27L6k4k6M7j88R3Nrj45L01j14jJ69
$$ plain form
3693 -75 249 -40 19 33 -99 214 -109 -15 -30 -111 47 165 -204 -303 -204 30 130 200 -3 -64 26 82 -61 212
3717 212 -55 -24 -31 17 -36 89 57 155 -165 -45 0 46 88 63 -22 1 -269 175 -194 -166 -52 -176 216 146 31
3742 31 -87 -203 26 248 201 76 -264 138 1 113 -125 -15 86 138 71 -45 -45 112 176 -162 -87 -215 98
3765 98 163 -30 9 -83 -373 208 -115 180 54 44 -204 9 186 235 -80 -219 135 92 -83 91 -101 196
3787 196 197 -165 -94 98 209 -148 -145 35 -276 -18 -7 55 36 -212 -68 -158 -70 190 264 -167 157 340 -44 -103
3811 -103 101 -87 102 -58 -198 223 134 -87 -257 58 -2 -89 -91 -19 -238 66 -152 -220 -270 170 34 159 -130
3834 -130 32 312 108 66 -48 -207 -21 110 -83 6 121 37 -67 -147 245 22 -147 264 40 -76 144
3855 144 178 -10 -31 -30 63 -13 -70 -36 -140 -239 37 -166 -216 11 47 23 -3 44 -144 -51 -46 -55 -200 101 -13 -14 155
3882A55k21K10p9L8P7k43Q1k57J77k6j26K33j15L3k42J8J63l2%J16RP4kJ26m5
3907A22j37RJ27k84L52J04m46L76j06J56k06j63M4M6K27j89n1J29K4j25j69J31
3929b9J33J16n0k39N2k63M96r2K03M3j37j47j14k52K89p2j40J68J92J8k80J0K45
3952A50J00k23j42L2J7J03q7J86k27L79l61j99L08k73K3L55j15K17j93j4J65k
3974A99K2r8r9M0J74j64j04r7J30N0l61k7K26J32m1N4l23J58J56j88J02O3R3j73
3998g6L54k85p5k19L27K50M2l37L54l16J76m4L16n80K92l94L2J47r4J58j43j0
4020a25k76M79l72K41n9m3K15O7K6j03qOj59J60j76O5K03q9k17qM31k72k79N07
4044B14k25Q7O3o0MR9l15l89O76j56j20O2J90o53O76k25J8m1M2Qj86J69J75k40
$$ plain form
3882 155 -66 144 65 103 180 -63 18 -239 -62 -88 -214 19 -96 -63 -305 -287 -124 -156 -156 -40 -31 43 41 167 122
3907 122 -15 -6 121 -163 189 293 -153 223 117 273 67 -96 -52 -6 221 32 -19 110 134 9 -160 -29
3929 -29 104 220 170 -69 -17 -280 216 124 327 370 233 86 -28 -280 9 -63 -203 -35 157 175 -105 -95 150
3952 150 250 27 -115 -83 -66 37 -50 136 -91 288 -73 -272 36 -237 -214 141 26 243 50 36 201 199
3974 199 221 123 24 64 238 74 -30 -127 3 53 -308 -335 -109 23 -18 36 -287 -129 27 -161 -59 4 97 -76
3998 -76 278 -7 -82 -301 26 276 318 -19 335 19 195 151 467 -113 179 -215 -183 -36 -130 28 -115 -125
4020 -125 -401 78 -294 -53 -112 -155 60 127 153 50 42 48 -111 49 -127 -62 141 52 -165 -173 258 -14 -293 214
4044 214 -11 76 139 79 83 182 -133 -522 154 -2 -122 -60 130 -523 153 -72 -54 -95 -53 -45 -231 -62 113 -127
4068a27P5R3K9k2j19J74J59m57J90K30n8j43j07%J58N5l38L29j73k4J80k48K60
4091A16j48O1j16J49j40R2J19j72J02j7Q1k1rJ28m96K32j1o9J24k41L19Kj25j21
4115a61K98n4J89j16q3j96J87Q6j95K34m93M71k07J92K02m28O9O5J26q2J18m86
4137b64K17L82l77PK91m44K18J12n5r1j41K62j77J56o8J50l99M43m21j02L23r6
4159g4%Q3N4k70P6J82R1k58L9K19j79k92L26N0p1j74K21l5q5m7J56j34K5J79j00
4184a8J17l24J31K26j71l2K32j42m9J85r5j09L8J73p3Q1k16J39J31j13P1k10J27
4207I9j36o2j34R0J08m1j41M37p7j11J98l2j47M3n7n0K7j63J15P6N4l46K75j9
4231FJ49r4l6J62o1l55K84k41j24J70J22k1QoJ4J18j41n1J29j71k7L20j50j71
$$ plain form
4068 -127 -52 41 70 48 -71 103 262 -195 -5 225 167 24 -83 -83 75 130 -208 121 -52 -76 104 -144 116
4091 116 -32 29 -87 62 -78 14 133 -39 63 46 127 106 97 225 -271 -39 -50 -119 5 -236 83 85 -40 -161
4115 -161 137 83 272 156 73 -123 64 150 -45 189 -304 167 -40 152 354 -74 -5 60 186 104 222 -264
4137 -264 -47 335 -42 -35 256 -188 30 142 87 -4 -145 117 -60 96 28 178 -221 222 -199 -301 22 -74
4159 -74 -74 9 63 -207 -131 51 142 -116 -77 142 -37 -329 -3 47 -24 -198 23 -12 -97 -144 12 -122 -97 82 -18
4184 -18 99 -225 -94 132 -39 -71 161 19 -30 155 60 -49 -11 162 89 170 -46 93 224 111 182 -28 99
4207 99 -37 -99 -233 -143 -35 -76 -217 220 143 32 230 198 51 94 37 -13 14 -149 -34 42 96 -250 25 6
4231 6 155 61 25 187 126 -229 55 -186 -310 -140 -18 -39 -31 -37 -23 95 -46 -97 32 -139 -166 154 4 -167
4255a67L86k59p8L47k83j76J79J20K8m7o2P1K27j19k09J46j01J08l13P8K07k40
4277a57J66j19q3L98m32j18K54j13K64o0o1j20j00M4J98qJ10j57P5P7j78N64m51
4300gl0L0Q9o6j14p6K94m5m57NL73j49J32j56N1n7J25K66k21l92J98K43K43j1
4324B68l65K78l2j53j86J15L1o8J00L12l01Q2P3k51J25j25L63L4l75Q3K37j35
4346A10mk54K75j13L19k04n4J9J24K5k53L1k8J42j22n9p0J75j01L70k81K05j72
4369H0j96J6j79L42J01m01L15k9j17q3O1l3L04j01j2J2k26J86O0q4K73m88j27
4392c26L92k3k03J23j92K77n9j42J18J31j79Jm9J76j52k06J82K63j22P9p6k49
4414b36K75J55j83j28L69l89m1J18k03L19J00l04K15Q6l11N18o27L31J22j25r1
$$ plain form
4255 -167 219 -40 -118 229 -54 -230 -51 69 97 50 -12 59 286 167 -42 104 3 111 -202 -124 83 -157
4277 -157 9 -110 -193 205 -227 -345 -91 -204 60 0 -61 -181 -281 -237 -39 -47 63 -94 -19 58 -120 444 -7
4300 -7 -37 -7 82 16 -98 -174 120 75 -382 -377 -4 -153 -21 -177 -126 -183 -58 208 -13 -405 -207 36 279 268
4324 268 -97 181 149 -4 -190 -75 -44 -112 -12 300 -1 81 154 -97 28 -97 266 300 -75 8 245 110
4346 110 106 -148 127 14 333 129 75 94 218 243 -10 21 -7 135 13 -46 -116 59 -42 328 47 252 80
4369 80 -116 -100 -279 63 164 -237 78 49 -68 -151 -90 -123 181 80 68 80 -146 40 100 16 289 -199 -326
4392 -326 66 43 -160 -37 -229 48 -11 -153 -35 96 -83 -82 -131 45 -107 -313 -131 132 10 89 13 -236
4414 -236 39 194 11 -117 252 -137 -178 -60 -263 56 156 -148 67 153 -158 360 -267 64 186 61 -30
4435c0Q8j83K53k53K52r6l74L58j94m9M36l14J48M7j80R1j8o9l4K23M8j19j50
4458a19K71j79q8J76j56J27l8N9L10k16k99L28M6l27K60r0j38l9K06q9k08J87
4480a6j10Q4J19LL1m2M0j88K74n0k38j8J96m5J9l4j73J19r2K49k96mK31J15l04
4505a30K40m0j67Mk61J99Q6m0j19M66l93P7K66j4k45RJ01k18J16j8M41p55J82
4528b13K79P1o0j56L74m64M7n2K73j75lJ01M0j44q5n1J50J45k63k4J62K67k1o6
4552A32j62J35J05j25l7Q9k92m6J91p2o9N5J73o7N1j83J62K00m12J85J05k25j14
4575b21J08J19j69J42J40r1Q3J40k45O9j12J62k42O6MP4j20K15j47M4k75L61j12
4598gj43M6K13j60j73P4J73O9j18P4O7j11M1k50M00o4j60J27l26J82p2j09K14
$$ plain form
4435 -30 58 -125 128 -125 127 31 -343 15 -179 -228 208 -106 42 89 -91 0 -18 -87 -121 102 150 31 -119
4458 -119 152 -27 -115 61 -95 32 -6 53 363 147 -152 176 222 -105 155 65 -73 -112 94 5 -203 -16
4480 -16 -126 -42 77 80 111 69 109 -79 195 145 -93 -111 85 40 59 25 -148 -29 -121 128 -168 -172 59 174 -130
4505 -130 110 70 -97 -93 -354 -155 -69 -109 -228 238 -155 -78 188 174 -71 -62 39 -179 -63 -81 360 -395 -213
4528 -213 66 137 77 -79 295 -169 -122 -174 99 -76 -79 22 62 -82 -167 -218 -68 77 -186 -210 -48 219 198 132
4552 132 -30 105 210 85 48 137 -155 -201 -10 -82 -151 -96 77 10 61 -122 40 240 -172 13 118 -107 -221
4575 -221 -113 6 -163 -21 119 28 111 251 6 75 -37 125 -117 -51 -47 27 -93 122 -25 19 -256 105 -7
4598 -7 -150 -104 109 -51 -224 -150 23 92 -26 48 115 4 45 -205 195 131 -29 98 -228 -46 -118 -227 -13
4621a3m8K48j66K3m7J65j27m3O1N6k97K74m7n1K7l07L37p6J57k41n1K49k07N7
4645f7q3K09R6r5l88M06j36J14M5j17Q1k29K78r2j27k1r0P3j24L33k84m0K74J75
4669A91J0l49K08l37L46k00K45k14J5M6J55l15K52o5J50k34K50j70j65K48j17
4690e0M11m17koQ6J18j10Pr9K59j89j36J11k08K12K24k37Mj72J66P6N3j86K79
4714A94oo0j99O8K13k02K83o4j76l66M27K58l49J26J3j72J39l00J10K13m95M01
4736E6j75J15o9J58m15K63J0p0l24L71N1q6J59j2Q3j27K78m94N01j77m0j21o8
4759a33K76k99PJ67p0O8o8k04L29K59m21K30j93k03L34j85J28j39J82l32L16J14
4781A63l73L60j3o9R3n6l00L11j82r9J22k80J58M5KP0L0J10m01N50m48J28J64
$$ plain form
4621 -13 -61 187 21 44 -3 162 35 -8 53 109 -188 86 39 -12 15 -292 45 -31 126 -115 -166 83 -124 -67
4645 -67 -150 59 155 60 -328 78 -58 56 101 -16 65 -164 114 22 -105 -126 -216 -143 -267 66 -218 -258 16 191
4669 191 201 -148 60 -277 69 -131 114 -100 -85 -39 116 -199 53 -12 138 -96 154 -16 -181 67 -50
4690 -50 361 -56 -58 -64 22 140 30 37 -62 197 8 -128 -17 -225 -13 211 -26 -22 -194 -28 48 101 -85 194
4714 194 188 128 -71 -3 210 8 291 227 51 -315 112 370 21 147 160 -12 127 -173 -63 150 -345 56
4736 56 -119 -4 -73 85 -330 -67 -57 -127 -451 -80 -29 -115 44 32 115 -12 266 -228 273 96 56 -65 -133
4759 -133 143 -156 -149 18 -52 16 -52 -256 73 332 -89 141 -52 -255 79 -106 22 -117 65 -267 49 163
4781 163 -210 150 137 68 161 105 -195 116 -66 -165 -43 -323 -165 -120 -118 -48 -18 92 -309 241 -207 -79 85
4804H5j87k46N89j38j88J58N1L9k4j08j30J09P6j6K13m92J75o3K45J74j30l37
4826a45P3m7L26l30J07J05l22K55l28L86M6J08k23R8N0o5p8Qp9J76k75K67L4m5
4850A02j7j33j1L07j95K7m3Q7m3k44P4j17J98j20Q0r9K21Ok44O7M0K41o1j96l9
4875a12K85j78O7J42k00p5J79j7l0k39K35j0k15K18Ml7J04o2o5M7o8m1N9k99J76
4900a32j04K35Rj28J15j08o8L78k71R2q9L0q4J20n4m9J83j18o6J39n9J50j1J17
4924B27j41m2k23L21l01J53M9P0j67L25q0k29K24k39J94k24J34k06M88n62L43
4945A14L1o5k0j89J61j5O0j41OK25j02j50j57L11R0r3r3q9J90q7j6L9j2J4m2j19
4971a49O8O5K02n1k60J8J03N7j02P2j7L6mRj10J39J24l23M50rm43K57k35j09O6
$$ plain form
4804 85 -102 -348 241 103 -85 73 124 163 139 31 -99 10 86 70 283 -209 -34 -97 148 322 192 -145
4826 -145 -72 -119 207 -123 -16 89 -233 22 -306 80 126 234 11 109 159 94 16 24 -55 121 -154 113 147 102
4850 102 85 -48 -59 248 53 80 37 124 81 -163 -89 -206 -8 -128 -48 -147 74 80 -164 -97 -57 184 123 -73 -112
4875 -112 173 -5 62 204 4 -71 108 91 61 -178 57 47 -168 50 54 17 121 59 -6 41 -27 -68 -9 -308 -132
4900 -132 -236 -1 8 -120 -5 -113 -181 197 -74 18 -71 -41 -125 -5 -59 -108 75 -43 -109 30 -29 121 110 227
4924 227 86 44 -179 142 -159 -6 43 113 -54 271 191 -38 186 -53 141 -83 51 -155 333 -229 114
4945 114 145 80 60 -129 32 17 77 -64 -58 167 65 -85 -242 69 159 66 -27 -116 74 -13 -29 10 -2 12 -30 -149
4971 -149 -81 -16 186 135 -125 -107 -4 53 -49 23 6 42 38 47 -63 76 200 -123 327 318 -125 132 -103 -212 -146
4996a46Q2j16O7R0p1K39k72j06L38j22p5J26k9o3J45J27m83J01J26J58K79n90
5018a95p8L16m53M86l86K38J82J13n36M84o15M36o6j8J92j30L1N9Q7q3m0J98r8
5041A24K42k84N4k54J98J93l46J47q5o5L15j86j45m2J30M0j44j55J68K37j40o0
5063e8o2K04j52K70j25J11j29K40j58l1J5k82J4L32k21J78o1n9L82k38j40J39
5085A69l69J81J00j25K28l28J76N8r6Q2j06Rj4J0J32Rk9J24k83L2J04L5K22m25
5109a04K35k11J40p3J88l7lj09j70J05k84M80k34j58L32M0j84J11k2k2O6J82j07
5132A61k90M72l92K93j22r2R2k9O2k41j6L59ok10L8lk81L92j49k29J73j33J77
5155B6J00k12K58q2j03J57j85j12L18J00r2k54j82L70j40J9j06J37k6p8l8J31
$$ plain form
4996 -146 -64 -180 -113 -23 -94 145 -127 -233 105 -17 -92 34 5 -58 87 214 -269 -168 -42 116 395 -195
5018 -195 -273 43 -410 76 -310 -72 110 223 -313 171 -444 -8 -74 -92 100 -30 1 60 147 64 24 222 124
5041 124 366 82 136 -118 80 273 -73 74 -11 -76 239 53 -92 -134 -4 36 -108 -263 -95 142 2 -58
5063 -58 -120 84 -68 202 77 188 59 299 141 110 125 -157 -143 189 -32 146 85 26 408 170 30 169
5085 169 -200 -19 81 -44 184 -144 32 90 -6 76 -30 -21 -35 -25 107 116 87 211 -72 -40 64 99 321 -104
5109 -104 131 -80 60 -13 175 138 135 26 -144 -39 -323 157 -77 -235 97 137 -47 64 42 20 86 268 161
5132 161 -129 343 -49 244 122 30 122 93 155 -86 -102 257 251 41 79 76 -205 187 38 -191 -18 -151 26
5155 26 126 -86 172 90 -13 144 -41 -153 165 265 173 -81 -263 107 -33 -14 -120 17 -9 -87 -125 6
5177Fp9J49j16J26l08K41p7R1j2L6j34J28J2j4K9j72J96J0j68J41j95O0l3J04
5201B1M1J77j83J60q8k27J38J68j69J68k35j74M66k45j19K9j3J36j0L7p4P7k36
5224a55M07l00J16J61l69K00L0K6l8q1R2J4n5o9j7J32J46l57L76k55j47j2K68
5247A13j53k2J21m10L7K68L62k71Qm3l43J98K63L0k45J78P1l29N8P5K21p9J20
5270B28m56M99l45K26n5q9r6JL76k24k06K9K03j92J8L6o0J89k42J5O9k76M81k06
5294g7l2J73j05l0%L59k09j57Q0L8M2k34J70J01j59j74N7J24o8R1j99J80J00k1
5318E0k7k47M62l27O8J61j77j20MO8j64L58M3o5j0p2j19R8k0n8Q5j92L50k34k00
5343b85J66K63j74l15J88J31J45k0j77P8K88k53J56k84q1Q2K24R6k12nj74L67
$$ plain form
5177 6 -73 76 -40 86 -222 19 -58 33 21 57 -77 51 63 49 78 -94 102 112 -56 85 -110 -50 -83 21
5201 21 62 239 56 216 128 -99 39 207 38 206 -29 -203 263 18 -101 -72 -85 51 41 78 4 81 -155
5224 -155 252 -48 68 229 -140 60 90 116 78 -3 89 103 48 -21 -38 94 240 -117 259 4 -143 -155 113
5247 113 -40 -62 59 -351 -314 -46 316 45 53 10 -333 -135 128 158 -87 91 162 -167 -109 -34 187 108 228
5270 228 -228 271 -74 152 97 8 -88 -87 289 65 -141 -112 91 -101 -83 -47 -107 82 -160 -145 -76 -352 129 -77
5294 -77 -109 64 -41 -71 -71 288 79 -78 2 40 82 -152 18 119 -40 -214 -157 -33 -101 -10 -209 -29 71 50
5318 50 23 -224 238 -89 -21 140 -37 -157 -153 -85 -249 109 152 87 77 5 -114 -16 -36 -94 -9 -201 149 -85 -285
5343 -285 -119 144 -30 -345 -157 -26 119 99 -78 0 288 35 191 -93 -174 -92 132 228 16 11 -163 204
5365B04Ll03J78O6k53J24k42K21j19m7K46Q9l93J99r7p0L32l83J85j6o3J29k3
5388c3L3m1P9m3N7p4M6J74m76K41L1j86J88l8K8J71k57J48k54N6Q6M7j12J37o2
5413e4K34j38m8j07J11o1p0L63k23L6pk25L20l63l5J90K01j33K00l83L34m96M48
5436I4m9j89J29Q8J08k02K5J9k83J56j09L63k10K5j58J65K25l51K78k88J57P0
5458F3Q4j12j90PL85l09J67j26L99m33J46j16l3j17K18l0j19q6K11P9j73L27k30
5481A2O0j74J51j43L37l04p1L34l14r2K56k75l2R3N5J79l21M49k18N2r6K9J94
5504A61j85r9J09r9K0K9j22K51p5Op9o3M2J16o0J53k27K83J59j95P1k51Q9J56
5528A90k58J32l5J12Nr2j39J57j40K18l02j1K1kp2K42k62J64k58L70l23L47l7
$$ plain form
5365 204 207 -96 82 148 -105 19 -223 -2 -121 -168 78 167 -226 -27 -124 -194 138 -245 -60 -76 -139 -10 -33
5388 -33 0 -41 38 -5 52 -22 24 198 -278 -37 -6 -192 -4 -42 -14 157 -100 48 -206 -150 -64 -17 -129 8 -54
5413 -54 180 42 -6 -113 -2 -63 -133 230 7 43 36 -189 131 -232 -267 -77 124 -9 191 -192 142 -354 94
5436 94 45 -144 -15 73 181 -21 4 23 -260 -104 -213 150 -60 -35 -193 -28 197 -154 124 -164 -7 63
5458 63 147 35 -155 -148 237 -72 95 -31 368 -65 81 -35 -68 -185 33 3 -116 -202 9 88 -85 242 12
5481 12 72 -102 49 -94 243 -61 -132 202 -112 -204 52 -223 -255 -162 -107 72 -249 200 -18 34 -62 -33 161
5504 161 -24 -123 -14 -113 -93 -64 -186 65 -10 -4 -83 -146 -104 12 -48 105 -122 161 320 125 196 -55 34 190
5528 190 -68 64 29 141 146 54 -85 72 -68 150 -152 -163 -142 -144 -216 26 -236 -72 -330 40 -283 64 27
5551B7j38p0J88j16J74j8m5P3R4j60j77P1J74k2mJj04J82k60J79j68K34k47N1
5575h1L43l88L22jk23J49L7LJ39k54k17J56K2L94k66n8R0n3j47N9j4L6L5O8k13
5600f2K97m48K68K22j80q0j42K31k84L12p2j78K51j15O5l9j26L40k18K02j92J09
5622A61j64J19J19j40j8k97M20J17k42j32j34j29J04K09p0J21j71P9k09J97m3
5643a03O0J3k8PJ6J62p8R4j82J5j21P8r8J24Q1J47M0k22J87k40N7J49J16l77J73
5668G0k06J84k5nNl39L14J00k16K24N9l24K55r4j1M7p2J48%k25M5L91k58j50J5
5693f8K52j66n2O6K96k01k01P7P0r7K63j41k14Q6J18j32K63k59k12K01K23k36
5715f4J50j14j41P6J01m2K08q7R4k66k38M18j62K66m49M68l40Q6J91l28Q8K62
$$ plain form
5551 27 -111 -181 7 -109 65 47 2 75 169 9 -168 -97 77 55 51 52 -52 130 -130 49 -119 115 -132 -81
5575 -81 262 -126 196 195 -28 121 158 161 300 46 -171 -15 7 401 135 77 167 114 -33 26 12 48 83 151 -62
5600 -62 235 -213 55 277 97 17 -125 106 -178 134 62 -116 135 20 85 46 -80 260 42 244 52 161
5622 161 -3 116 235 95 77 -220 200 317 75 -57 -191 -320 -216 -7 -77 44 -127 -48 -257 -60 -103
5643 -103 -43 -30 -58 -51 -35 127 49 143 -39 -24 -145 -67 -165 -41 40 187 227 5 192 -48 9 158 274 -103 70
5668 70 -136 48 23 18 23 -316 -2 98 -118 106 165 -159 96 2 -9 38 -34 114 114 -111 -66 325 67 -83 -68
5693 -68 184 18 -34 32 328 127 -74 3 73 -24 239 98 -116 -30 88 -44 219 -40 -252 -51 172 -64
5715 -64 86 -28 -169 -93 8 -34 174 87 181 -85 -323 95 -67 199 -250 218 -122 -36 155 -173 -85 177
5737A77m17K94J25N8k23O3j24j08J13J92j30j20k13Q9L10k4J36l99J83O7j55J22
5759A6k00k2M69m02M73m16j9K04r0J83m91K17J34L30l95J25q5j08J8K39j18r8
5781c6J47l03M09k39K35n8l1l18J10N8P3n0Lo7pJ93l00K34j95J76j13k13Q8L62
5805A58j27qk24J70J26j15R9Q2k47p5L83j35k8k02J55L16j12j90K06j84M8j34
5827c8J64J8k51k5K29m9j48M0J88j85J53n1K44j45j77M03m31n0K65n8k00L16k64
5850e2o9j9j33L21k3p7k15K82J74k74RR4j01O0K58j46l21r8L37jOj37P3J95k78
5875a35J60j73m2J7K60K02l36o6m5O3K66j24Q9j19O6j12K56l39K68r2k8o0K04
5898A80p3N3k15m7k6L03m03L06rq8J2k7p7J70l4j93K83Q6J27m07P5R1k4kM6j44
$$ plain form
5737 177 -240 54 179 237 14 77 -47 -155 -42 150 20 -100 -313 -224 86 62 198 -201 -18 49 -106 16
5759 16 -184 -206 263 -139 334 -82 -101 103 13 196 -295 -78 56 386 -9 116 31 -77 -59 180 62 -36
5781 -36 111 -192 217 -22 213 155 124 -194 -84 -26 47 -3 0 -67 -74 119 -181 53 -142 34 -79 -292 -204 158
5805 158 31 23 -201 -31 95 -20 79 161 -86 -161 222 87 59 -143 12 328 216 26 232 48 96 -38
5827 -38 126 144 -107 -132 97 48 -100 -60 128 -57 96 45 289 144 -33 370 -61 -111 154 96 -104 212 -52
5850 -52 -121 -140 -273 48 25 -52 -267 15 189 -85 -76 18 -83 -23 235 89 -232 -330 7 6 12 -125 -52 143 -135
5875 -135 25 -148 -190 -173 87 289 -47 -113 -158 -95 171 47 136 17 83 -29 227 -112 156 64 36 -24 180
5898 180 107 160 -55 -102 -128 175 -228 78 69 -19 -7 -34 -111 59 25 -168 115 201 328 -79 -4 87 63 61 107 -37
5924c7J60m37K23k5J63k46O9K61j6k73L77j31J52j42kO4j4k38Q3j3J15n0J29J9
5948A91j03J24n5k82J15L49m75K72L6j46l5K56j14j71J06P6k67J07j13J01L03
5969B75j6l07n4N0J32Kp5K12j85q3L2R0k27M75l12K05l58J51J15j18j73J59o6
5992g6J78k13J49r6r3j2K14j05K67l22L5j0j43K20O8J48j41m32N46j69J90j93
6014A0k51L02O8k54QJ46J49j08M0j65J40j55j86J37j29K40k46K56J51Q2j76j33
6036g4N1J61k93K21j98R4k9k3K58j0j85J37k23K55j47J53l52L67l87O5J04J03
6058D8R8k00K49l39J39j43J37j39K28l29K05l4m0J46K2j29K47k26j3J62n9J72
6080B02k47O4K59k84J7%J07j68J34k74j60N00n64N89l01K56m2j91J52L2k16k30
$$ plain form
5924 -37 123 -314 -91 -116 47 -199 -130 131 115 -158 219 88 240 98 96 160 146 -92 -9 -22 93 43 172 191
5948 191 88 212 157 -125 -10 339 -136 136 172 26 -9 247 133 -38 68 144 -123 -16 -129 -28 275
5969 275 259 -48 -102 -52 80 82 7 219 34 -49 -17 73 -154 321 9 214 -144 7 122 4 -169 -10 -76
5992 -76 102 -111 38 -58 -151 -163 51 -54 213 -109 -74 -84 -227 -7 61 209 68 -364 182 13 203 10
6014 10 -241 61 129 -125 -117 29 178 70 110 -55 85 -70 -256 -119 -248 -8 -254 2 153 235 59 -74
6036 -74 -23 138 -155 66 -132 -38 -67 -90 168 158 -27 110 -113 142 -5 148 -204 163 -224 -159 -55 48
6058 48 146 -54 195 -144 -5 -148 -11 -150 78 -251 -46 -80 -120 26 48 -81 166 -60 -73 89 30 202
6080 202 -45 19 278 -6 11 11 118 -50 84 -190 -350 150 -414 175 -126 130 88 -103 49 81 -135 -365
6102c65N63j78r2K89l49P2Q2j5J55k18K01j69Q1J7m38N89l05k30K25K87k31q0
6124a09PJ15j05N1j62J44O9K2Qn6K52j64N3k86N2R1l7N4K5L81m48j57K81j08p
6149c4J20k25L12k35K58j90j39Q1R4k31N9L3J25Lj02J32p8J8j94L17k20K56l71
6172b11L62k98L60J32m82M1K38nj61Mj39j81N19M5k58m9J13k56M05l34K02P3o0
6195F0j09l5o5J01J18k59L60r8k39J47J4ml4k24L70r9j8q4l1K82j25l58J09L8
6219a83M9N5J82j29O2j34K28j86o4M04l06K0k47O03l20q0l4R9o3QJ12p2j14O9
$$ plain form
6102 -365 198 20 -72 217 -132 -60 22 7 162 -56 145 -24 57 74 -364 225 -80 -310 -85 202 -29 -109
6124 -109 -102 13 -92 -41 -203 -59 10 32 40 -16 236 72 125 -161 -109 -18 -55 -1 24 405 -43 -200 81 -27 -34
6149 -34 86 -139 173 -62 196 6 -133 -52 42 -189 -130 -97 28 31 -71 61 -17 1 -193 124 -96 160 -211
6172 -211 151 -147 213 345 -137 -96 142 137 -24 -20 -159 -340 179 224 -34 -83 30 -226 179 -155 47 120 60
6195 60 -49 -84 -149 -48 70 -189 171 73 -166 -19 -5 -9 -43 -267 103 4 -14 -98 -129 153 28 -330 -221 -183
6219 -183 -134 -79 103 -26 36 -98 130 -56 -120 284 -22 -2 -249 354 34 -46 -80 19 -44 -36 76 4 -110 -41
$$ [...]
8191A60
##END NTUPLES=NMR FID
##END=
