##TITLE=1H_di2tSL17-f5
 200.13Hz,CDCl3.
 8 sc
 3.6.2026
##JCAMPDX= 6.0         $$ Bruker NMR JCAMP-DX V2.0
##DATA TYPE= NMR FID
##DATA CLASS= NTUPLES
##ORIGIN= UXNMR, Bruker Analytische Messtechnik GmbH
##OWNER= pz
$$ XWIN-NMR		Version 3.5
$$ Wed Jun  3 13:53:56 2026 Russian Standard Time (UT+4h)  she@DPX200
##.OBSERVE FREQUENCY= 200.131
##.OBSERVE NUCLEUS= ^1H
##.DELAY= (6, 6)
##.ACQUISITION MODE= SIMULTANEOUS
##.ACQUISITION SCHEME= undefined
##.AVERAGES= 8
##.DIGITISER RES= 18
##SPECTROMETER/DATA SYSTEM= spect
##.PULSE SEQUENCE= zg30
##.SOLVENT NAME= D2O
##.SHIFT REFERENCE= (INTERNAL, D2O, 0, 14.3821)
##AUDIT TRAIL= $$ (NUMBER, WHEN, WHO, WHERE, WHAT)
$$ ##TITLE= Audit trail, XWIN-NMR		Version 3.5
$$ ##JCAMPDX= 5.01
$$ ##ORIGIN= Bruker BioSpin GmbH
$$ ##OWNER= she
$$ F:/spectra/data/she/nmr/H-C/1/audita.txt
$$ ##AUDIT TRAIL=  $$ (NUMBER, WHEN, WHO, WHERE, WHAT)
(   1,<2026-06-03 13:52:35.59 +0400>,<she>,<DPX200>,
      <created by zg, POWCHK disabled, PULCHK disabled
       configuration hash MD5:
       00 E9 B6 7A A2 85 ED C7 34 08 36 98 17 FE 4E 26
       data hash MD5: 16K
       DA 9F CB DC 43 72 37 CF 4C 6F 8E A6 09 96 50 AB>)
$$ ##END=
$$ 
$$ hash MD5
$$ E3 AB 3E 69 4B F9 FE 41 5D C9 84 11 09 A9 7F 84
##$RELAX= 
##$RELAX= 
##$RELAX= 
##$RELAX= 
##$RELAX= 
##$RELAX= 
$$ Bruker specific parameters
$$ --------------------------
##$DU= <F:/spectra>
##$EXPNO= 1
##$NAME= <H-C>
##$PROCNO= 1
##$TYPE= <nmr>
##$USER= <she>
##$AMP= (0..31)
100 100 100 100 100 100 100 100 100 100 100 100 100 100 100 100 100 100 
100 100 100 100 100 100 100 100 100 100 100 100 100 100 
##$AQSEQ= 0
##$AQ_mod= 1
##$AUNM= <au_zg>
##$AUTOPOS= <>
##$BF1= 200.13
##$BF2= 200.13
##$BF3= 200.13
##$BF4= 200.13
##$BF5= 200.13
##$BF6= 200.13
##$BF7= 200.13
##$BF8= 200.13
##$BYTORDA= 1
##$CFDGTYP= 0
##$CFRGTYP= 5
##$CHEMSTR= <none>
##$CNST= (0..31)
1 1 145 1 1 1 1 1 1 1 1 1 1 1 1 1 1 1 1 1 1 1 1 1 1 1 1 1 1 1 1 1 
##$CPDPRG= <>
##$CPDPRG1= <>
##$CPDPRG2= <>
##$CPDPRG3= <>
##$CPDPRG4= <mlev>
##$CPDPRG5= <mlev>
##$CPDPRG6= <mlev>
##$CPDPRG7= <mlev>
##$CPDPRG8= <mlev>
##$CPDPRGB= <>
##$CPDPRGT= <>
##$D= (0..31)
0 0.7 0 0 0 0 0 0 0 0 0 0.03 0 0 0 0 0 0 0 0 0 0 0 0 0 0 0 0 0 0 0 0 
##$DATE= 1780480355
##$DBL= (0..7)
120 120 120 120 120 120 120 120 
##$DBP= (0..7)
150 150 150 150 150 150 150 150 
##$DBP07= 0
##$DBPNAM0= <>
##$DBPNAM1= <>
##$DBPNAM2= <>
##$DBPNAM3= <>
##$DBPNAM4= <>
##$DBPNAM5= <>
##$DBPNAM6= <>
##$DBPNAM7= <>
##$DBPOAL= (0..7)
0.5 0.5 0.5 0.5 0.5 0.5 0.5 0.5 
##$DBPOFFS= (0..7)
0 0 0 0 0 0 0 0 
##$DE= 6
##$DECBNUC= <off>
##$DECIM= 32
##$DECNUC= <off>
##$DECSTAT= 4
##$DIGMOD= 1
##$DIGTYP= 9
##$DL= (0..7)
0 120 120 120 120 120 120 120 
##$DP= (0..7)
150 150 150 150 150 150 150 150 
##$DP07= 0
##$DPNAME0= <>
##$DPNAME1= <>
##$DPNAME2= <>
##$DPNAME3= <>
##$DPNAME4= <>
##$DPNAME5= <>
##$DPNAME6= <>
##$DPNAME7= <>
##$DPOAL= (0..7)
0.5 0.5 0.5 0.5 0.5 0.5 0.5 0.5 
##$DPOFFS= (0..7)
0 0 0 0 0 0 0 0 
##$DQDMODE= 0
##$DR= 18
##$DS= 0
##$DSLIST= <SSSSSSSSSSSSSSS>
##$DSPFIRM= 0
$$ [...]
##$SUBNAM0= <"">
##$SUBNAM1= <"">
##$SUBNAM2= <"">
##$SUBNAM3= <"">
##$SUBNAM4= <"">
##$SUBNAM5= <"">
##$SUBNAM6= <"">
##$SUBNAM7= <"">
##$SUBNAM8= <"">
##$SUBNAM9= <"">
##$SW= 18.0517599122864
##$SWIBOX= (0..15)
0 0 2 0 0 0 0 0 0 0 0 0 0 0 0 0 
##$SW_h= 3612.71676300578
##$TD= 16384
##$TD0= 1
##$TE= 0
##$TE2= 300
##$TE3= 300
##$TEG= 300
##$TL= (0..7)
0 120 120 120 120 120 120 120 
##$TP= (0..7)
150 150 150 150 150 150 150 150 
##$TP07= 0
##$TPNAME0= <>
##$TPNAME1= <>
##$TPNAME2= <>
##$TPNAME3= <>
##$TPNAME4= <>
##$TPNAME5= <>
##$TPNAME6= <>
##$TPNAME7= <>
##$TPOAL= (0..7)
0.5 0.5 0.5 0.5 0.5 0.5 0.5 0.5 
##$TPOFFS= (0..7)
0 0 0 0 0 0 0 0 
##$TUNHIN= 0
##$TUNHOUT= 0
##$TUNXOUT= 0
##$USERA1= <user>
##$USERA2= <user>
##$USERA3= <user>
##$USERA4= <user>
##$USERA5= <user>
##$V9= 5
##$VALIST= <valist>
##$VCLIST= <CCCCCCCCCCCCCCC>
##$VD= 0
##$VDLIST= <DDDDDDDDDDDDDDD>
##$VPLIST= <PPPPPPPPPPPPPPP>
##$VTLIST= <TTTTTTTTTTTTTTT>
##$WBST= 1024
##$WBSW= 4
##$XGAIN= (0..3)
0 0 0 0 
##$XL= 0
##$YL= 0
##$YMAX_a= 456208
##$YMIN_a= -345422
##$ZGOPTNS= <>
##$ZL1= 120
##$ZL2= 120
##$ZL3= 120
##$ZL4= 120
##$ABSF1= 10
##$ABSF2= 0
##$ABSG= 5
##$ABSL= 3
##$ALPHA= 0
##$AQORDER= 0
##$ASSFAC= 0
##$ASSFACI= 0
##$ASSFACX= 0
##$ASSWID= 0
##$AUNMP= <proc_1d>
##$AZFE= 0.1
##$AZFW= 0.1
##$BCFW= 1
##$BC_mod= 2
##$BYTORDP= 1
##$COROFFS= 0
##$CY= -3
##$DATMOD= 1
##$DC= 2
##$DFILT= <>
##$DTYPP= 0
##$F1P= 0
##$F2P= 0
##$FCOR= 0.5
##$FTSIZE= 0
##$FT_mod= 4
##$GAMMA= 1
##$GB= 0.15
##$INTBC= 1
##$INTSCL= 1
##$ISEN= 128
##$LB= 0.25
##$LEV0= 0
##$LPBIN= 0
##$MAXI= 10000
##$MC2= 0
##$MEAN= 0
##$ME_mod= 0
##$MI= 1.114404
##$NCOEF= 0
##$NC_proc= 0
##$NLEV= 6
##$NOISF1= 3.799351
##$NOISF2= 2.8
##$NSP= 1
##$NTH_PI= 0
##$NZP= 0
##$OFFSET= 14.38212
##$PC= 1
##$PHC0= -4220.085
##$PHC1= 13.79229
##$PH_mod= 1
##$PKNL= yes
##$PPARMOD= 0
##$PSCAL= 0
##$PSIGN= 0
##$REVERSE= no
##$SF= 200.129724274929
##$SI= 16384
##$SIGF1= 3
##$SIGF2= 2
##$SINO= 400
##$SIOLD= 16384
##$SREGLST= <1H.CDCl3>
##$SSB= 0
##$STSI= 0
##$STSR= 0
##$SW_p= 3205.1282051282
##$SYMM= 0
##$S_DEV= 0
##$TDeff= 0
##$TDoff= 0
##$TI= <>
##$TILT= no
##$TM1= 0
##$TM2= 0
##$TOPLEV= 0
##$USERP1= <user>
##$USERP2= <user>
##$USERP3= <user>
##$USERP4= <user>
##$USERP5= <user>
##$WDW= 1
##$XDIM= 8192
##$YMAX_p= 0
##$YMIN_p= 0
$$ End of Bruker specific parameters
$$ ---------------------------------
##NTUPLES= NMR FID
##VAR_NAME=  TIME,          FID/REAL,        FID/IMAG
##SYMBOL=    X,             R,               I
##VAR_TYPE=  INDEPENDENT,   DEPENDENT,       DEPENDENT
##VAR_FORM=  AFFN,          ASDF,            ASDF
##VAR_DIM=   8192,          8192,            8192
##UNITS=     SECONDS,       ARBITRARY UNITS, ARBITRARY UNITS
##FACTOR=    0.0002768,     1,               1
##FIRST=     0,             0,               0
##LAST=      2.2672688,     0,               0
##MIN=       0,             -345422,         0
##MAX=       2.2672688,     456208,          0
$$ Real data points
##PAGE= N=1
##DATA TABLE= (X++(R..R)), XYDATA
$$ [...]
1897BK43N26p48M2j86p1N6k11J42M99K0k60k58k64R1J34K00J65O23Q5m22j096
1919f88k71N94J032K08m53l28l58l39o1M63Q58L31r9j058n05M1L33P41L17n4m87
1940B17p24k05q3P50O35L71n09p62j67k95N32M27O1K80l63m68K69m94J85N24n0
1961A31R7N5m20LK45l86k37M45O27O6k60o15k82L36m3L06K80J87J9r08j22kL31
1984a47M19L41j58n93l18l48N08N15M01K83m07p16m69L53j53R16K10j79n57q1
2004a80k86K25K09J71J44L0l56m12O5K99K58m4o3J73k34q6j45NL81r1J47J74l37
2027D7k22nj65M69l17L43K41m20j75P1j62J41J50L21J83n08k73k38L8L70L87K21
2049D97j59o06k66QL61P02k08K3N8o34n24K38L75P40k36l53Q0m15m2L96k78L83
$$ plain form
1897 2 245 771 23 65 -121 -192 -136 -347 -205 294 314 54 -204 -468 -377 -243 -43 122 745 830 408 -688
1919 -688 -959 -365 667 875 422 94 -264 -603 -664 -201 657 988 889 -169 -674 -633 -300 441 758 704 217
1940 217 -507 -712 -795 -45 590 961 452 -310 -477 -772 -240 187 248 528 165 -303 -34 -528 -343 181 131
1961 131 228 283 -137 -134 111 -275 -512 -67 560 626 366 -249 -531 -195 -238 68 348 535 554 -354 -476 -478 -147
1984 -147 272 613 455 -138 -456 -804 -296 219 620 903 496 -220 -689 -336 -489 427 637 458 -99 -180
2004 -180 -466 -241 -32 139 283 313 -43 -455 -390 -91 167 123 60 233 -1 -87 -232 -227 154 63 210 384 47
2027 47 -175 -180 -345 124 -193 150 391 -29 -204 -133 -295 -154 -4 317 500 -8 -281 -519 -481 -111 276 497
2049 497 338 -268 -534 -526 -165 537 329 352 410 -224 -748 -510 -135 605 369 16 96 -319 -361 35 -243 140
2071A40M28Lo45j44l7L36J92k98p9oJ10l90j19M77J22K54j05J2j50R6m58L17J41
2094A97N8R0J40o93M89p75M51P3M44Q9m13k42l23J34qO70J13J55m44l19n13L34
2116b93O8P25L97m75k19m31n00N95M16K17j12p2q15j04M07K55J31j7J5j04m56
2137c72J1K23L09k99K95J88l21k34j21K14M6L71J61j71m35J15j83J32k99N10O9
2158B09K07Mn51J9j06J87L72q8j26l6m03k90J22N1Q21J17l99m58J5j50M44K61
2180B22J14L6k31k96m23Q2K01L92Ml8l7k46j17J49K15L46j04L6k92Kj73K0m0L71
2204A93J08k67pp9p1J51p8L81p3j47k41j94O5M43k39L4K09m5M2n51Q8l4K99K34
2228B21Kj39j40m75K66L8M05J54N0k9l71m08Q8M72K5L85m45j43j93n5k8K41M77
$$ plain form
2071 140 568 571 -74 -218 -255 81 273 -25 -104 -110 0 -390 -509 -32 90 344 239 251 101 197 -261 56 197
2094 197 255 345 485 -208 281 -494 -43 30 474 563 150 -92 -415 -281 -289 381 494 649 205 -114 -627 -293
2116 -293 -225 500 897 422 203 -228 -728 -133 283 500 388 316 -499 -603 -196 59 190 173 188 84 -372
2137 -372 -361 -138 171 -128 167 355 34 -200 -321 -107 -61 310 471 300 -135 -20 -203 -71 -370 140 209
2158 209 416 420 -131 -112 -218 -31 341 253 127 91 -312 -602 -480 -429 392 509 110 -348 -333 -483 -39 222
2180 222 336 372 141 -155 -578 -496 -295 97 101 63 26 -220 -337 -188 27 373 269 305 13 15 -158 -138 -178 193
2204 193 301 34 27 -52 -123 28 -50 331 258 111 -130 -324 -259 184 -55 -21 188 143 185 -366 -278 -312 -13 221
2228 221 223 84 -56 -531 -265 -227 178 332 382 353 -18 -426 -338 134 159 544 99 -44 -237 -292 -320 -79 398
2251C98n19M37j79m52n3Q4L86K54l36L0p3l04K66p4J29J96K1j02k89K65m38L71
2273A8J27l8K6m41L47j26j85J35N94n05l9K19l74r2J99K63l4K35l21J0p3m08L11
2296a52N58r2K89o82L49n57L33j58J91M22n65K11l48rj3J03M8O00m29m97K28R9
2318g1l18N28k67L66j32j79J02NL0k32M29j62N3m67MM72l36J74j44K71l1j95J08
2341HL3j58K23j07J20n0j5j24j22j92M03l4K67J01o04K62l62K62qL39pl45k07
2364c17N4K33J43j0j28J70q2k51mL26r4K38j47l26l2qj76K87m7M08k21j18l54
2387d56L08J60j77J89j95N11j86k71k25J86Q3J99K25j54m75k0K26P7L7j73K54
2408A23O4j92j90j67J95K7J50J0P6pj49m2p9K63M5M54n46M7m47J55n2N02P6j91
$$ plain form
2251 398 -121 316 137 -315 -368 -284 102 356 20 50 -23 -327 -61 -135 -6 190 211 109 -180 85 -353 18
2273 18 145 107 133 -308 39 -87 -272 -137 457 -48 -87 132 -242 -334 -135 128 94 329 8 18 -55 -463 -152
2296 -152 406 314 603 -79 270 -287 46 -112 79 501 -64 147 -201 -210 -223 -120 -72 528 99 -398 -170 -71
2318 -71 -389 139 -128 238 106 -73 29 34 64 -168 261 99 152 -315 -311 161 -175 -1 -145 126 95 -100 8
2341 8 41 -117 106 -1 119 69 54 -70 -192 -384 19 -15 252 353 -251 11 -351 -89 -97 242 235 -110 -317
2364 -317 -263 -30 113 103 -25 145 63 -188 -192 134 40 278 131 -195 -227 -235 -411 -124 -171 237 16 -102 -456
2387 -456 -148 12 -165 24 -171 340 154 -117 -342 -156 -73 126 351 197 -278 -298 -72 5 42 -131 123
2408 123 187 -5 -195 -362 -167 -140 10 20 96 89 -60 -102 -181 82 127 581 35 82 -365 -210 -262 240 316 125
2432A25J81l35k64J80O8m1K35r7j96J23q5j57L45k66K8J38J25k86K17j94O29k27
2454B46n8P7m4k05j54k03K54J08P0O1l42J52N4R0j38L42k88j29L3k06L20j75J96
2477F1K48J99l34j73p7k01L13N7J57K85l58o45N35k53N75l76K81j56k75j08k0
2498b65K29J53M3j25p6j15M04n66N69l75L18j25K38k62m35K6K29K94p4K50m42
2519a07j59J50J79k60J87M02l45J42p7l01P6m0K19j03J57J19l99L9K49j35j03
2540a10M3K48l19j1P8q2K10k48L97k33K33l17p9J72P8K66l48O5o9K05l54k20M72
2563G7J94n9m1l64J72j63O2K28J44J47j23k67j94J68n7RL67j20l10K05k69Jj58
2586c51L94M7J43j82l10J69k37N47j08K52k00j52j79j47M6R1J34K31J22l12j72
$$ plain form
2432 125 306 -29 -293 -113 -45 -86 149 52 -144 -21 -106 -263 82 -184 -156 -18 107 -179 38 -156 473 246
2454 246 188 265 221 16 -138 -341 -87 21 91 152 -190 -38 16 106 -32 310 22 -107 -74 -280 40 -135 61
2477 61 309 508 174 1 -76 -277 36 93 250 535 177 -468 67 -186 389 13 294 138 -137 -245 -265
2498 -265 -36 117 160 35 -41 -156 248 -318 251 -124 194 69 307 45 -390 -364 -135 159 85 335 -107
2519 -107 -266 -116 63 -197 -10 392 47 189 112 -189 -113 -153 66 -37 120 239 -160 -121 128 -7 -110
2540 -110 -67 181 -138 -149 -71 -153 57 -191 206 -27 206 -111 -190 -18 60 326 -22 43 -26 179 -175 -395 77
2563 77 271 212 171 -193 -21 -184 -122 106 250 397 274 7 -187 -19 -76 -67 300 180 -130 75 -194 -193 -351
2586 -351 43 90 233 51 -259 -90 -327 220 112 364 164 12 -167 -314 -268 -177 -43 188 310 -2 -174
2607a74J1L4l4J93J02J1j2l86J13K03J63k9j64o1k2j4k35L50QLK37l49l4q4J73
2632Ck26J15M39pl35l18J43P4P9K42J95l10j96p2L27k37j0J30Q6N5k34J72k37
2655a22m0j12M23j26p9J06N3l69M77k31L9K45l34J00p0j93L10M7J57l3l70J40
2677A8k20j10L92n0O2j27j82M01l78l00M51n7J19J27P6m11k65L21J6j6L24k38
2699d7r8p3r0K14L76k87Q8Q5M9k82L08q7q8J84k21L16l73R6p5L8K6J18n1M8O4
2724B38l36J67j51J34k1n4Q0j39r7l3K21lk1k4j96K22r9J34n73P17J22q8l10j2
2748a22J73j40k5l4K20r0J1k99N12k08K2l1J43r8J73l18r4K65nj96K13k29L82
2771B25j62l95M64n20L05n06m4j12M08M33O70j495P87J69q81J62l6K30L68k79
$$ plain form
2607 -174 -163 -129 -163 30 132 143 131 -255 -142 61 224 195 31 -30 -52 -66 -301 49 57 60 297 -52 -86 -170 3
2632 3 -223 -108 331 324 -11 -329 -186 -112 -33 209 404 94 -102 -174 153 -84 -94 36 122 177 -57 115 -122
2655 -122 -162 -274 149 23 -56 50 103 -266 211 -20 19 264 -70 30 -40 -233 77 124 281 248 -122 18
2677 18 -202 -312 80 30 92 -35 -217 184 -194 -494 -43 -100 19 146 222 -189 -454 -133 -117 -133 191 -47
2699 -47 -145 -218 -308 -94 282 -5 83 168 217 -65 243 156 68 252 31 347 -26 70 -5 33 59 177 126 174 238
2724 238 -98 69 -82 52 31 -23 57 -82 -179 -212 9 6 -15 -39 -235 -13 -112 22 -551 166 288 200 -110 -122
2748 -122 51 -89 -114 -148 72 -18 -7 -306 206 -2 20 -11 132 34 207 -111 -205 60 55 -141 72 -157 225
2771 225 63 -332 132 -388 -83 -589 -633 -745 -337 96 766 -729 58 227 -654 -492 -528 -298 70 -209
2791b09M58j436J629l70o27k23N49P45j297P68R9J9m48m66P44L68o04M12j873
2810a762J808n40r09J496m06J36j77K92nm93K77L08M17n58Q07j192M97j87l54
2829e45R34q77J54R52r66J6J87P3L07p78L11Q69n67o48L75J094p36p89J067n28
2849i5l38Q0m2N75Q9K9n31J99N3J34j44j65p1K04klQ8j98k2K83m4j9kR1k02o3
2875a16K07k30L33k4k25jj24L31l4R6R6m55J55K9p2j6J77j75K21k35K4k19L27
2898G0p8j65M14j64j97J86J7j41J98k52j2J98j80J29p8q5l3L55r3L2r4l6n5p5
2922a39p5K30m1J06q2q3j18pL42q6M8l36j30N72o07L00K05Q8k0j82q2K80j85j88
2946a90J35M33n53N9M14k57J21m08Q1M58j84l13J44k23L64j78L0L30k40j95n4
$$ plain form
2791 -209 249 -1187 442 72 -555 -778 -229 516 -781 -13 86 105 -343 -809 -65 303 -301 111 -1762
2810 -1762 46 -494 -1403 93 -313 -177 -354 -62 -67 -560 -283 25 442 -116 691 -501 -4 -191 -545
2829 -545 389 -488 -334 618 -348 -332 -145 -72 235 -543 -232 637 70 -578 -203 891 155 -634 433 -95
2849 -95 -433 -353 -395 180 269 298 -233 -34 19 153 9 -156 -227 -23 -25 -28 60 -138 -160 123 79 60 58 149 -53 -116
2875 -116 91 -139 194 170 -55 -56 -180 151 117 213 309 -146 9 38 -34 -50 127 -48 173 -62 -38 -257 70
2898 70 -8 -173 241 77 -120 66 83 -58 140 -112 -124 74 -106 23 -55 -140 -173 182 89 121 27 -9 -64 -139
2922 -139 -214 16 -25 81 -1 -84 -202 -209 133 47 95 -241 -371 201 -406 -106 99 187 167 -15 -97 183 -2 -190
2946 -190 -55 378 -175 -116 298 41 162 -246 -165 293 109 -204 -60 -283 81 -97 -67 263 23 -172 -226
2967b26L53R0k7j10k4K25j1k8j10Om21L67l8j29j63K22l0M1k2J58j55j32L42k99
2991a21o5L11M5k73K90k42j10j21K54K4j7J96l10J57l7N2o4J6k36K16J2j51M77
3014C03m94K04K5j13J56j78j24M27j52j05j51K37j24o4K21m33N55j17O8j41P4
3035G4j73j03K78j96n3J62K34j38k10K36m92N31l07J91J36k94PJ13NnK70m05L18
3058A79j05j84Q8J37j46k05L08q4o6P3j92K36O4k27k44L85j25l8K10k74O0O2J96
3081A08K0o6q7l0O4J40l88K70m2l19L72l5pM1K46j35l1j93L64k68p6p4O6kM11
3106C49k71k30K18q5l01L60j93J77r8j92L02M9k16J28O0OR0k22J89K46k67j05
3128fo2k64J97J16Q3j87N19m30j55M3L61l10j79L32K64r5l7j75n3K89l08R5j81
$$ plain form
2967 -226 127 217 190 80 56 281 270 242 132 138 -283 84 46 -83 -246 -24 -54 -13 -35 123 -32 -164 178 -121
2991 -121 -186 125 170 -103 187 -55 -165 -286 -32 -8 -25 171 -139 18 -19 33 -31 -15 -251 -35 -23 -174 303
3014 303 -191 13 38 -75 81 -97 -221 206 54 -51 -202 35 -89 -153 68 -365 190 73 141 0 74
3035 74 -99 -202 76 -120 -173 -11 223 85 -125 111 -381 150 -157 34 170 -124 -117 -4 1 -4 266 -139 179
3058 179 74 -110 -22 115 -31 -236 72 -12 -78 -5 -197 39 103 -124 -368 17 -108 -146 64 -210 -150 -88 108
3081 108 128 62 -25 -55 9 149 -239 31 -11 -330 42 7 0 41 287 152 121 -72 292 24 -52 -126 -60 -62 349
3106 349 78 -152 66 -19 -320 40 -153 24 -74 -266 36 85 -131 -3 57 63 153 -69 120 366 99 -6
3128 -6 -68 -332 -135 -19 64 -123 396 -34 -189 -146 215 -95 -274 58 322 227 190 15 -38 251 -57 38 -143
3151a43J21n0l6J97j37j6K78m9Q1m45M35k57J42l43K53K8p8J16k4P1l06J03j41
3174b00J59k8P2M0k1k05K80n5N9q1k8J32nj95L4J51k32M9n9O5j7J8L52j94j15
3199b4J67m29L39l0J3j3j38J45L9l40J78J29j88J97J31k10R3J11j31N5o4K06j36
3222A00j22J10k50K33j23R6K74k23rj9j44M4K54k63N2j25O2M4K37j67k55J78j39
3245a55q0J81K23j60j11J88k50j6J36j6J35n7J40j48J52j87M5n8o8K1K75k15J86
3268A61j61J9Q8j27kL3L2R3j19ll0l7J60r3R2j02r2O8l4k73L35J30n19N04o4L9
3294I8l32L4M2R4j05J64p4L0N1J42ql02O4K26l9j83J24k50K00j38L14k02Nk25
3318b70N37m73K40j6j50n1K71o0r5j20J07K6j18K75j35l4rK2o2j11K02m7l1K3
$$ plain form
3151 -143 -22 -72 -108 89 -48 -64 214 165 246 -199 236 -21 121 -222 31 59 -19 97 73 144 -162 -59 -200
3174 -200 -41 -69 3 43 22 -183 97 42 101 20 -8 124 119 -76 -42 109 -123 -74 -133 -68 -85 -67 285 91 -24
3199 -24 143 -286 53 23 36 23 -115 30 69 -271 -93 36 -152 45 176 -34 59 170 39 94 30 236 100
3222 100 -22 88 -162 71 -52 44 318 95 86 67 -77 -33 221 -42 10 -115 -53 -9 228 61 -194 -16 -155
3245 -155 -235 -54 169 9 -102 86 -164 -180 -44 -60 75 18 158 10 162 -25 20 -38 -106 -85 190 -25 161
3268 161 0 19 107 -20 -22 11 43 136 17 14 -16 -53 107 14 106 4 -88 -20 -54 -327 8 138 -381 123 59 98
3294 98 -234 -200 -158 -64 -169 -5 -79 -49 2 144 136 -166 -102 124 85 -98 26 -224 -24 -162 152 -50 -45 -270
3318 -270 267 -206 34 18 -132 -183 88 28 -67 -187 -80 -54 -172 103 -32 -66 -75 -53 -115 -226 -24 -71 -102 -79
3342g9L20j99j01Q5k90J35J66J27j32l1R1j31l9K39j16J70l29K71k61N3O3k50
3364b38J94K04j19k48J3N07l36j0kK22k58J32L6Rm20K28J01l9j24J58L4m6J10
3387A08l3k19K41j59J99j24j14P6k15J21j13j37O06k29L06j64m0j67L25l18K36
3408A86L9m91K19m5M01o26M45R9j38l31P0ll7L27k21L43j90r1J37J5r6L5R1k25
3432h7P2j85J12j67L61J54j34l92J57K32j54K85l59Q9j59J20k55L14K9J57k21
3453c1K26K82m97OJ94n74M09l50o14J470Q49j411j2j38J79K74K67J17o40K28k53
3474a9J54l67K42l08M09J90M60p27J02m53O50p87N19j39j10K39p7o22J318K63
3494I37o15j93R9k76K43j96Q6j41K38k29j72R8J35O3j71J29j38J15J15j59l3L14
$$ plain form
3342 -79 241 42 -59 26 -264 -129 37 164 32 1 92 -39 -78 161 45 215 -114 157 -104 -51 12 -238
3364 -238 -44 160 41 -207 -194 313 -23 -33 -35 187 -71 61 97 106 -314 -86 15 -24 -148 10 44 -2 108
3387 108 75 -144 97 -62 137 13 -101 -25 -240 -119 -232 -369 237 8 314 150 110 -57 268 -50 186
3408 186 225 -266 -47 -92 309 -317 128 227 89 -242 -172 -175 -212 115 -106 237 47 -44 93 108 12 47 138 -87
3432 -87 -15 -200 -88 -255 106 260 126 -266 -109 123 -31 254 -105 -16 -175 -55 -310 4 33 190 -31
3453 -31 195 477 -20 -14 180 -394 15 -335 -949 521 1370 -41 -53 -191 -12 262 529 646 6 234 -19
3474 -19 135 -232 10 -298 111 301 761 34 136 -317 333 -454 65 -74 -184 55 -22 -644 674 937
3494 937 322 129 228 -48 195 -1 85 -56 182 -47 -219 -121 14 77 -94 35 -103 12 127 -32 -65 249
3516B49kk32j3k68K27P5R1j01J69l96j35M1J25k3L89l36K95l06J72J43k55K95
3538B04k27k11Q7M2L7k7J30q9L16l09K50l41O1K3J67l59K85R1j27O7j29R5p1M27
3562C92j95m93K21J56j37J15k47O13m30N8j20j92L46J29k09N6L9J63j05k7l40
3583b07K30K15k88qk2O2l8L59k13j69J47J37k33J55k38J95R0j63M3J27j29j78
3605a26L7l3K31R1j0p1j39k0M3%j30Q9J55r2J8J96k96j12k48M48K71l57K82q8
3629A39j12r7J70j98J51j44P9K4k8j41K41r7K77k19n2k18L36q0K59k70Rm9J06
3652H6j85RJ77m8mj31P6j38n1J14L7J43J11p4j41j01k49J5L49R0J67k97J81l28
3676a92K41k30L07k32J27J1L23j57j18O3j97J61K45k41n8k45L02k09J38J63j57
$$ plain form
3516 249 247 15 2 -266 -39 36 127 26 195 -201 -336 -295 -170 -193 196 -140 155 -151 21 164 -91 204
3538 204 -23 -234 -147 -105 -68 -95 35 -54 262 -47 203 -138 -77 -54 113 -246 39 130 3 70 -59 36 -35 392
3562 392 197 -296 -75 81 -56 59 -188 425 -5 53 -67 -259 87 216 7 63 102 265 160 133 -207
3583 -207 23 238 -50 -58 -80 -18 -56 303 90 -79 68 205 -28 127 -111 84 174 11 54 181 52 -126
3605 -126 -89 -122 109 200 190 119 -20 -40 3 3 -127 -38 117 25 43 239 -57 -169 -417 31 302 -55 227 139
3629 139 27 -70 100 -98 53 -91 -12 12 -16 -157 84 -13 264 45 -7 -225 111 31 290 20 29 -20 86
3652 86 -99 -90 87 39 35 -96 -20 -158 -209 -95 -58 85 196 122 -19 -120 -369 -354 -5 85 252 -45 136 -192
3676 -192 49 -181 126 -106 21 32 355 198 80 143 -54 107 352 111 53 -192 110 -99 39 202 45
3697D5p2M4N6j39P3J75P9j08l54J7J33j38J56Q5l2J90j81l4j41M4j20K79j05j53
3721b01L22k65L05k42j62J29J10N2j59M4N3J75l17J05J0j94K40oj75J54o8L2l3
3744i1L19l24O2j92p7M02j91P4J86l34K84j71J48k23Q9K28j77Q4j81M5or5N01
3767C60n2l80J5j43r0J84Q8K98j07j65j30Q7j02j00NK00J01J41m24J28L55l60
3789i1P2J82n0p0j67J06K6k40L91o9l65K77j89K97o3j3j28M42k74q6n7L37k33
3812C5j37K97k08K6K25l48R1M6J6k5PM9j76jJ3K87n2k30K17r4O6o5j11J73k11
3837a10K37l31M48j82K33o52M27L64n53L42j46m61N03m91O2L97Q2l47K08l51K63
3858e8K31j96R3k0j82J23J07j68J8q9K27oJ01n23J66J69L8O5j85L18j21M1l53
$$ plain form
3697 45 -27 17 73 -66 7 182 261 153 -201 -184 -51 -189 -33 52 20 210 29 -5 -146 -102 -222 57 -48 -201
3721 -201 121 -144 161 -81 -243 -114 -4 48 -111 -67 -14 161 -156 -51 -41 -235 5 -1 -176 -22 -90 -58 -91
3744 -91 228 -96 -34 -226 -303 99 -92 -18 168 -166 118 -53 95 -128 -39 189 12 96 -85 -40 -46 -141 360
3767 360 308 -72 -57 -200 -290 -106 -18 280 173 8 -122 -35 -137 -237 -232 -32 69 210 -214 -86 269 -91
3789 -91 -19 163 113 43 -124 -18 8 -232 159 90 -275 2 -187 110 47 34 -94 348 74 -12 -69 268 35
3812 35 -102 195 -13 13 238 -110 -19 27 43 18 25 74 -102 -103 -90 197 145 -85 132 38 104 39 -72 101 -110
3837 -110 127 -204 244 62 295 -357 70 434 -119 223 77 -384 119 -372 -310 87 169 -178 30 -321 -58
3858 -58 173 -23 70 50 -132 -9 98 -70 -52 -141 86 80 181 -342 -176 -7 31 96 -89 229 108 149 -204
3881b04J40J57k42J87rL9j20l67M92k48J88q0m8K83k31J90l01j1J50J52K1j19
3903A9r9J74n1j92M45l71L32q6k61j34K62r6j6K46l45Q4J07K32j02L31m05j97
3925a23Q0P3k45N7K25k45K03J61j06Nj12q7J34o8n1K66j35pK20k71j55j6K95J11
3949B09m85O4K89l44K23M3K48l43Qj18O4J01r5J42j85L68j31k19l7m5L15R2m0
3972A24l82J69L10n8j2k05p9K56K8L33j30K2o0l48K37K37L36l52o95J6P79j49
3994C77m04l78N32k66p5M91J86n50l1J55L20j44l87K04M65p9j04N6j126q2J037
4015A97K19k3j94P05q50q3r5J177j387P45r1m11P71n16j084P27M16J04j13k26
4035a2q0l23M95q11J106n87J035m23p86j65N82j85M68p49N49k92M85J60J75m42
$$ plain form
3881 -204 -64 93 -149 38 29 68 -52 -419 73 -175 13 -67 -115 168 -63 127 -174 -185 -35 117 138 19
3903 19 -80 94 43 -149 296 -75 257 171 -90 -224 38 -58 -74 172 -173 -89 18 250 148 479 74 -123
3925 -123 -43 30 -215 -158 67 -178 25 186 80 85 -27 -114 20 -48 -99 167 32 25 245 -26 -181 -197 98 209
3949 209 -276 -212 77 -267 -44 -1 247 -96 -88 -206 -142 -41 -136 6 -179 189 58 -161 -198 -243 72 164 124
3972 124 -258 -89 221 163 151 -54 -133 123 151 484 354 376 316 -32 205 442 778 426 -269 -253 526 377
3994 377 -27 -405 127 -139 -214 277 463 -87 -118 37 357 213 -174 30 495 416 312 368 -758 -840 197
4015 197 416 393 199 904 54 -29 -124 1053 -334 411 320 -91 680 164 -920 -193 223 327 214 -12
4035 -12 -92 -415 80 -731 375 -212 823 400 -386 -551 31 -154 314 -435 114 -178 307 467 642 200
4055B00j146J142r1L57j7o37j75K16K62M8j95n4K65n36J87K62J53k38n8P6k53
4076b32K06M0k59M76j23l7k56J86N2j95K46J22j73J37k63J38j90R0J62j18J00
4097A09k26R3k3jJ44K40k94K51j14k86J36m7k18K68O5J00L2k53j51L31m7n0k08
4120a49J30n9j68R6J45q4K01k05J45K4j56p8J56K0k89K06P5J7j60K08j50l6K37
4143A26k97%M6L4J18J8j10j95M30r5j10l4j4K06J21o6m0k11kJ76l8j56KK78j68
4168A9k8j6j64M91k69oK45J0l88J55L6m37K79J35j36J36j12K34k10K60J44l61
4190A7K18M5m28J09q7J08O1q3R7k09K12j62k8K77P8k80K23m55K84j44K07J40k77
4213g7M8L8L53l29j99Q5o9K55k27J50Q5o7q6K06l74J61J41r6J88l5k91K99k80
$$ plain form
4055 200 -946 196 105 462 445 -192 -367 -151 111 159 -36 -90 175 -361 -174 88 241 3 -55 21 -232
4076 -232 -26 14 -245 231 108 71 -185 1 53 -142 104 226 53 190 -73 65 -125 -35 127 9 109
4097 109 -117 -24 -47 -48 96 336 42 293 179 -107 29 -18 -236 32 97 197 229 -24 -175 156 109 59 -149
4120 -149 -19 -78 -246 -150 -5 -89 112 -93 52 76 -80 -158 -2 18 -271 -65 10 27 -133 75 -75 -111 126
4143 126 -171 -171 -125 -91 27 45 -65 -260 170 75 -35 -69 -83 123 244 178 138 -73 -75 101 63 -93 -91 187 19
4168 19 -9 -25 -189 302 33 27 272 282 -106 49 85 -352 -73 62 -74 62 -50 184 -26 234 378 17
4190 17 235 280 -148 -39 -126 -18 43 -40 57 -152 60 -102 -130 147 225 -55 168 -287 -3 -147 60 200 -77
4213 -77 -29 9 362 33 -166 -81 -150 105 -122 28 113 46 -40 166 -208 -47 94 -2 186 151 -140 159 -121
4236a21Q4K01k22j3j09K44q8L4l5O5M1j33j64p9K27L91J32l25k76J62J07j92J93
4259A24j69p7K31l22L50j92j38M36o2j71j95k3L56K6q6j16J49J39l36l1J94j39
4281e2M41m64J74Q7k50M3j27K32J26j98m1K50m42P1J36J19j43m8R5p1J7N5j13
4304a03N1Q7j37r4K42j55K07m23K70O5q5M08k86o1jlN6O7k9J66k6j71j67J54l76
4329c44M92K4J8o5j96K5%K35j5j67j03O6l1j60J11K54k16q5J26K45j4k47Q7J9
4353E9J6q9M3J5O8n2n8L07j45m6j67l4J08p3l3Q3k92L14n1K91k28k20j08J58J53
4378A9o6K62l17J87k07kQ3j15J21N8j17j4J12n0R4k6j73J62L9j89K80q3k35j2
4402a89J66j54L8Q1J42j33L49k46J70l86J36K00l18J24O2J8J5j72Pj9M1lN4J15
$$ plain form
4236 -121 -37 164 -58 -71 -180 64 -24 10 -25 40 81 -52 -216 -295 -68 323 455 130 -146 16 123 -69 124
4259 124 -45 -122 109 -213 137 -55 -193 243 181 10 -185 -208 148 174 88 -28 121 260 -76 -107 87 -52
4281 -52 389 -75 99 186 -64 -21 -148 84 210 12 -29 221 -221 -150 -14 105 -38 -86 9 -62 -45 10 -103
4304 -103 -52 35 -102 -196 46 -109 98 -325 -55 10 -75 333 47 -14 -15 -18 38 105 76 242 216 45 -122 32 -344
4329 -344 148 172 190 125 -71 -46 -46 189 174 7 -96 -30 -61 -221 -110 144 -72 -157 -31 214 200 -47 40 59
4353 59 75 -14 29 44 112 60 2 309 164 118 -49 -83 25 -48 -81 2 -290 24 -27 264 36 -184 -292 -134 19
4378 19 -47 215 -102 85 -122 -124 -41 -156 -35 23 -94 -108 4 -46 48 22 -151 11 50 -139 141 58 -177 -189
4402 -189 -23 -177 -139 -58 84 -49 300 54 224 -162 -26 174 -144 -20 42 60 75 -97 -90 -109 -68 -71 -17 98
4426I8k28K9M0n2J87j98j58K15q0K66k38j24k61O64j25J00k04O8j68K24J86k22
4448A9N8N9k57K21l39L29k93j24K86m7O4J75j79r4l6L57j2m00O7R7N1K5P4k89
4472a88K6L70m93J91J82N7j76Q5K60m60L92k70L13r5R2j04l48J08L24k79l49M03
4494D1n9q5K06M6k59J76j45J14M1J13k81N2q3J99j44K10k5m26l8M41l46J73K51
4517A72k44K95l03j21L21l65K77J68J64l15j15J80j74k12J34K68ok10K28k21O8
4538a1j60K13n5J71j84K46j14l00k7J98k10M57k32J10j54j31K66j50jn1K64l31
4560a86l9L33k88K59k30M50j82K04j14l81K23P6K31m77l4j20K05j30M12j92k07
4581a87J24k02J33O4L5J36j09k33J11p9K75j24J41j35J23R4m1n7q1j11P7J34j68
$$ plain form
4426 98 -130 -101 -61 -113 74 -124 -282 -67 -147 119 -119 -243 -504 160 35 135 -69 -1 -169 55 241 19
4448 19 77 136 -121 100 -239 90 -203 -327 -41 -88 -24 151 -28 -122 -158 199 187 -213 -146 -49 2 27 101 -188
4472 -188 -162 208 -285 -94 88 145 -31 54 314 -146 246 -24 289 194 286 182 -166 -58 266 -13 -362 41
4494 41 -18 -103 103 149 -110 66 -79 35 76 189 -92 -40 -123 76 -68 142 117 -309 -347 94 -252 -79 172
4517 172 -72 223 -80 -201 120 -245 32 200 364 49 -66 114 -60 -272 -138 130 124 -86 142 -79 -11
4538 -11 -171 42 -13 158 -26 220 106 -194 -221 -23 -233 224 -8 102 -52 -183 83 -67 -68 -119 145 -186
4560 -186 -225 108 -180 79 -151 299 117 321 207 -174 49 125 356 -121 -155 -275 -70 -200 212 20 -187
4581 -187 -63 -265 -132 -68 -33 103 -6 -239 -128 -207 68 -56 85 -50 73 167 126 69 -12 -123 -46 88 -80
4604h0J45K7j32j83J01j0K41j97K24J2k29R2j16n4J22P0J53p9k26J75j37R7O0
4627G6p8j56K70R3m18J14O4PL20m24J89j27j60J66J0N3J62O5j41r4j16j54L29
4650E0j74J29K35k99J72j07O1j62J99j65J48J65k40j74lK03Q3k54M14p8k48j66
4672b11N1J98O5k08O6J5l37L89qJ16q0P4l35M4lm3K45J95r3j19M8k28J92K42l77
4697a02L49l97J06n5N9N1l13L05qk10j5K49j01K01j59K1O9j85K42k12J80k8JL97
4721D45o87N83j78r8j04j94K86N6k48P1N0j16K07k0l0K26l31L9J04k56K49m7j78
4744a71L53j25j82J44J97j76K25pq0k09L8j4L0J38k02L29k49j89Q4J10J90l19
4766h5J33n9j1J82j41q6J61l46KJ92J1Qj44L25j98qJ27k63L89k34R5k38J74J9
$$ plain form
4604 -80 65 92 -40 -223 -122 -132 109 -88 136 148 -81 11 -105 -159 -37 33 186 107 -119 56 -81 16 76
4627 76 -2 -158 112 205 -213 -99 -35 -28 292 -132 57 -70 -230 -64 -54 -1 161 226 85 -9 -125 -279 50
4650 50 -124 5 240 -59 113 6 67 -95 104 -61 87 252 12 -162 -165 38 121 -133 281 203 -45 -211
4672 -211 -160 38 103 -105 -39 -24 -361 28 20 136 56 130 -205 -161 -164 -207 38 233 140 21 69 -159 33 275 -102
4697 -102 247 -150 -44 -99 -40 11 -302 3 -5 -215 -230 19 -82 119 -40 -19 50 -135 107 -105 75 47 48 445
4721 445 -242 341 163 65 -39 -233 53 109 -139 -68 -18 -134 73 53 23 249 -82 -43 61 -195 54 7 -171
4744 -171 182 57 -125 19 216 40 265 258 178 -31 7 -7 23 161 -41 288 39 -150 -66 44 234 -85
4766 -85 48 -11 -22 160 19 -67 94 -252 -250 -58 -47 -39 -183 142 -56 -64 63 -200 189 -45 50 -188 -14 5
4790Ek75K87N3j1j7j79j02J26K06j82O4j62K42j62K26k09Q6p1J1J06M8p7j73L3
4814a27J02N0J14q5K62l40k31N09k29o0J14q1r8n5P0p2L41k14J75l41J89r3o8
4837a68K53L8r2k94K64J1N2j54O4p9L73m37M3L05k84R1LJ2K27j65j55l5P1M1J61
4862A46j16j7J34j80j24J5M68k27J39p4n8j66m4K15m8jk01J28q6j77K99N5m3O9
4886A06kj19p4k3K45j23M6j94P7j27J90j7j22K36O9j46k2P4Nk19q4M00k75K41
4910A42J01Q9l50j16J88j75M22J30k70k14j61J55J51j6R3J3J31l59K58k37k7q1
4932a33K96j7r5o0M3P7o3o8J31n2o0L19l34R4k53M38m10L02k12K17j87J27k68
4955a68J41J9K88j41k84K84n0j26K1K3J20l87L96l51RJ29J48j79M25q0k81j4j19
$$ plain form
4790 5 -270 17 70 59 42 -137 -239 -113 93 -89 -25 -187 55 -107 119 -90 -4 -75 -64 42 90 13 -160 -127
4814 -127 -25 25 139 54 316 -24 -255 254 25 -35 79 -2 -100 -155 -85 -157 184 -30 145 -196 -7 -100 -168
4837 -168 85 123 31 -263 1 12 64 -90 -26 -105 268 -169 -126 179 -105 -14 -11 1 228 63 -92 -127 -56 -15 146
4862 146 30 13 147 -33 -157 -142 326 99 238 164 106 -60 -104 111 63 62 -139 -11 -97 -274 25 80 37 106
4886 106 104 -15 -89 -112 133 10 56 -138 -61 -188 2 -15 -137 99 168 22 0 74 79 -140 -224 176 -99 142
4910 142 243 332 -18 -134 54 -121 301 431 161 -53 -214 -59 92 76 169 182 313 -46 212 -25 -52 -133
4932 -133 163 146 51 -9 34 111 48 -20 111 59 -1 318 -16 78 -175 263 -147 155 -57 160 -27 100 -168
4955 -168 -27 -8 280 139 -145 139 89 -37 -16 7 127 -260 136 -215 -206 -77 71 -108 317 237 -44 -58 -177
4978a77J17k9M46k47j12n1j34J01o7J98q2P7p3p6jJ60N9o4l7J83j08k92J63J68
5002A22k2j15N5J95k31L00l5k76j63J65M9j80P3n9K21j31J75m2r1o0o4k3J62R9
5026A24j19k7K12k54M5J17j47J84j47q4L37q6l10J42J6J62J7k02J10k46J48k60
5048b68L82K3q3k5l8mJ14m77L65M48m11J0r2j2j95L0K88Q0k25N6l6mK42j98j04
5073a34J31pj14K64k27j35J84J11K60k62n0J92m03J76j75K99K0j97q0J41J36k69
5095a39K24R9j69J94p5k81J68l53K98J6K20p7m08N7J22K51r5k67L25J10R3k65
5117D8k14K08j71M88l30J05k33P8k19O8J43K70j75r5K32o4m2j51n7j09K18J28
5139A26r7j84j09J40j47J86P0j00K08l48N3k6J45M7P5l4n1o1N5R2J66j33m5J78
$$ plain form
4978 -177 -60 -89 357 110 -2 -53 -187 -86 -153 45 -37 40 -33 -109 -110 50 109 45 8 191 83 -209 -46 122
5002 122 100 -15 40 235 4 304 269 -7 -170 -5 44 -136 -63 -122 99 -32 143 101 10 -50 -114 -137 25 124
5026 124 5 -22 190 -64 -19 98 -49 135 -12 -96 241 155 -155 -13 3 165 182 -20 90 -156 -8 -268
5048 -268 114 137 54 29 -9 -13 101 -376 -11 437 26 36 -56 -68 -263 -233 55 135 -90 -34 -70 -74 168 -30 -134
5073 -134 -3 -10 -124 140 -87 -222 -38 73 333 71 21 213 -190 -14 -189 110 130 -67 -147 -6 130 -139
5095 -139 85 184 15 209 134 -147 21 -332 -34 -18 202 125 -283 -226 -104 147 52 -215 110 220 313 48
5117 48 -166 42 -129 359 29 134 -99 -21 -240 -172 -29 241 66 -29 203 139 97 -54 -111 -220 -2 126
5139 126 29 -155 -264 -124 -271 -85 -15 -115 93 -255 -202 -228 -83 -36 39 5 -46 -107 -52 40 206 73 28 206
5163B06p7k44K32n3j64K92l21J13N1N2J1m9K93k16p6rk49K38N8j29p1l6K78r0
5187D0j59M3o4J45K02k59J14K77q5k22p5L4q7K33m97K73K38%l17K03j20N0J8L3
5211A8O3l87M19p7J04j25J3M4J4j40K33k21K78k79J44k64K33r7p3J65n3rj47J29
5235a5m4l1K44j06j49K7J08j11O4k65K96J27j62k0R9p3K53n99L75q6J42j49rk44
5259c28N3K63K15k37j21L55j75J26k6K1k08n1j6L84l70nJ85n0K52k45J7J42l84
5282b03K21q2R6L2j24J14J84m78J58K36j70j21J15Q0l99K21J15J34Pq8j90J85
5304D3k92R6P4P5n8L7L04k87O2j7J08r5pN4j6m6l97J46R7K27J8LNR4L3n83M09
5331H7k04K82k5k6l93M35l40Q5J41j74L5J21m4o8j49L39K10j74j86j10L37k67
$$ plain form
5163 206 129 -115 117 64 -100 192 -129 -16 35 87 98 49 342 126 50 41 -208 30 88 -41 -112 -148 130 40
5187 40 -119 -76 -140 5 207 -52 62 339 254 32 -43 -9 -96 137 -360 -87 151 151 -166 37 -83 -33 -15 18
5211 18 81 -306 113 36 140 15 28 72 86 -54 179 -42 236 -43 101 -163 70 -27 -100 65 12 3 -144 -15
5235 -15 -59 -90 154 48 -101 -74 34 -77 -13 -278 18 145 -17 -37 62 -11 242 -357 18 -68 74 -75 -84 -328
5259 -328 -275 -12 203 -34 -155 200 25 151 125 146 -62 -113 -129 255 -115 -120 65 15 267 22 39 181 -203
5282 -203 18 -64 32 64 -60 54 238 -240 -82 154 -16 -137 -22 58 -341 -120 -5 129 136 48 -142 43
5304 43 -249 -153 -79 -4 -62 -25 279 -8 54 37 145 50 43 97 81 35 -362 -216 -119 108 126 129 134 228 261 -322 87
5331 87 -117 165 140 114 -279 156 -184 -99 42 -132 -97 24 -20 -88 -237 102 312 138 -48 -158 179 -88
5353h8L03j53J14l38J15K46l74M7m2J42l0P6K6l6k58N45l70N7J80nk77K04j17
5376c3J41R6q8l4J4L8n5j29R7J57j86j47L5J30j91K11K8r1m9j70J79L2k4j59L2
5401a66K34j28J64j6j25O8N8k35J7J07K1p6Q0k2J92rJ37l15o5J29J67l23J90o5
5425A9j55ml8j22L76l2j50L42Lm95J82J56k07K85l04o0NM29m55P0N7M4K94l19
5449g9j39L40j70P2N8j45ln3J29OR4n1Kk67L56Nk04J91j69L3k13Mm7L50jj57r1
5476a49J98j99K48j83kJ82J03k23J4qK28l64J41%j39K48k26M37n9k64J08N1j19
5499B3Q1m4K82n11q4J87J13O6K4n01L81M5k73L03p5m5J21k08j5J94k7r1N5j49
5523a48J4j41K87J7J01K4j72J35k28J47oJ76k88J64k46K57J14j36j33K58k83K68
$$ plain form
5353 -88 215 62 176 -162 -47 199 -175 -128 -170 -28 -58 18 44 8 -250 295 -75 -18 162 157 -120 84 -33
5376 -33 108 204 116 82 96 134 79 -50 47 204 18 -129 -94 36 -155 56 84 -7 -56 -226 -47 -15 -39 -198 -166
5401 -166 68 -60 104 88 -37 31 89 -146 -129 -22 -1 -77 3 -19 173 164 301 -14 -79 50 217 -106 84 19
5425 19 -136 -140 -178 -300 76 44 -106 236 239 -256 -74 82 -125 160 -144 -204 -199 230 -225 -155 -98 -54 240 -79
5449 -79 -218 122 -48 24 82 -63 -66 -119 10 16 110 59 61 -206 150 155 -49 142 -27 6 -207 -203 -250 100 99 -58 -149
5476 -149 49 -150 98 -85 -87 95 198 -25 -11 -19 209 -155 -14 -14 -153 95 -131 306 247 -17 91 142 23
5499 23 104 60 342 -169 -253 -66 47 113 137 -364 17 62 -211 92 17 -28 93 -115 -130 64 37 -54 1 -148
5523 -148 -134 -275 12 29 130 154 -18 117 -111 36 30 206 -82 82 -164 93 207 71 -62 196 -87 181
5545A81l91K90k0k46L0J98Q0j50k50L79j87N6m4K56N6k95O6k33J50O3l66M78L4
5568A35l1j25j25J84j57p1M76m36M02k19j1k62L44l37L5K07Kj5j80K8L13l05L7
5591a11J97Rl42N1L24l09O26m57P2j58J62k43K3J84L7q6J12j75m5K41l0o9p3Q6
5615B6K57k17K0l63l3K23K30J37p4l46J53j9L9j33L67j89j25J25O3l95K02J8o7
5638a01J38jK85k14j43j39K05J49k22Q4%m21L71K19j25m2mj25M6j67K60P6p8j54
5662a03Q7J91l65O6j7Q5N6L7K30l97J75r8L2Mj03Q7k35L27j08K1J65N9n8Lk64
5687a23L22q4k47R5K6J17JM4j36j82l2j58N38J6j19j12k94L70K90o73O29l65n9
5710a36L71n98J90K55k19L20l23J23J79k11q8K93k87K14l2N3n9r4JJ16j0J17J2
$$ plain form
5545 181 -210 80 60 -186 -156 42 122 -28 -278 101 -86 -30 -74 182 238 -57 9 -224 -74 -11 -377 101 135
5568 135 104 -21 -146 38 -119 -190 286 -150 252 33 22 -240 104 -233 -198 9 11 -4 -184 -156 157 -148 -111
5591 -111 86 95 -247 -196 128 -181 445 -12 60 -98 64 -179 -156 28 65 -21 91 -84 -129 112 82 13 -60 26
5615 26 283 66 86 -277 -310 -87 143 280 206 -140 13 -6 33 -100 267 78 -47 78 141 -254 -52 -34 -101
5638 -101 37 36 321 107 -36 -175 30 179 -43 41 41 -380 -9 210 85 43 39 -86 -40 -207 53 129 51 -103
5662 -103 -16 175 -190 -124 -141 -56 0 37 267 -130 45 -53 -21 -17 -120 -33 -268 59 -49 -28 137 196 138 141 -123
5687 -123 199 115 -132 -37 -11 106 107 151 15 -167 -199 -357 181 197 78 -34 -328 42 332 -341 288 -77 -136
5710 -136 235 -363 -173 82 -137 183 -140 -17 162 -49 -137 156 -131 83 51 104 45 -49 -48 68 58 175 187
5733A87k18k95J93K82J9j86J23m18M65n07O81k74k3L1j24K53m61L34n9j68K51
5754H6l5Q7k84K62k22L58m93M25q6k62M50n27K72J97k48J42N3k19J8P6J71n69
5776c48M26l1q5k9L82n45K57k17K69k06K77q7K9l97M88k62P0K6n8K09l67k44M51
5799HJ89l92J42K29j37o1M8j13J9j4l4R5O1n3j02J97j80J75o6l16L24k54J78j18
5823a75J2K56k4r8J8O7k83N30j80J44j25k38j82J94K6l8J02L02k44p3M4p3p8k31
5847c47O22k01j38O7K0j88J00J03O5k37N6J75j92k46L53Q1qL5j13n3k21K59oJ32
5871A18J4P4m3q7m6J7J47J00l27J27kj31Q1P0o9m62L65K72j61M59m21k76L17k70
5895a34K09L9j45j24J88k61j6J50O6J96l38K1M6pl6K17J49j61N8j82l9Q9k03L85
$$ plain form
5733 187 -31 -326 -133 149 168 -18 105 -313 152 -355 326 52 29 60 -64 189 -272 62 3 -165 86
5754 86 51 138 -146 116 -106 252 -241 184 98 -164 286 -241 31 228 -20 122 175 -44 -26 50 221 -348
5776 -348 78 47 -38 -67 315 -230 27 -190 79 -127 150 63 92 -305 183 -79 -9 17 -41 168 -199 -443 8
5799 8 197 -195 -53 176 39 -22 26 -87 -68 -82 -116 -21 40 -13 -115 82 -98 77 11 -305 19 -235 -57 -175
5823 -175 -163 93 69 -29 -11 56 -227 303 123 267 142 -96 -278 -84 -58 -96 6 308 64 -9 35 -38 -116 -347
5847 -347 275 74 -64 3 23 -165 -65 38 103 -134 -78 97 -95 -341 12 93 85 120 7 -46 -267 -8 -14 118
5871 118 132 206 163 76 30 47 194 294 -33 94 92 -39 42 112 43 -419 -54 218 57 516 95 -181 136 -134
5895 -134 75 114 -31 -155 33 -228 -244 -94 -28 168 -170 -149 -103 -110 -146 71 220 59 117 -65 -104 -15 -218 167
5919A67k22R5l2J96j27q5q6J69J97O7m63P9M6J49n6LLj02M2K08l22K39k02O4n
5944B2op6J92q3m36M6J66N17k99k26K24j00J56l83M7L68q0J07n5j27l40M11k02
5967a57K17R2k92j74n4L27n2J97k1K67k23l84j39M47J00j61j75J87M4o3j10L02
5989A75m7l49K97r0m4o7J28J43r9M5O2j93J41o4J54l01O4J54n8Q6M8j3k92N8Q0
6014A8j96L06j05k94L55j84K38q3O7k76Q3J47k68K21k61M4J28r9O6Q8k3l0J3J09
6038F4l50Q6K53j04q6J67J0o9K21j15m2Q9l44L10k15O5mJ19j19K0K09k22J16J01
6062A60j18k53J04J71j5n8N0j66K09j17j69K40k86M73P1k66N2j62j56j17K25K15
6084H7j00J00l0K41n71K79J74k67P8J3K95l60J25n5J9Nj07J37j08r0J51j50K73
$$ plain form
5919 167 -55 40 8 204 77 -8 -94 75 272 339 -124 -45 1 150 94 97 100 -2 40 248 -74 165 -37 27 22
5944 22 16 -60 132 49 -387 -341 -175 342 43 -183 41 -59 97 -286 -239 129 49 156 101 -26 -366 45 -157
5967 -157 60 152 -140 -314 -368 -41 -93 104 83 350 127 -257 -396 51 151 -10 -185 2 46 -17 -127 175
5989 175 128 -221 76 -14 -58 -125 3 146 47 92 154 -39 102 38 192 -109 -45 109 51 137 185 172 -120 -62 18
6014 18 -178 128 23 -271 84 -100 138 55 122 -154 -71 76 -192 29 -232 -188 -60 -159 -93 -5 -28 -58 -45 64
6038 64 -286 -200 53 -51 -137 30 40 -29 192 77 35 124 -220 90 -125 -60 -64 55 -64 -44 165 -57 59 160
6062 160 42 -211 -107 64 49 -9 41 -125 84 -33 -202 38 -248 225 296 30 82 -80 -236 -353 -128 87
6084 87 -13 87 57 298 -273 6 180 -87 -9 4 299 -61 64 9 28 33 -74 63 -45 -135 16 -134 139
6107A39J85l00m7K24O5k66p8p1K02Q0p5l1K05l50L5L12j82j25J72j00l64L29m5
6130h6J43M4j80l07O79n8m03K77k64NJ69j73K64oj20J29j64K56k8l71m7J20K86
6153A65k11k66K30J90j39j09O3JK60j09N5j92k07J43oJ2n0rM09m15K16N0J93j28
6177A46j44J27l2o9Kk81K80k78J49J66j18J89m2K9l15L01j49R1j01k2Q4Q2k70
6200a75K00O4k93L17j27J00o5r3O5m2J69Ql47K73k96L04J3k0k07L61j73j65J49
6223B0j44K1L15r7j77k34L66k85K68pk01J99j44K2j79M09j14O3j66q3K82k33P1
6246b8LP9l12o2K55J8k1K0L47l23j99J86n9J38j44l5L73m3m86J16M7J59j03K8
6270d6l2J41n8L2M8k30L33l50K02q9J70k67K4O7j12J05J43M6l62J67K39j98N4
$$ plain form
6107 139 324 24 -23 201 266 0 -78 -149 53 133 58 27 232 -118 -83 229 47 -78 94 -6 -370 -41 -86
6130 -86 57 101 -79 -386 293 235 -168 109 -155 -150 19 -154 110 104 -16 113 -51 205 177 -194 -241 -121 165
6153 165 -46 -312 -82 108 -31 -140 -77 -76 184 75 130 -62 -269 -126 -132 -120 -170 -179 230 -185 31 81 274 146
6177 146 2 129 97 28 30 -251 29 -249 -100 66 -52 137 95 124 -191 110 -39 52 -49 -71 13 95 -175
6200 -175 25 89 -204 113 -14 86 21 -72 -7 -49 120 128 -219 54 -242 62 75 55 -152 209 36 -129 20
6223 20 -124 -103 212 115 -62 -296 70 -215 53 46 -155 44 -100 -78 -257 152 38 101 -65 -148 134 -99 -28
6246 -28 -25 54 -258 -320 -65 -47 -68 -48 299 -24 -223 -37 -96 42 -102 -137 236 193 -293 -177 -130 29 -74 -46
6270 -46 -78 63 5 37 85 -145 188 -162 40 -49 121 -146 -122 -55 -167 -62 81 127 -235 -68 171 -27 27
6293B7L54j61k05j33L6pK71m14M65j3l89J76MJ68n2k10M30m88J66j89P4J02o8
6316e6k08J77J92l53J77K45n3j74K05k0oj34J02N5k33J97p0k95J99jn1K22q3P6
6340A10k58J81m5j66j18M5J47Q5n0J10j02L38k78J23k42j68L39k16J88r7LL2j7
6363e6l2K97P1j65k48J51N8m9J25p9j01K45k03P5J29k50K6J63j37M9N4k31J20
6386A2j53J2K95n0l17Q7Q3j92Q6J42l90L26K31n9j43J76j97QM2q7K58j73P4o5
6410Fo8pr9%L7P5L1Lj76K73J0j37K10j7j90J56J18k96k08M19k62J66OM4j20O1
6436C5L8m0j73O7kj96N45l56K43j38J61j64j60L08r6j92Rq2L86k29J84j17o8n6
6460i3J43M0j40j39L23m98L08R3j65JO4O0p2P1M5j7p7P6M14o20K73l51K83j89
$$ plain form
6293 27 381 220 15 -118 -82 -89 182 -232 233 220 -169 7 11 179 127 -83 347 -141 25 -164 -90 12 -56
6316 -56 -264 -87 105 -248 -71 174 121 -53 152 132 126 -8 94 149 -84 113 43 -252 -53 -54 -105 117 34 110
6340 110 -148 33 -12 -178 -296 -251 -104 -19 -69 41 -61 277 -1 122 -120 -288 51 -165 23 -74 -71 -39 -56
6363 -56 -88 209 280 115 -133 18 76 27 152 73 -28 217 14 89 218 -32 -6 157 20 69 123 -108 12
6386 12 -141 -129 166 116 -201 -114 -31 -223 -137 5 -385 -59 172 113 -30 146 -51 -43 -1 -88 170 -3 71 6
6410 6 -62 -69 -168 -168 -131 -56 -25 -22 -198 75 85 -52 158 141 -49 107 225 -71 -279 140 -122 44 50 94 -26 35
6436 35 73 33 -140 -73 -75 -271 274 -82 161 23 184 20 -140 168 72 -120 -111 -193 193 -36 148 31 -37 -93
6460 -93 50 90 -50 -189 134 -364 -56 37 -128 -127 -63 -3 -75 -4 41 24 -53 23 437 -183 90 -261 22 -167
6484a67j29K48k57L61j84P1K28k21J13j8J14J98l40P7l31M45K5l51J42j3m0N9
6506C0L0j9J89k32J23L1k18l7n4O9M2P7j18M7k6J46R8l82M76m21R7J71R3l08L40
6531B44l07K03L0j72oL0J56k93L09k49L1J65l37K55J89j52l37M14k24J00j04L27
6553B72l31j02M03k30O3l37J8M02k00L8m0m2K25k60K28l39K10n3j38L32L4j14
6575C9J53l02K01q3m1J21j57J86l05L40j61k62M31m2kk0p6J73l27n3J50J1j9m5
6599i0J40j7Jj68K79N7j88j54J72k37J02R0j99J05J50k26K0J66R8o0k84K94k91
6622b40j6L93j91N4J53k34J58J00j42j55p1L84j16l33K8K17n0j06K68O9k45L8
6644c7j16J82p1J73l41K65j67k52K75j9L12j74L7l76N07k89Q0J71l10K81L0k39
$$ plain form
6484 -167 -296 -48 -305 56 -128 -57 171 -50 63 45 159 357 17 94 -237 208 233 -118 24 11 -29 30
6506 30 60 41 230 -2 121 152 -66 -103 -157 -88 -46 31 -87 -40 -66 80 178 -204 272 -149 -52 119 212 -96 244
6531 244 -63 140 170 -2 -8 22 178 -115 194 -55 -24 141 -196 59 248 96 -241 173 -51 49 -55 272
6553 272 -59 -161 242 12 75 -262 -244 158 -42 -4 -44 -86 139 -121 107 -232 -22 -75 -213 119 153 39
6575 39 192 -110 91 8 -33 88 -69 117 -188 152 -9 -271 160 118 116 96 20 193 -134 -187 -37 -26 -45 -90
6599 -90 50 33 34 -134 145 202 14 -140 32 -205 -103 -13 -212 -107 43 -183 -163 3 101 41 -243 51 -240
6622 -240 -256 137 -54 0 153 -81 77 177 35 -120 -191 193 77 -256 -228 -11 -61 -167 101 170 -75 -37
6644 -37 -153 29 -42 131 -210 55 -112 -364 -89 -108 204 30 67 -309 198 -91 -11 160 -150 131 161 -78
6666g8K06k79J91J32l17K54j02k02K79k26Q8k4K6p6L02l00qJ31R8m22N00j10j12
6689d9l8K54k51o0R4lp2L15k36k6o7N9J22n15N24k29L2L76m61K10j18r1Q1J11
6713c8k8M38j93k5l21R8l7M5n2Lp6L18m0O5j76P9k82M3J26r4K21k6j53L2K82L3
6739B42l9k71N7LP2J95k70l34N60j62p9J2l7j79K38R4o3j22P5p1q9J53N2l61L18
6764fj65J32p1L0O9j8J81ON7l2m96L19q0J28j36J18l5K34r1j75J43L2j22j38J16
6789@o1rJ92k58q4K21l73K48j4J50R4j63P8N3N0l24L02k96j16K90j5PJ56k09Q
6814g3K66n7l69K95j33K75k83J64M0l25K83j6j17K96q0K4j72N8k80J1K17j41L22
6837B05l60J93L8j99J22L34j68L1m13J85Lj93q2K56J27J74k15J00j18N2k5j8j35
$$ plain form
6666 -78 128 -151 40 172 -145 109 7 -195 84 -142 -54 -78 -52 -128 174 -126 -134 -3 95 -327 173 63 -49
6689 -49 -87 167 -84 -144 -50 -53 -125 190 -46 -72 -139 -80 42 -473 51 -178 -146 230 -231 -21 -139 -230 -149 -38
6713 -38 -66 372 179 154 -167 -69 -106 -61 -113 -110 -186 132 92 157 -19 60 -222 -179 -53 -147 74 48 -105 -73 209 242
6739 242 203 -68 -11 -8 64 259 -11 -345 215 53 -26 -14 -51 -230 8 102 39 -83 -8 -79 -168 -15 37 -324 -6
6764 -6 -171 -39 -110 -80 -11 -29 152 158 215 183 -313 6 -74 54 -82 36 1 235 144 -31 112 144 22 -116 0
6789 0 -61 -70 122 -136 -220 1 -372 -124 -138 12 106 -57 21 74 124 -200 102 -194 -310 -20 -35 -28 128 -81 -73
6814 -73 193 136 -233 62 -71 204 -79 85 125 -200 83 67 -50 246 166 190 18 76 -204 -193 24 -117 205
6837 205 -155 38 76 -123 -1 333 165 196 -217 -32 -29 -222 -304 -48 79 253 38 138 20 72 47 29 -106
6860a06J41q7R7l72j2K06J69K11l19m4K37j51M1R3kj43R6k29k0M24j99R7l19L02
6884A11j81K40m46K41r2J75K1J5K1j6j8j75J09j12j44K69n5J57M6l57L91k30J33
6907A03k07J92j97m7K07l3O2k18J00k9Q8J28j88o1K8n5J59n8K81j21n1j87j49
6930b53J70L39j83k22j3K68r8k15K67k94L53k10K94j89O3K04m7k05p7q3M9J09
6952B7k1L13m07OK11k97J79o2J45j49q9J95n07L13J94M0k00J54m2j53q3J61O1
6975a1J66j38K05l72K74j72j16K3J22l0K6J0J44l5j98J73k04K38K48k45j50j45
6997a87L24n16N86n4j56P8j27J99l45J77pn9K1M72k57j32j53j0J80r1J95k42L5
7020f9r6K63j61p5K10J03M7p8k24J33j92L09j60n4N8j8q0M5M6l7j13nK13j88Q8
$$ plain form
6860 -106 35 -52 45 -327 -339 -133 36 247 -72 -116 121 -30 11 104 102 -41 55 -174 -194 230 31 128 -191 111
6884 111 -70 170 -276 -35 -127 48 69 84 105 89 71 -104 5 -107 -251 18 -37 120 166 -191 200 -30 103
6907 103 -104 88 -109 -156 51 18 80 -138 -38 -67 21 149 -39 -100 -72 -127 32 -26 255 134 83 -104 -253
6930 -253 -83 256 73 -149 -162 106 8 -207 60 -234 119 -91 203 14 77 281 234 29 -48 -131 -82 27
6952 27 6 319 -88 -82 129 -168 11 -51 94 -55 -144 51 -456 -143 51 91 -109 45 3 -150 -233 -72 -11
6975 -11 155 17 222 -150 124 -48 -164 -141 -19 -49 -23 -13 131 96 -102 71 -133 105 353 108 -42 -187
6997 -187 137 -379 207 153 -3 75 -52 147 -198 -21 -28 -87 -66 406 149 17 -136 -146 34 -57 138 -104 -69
7020 -69 -165 98 -63 -138 72 175 222 144 -80 53 -139 170 10 -44 14 -4 -84 -39 7 -30 -143 -148 65 -123 -35
7045c5j76L58j28K0n2K32l85J54jj22L01q5j63o1R8n8j46j6K41p5K1N1m2j81L89
7070A39j98k12M48k97r6L50j73L45l38Q5K32k99l8n2k0j71K70O7j30lp0K39l5
7093D3R5j56p5L09l12R8J6L0M1nl7%j48O7j64K49J47J22n42j3K35J39k00J51m50
7118c60O17m43k3K57j47J36J13j30J79j13k90J16j04K21j79J01N7j58K62q0j34
7139a02K07k9m61M68k07J15r7Q4j6q7j13J94J88k1j92o5K06J95j53o7l41n7N37
7162A86kQ0j72k93J12o8M4O4j17K03r5K05o4k94J78p7J41r4j13L98l7k22j79N4
7186a62n7N72n23j04K95j46J53q4p0K14K5j42J87j97J29o1N4n2k15M14m27J04
7208i3M96l55L4K5j95J33J37l98Q9R3j54J10O6j71J88O8q2L0l44O62l07L24n07
$$ plain form
7045 -35 -211 147 19 39 -13 219 -166 -12 -13 -135 166 81 -82 -143 -45 -103 -249 -265 -24 -99 -78 -27 -69 -250 139
7070 139 -59 -271 177 -120 -216 134 -39 306 -32 53 285 -14 -52 -104 -124 -295 -25 42 -88 -91 -161 78 43
7093 43 138 -18 -93 216 -96 2 18 48 89 84 47 47 -101 -34 -198 51 198 320 -222 -235 0 139 -61 90 -360
7118 -360 257 -186 -209 48 -99 37 150 20 199 86 -204 -88 -192 29 -150 -49 8 -150 112 32 -102
7139 -102 105 76 -385 83 -124 -9 -106 -22 -38 -125 -238 -44 144 123 -69 -134 72 267 114 47 -294 -351 186
7162 186 184 264 92 -201 -89 -157 -113 -49 -166 37 -58 147 83 -211 -33 -110 31 -63 -176 222 185 -37 -216 -162
7186 -162 -219 353 -170 -274 21 -125 28 -56 -126 88 113 -29 158 -39 90 29 83 31 -184 230 -197 -93
7208 -93 403 48 82 107 -88 45 182 -216 -127 -34 -188 -78 -12 -183 5 73 -9 21 -323 339 32 356 -151
7231a51j0R7rK70l74K38r7J2J51l86K51J70n71N32j50j52k0N26k62k85N7N6J07
7254@m7P5J18l94J83K14l18L20j23mJ4N8k41J6J76k54k65M77L0K9j19j62J07O6
7278d4O9J28P2k44J08q3O9j30K40l54M19l34L28j70o1k6J05j07p4J5Q1L59l81
7301a5J21l17L43j44j00K27O2l52q9K42J0O4n9J09j39L1K0l31L10Rj5J35J03m65
7325b40L22j54J76P0o2n4r4J48rk04k03M68k1r9J78k55NQ1j20J32P6n9J20n57
7349c55K77J11O1r3K42k96j49j13K81J42k23JJ12p5r4L74m00J06M7J69k76L31
7371A80j87l6L97j18m78J61J38J46l24p9M6O3m5j29M33m1k64R7M6j45J98j56J5
7394h2j47L21j72J28j82K87j31J48k09j56P6P2J43j34J44j03Q1k92K8K32k28K72
$$ plain form
7231 -151 -161 -64 -73 197 -177 61 -36 -24 127 -259 -8 162 -409 123 -27 -179 -199 327 65 -220 -163 -107 0
7254 0 -47 28 146 -248 -65 149 -169 151 28 24 38 96 -145 -129 47 -207 -472 5 35 64 -55 -217 -110 -44
7278 -44 25 153 225 -19 89 6 75 -55 185 -169 250 -84 244 74 13 -13 92 -15 -89 -74 7 366 -15
7301 -15 106 -211 132 -12 -112 115 177 -175 -264 -22 -12 52 -7 102 -37 -6 14 -317 -7 2 -13 122 225 -240
7325 -240 82 -72 104 174 112 58 -36 112 103 -101 -304 164 143 44 222 -33 -28 53 -67 65 141 82 202 -355
7349 -355 -78 33 94 1 243 -53 -202 -315 -34 108 -115 -114 -2 -77 -171 203 -197 -91 -44 125 -151 180
7371 180 -7 -43 354 236 -242 -81 57 203 -121 -200 -154 -91 -136 -265 168 127 -137 -40 6 -139 59 -97 -82
7394 -82 -229 92 -80 48 -134 153 22 170 -39 -195 -119 -47 96 -38 106 3 84 -208 -180 52 -176 96
7416I6J77j29J91k27n3P8j58j62J10p2L01k35O0N6k07J14O4k6q0OnR9Q8M0k35
7441a09K17q8K18j29j03L5k39K74l2k34K97k51K95l45K54j82n6L06k77P4J13o
7463C2R3l36J27L4j66Q9K91J9l56K53k14J56O7k6j02j2l8P7k53K73q4p2J03j2
7487e7J95k62n8K55J08j19j00m6l8k16J57J10M02l54K07J3p2p6j19K84n41L48
7509B1J70k23p1J78J73j42J6r1J09K1q2K40l47j07J6J01L2j11j20K11o3Pn7K58
7533A39K9k50k6K24j69K92j88j84K3j10j7L26l2J45l79L41j80K63J13l95N8R7
7555A20j01q4K64j76k66M6J53k42K38j0k1j42K85K3j35N1k56J27L60k38J20o8
7577D8k51Q5J89j44K77j15j72K52j48p3K88K7k15j50L16k5K5r4k10J58j92Q3p8
$$ plain form
7416 96 273 144 335 108 55 133 -25 -187 -77 -149 152 -83 -23 33 -174 -60 4 -22 -102 -96 -101 -2 86 126 -109
7441 -109 108 20 238 109 6 41 -198 76 44 -190 107 -144 151 -194 60 -122 -178 128 -149 -75 38 32
7463 32 125 -211 -84 -50 -216 -127 164 183 -173 80 -134 22 89 63 -39 -51 -89 -12 -265 8 -76 -148 -45 -57
7487 -57 138 -124 -182 73 181 62 -38 -84 -122 -338 -181 -71 331 -23 184 197 125 49 -70 214 -327 21
7509 21 191 -32 -103 75 248 106 122 31 140 161 79 319 -28 -135 -119 -18 14 -97 -217 -6 -69 -62 -119 139
7533 139 168 -82 -108 116 -53 239 51 -133 -110 -220 -237 89 57 202 -177 164 -16 247 360 -35 23 120
7555 120 19 -65 199 23 -243 -197 -44 -286 -48 -58 -79 -221 64 87 -48 3 -253 -126 234 -4 116 48
7577 48 -203 -118 71 -73 204 89 -83 169 21 -52 236 263 48 -102 214 189 214 120 -90 68 -124 -41 -119
7600a19L78j67J0j35J86J29k80K08l11L15j57n4J30o4p1k14L72n1m1K94k25K02
7622C35j98j44J9O8k21K51k76J78m0MkN7P6j03o0j67K90j21o8K57L5j62O4j04
7646c2l31M57k40J01mJ07p2J08j83J43o8L3r3o9Q5p6K29k42L23r5j75L51k79R1
7670F9kQ3O6m08J5K54J31l33p7L15k71P2M29m16k2K5J60N5j50j2J72J24k14j32
7694f7Q7o9O0Nk86N0L76r9m88L79J43J17j04r8j4j6j70P9K23l4P4j7j18j29J88
7719G2j57l3O0Q1o9P4P6j39M8J62j90L7J02J18l90J34J73j59Q7j00j56K11J61
7742B03l09lM6O4L19l46J02P0j28J14j3r6J15J14j70n8j5J76M5k72K13j29m1Q6
7766H7k79J59L29k01K53l75m4k34L12l0K50j77j33K2j25KJ66K28k95J56L1p8L7
$$ plain form
7600 -119 259 92 102 -33 153 282 2 210 -101 214 57 3 133 69 -2 -216 156 105 64 358 133 335
7622 335 137 -7 12 80 -141 110 -166 12 -28 -24 -26 31 107 4 -56 -223 67 -54 -122 135 170 8 72 -32
7646 -32 -363 94 -146 -45 -49 58 -14 94 -89 54 -14 19 -74 -143 -58 -134 95 -147 176 81 -94 257 -22 69
7670 69 67 150 216 -192 -177 77 208 -125 -202 113 -158 -86 343 -73 -95 -70 90 145 -5 -17 155 279 65 -67
7694 -67 20 -49 11 16 -270 -220 156 57 -431 -52 91 208 104 6 -8 -24 -194 -115 108 74 148 131 13 -116 72
7719 72 -85 -118 -58 23 -46 28 104 -35 13 175 -15 22 124 242 -148 -14 159 0 87 -13 -169 42 203
7742 203 -106 -109 -63 1 320 -26 76 146 18 132 119 23 138 252 82 24 9 185 230 -42 171 42 1 87
7766 87 -192 -33 296 95 348 -27 -71 -305 7 -23 227 50 -83 -61 -186 -184 -18 210 -85 71 102 24 61
7789F1j54K03r7k05N45k26k56k8k30P0L84N2j05r9j38JM72l93J92K91k73j49O7
7812a5Ql62M56r6j51K89K7j94k79J87P0Qj66K69k52K15l02N37l71K66o6m2P7J57
7836B70k49k70J26J59j06j35N9J98L2k68Q7K43j61Pk25k7J19J89lK02k48j84J87
7859Bk5q8N5J94k50k64M91J09j85k23J03K77j66m4J19o3l04R8R3K16p7P2RK24
7883C73m52j56K17L09j57l25M06k20j50K84k18J11K3K68l33j64M3L40j14n5M5
7904G5k70J3Q4J04J23k17m1J74J9m3j08k34L56R9m1l52L24k9j06J9J47j49K62
7927B09k92k9L03Q4q4o16N21p7l68K87J43l36L36o3k5n2J52m18J57Q6Q9N1j79
7950a21L12k62j3L7n9K59K9m03L61J67m14k9J94j32J82r8J85n78K86J1J87q4j7
$$ plain form
7789 61 -93 110 13 -192 353 127 -129 -157 -387 -317 67 119 14 -85 -223 -222 250 -143 49 340 67 -82 -15
7812 -15 -7 -369 87 -9 -160 129 156 -38 -317 -130 -60 -52 -218 51 -201 14 -288 249 -122 144 78 36 113 270
7836 270 21 -249 -123 36 -70 -205 -146 52 84 -184 -97 146 -15 -8 -233 -260 -141 48 45 247 -1 -185 2
7859 2 -23 -111 -56 138 -112 -376 115 224 39 -184 -81 196 30 -14 105 42 -262 -164 -71 145 68 140 149 373
7883 373 -79 -235 -18 291 134 -191 215 -5 -155 129 -89 22 45 313 -20 -184 -141 199 85 30 75
7904 75 -195 -182 -98 6 129 -88 -129 45 64 21 -87 -321 35 134 93 -259 65 36 -70 -51 96 -53 209
7927 209 -83 -112 191 275 191 -425 96 19 -349 -62 81 -255 81 18 -7 -59 93 -325 -168 -82 7 58 -121
7950 -121 191 -71 -84 -47 -106 153 182 -221 140 307 -107 -136 58 -74 108 10 195 -383 -97 -86 101 17 0
7973@J12k11J42k70K99j64Q3j17J35J37j47mK88j81j61j75N27k22r8J35k78J50
7995b0K70l12k24N92j39j65P7l20L72o8m3j46M52l26j02P7m1J79L2m2k73L13k73
8018a30o6J60K65n52L87o2j78J6K47N9M4q4k76L45k81N7o5mK22J40l42r9J59K21
8042A83k74N5K03j61l2j37K15j08J19k49J16J60k28P2k18M28j23J17j6p7j71J27
8064Aj76K00Lj32Q1l8J69k63Q4l1L33l23K50o9j74J87k15K10l3m4k64M10p3j72
8088g9j73L47j22R1j4j73K49k64j07N66k79J38l46J34L9j56K94j46K25j86J34
8109A72k09K9J68l55M70j39j30J01j60o4J41L4q6j54L05l8k21N6l9Q4P0j5p2J47
8133I5k19K20j58Q7Q1j86P7J75l94K79k4J03q9m77M25J73q2l70M7N21l9l51J71
$$ plain form
7973 0 112 -99 43 -227 72 -92 -9 -126 9 146 -1 -5 283 102 -59 -234 293 71 -27 108 -170 -20
7995 -20 250 -62 -286 306 167 2 79 -241 131 63 20 -126 326 0 -102 -25 -66 113 145 103 -170 143 -130
8018 -130 -196 -36 229 -323 64 2 -176 -160 87 146 190 106 -170 175 -106 -49 -114 -118 104 244 -98 -197 -38 183
8042 183 -91 -36 167 6 -26 -163 52 -56 63 -186 -70 90 -138 -66 -284 144 21 138 122 45 -126 1
8064 1 -175 25 28 -104 -23 -61 108 -155 -71 -102 231 -92 158 89 -85 102 -113 97 64 20 -244 166 93 -79
8088 -79 -252 95 -27 64 50 -123 126 -138 -245 321 42 180 -166 -32 7 -149 145 -1 224 38 172
8109 172 -37 -8 160 -195 275 136 6 107 -53 -117 24 58 -28 -182 123 85 -136 -80 -119 -35 35 20 -52 95
8133 95 -124 96 -62 25 106 -80 -3 172 -222 57 33 136 47 -430 -5 168 86 -284 -237 284 245 -106 65
8156F5J72m09K35L3L4l9k82K31o2p4K36OP7q9l14L19j62K2j05Q2l8k0J75l22L66
8181A37O6k76J36n9J66k90R5j28K02J1
$$ plain form
8156 65 237 -172 63 96 130 91 -191 40 -22 -96 140 146 223 134 -180 139 -23 -1 -106 -24 -62 -82 93 -229 137
8181 137 203 -73 63 4 170 -120 -25 -153 49 60
8191F0
$$ Imaginary data points
##PAGE= N=2
##DATA TABLE= (X++(I..I)), XYDATA
0@%%%%%%%%%Qj6J6j6K4l2L2m0N6o7P8r9J20j36J60j92K24k59K99l45L96m54N20
32B77n92O70p58Q54r58J075j203J343j496J663j846K047k264K502k764L048l359
49a761L702m079M492m951N462o032O675p403Q238r204J0338j1693J3343j5408
63h281J8077k1675K6829l4873M9292q3121L11934J98026n76053k25577J76547
74a68875L57721J4769j82036j08172J18452O2063r4064j35729N6043J57042P4454
85A51668r8278j09579j8904N7423K5343n377k033K7840P477k5297l8330j934K7797
98b184K9158o806k3631q020K5711J7921k7786n4749j0986N3848N7994o496m8120
111d146j8076K6459Q144l9672k7989M8298Q1628J1879q1245q1373L963O5686M3530
$$ plain form
0 0 0 0 0 0 0 0 0 0 0 8 -8 8 -8 16 -16 16 -24 32 -35 43 -56 64 -72 88 -104 120 -139 160 -185 211 -243 277
32 277 -315 355 -403 451 -507 568 -635 708 -788 875 -971 1076 -1188 1314 -1450 1598 -1761
49 -1761 1941 -2138 2354 -2597 2865 -3167 3508 -3895 4343 -4861 5477 -6216 7127 -8281
63 -8281 9796 -11879 14950 -19923 29369 -53752 258182 456208 -119845 -345422 -168875
74 -168875 188846 203615 21579 -86593 31859 93922 -142 -135871 -79828 77214 151668
85 151668 53390 -56189 -75093 -17670 7673 2296 263 28103 35580 10283 -28047 -29981 -2184
98 -2184 26974 20168 -3463 -11483 14228 32149 4363 -50386 -61372 -7524 50470 43974 -4146
111 -4146 -22222 4237 12381 -27291 -55280 -6982 74646 86525 5280 -76093 -72130 -6444 37086
124C7086n678j4574L611n435l7613l7316J4544O1931M7978j4369n6768m3483K203
137d7883L5027L1433M818j4372j2605r85K204m159k959J0266J6538K20k0963j3961
151a7381J4970K5275k449l0954j8317J9665L1657M494k1269j2535N625L37j7603
164a8485p792K8062L7820j361m6666m0995R203M2701K7024p128j8380o743j110
177c850r354q804J2145K9225J6303j8480l7696j7903K0689L5295J2451j8772k3113
190a1864m346J1413O803j034L048Q336j794k0966j8680J1803L4164J7808k0187
203A4504l4603j0134K0453K2444K652o971q74o77j4141j7779M722L0844K4384
216C4824j0974l3831j9457J1676K2408R615m016m199j524p224j1866j750J6847
$$ plain form
124 37086 31408 16834 20445 15010 -22603 -59919 -45375 16556 64534 50165 -6603 -50086 -47883
137 -47883 -12856 18577 23395 9023 -3582 -4567 -2363 -6522 -9481 785 17323 17543 -3420 -17381
151 -17381 -2411 22864 20415 -10539 -28856 -9191 22466 26960 5691 -6844 -1219 -882 -18485
164 -18485 -26277 1785 39605 38244 -8422 -49417 -40214 2487 29511 22383 4003 -2740 -3850
177 -3850 -13204 -22008 -9863 19362 35665 17185 -20511 -38414 -17725 17570 30021 11249 -11864
190 -11864 -16210 -4797 2006 972 4020 12356 10562 -10404 -29084 -17281 16883 34691 14504
203 14504 -20099 -30233 -9780 12664 15316 8345 7471 6794 -7347 -25126 -20404 10440 34824
216 34824 23850 -9981 -29438 -17762 4646 14261 10245 6046 4522 -2702 -14568 -16318 529
229E29J8682j050k2085j8440M316K1598J5128m644j5314r406L531P547M828K883
243H103J906k679j3272j6223J265K4627K6725o94k9501k8545M45K4205K0275K500
257A9137p960q436j0648j3578l195J9486L0417J0411k1638l1497j1190J5406K1874
270H589Q746l971q006p905q698n425P340J8466J3205o993k0852j3985P388J8646
284F545R143p885j3866m299N975O781K417M25J354l081j0050p705O433J8729J1819
299B2735j1071k4659j4391J1522K3101J3381n220j3485r578m792k920M380J7417
312F420J8725k022k6801k6837J562K7526K4399p7j6762j3338l775o44M15J0079
326a130J6760N998j5748k4380p454J7359K2297M538j3864j3158j264N859M080
$$ plain form
229 529 19211 18161 -3924 -22364 -18048 3550 18678 14034 -1280 -10686 -7155 392 5220 8103
243 8103 10009 7330 -5942 -22165 -20900 3727 30452 29758 257 -28288 -27843 -3638 16637 19137
257 19137 11177 2741 -7907 -21485 -24680 -5194 25223 35634 13996 -17501 -28691 -13285 8589
270 8589 17335 13364 5358 -2547 -11245 -16670 -9330 9136 22341 15348 -5504 -19489 -12101 6545
284 6545 15688 7803 -6063 -10362 -4387 2394 4811 5236 6590 3509 -6541 -14246 -7813 10916 22735
299 22735 11664 -12995 -27386 -15864 7237 20618 15398 1913 -7665 -12457 -15377 -10997 6420
312 6420 25145 23123 -3678 -30515 -28953 -1427 22972 22895 6133 -7205 -10980 -11624 -11209 -1130
326 -1130 15630 21628 5880 -18500 -25954 -8595 13702 18240 4376 -8782 -10046 -4187 -107
339a07O88K955K757l528r908n836Q726J6249N320j3203j8866l796J4887J7036
353A3374K077j1122j0695k829m13M15O753J4678Q819j1754k5403j4035J4770K8554
367A3189J3527j1205k0549j0085K369N598O636J0524R320m699k0581j8529L496
380b0989K3748J9375l601j9680j4137K163R417N762J777K179N53o579j1384k779
394a4175J1600J6039J717j5355j5363J941J6058J0949m132j0628m921J700n38
407e108k89N887J1951K478j5786j9283j089K0097K0345M52j5949j3936l103M381
421h952N987Q426Q723k03j2969j7045m321J3940J9806P849j0628j7039q609N342
435i693J1452P514M74m832o119o477l813M854J3730R966n613j8652j2413Q048
$$ plain form
339 -107 581 3536 6293 2765 -7143 -12979 -4253 11996 17316 4113 -14753 -18549 -3662 13374
353 13374 15451 4329 -6366 -9195 -9608 -9193 -2440 12238 21057 9303 -16100 -30135 -15365 13189
367 13189 26716 15511 -5038 -15123 -12754 -7156 -520 10004 19324 14625 -5956 -24485 -20989
380 -20989 2759 22134 18533 -1147 -15284 -13121 -3704 2058 3835 6014 6567 -12 -11396 -14175
394 -14175 -2575 13464 15181 -174 -15537 -13596 2462 13411 9279 -1349 -6270 -4570 -5108
407 -5108 -5397 490 12441 14919 -867 -20150 -21239 -1142 19203 19655 3706 -10230 -13333 -8952
421 -8952 -2965 5461 14184 13981 1012 -16033 -20354 -6414 13392 21241 10613 -6426 -15035 -9693
435 -9693 1759 9273 9747 4915 -1204 -7681 -11494 -6640 7090 17056 11443 -7209 -19622 -11574
449a1574J9565R982p995j3456n382J317J224K031R842J1227k322j9009j6492N069
463a5973K1443J4911n894j5436q451P39K945K311N569P815J114j0981j2857j19
477a2864J2606J2719q77j2128r999R80R537P550k15o262n414j994J317M001P316
492F273O558k046j4488j5487M4J8958K0507J743j7518j7698m616N936P665R552
506E383J1636L120j4072k4763j0954J5832K6366J1391r084j5887q544j961M20
519a1117M568J1438J0947j456j4386j3710o77J1015R715K08n178l649J715K320
533A753k097m902j662L121M629K570J018J474o74p048j1871m624J2497K1595R236
548B5015j2750k2405j2215M583J2589J2455R194M265q907k1449j8794L024K4802
$$ plain form
449 -11574 7991 17973 9978 -3478 -8860 -7543 -6319 -4288 5554 16781 14459 -4550 -21042 -15973
463 -15973 5470 20381 14487 -949 -9400 -8661 -5716 -3405 2164 9979 11093 112 -12745 -12864
477 -12864 -258 12461 11584 -544 -10543 -9563 -26 7524 7309 1047 -4367 -6361 -5044 -1043 6273
492 6273 12831 10785 -3703 -19190 -19146 -188 20319 22062 4544 -13154 -17770 -11834 -4169 5383
506 5383 17019 20139 6067 -18696 -29650 -13818 12548 23939 14855 -1032 -9576 -11537 -11117
519 -11117 -6549 4889 15836 14380 -6 -13716 -14393 -3378 6337 6545 1367 -2282 -567 1753
533 1753 -344 -5246 -6908 -3787 842 3412 4430 5904 5230 -1818 -13689 -18313 -5816 15779 25015
548 25015 12265 -10140 -22355 -17772 -5183 7272 16466 20731 11824 -9625 -28419 -25395 -593
561e93K4136L120j6743j8627r074J538P244J1624J2163N364r419j7698j2615L681
575a5899J4985J2651k42q213n518j212J169j058k081L187O958L002j942o011j525
590a749M56l100n595K128J3257J2351l055j5543j5823k12J1108J0680O841L935
604A5679m149j2739j8936n853J5721K4480J3511j1379j9722j4092j58Q451J1857
617B671J0669M170p274j3674j2197j631J2563J4304N462o364j1609p953L442O942
631d79L101m2j374J919j510l876j512L100M603k215p006j013J1374Q593n928j3927
647f192r170P160J1362L272J104o26j157r862j1028L44J7296J6042L37j5505j5938
662a2561l043P707R882O244L702l307q745j0810l412Q956J4017O635n913j3331
$$ plain form
561 -593 23543 26663 9920 -8707 -17781 -16243 -8999 2625 14788 20152 10733 -6965 -19580 -15899
575 -15899 -914 11737 11495 3282 -2236 -3448 -2279 -3337 -5418 -2231 4727 7729 5787 -224 -1749
590 -1749 -1293 -4393 -9988 -7860 5397 17748 14693 -850 -16673 -16885 -5777 4903 11744 15679
604 15679 11530 -1209 -20145 -25998 -10277 14203 27714 16335 -3387 -17479 -17637 -9186 2671
617 2671 13340 17510 10236 -3438 -15635 -17266 -4703 9601 15063 8699 -2910 -10863 -7421 -479
631 -479 2622 2580 1206 3125 1615 -2261 -3773 -673 3930 1715 -5291 -6304 5070 13663 7735 -6192
647 -6192 -15362 -8202 3160 6432 7536 6910 5753 -4109 -15137 -14793 2503 18545 18882 3377 -12561
662 -12561 -15604 -7897 1985 8229 11931 8624 -121 -10931 -14343 -5387 8630 15265 9352 -3979
676c979q443L765R186O612o51m991l252j313l04Q17M186N106j284r005p091M372
692f269J1859O420o590j1233l312N396M734J887J745K030k698r879p198M762J4394
707F048R163n654j2531p845K088P542N354K667o29m043o382m993J813Q346Q528
722I472m19q697q935j290P651P977J800m916n521k130Q87K310L870M435L60o347
738E07r076j534Q662J1256K129r218j0118j932M973O098K666J862o19n446q287
753h077l775P417J2067N486o999j1500n017L709P130M932P01j752m414n060j949
768g101L186P886M901k934q347n926K193P459N570j790n617l567L87K249J889
783D38L004J803j613p004n918K696J0576P091l117j0952o673K524O844N095J798
$$ plain form
676 -3979 -12422 -8657 529 7141 6490 1499 -1753 -3066 -3370 -2553 1633 6739 5455 -3550 -10641 -6269
692 -6269 5590 12010 5420 -5813 -9125 -3729 1005 2892 4637 6667 3969 -5910 -13108 -8346 6048
707 6048 15211 9557 -2974 -10819 -8731 -1189 4165 6832 6203 2160 -4222 -9215 -7402 944 9472
722 9472 9053 356 -8579 -9869 -2218 5759 7559 2643 -2878 -5008 -4121 -1811 2059 6494 6854 507
738 507 -8569 -10103 -1441 9815 11944 2726 -7392 -9324 -4351 1747 4413 6275 5656 210 -8077
753 -8077 -11852 -4435 7632 13118 6119 -5381 -10398 -6689 441 5373 6074 4322 -92 -5152 -7101
768 -7101 -3915 3971 8872 5938 -2409 -8335 -6142 1317 6887 5097 -520 -4087 -3700 -1451 438
783 438 3442 5245 3632 -3372 -9290 -6594 3982 11073 7956 -2996 -9669 -7145 -301 4794 6592
798F592j276k833p149o123K336J0465R348j223r840r526k82O633O524L000q64
813E782k882n655n243m76O959P639L034n948p967k886M223O749L283l059m567
828a014j842k99J742J682K076J310l037m688j904L997P622K455m844q287l436
843h467M904N150L440r18j395l779n984q48N329J0185M416n924j1464n446L768
858g033Q647N674N69l567n935m965r22N054P235M196k714q098o026J31N646O830
874D722K580m193n335l106J615K948L845J116o51l837m848L0M162P050J521n907
890A712p599l41M661N414M31k146k333k133l009K03N141O806J357o934q263j166
906h199N970P027J895l082m389k990j583J550M891N072O44n459o673k135M129
$$ plain form
798 6592 5316 2483 -4666 -10789 -8453 2012 11360 10137 297 -9229 -9511 -2878 3646 6646 5782
813 5782 2900 -2755 -7998 -8474 -1515 6124 9158 3210 -4757 -7643 -3420 3329 6612 3553 -1014
828 -1014 -2856 -3155 -1413 269 2345 3655 618 -4070 -5974 -1977 5645 8100 3256 -5031 -8467
843 -8467 -3563 1587 5027 4109 2714 -1065 -7049 -7897 -2568 7617 12033 6109 -5355 -10801 -7033
858 -7033 1614 7288 7857 4290 -1645 -6610 -7532 -2478 4757 8953 6239 -1859 -7885 -7754 -2108 4722
874 4722 7302 3109 -2226 -5332 -3717 -769 3076 4192 3541 -296 -5144 -5114 -952 6098 7619 1712
890 1712 -5887 -6228 -1567 3847 4278 2132 -201 -2334 -5343 -5140 1 6807 8164 1230 -7033 -8199
906 -8199 -2229 4798 6693 3611 -778 -3768 -5351 -3801 1090 6162 6806 1347 -5326 -7461 -3332
921c332O707L624k786o121l884L65L806M195K307j69l625n160k925L106P229N073
937H410k373p727n777J237N536M251J255j295k354m094l761J095O733O415p55
952F796o758n776n16M653M163J503j301k387k840j028J818L041K266p71l824l024
968c985K21M178M195K39n028n284o53M536M941K150k009l267m136k697J139O506
984A046P531J193p469r116l302M693Q066M723j31l708n363m976j250M563Q303
999D803M875k988q499n568N70M889M566J776p02k295k804j791J31K466K603O02
1015B634j562k476p0J815J625j399k988j383K552M046J706j423m275k989j027
1030e214J356L961N730K950l731r017o375J996R047P612J014m907o681m719j367
$$ plain form
921 -3332 3375 6999 4213 -1908 -5792 -5427 -1621 2574 4881 4712 1087 -4073 -6998 -3892 3337 8410
937 8410 6037 -1690 -7467 -6230 -694 3557 4812 3517 1163 -2931 -6692 -5597 1136 7551 6796
952 6796 38 -5738 -6254 -1601 2562 4065 2764 377 -2463 -3491 -1673 1368 3634 2863 -961 -3985
968 -3985 -3764 414 4609 4848 -180 -5464 -6117 -1581 3360 5510 3501 234 -3902 -6599 -5460 1046
984 1046 8577 9770 2301 -6815 -10117 -5424 2642 7365 7234 3526 -1837 -6813 -8063 -3500 4803
999 4803 9678 6690 -1809 -7377 -6807 -1918 2648 4424 3722 1427 -1377 -3168 -3037 -571 2032 2634
1015 2634 1072 -1404 -1474 341 1966 567 -2421 -3804 -1252 2794 4500 3077 -1198 -4187 -5214
1030 -5214 -3858 103 5833 8783 5052 -3965 -10340 -8344 703 8315 9329 4422 -2259 -6978 -8345
1045h345L143P653P206J37p606q993l103M398P033M798r9l575m461l026L45K964
1061a531L911K433q86l559k849p06K343K093j82j703n08J221K265L9k195k058
1077a872o12Q16R50K143L041q8m495o108j626N542P706K860l342n822m279j065
1093f251J969M235N741K255m151q305m832K735P614N516K98l615n237k913K6K845
1109b070M401L286j443m196l882m12L335L083J074k065k417o90J153J314M09o19
1125B61p32j7m44m1J268K235K3l087l757M00M360L631N5l115l143j284M31K246
1143g10K986K654p60m462n120m43M179N256K220k398m472l017K74K356L347K444
1159D334l51l465l478j391J794M162L099q00m307l658N59L175K792L1j519j687
$$ plain form
1045 -8345 -5202 2451 9657 9794 2188 -6805 -9908 -5510 1523 6321 6222 2647 -1814 -4840 -4495 -1531
1061 -1531 2380 4813 3927 368 -2481 -3187 -844 1249 1067 -636 -1144 77 2342 2381 186 -1872
1077 -1872 -2484 -1668 -718 1425 4466 4378 -117 -6225 -7851 -2309 5397 8257 4915 -907 -5186 -6251
1093 -6251 -4282 -47 5694 7949 3798 -4507 -9339 -6604 1010 6526 6824 3209 -2028 -4941 -4915 -2070
1109 -2070 2331 5617 4174 -22 -3904 -4316 -981 2102 3176 1111 -1306 -1996 -843 471 880 261
1125 261 -471 -488 -932 -973 295 2530 2553 -534 -4291 -3891 469 4100 4155 1040 -2103 -3387 -2956 -710
1143 -710 2276 4930 4170 -292 -5412 -5855 -1676 3580 5800 3402 -1070 -4087 -3813 -1457 1890 4334
1159 4334 3983 518 -2960 -4351 -2557 1605 4704 3904 -403 -4061 -3502 -327 2465 2496 977 -710
1175g10j094r22Q97K817K288n45l342l016P74L639K964j076k367j462p26L57P87
1192g37J806K049n78l765k722P25L220L196Q0k534k897j223J466K428J708O43
1208B865j338k575j755m7K457L803M97k386m004j909K857L623J042j391k456j371
1224b088k25L25J643K704J342k435m268j509K947M269J558j907k985j598M5P24
1240a458J418K201J272j745l890k117J866M126J964j454k506k000k31J223J638
1255C07J616O93j405j954j763M40K666J957l03k519k604L99K204K296L38j670
1271F98j644o04L64R44J403J047k84k927k712O79L779L294n32k901l147k76J417
1288a402J839J497P56l96l179k923j69L436L910N60k575l192j410R47J728J827
$$ plain form
1175 -710 -1804 -2726 -1829 988 3276 2731 -611 -3627 -2853 786 3750 2674 307 -1155 -1881 -1524 -737
1192 -737 1069 3118 2540 -1225 -3947 -3222 -2 3194 3274 740 -2157 -3380 -1914 514 2222 2865
1208 2865 1527 -1048 -2803 -2850 -393 3410 3907 1521 -2483 -4392 -1535 2088 3130 1739 -717 -2088
1224 -2088 -2313 -1988 -345 2359 3701 1266 -3002 -4511 -1564 2705 4263 2356 -629 -2227 -2182 -1458
1240 -1458 -40 2161 3433 1688 -2202 -4319 -2453 1673 3637 2183 -323 -2323 -2554 -1331 307
1255 307 1923 2616 1211 -743 -2506 -2066 600 2557 2254 -265 -2869 -2470 -266 2030 2368 698
1271 698 -946 -1550 -1186 -242 1161 2208 1924 -1003 -3715 -3036 743 4037 3505 604 -2543 -2819 -1402
1288 -1402 437 1934 2690 2294 -885 -3808 -3977 -541 3369 3929 1354 -1838 -3248 -2301 -573 1254
1304A254J115l45j948k499j82J498K546J575j122k382j399M80J531J192K36j302
1320B48j048J04j58M18J125J060n66k470j127J060K764J292j147k517j069O25
1336a406J240J271P36K00j399k495j406J600L178J842r30l042k163l19J998K244
1352A149J260j72j715k179j162R89K299K404P0k315k662j082J630K661J202n22
1368A855j799j079l95L89O91J396R90j036k334j325J633K070J009j306j481n02
1384a224N88P91K04N42J46q39j338p23J710J589P15j668k117l21J038J411J295
1401A799l07j211j254j168P46J670J667O93j564k522j538Q14K492K495m95j798
1417E19j871n69K27J254J729J269n11k399k448J6K413K292M88j415j419p86J17
$$ plain form
1304 1254 2369 2024 76 -2423 -2605 -1107 1439 3014 1892 -490 -1889 -1409 122 1314 1550 248
1320 248 -800 -696 -854 -436 689 1749 1183 -1287 -2414 -1354 1410 2702 1555 -962 -2031 -1406
1336 -1406 -166 1105 1841 2041 642 -1853 -3259 -1659 1519 3361 2431 -611 -2774 -3093 -1095 1149
1352 1149 2409 2237 522 -1657 -2819 -1830 469 2873 2943 628 -2034 -3116 -1486 1175 2377 1855
1368 1855 56 -1023 -1418 -1029 -338 1058 2048 1012 -1322 -2647 -1014 1056 2065 759 -722 -1224
1384 -1224 -636 155 359 901 1047 208 -1130 -1853 -143 1446 2161 493 -1624 -1945 -907 504 1799
1401 1799 1492 281 -973 -2141 -1395 275 1942 2635 1071 -1451 -2989 -2175 317 2812 2317 519
1417 519 -1352 -1921 -1694 -440 1289 2558 2047 -352 -2800 -2784 -371 1921 2409 994 -425 -1211 -1094
1434a094L64N08J730J94j012j871l25J229J126J18o99n47l31P45K50j75J70o41
1452b61p02J63P36J366Nq23j552p68M48J638J966L01j135k572j665J150J949J413
1470A657Q49q51j815k355l86J637K619J731q66k553j821L1J336J278J345L31q53
1487A314j973j388M63J394J781L14q15j436L7o8R2J079k24k78j50K89m17j95P0
1506a11j84j03M0J74J008M89n31j764p61N29J450J381k28J39j572j783o08R17
1524a518K491J766n00j765k695l30J219J578J450L38o14j782j761k29J505K159
1540A312J087n96j984j117n01P28J280R11R5m73r36o21l7L86P28L60j87n06p9
1559a50j16K82Q8n06J39M26L63J59l22o20n33l81K80J004J287R6o30k089o30O94
$$ plain form
1434 -1094 -730 -222 1508 1702 690 -1181 -1506 -277 849 967 268 -279 -610 135 385 210 380 -261
1452 -261 -963 -800 -64 1302 1307 484 -1068 -1836 -1388 250 2216 2517 1382 -1190 -2855 -1705 244 1657
1470 1657 2506 1655 -160 -2515 -2901 -1264 1355 3086 2220 -333 -2154 -2123 -787 491 1836 2167 1314
1487 1314 -659 -2047 -1584 -190 1591 1905 1090 -346 -309 -377 -285 794 570 292 142 431 14 -181 -111
1506 -111 -295 -398 -358 -184 824 1313 782 -982 -1743 -1214 236 1617 1389 1528 -44 -1827 -2435 -1518
1524 -1518 973 2739 2239 474 -2221 -2551 -1332 246 1696 2034 1420 -362 -2123 -2352 -847 1312
1540 1312 2399 1803 -181 -1298 -1799 -1071 209 1120 1215 742 -194 -815 -852 -466 262 622 435 -71 -150
1559 -150 -266 16 104 -402 -263 163 526 685 363 -257 -790 -1171 -891 113 1400 1496 866 -1223 -1853 -1159
1579a159J481J361K34q05j647j504J73J111J512J726p04j461k068j71O82J659
1595D20J440m56r05j165q53N59Q50Q74N57m14j244o78p3J027O60K60o04l8j06
1614A11l59j47N55J81J84o55l39J07M87M32m49q40j42P35P57j2k96l04m40l27
1634g61L10R25N61K15j065j408j36M99J559O50k15j465o18m30M44J287O74M13
1652A439r40j281j149K98J391J714K37j271j374l40N11R86M88J51n3m65q04o86
1670a148L57J139O68l10q02o57L99J80O5k39N55K67m90l27L00J03K89n16m44N24
1690h7M30J73j52n91q14L80M61O79J81R8n39p90m62j5J173J227j34o97j376m85
1710a340M80J113P91L30q17p61n38o57Q11R60J180l87j490o00r9L77R36J91M11
$$ plain form
1579 -1159 322 1683 1917 1112 -535 -2039 -1866 -755 757 2483 1779 318 -1750 -1921 -1239 420
1595 420 1860 1404 499 -666 -1519 -960 -110 764 1321 907 -337 -1015 -1088 -61 599 859 255 217 111
1614 111 -248 -395 160 341 525 -130 -469 -362 125 557 108 -732 -874 -139 618 606 310 6 -434 -761
1634 -761 -451 474 1035 1250 185 -1223 -1359 -860 699 1349 1134 -331 -949 -1379 -935 352 1026 1439
1652 1439 499 -782 -1931 -1633 -242 1472 1709 438 -936 -1276 -765 221 709 860 807 342 -462 -1148
1670 -1148 -791 348 1016 706 -96 -753 -354 -174 -109 -348 207 474 -16 -343 -43 60 349 -167 -611 -87
1690 -87 343 516 364 -227 -1041 -661 -200 479 660 758 219 -571 -1033 -1048 125 1352 1218 521 -855 -1340
1710 -1340 -860 253 1044 1374 557 -204 -742 -1399 -588 372 1552 1165 -325 -925 -1024 -647 289 480 891
1729H91k50o04q35j46N09P62O39l05p48m56K63J74K03k57P8M42l56K59n66J40
1749a63J64J54j83q8J83M96k1p48o81K10Q40M22k9q00k04Q2k92J83O70O92J18
1770A005p58j330j35P71J057N25p68k90p61j80L16R5J019N72n92j001k36q7P24
1789e4O03K57m29n53l15k40L33N25M18r6J77q47m21K56N25N59m22m82N8M79q9
1810B42n50M8J79K12J35k67J69n1p3n42k13J76J249R3o88l04k55n1P5P22L35L82
1832A023l38r94p77K51R19Q16K61q49n30n37J86K75P31L18j98m37n26o57J72J159
1852B68Q40l25o84n08K09NR1L40L80j48l90n44j18M08K43L14j89j46J05l2J2j51
1874b0m00N99l3K71l34j40N4j03m30L05K01M73J40n39m44n12N13N55M74jk59m13
$$ plain form
1729 891 641 37 -798 -944 -435 327 966 661 -87 -543 -280 -106 97 -160 -82 360 4 263 -303 -163
1749 -163 1 155 -28 -116 67 563 542 -206 -887 -677 163 585 556 -244 -448 -366 -658 -475 195 887 1005
1770 1005 247 -1083 -1218 -447 610 1135 367 77 -684 -864 -548 -453 566 1138 546 -455 -691 -778 -54
1789 -54 549 806 377 -176 -491 -731 -398 127 545 449 626 -221 -642 -386 139 698 276 -206 -148 331 242
1810 242 -308 -260 -81 131 266 -1 168 117 44 -498 -711 -535 714 807 119 -185 -440 -491 -416 306 641 1023
1832 1023 685 -309 -1086 -835 84 900 1161 312 -218 -755 -569 -294 437 755 557 120 -406 -1063 -891 268
1852 268 1108 783 99 -409 -200 -195 -104 236 616 468 78 -466 -584 -176 67 381 192 46 151 119 131 -20
1874 -20 -420 179 146 417 83 -57 -3 -106 -536 -231 -30 443 583 44 -400 -912 -399 156 630 629 370 -43
1896d3o00RJ94O51Q13l13o07p19k27K53R07K00mk13j54m54n90L94O69N87j79n39
1918C5p03N34r4K72j06N04L9k39l59m83M69L13J5o0K4q9j32r9J22l39L55K14J39
1941C32j19k9m24j88O9o8Q62L97M21j113J04n12oJ171J82m43p44r7l16J0K63N76
1963C28M55N1p74q25K13K61L03N79k06p5k97m92n9K06P95L41m08l25n24M3M18
1984HJ8Q2M26k78k03k97O0P3K68k53O7LK24j38l6m53K49j47M46L84m3k44m85j52
2008d21O7J47O00j09K38p31n54K27P6Q11L34m81k54l25l6M4K06O68p9j05l92l05
2030c74j4N0O06K82j16k89m03j56KM34M12j40L25m18m33L0J4J17J40K78l89k61
2052c03J52l1j65L24J2m6J17J04l10j63k36K21M31N73l40k97n77L43j90K42R7
$$ plain form
1896 -43 -643 -634 -440 211 1024 711 104 -615 -842 -589 318 518 514 301 147 -307 -897 -503 166 753 574 35
1918 35 -668 -134 -228 44 -62 442 481 242 -117 -600 -131 182 197 137 161 72 -60 -159 -37 -376 -21 193 332
1941 332 213 184 -240 -428 -359 -427 435 832 1253 140 244 -268 -274 897 1079 636 -108 -205 -521 -511 -248 328
1963 328 783 834 60 -765 -552 -291 12 591 385 310 13 -479 -538 -332 463 804 396 71 -453 -410 8
1984 8 26 108 534 256 53 -244 -184 -111 157 -96 -29 -26 198 60 24 -429 -180 -327 119 503 460 216 -269 -421
2008 -421 -354 -207 393 284 522 -209 -763 -536 -460 351 685 204 -50 -375 -411 -367 -161 507 428 323 -69 -374
2030 -374 -388 -338 268 550 434 145 -258 -414 -412 22 434 294 619 201 -232 -202 -188 -71 69 347 -42 -303
2052 -303 -151 -182 -347 -23 -11 -57 60 164 -146 -309 -545 -324 107 680 340 43 -534 -191 -381 -139 -42
2073d2N83J08n93j62n34M95M18M52k56l22j07m90k85K44N14N81l67P0p41q2J94
2094c22Q4N08N6J74n06m31O7L74m0K31J09k21r8j84j69J38K66J24r5o4o0l04J62
2117b01j22L5L64K86k20l3k09p4l10N01J08K95k39k28l03r1K20J46K74J43j67
2138A75k38l64J14k06Q77P5k16j06l07j25K7J11N17J53j14j76m79J57q3J44L05
2159B41q8r0j54o2j73J35L84j0p2J03n55L9o9L57J35j48L47k54m7j94L9K3J72
2182E9K50J26j27m13q4m10L33K14L91R7k90k70k71J05J20L65L23m8n36n7l08R7
2204c34J88J43M13j02j35p41L02L9L37J96K22k67j60n22J99J36J83L78l77o7o6
2225c5j84K07M4R7J50k3j0n05M9J36J42JM5K01k40j81j72J14K00K07k58N93m84
$$ plain form
2073 -42 541 649 56 -106 -640 -145 273 725 469 147 40 -450 -735 -491 23 604 237 307 -434 -516 -322
2094 -322 -238 270 326 500 -6 -437 -370 4 -36 195 304 83 -15 -199 -368 -230 36 160 65 1 -59 -363 -201
2117 -201 -323 -288 76 362 142 109 -100 -174 -484 17 125 420 181 -47 -350 -441 -221 -75 199 342 175
2138 175 -63 -427 -313 -519 358 433 217 111 -196 -321 -294 -183 334 487 373 197 -282 -125 -208 -64 241
2159 241 153 63 -91 -153 -326 -191 193 183 111 214 -341 -302 -371 -14 121 -27 320 66 19 -175 -136 -113 59
2182 59 309 435 308 -105 -189 -599 -266 -52 339 436 146 -124 -395 -290 -170 195 518 470 -66 -123 -431 -334
2204 -334 -146 -3 410 308 173 -568 -266 -227 110 306 528 261 101 -421 -222 -86 97 475 98 31 -35
2225 -35 -219 -12 32 129 279 256 246 -259 -210 -74 68 69 114 315 75 -106 -278 -164 36 243 -15 578 94
2248I4j6l95J45n2M53M6j37j70k56PQ9l7N90J65j65o67k96M94q6L46L2M2j00k15
2272h9j95k52L88J54M09k50j26j34j36k12O40K39k58K59o56o9p8K48K87p4N7k15
2294f3P4k91M3L68j27K44j27n1N6j82k46L02j00J00K92l42k02K17m29R1L12J12
2316E1L5K0j86l38K24N9K62J06o7Q2l06J0O7N9J10J4Q6O6l87k51P4M27l4J83k41
2341A25m6k99J7J03Q4M28k54j87J81k86K87k33J39J45j52j08mJ8K47J48k48q9
2363A6j23L80l55J11k1q6n4J31j2J96j23l21J55J64q7L59l13N8k74J22M0L2p8
2386h3M4J18o7p3j73L30o2p4M93m44n0r7J69j84j56N91o3l08kk85M20J3l5L19
2410C41l87k14J62k64M82l29M56j68k95Q8N6M0J36j53K05Ok3j50k62Q7Q7L92j90
$$ plain form
2248 94 78 -317 -172 -224 229 275 138 -32 -288 -281 -192 -229 361 526 361 -306 -602 -108 -194 152 184 226 126 -89
2272 -89 -284 -536 -148 6 415 165 39 -95 -231 -443 197 436 178 437 -219 -288 -366 -118 169 95 152 -63
2294 -63 11 -280 -237 131 4 248 121 70 126 -56 -302 0 -100 0 292 -50 -252 -35 -464 -373 -61 51
2316 51 86 106 -80 -418 -194 -135 127 233 166 248 -58 -48 19 78 188 202 288 354 -33 -284 -210 217 183 366 125
2341 125 79 -220 -203 -100 -16 412 158 -29 152 -134 153 -80 59 204 52 -56 -60 -42 205 353 105 16
2363 16 -107 273 -82 29 8 -78 -132 -1 -13 183 60 -261 -106 58 -29 330 17 75 -199 -77 -37 -5 -83
2386 -83 -39 79 12 -61 -234 96 34 -40 453 9 -41 -138 31 -153 -309 282 219 -89 -91 -376 44 57 22 341
2410 341 -46 -260 -98 -362 120 -209 247 79 -216 -128 -72 -32 104 -49 156 162 139 -11 -273 -186 -99 293 103
2433A03k8k04j62L79j76j71M47l10L48l78j93K92J88l01J42l6k2J33l26Q2K26
2454C3R8j9J84q1m48M6K09J77k50K28J55n22J98j15q7J10M23j94J55m36P4j54
2476b16j5R9J23J86k2m50J23K24l63K38q0N3j05J24J26j99M4J8J41J89k18Q8j56
2499d8j80K83O0n4L3%o4M9j78J52K07k30j7L8l76P2K88k13L5J11M04j20k04k10
2523a62Q8J40J72j8k2j64k50K14k30R3K65J78k20Mk78j82n1N57k8P3k26K24r6
2546H1J2rR3r3J76p4k23O9J02j48k6K04Q7q4k03R0j30K41k09K87l36M58l04k11
2570a50N6j47N41k50j00L91k65k69K14r6J4J68K98k99j45p4nM7M50j49j87P5k93
2593a75j16p5L12K63l0K39l01n14K05L61j82K38j0j98J57j63l93L32q1J72J14
$$ plain form
2433 103 75 -129 -291 88 -88 -259 188 -122 226 -152 -345 -53 135 -166 -24 -60 -82 51 -275 -193 33
2454 33 131 112 296 215 -233 -187 22 199 -51 177 332 -190 8 -107 -194 -84 339 145 300 -136 -62 -216
2476 -216 -231 -132 -9 177 155 -295 -172 52 -311 -73 -153 -100 -205 -81 45 -154 -110 -92 49 238 20 108 -48
2499 -48 -228 55 115 61 94 94 30 79 -99 53 260 30 13 51 -325 -253 35 -178 -143 -32 372 252 48 -162
2523 -162 -74 66 238 220 198 34 -216 -2 -232 -139 126 304 84 88 -190 -372 -423 134 106 179 -47 177 81
2546 81 93 84 177 84 260 186 -37 32 134 -14 -40 164 251 167 -36 54 -76 165 -44 243 -93 365 61 -150
2570 -150 -94 -241 300 50 -50 341 76 -193 21 -75 -61 107 405 106 -39 -113 -118 -71 379 230 43 118 -175
2593 -175 -291 -366 -54 209 179 418 117 -397 -192 169 -13 225 215 17 174 11 -382 -50 -131 41 155
2614A55p7l95R3J94k73L18K44l46K61j95P9M6l0J00Q7j19j11N8j46K6L8M2MO1
2638A14k8J24l41n0J52j78L99j8k75j84K51r3J07k5M41r5l52J10l35M30j55L59
2660C58j98J93o63L01j73M52l31K48k03K88k77k99J61K41L64l11K8k88q8j20J74
2681a43J90j5p6L05j38m17K4ML55J70k96L54K5m46pL5J05K30Q8j70p2m03J06J08
2705h4o9K02J4K57m53P6J80m50N09k11R3nn1n2p9o4M88jj05p1r5j78K01Q0R1l3
2731A90l18K96K59l85j76N8J47J68j08J21n25R2NP7J21n0J99k79p9J71K1k26L63
2754A42j78M2n4K5k61K58j72j80L89J5m3L8p4N2J99J57m11J52k04K87l92q0M18
2777A25m6o8p45N31k9O20j18j130N11J57M91j466J703j10j529J700j452J745q43
$$ plain form
2614 155 78 -317 -224 -30 -303 15 259 -87 174 -21 58 104 74 174 261 142 31 89 -57 -31 7 49 53 114
2638 114 86 210 -131 -181 -29 -207 192 174 -101 -285 -34 -127 -20 -45 396 301 -51 59 -276 154 -1 358
2660 358 160 353 -310 -9 -182 270 -61 187 -16 272 -5 -304 -143 98 462 151 179 -109 -197 -317 -143
2681 -143 47 32 -44 261 123 -294 -270 -266 89 259 -37 317 342 -104 -111 -76 29 259 347 177 105 -298 -192 -84
2705 -84 -153 49 63 320 -133 -57 123 -327 182 -29 64 59 8 -44 -123 -187 301 300 195 124 29 -149 52 132 223 190
2731 190 -128 168 427 42 -134 -76 71 239 131 252 -273 -181 -176 -99 22 -28 171 -108 -187 -16 5 -221 142
2754 142 -36 6 -48 -23 -284 -26 -198 -378 11 26 -17 21 -53 -1 198 355 -56 96 -108 179 -213 -293 125
2777 125 79 11 -734 -203 -232 388 270 -860 -349 -192 299 -1167 536 426 -1103 597 -855 890 47
2796D7l17O43Mp65Q22o14p8L36j82J23r93J463N62j484J39J80K73K63K01j057
2816d34L2Q38n26m5J13L16j147Q96m32M90p64R8P6O74n24J003n77Q5K11k94n27
2837d38P57L4o96J101l33j505J455o62N20j55n99J363r32J65l47J43k20L05K25
2856A81k23L2M85o37K8N5j1lO0k9L6J47l30K53J54j18Q4j02j01J33k35L37m03
2879b07L61Kk08R1J3R0m69L01J97n18K98K3J23k8k20K13j7k4j50K78j33j91R9
2902g6L82m24K54l13K3J27L04j29j09R5k03M2K58k45p5L02k10P8M2l13M46l6o8
2925A52j43l2j33J72J39M1l24m3K50l04k6K25q4J91l37L64j63j47J3L1J25J14
2947H1j71N9m5Jr6L66k09j60R4J06M3O2j03k43Q8J4K00k77M78l38J41j20O0k74
$$ plain form
2796 47 -270 373 377 -388 434 -180 -258 78 -104 19 -974 489 1051 -433 -294 -114 159 422 623 -434
2816 -434 -402 436 -90 -135 -22 294 -853 43 -389 101 -663 -565 -489 185 -339 664 87 172 383 89 -438
2837 -438 319 353 -343 758 425 -1080 375 -287 233 78 -521 842 -90 75 -272 -129 -349 -44 181
2856 181 -42 -10 475 -162 -134 -79 -90 -93 -33 -62 -26 121 -209 44 198 80 164 62 -39 94 -141 196 -207
2879 -207 154 156 -52 39 52 142 -327 -26 171 -347 -49 -26 97 69 -151 62 45 21 -129 149 16 -175 -76
2902 -76 306 -118 136 -177 -154 -27 277 148 39 134 -69 -27 231 -14 -89 213 3 81 123 -190 256 220 152
2925 152 9 -23 -156 16 155 196 -128 -171 79 -225 -251 -26 -110 81 -256 108 -55 -202 -189 -158 -33 81
2947 81 -90 -31 -76 -75 -171 195 -14 -174 -80 26 69 131 28 -215 -127 -113 87 -190 288 -50 91 -29 31 -243
2971b43J24J07J56k04N6j20P3K32k31K96ol31L6j7j59K39J34r2J56l04n5R4L7
2994b2r4L28k05j8jq1p8J00r2J59KL7K2k98M07n02L23k65M30j84K63r8k34M6j35
3019a90K75j87J50K23n40J8L48KJ20K1j04p9m4j13L25j24j16j69N45n83J48jk01
3042b76L76r4n7K52k45J2l5J9J73l73J53j4K62j16j10R0q6K17m20M90k45j20K95
3065A48j96k1K85k86J91k87J35j87J08L59k20j45N9k03qK45j8r2J34J16j6l15
3087b14R3J56K10k37J79k19L6q2K69Mj29q4Pj13J13r1n1J69M3M4j08J17o4M7k48
3112a53J31Q2R9J2J12q3j0k17o2J13j96L92l20R6j03K18q2K06j44j57j03K60j16
3135b5n0J42kRmL7r2L01j85n33M13R7j35k81M25r0J89j41J13q7k03J61O3k32k3
$$ plain form
2971 -243 -119 -12 144 -60 -4 -124 -51 181 -50 246 240 -91 -55 -72 -231 8 142 50 206 -98 -153 -59 -22
2994 -22 -116 212 7 -11 -12 -93 -171 -71 -163 -4 -2 35 57 -241 166 -336 -13 -278 152 -32 231 133 -101 -55 -190
3019 -190 85 -102 48 271 -269 -251 97 99 219 240 136 57 13 -100 225 101 -15 -184 361 -222 -74 -75 -276
3042 -276 100 6 -51 201 -44 -32 -67 -48 125 -248 -95 -109 153 37 -73 17 -69 148 -272 218 -27 -147 148
3065 148 -48 -69 216 -70 121 -166 -31 -218 -110 249 29 -116 -57 -260 -268 -23 -41 -133 1 117 101 -214
3087 -214 -121 35 245 8 187 -32 4 -78 191 195 66 -18 -11 -124 -11 -102 -153 16 59 103 -5 112 48 95 -153
3112 -153 -22 60 159 171 283 200 190 -27 -89 24 -172 220 -100 -4 -107 111 29 235 91 -66 -169 91 -25
3135 -25 -75 67 65 74 70 107 15 316 131 -402 11 108 -27 -308 117 27 216 75 188 101 -102 59 122 -110 -133
3160a33M63k69k38k2lP4J90j88M24k35j8k65J16m7L19l94J91L29l66P9J39j63
3182a7O1M3k61J77j49J68k14K01M4n8L0L01o00L67n5nQ7k10J67k85J73K13j36
3205D2n7r9N8J03oj94l9K74l74J7M27j18k53K64k81O8M32k90K90j69j75L8O7N9
3229H4Pj83l01K53N2N8K51k96J13R8j73J90j47Mq9J11k4J1L8p7J59k98K0J95n2
3254Dl77L00J62j89L26l47M3M9l0J64k66K77m1j99L77k13P0k08Q4J74m69L86p7
3277@k02L11k28K65j82q7J46k52L17J05l42P2J55q6k31M03m04K43J4l9k17K99
3299F0J53l40J56J8J42j68k03n6L05j3q7L2j10K15l41J69k05J71J23k59J12J9
3321a07j92J70K67L2j06j80K69k71L63j70R2M5k05J13j92J11q9K93p0l6p1l11
$$ plain form
3160 -133 330 61 -177 -199 -202 -128 62 -126 298 63 45 -220 -104 -151 168 -226 -35 294 -72 7 146 -17
3182 -17 44 87 -174 3 -146 22 -192 9 53 -5 25 326 -274 93 38 33 120 -90 77 -208 -35 178 42
3205 42 -15 -114 -56 47 41 -153 -192 82 -292 -275 152 34 -219 45 -236 -168 264 -26 264 95 -80 -42 25 84
3229 84 91 -92 -393 -140 -88 -30 221 -75 38 136 -37 153 6 10 -79 32 8 19 57 -20 139 -159 -139 56 4
3254 4 -373 -73 89 -100 226 -121 -78 -29 -59 105 -161 116 75 -124 253 40 110 -98 -14 160 -309 77 0
3277 0 -202 109 -119 146 -36 -123 23 -229 88 193 -149 -77 78 -8 -239 164 -240 3 17 -22 -239 60
3299 60 213 -127 29 47 189 21 -182 -238 67 54 -33 -1 -111 104 -237 -68 -273 -102 21 -238 -126 -107
3321 -107 -299 -129 138 170 64 -116 153 -118 245 75 167 212 7 120 -72 39 -50 243 173 137 66 -245
3343b45L30k00j66O60l30k23L8K55k32K18n7r8K30R8l62q2o4J50mK61j94L47n27
3366a97J1L18j71q4L22r2k05k65M81j2k63K13q4J71J9k25J15Kk0%j52K88m8n9
3390F3l07L2P7L70m04L66k98J74j83O1O1j9J2oj9J73o9o1R0j31j25l0K19r6k3
3415g3J48j27R5j16j44J50j73J35J03N3lL9k96K10Q6r5K01l50J71l8r2OK54l79
3439b35K93J83m08J42J29l70R4M65n37M36l28K70j28k47L08j54N1J15o4l15J65
3460a35K12R11j08p93n0M03q64N29p05J90K17K09k77M4J12l8j79K46L78k33O47
3481G16l34p24N41l31M03n25J063j172O87m70m15Q64R2n35Q4k1j7J83K37r8J55
3502C83l74k9J51k26J50O9J15j87N8n4k27K95k69j1K55k49L51l27P2j09Q4K29
$$ plain form
3343 -245 85 -115 -281 379 49 -174 -136 119 -113 105 48 -50 180 278 -84 -166 -230 -80 -84 177 -17 330 -197
3366 -197 -186 132 -39 -123 199 107 -98 -363 118 106 -157 56 -28 143 162 -63 52 54 34 34 -118 170 122 63
3390 63 -244 -212 -135 235 -169 197 -101 73 -110 -49 12 -7 5 -1 -20 153 84 23 113 -18 -143 -173 46 -50 -73
3415 -73 75 -52 43 -73 -217 -67 -240 -105 -2 51 48 87 -209 1 87 -8 193 -157 14 -24 -116 -110 144 -235
3439 -235 58 241 -167 -25 104 -266 -172 293 -244 192 -136 134 6 -241 67 -87 -36 79 15 -300 -135
3460 -135 77 988 880 87 37 440 -424 105 -600 -410 -193 16 -261 -217 -105 -143 -322 -76 302 69 716
3481 716 382 -342 199 -132 271 -254 809 -363 324 -146 -561 303 395 -140 -56 -77 -94 89 326 228 383
3502 383 9 -20 131 -95 55 124 239 52 110 56 -171 124 -145 -156 99 -150 201 -126 -54 -163 -79 150
3524A50k37R2LJ04n65N36k9L0p9J74k50j41M96k37K72n4m04rJ14k40M4K71k46
3547b05M8L56j29j34j39K81k4j88L6k4J85Kk42K17j4j54M3K49ql46j40M2L03L8
3571E3J79l77k0K42j74p7q2L03R1k12o2M14Kl32l1l9k3J60n6J63j11j99J50L1
3595gK4k66J97j9j40J25J27oJ04p5k70K35qo9J29r3P8k24M33k35j77K7L05j85
3619A0R3n0Q2k84J9k02N99k10m6J16m2j92J10j64l5J30j4K32m70K58Q9O2N5o5
3643H1n9M5k39L28p0o0K0j07K18j60L20l81N9j12r5K64K38m13N0J21l20L71j66
3666f7n3Q6R8P5k3j04KL0Q6j66Kj89J69K1j10L17k43J51p5k0k00K86J15l68O06
3691D26n13J52J44n79M52n5l0j1R1k7j24m6K71q2j9j18R8J4k79J84k16J07J57
$$ plain form
3524 150 -87 5 8 112 -453 83 54 84 5 179 -71 -212 284 47 319 265 -139 -148 -34 -274 -230 41 -205
3547 -205 -157 199 70 -64 -203 78 54 -134 -98 -122 63 65 -177 40 26 -128 -85 164 156 -190 -330 -288 15 53
3571 53 232 -145 -165 77 -97 -174 -256 47 138 -74 -136 278 280 -52 -83 -122 -145 15 -41 122 11 -188 -38 -7
3595 -7 17 -249 -52 -71 -211 -86 41 35 139 64 -206 29 21 -48 81 -12 66 -158 275 40 -137 -110 195 10
3619 10 103 53 135 -149 -130 -332 267 57 11 127 85 -107 3 -161 -196 -66 -80 152 -318 -60 29 91 146 81
3643 81 22 67 -172 156 86 26 46 -61 157 -3 317 -64 -5 -117 -212 52 290 -123 -73 48 -272 99 -67
3666 -67 -120 -34 64 139 116 12 14 44 130 -36 -34 -223 -54 -33 -143 174 -69 82 7 -13 -213 73 188 -180 426
3691 426 -87 65 209 -370 82 27 -3 -14 77 50 -74 -120 151 69 50 -68 30 44 -235 -51 -267 -160 -3
3714cq8L59k06n5k3q6n5K52j5K03l37K47k86J54j06J69r9O9j67o3n3K70M0k91
3738a70K1J78r8J78l23L04r8O6l5j72J47P7q1k60K84Q5K28l02j94J49J29j31M0
3761B2J04j63j81M60k28N5K73n38K26J58j66j03l0J78j09J75l03J30l19K99J7
3782d3J97o1J75l87K90p3l42Q9L00R1l23l8K55j94m23L42K10k85K21N8k34k4L6
3805a63Q7K5O2K37j77k33K31q0J17j27k99M86o2o1j9m25O56j51K33m46J47o9j7
3828d8O8K4L15k69k0J77l36K14k27J04n3l6J39m35L78L18K38k90n82K56L77k63
3850D9M04k18m93M20k31Q5j5r7J89l38J64L9J71k46J38k3Kj02K99mj13P5j20M3
3874G8j24k9j1J9J91l50J48j3R6o1L52o4l99J26R8j47m3K43M3k04k31M54l81R1
$$ plain form
3714 -3 -91 268 62 7 -16 -102 -157 95 80 283 -54 193 -93 61 -45 124 25 94 -73 -136 -189 81 121 -170
3738 -170 -149 29 -69 109 -214 90 -8 58 23 -149 -2 75 -6 -266 18 103 331 29 -165 -16 113 -18 22
3761 22 126 -37 -218 242 14 69 342 -196 30 188 22 -81 -111 67 -42 133 -170 -40 -359 -60 -43
3782 -43 154 93 268 -119 171 98 -244 -155 145 236 -87 -125 130 -64 -487 -145 65 -220 1 59 -175 -199 -163
3805 -163 -76 -51 11 248 71 -162 69 -11 106 -21 -320 166 104 43 24 -401 255 104 337 -109 38 -31 -48
3828 -48 20 44 359 90 70 247 -89 125 -102 2 -51 -87 52 -383 -5 313 551 261 -321 -65 312 49
3850 49 453 235 -258 162 -69 16 1 -96 93 -245 -81 -42 129 -117 21 -2 0 -102 197 193 80 155 35 78
3874 78 -46 -75 -86 -67 124 -226 -78 -91 5 -56 296 232 -167 -41 57 -90 -133 110 153 -51 -282 172 -209 -118
3898a18j23J22K35q0k57J40K91l58n2P3L32Rl37N7J57j72j55K84k19J13L2j39
3920a65k3K24l4J50J0j14L0k62K30p9K43l95M43k52p1j36L22j25K87j47k09q2
3942a55R0j03M9P2M7l5L05j6Q1l24j24qP8K80k24J25l99R0n0K78J00j15J44J9
3966B05k15p1M9J7Q5m7o0J83l4j43lj57P6J70N2j95l01j4L04j7J15Q10j349N27
3990a3j79O24ro90P77k6n28L6N38q59O83j84o90M04p89J049o05P88K01n26P3k13
4012a38k75P13N41n99K08L5n70R78o56j082M76K99k29m88J727j297l38K74k23
4031f44N74j74J396j319P59o13l15R8j05J07J35O44m08m84O15l35P50J30l98p1
4051C42k18j288J468k30n65R99r90M43J91q43P46M52o60r1K00K5j24k7J88J16
$$ plain form
3898 -118 -241 -119 116 36 -221 -81 210 -148 -200 -127 205 214 -123 -66 91 -81 -236 48 -171 -58 -26 -165
3920 -165 -188 36 2 152 162 48 78 -184 46 -33 210 -185 258 6 -65 -201 121 -4 283 136 -73 -155
3942 -155 -65 -168 -119 -47 0 -35 270 254 335 11 -113 -121 -43 237 13 138 -261 -171 -221 57 157 42 186 205
3966 205 -10 -81 -32 -15 70 23 -37 146 112 -31 -34 -191 -115 55 107 -88 -389 -403 -99 -116 -1 809 -540 -13
3990 -13 -192 432 423 -267 510 484 -44 -8 530 -329 354 170 -520 -116 -905 144 -461 327 528 2 75 -138
4012 -138 -413 300 841 242 450 485 -85 893 237 -845 -369 -70 -299 -787 940 -357 -695 -421 -644
4031 -644 -70 -244 1152 -167 592 -21 -336 -238 -343 -236 -101 543 135 -349 266 -69 681 811 413 342
4051 342 124 -1164 304 74 -491 508 -482 -39 152 -691 55 507 -153 -244 -44 -19 -143 -170 18 134
4071A34j58J62n8l7O5k81K65Q1m25L87J18M6j50m86K69n6j98L01J44J19j93J1
4093F0r3l43K46L11k66L22l11K4r0o9K70J20j04M5m03J95Q7N0qK4K4R1k06j18
4117a42J43L88k52M1k71j28K52J53k69J2M9n9K30l30K27k35j87N20L9p7rM5k72
4140a32K71k60J09M5L3K08j14j98J98j53M6J75k49N8k43J52m6J49q5J46PJ71m31
4163a43J93j35j2J34Q3on2J7k3p0K17k60QL07l48L3k66K53j33J63P8m0n8l31N31
4188A40l04K63J15M8m38L49l65J32K85j79L0l5J0k29K1J22j20M16k17r0K72q6
4210A40M5j73Orl3N9L20k59q1M1r1r9J00J75k9l04M0j6m8K24J61j52k24K79m8
4235B4j70K12m4k74M83k81N2j4K05j50J07p8K5M1l34J23J41l60L66j51j33K49
$$ plain form
4071 134 -24 138 80 43 108 -173 92 173 -252 135 253 299 149 -337 -68 -124 -322 -21 123 242 49 60
4093 60 -33 -376 -130 181 -85 237 -74 -50 -140 -209 61 181 77 122 -281 -86 1 51 43 67 91 182 -24 -142
4117 -142 1 389 137 178 -93 -221 31 184 -85 -73 -24 -83 147 -183 44 -191 -378 142 181 104 95 140 -132
4140 -132 139 -121 -12 33 66 274 160 -38 160 7 53 228 -21 37 -206 -54 -100 49 -36 110 117 288 -143
4163 -143 50 -85 -97 37 120 114 62 79 56 -14 203 -57 -49 258 -90 -57 -323 -70 -203 -40 38 -2 -60 -391 140
4188 140 -164 99 214 262 -176 173 -192 -60 225 46 76 41 51 -178 -157 -35 -155 261 44 -46 226 140
4210 140 185 12 18 9 -24 35 355 96 15 56 -35 -134 -34 141 112 -192 -152 -168 -216 8 169 17 -207 72 24
4235 24 -146 66 22 -252 231 -50 2 -12 193 43 150 72 97 138 -196 -73 68 -292 74 -77 -210 39
4257C9q8O0j05r6P7M52p50L60kl80M51l03K26k5l4j32K40k4J19q6J0K13p3j93
4281d4j02K89k27K84j31J68k59k67N28l01J53Kl6k08O9r7L62k64q5J82k47L08
4303G7n0L2j35p0L43j51N7L3l09Q1R0J84j53l34K17l4J2L7p6J59j17J00J32k40
4327a15p5M24k24j97J15L94m71K74j84j50K37K7J44j22k02R0j20R4j20J40J53
4348A12j36K2N6J27q4r0R9k32K57k56L57k61l5K00k47K84l60J82j44j80J77K4
4370a28J77l7L45l46j71J30j79n8n8K64K38k40Q3J38r8k69L12j79J00k5N3j78
4392a26Q9K5k9K63j61K08l13M5N6J40k95j14K08O7m66L13J64j11n1K29k98N0O8
4415c9L8o1j16L93l67j49J96q3K00Q7k13N77k33j69J28j3j53J64K8k60L69l62
$$ plain form
4257 39 -49 11 -94 -190 -113 339 -411 -51 -53 -433 18 -285 -59 -84 -118 -250 -10 -34 85 -1 9 222 149 -44
4281 -44 -146 143 -84 200 69 237 -22 -289 239 -62 91 93 57 -151 -82 -179 183 -81 -166 16 -231 77
4303 77 27 59 -76 -146 197 46 103 136 -173 -92 -2 182 29 -305 -88 -122 -110 -73 -149 10 -107 -7 125 -115
4327 -115 -190 234 10 -187 -72 322 -149 125 -59 -209 28 55 199 77 -125 -35 -155 -61 -181 -41 112
4348 112 -24 -2 54 181 97 7 106 -126 131 -125 232 -29 -64 136 -111 173 -187 -5 -149 -329 -152 -128
4370 -128 49 12 357 11 -160 -30 -209 -267 -325 -61 177 -63 20 158 60 -209 103 -76 24 -1 52 -126
4392 -126 -37 -12 -41 222 61 269 -44 1 57 197 -98 -212 -4 63 -403 -90 74 -37 -88 141 -157 -107 -39
4415 -39 -1 -62 -178 215 -152 -301 -105 -188 12 99 -114 463 230 61 189 176 23 187 215 -45 324 -38
4437c8Q6l82K95L48j87l2o2M4k2L09o56L27l7j3N3M7m11J97K07l3j22K4n7K8O
4462h1N7k84L36k5K1j30p6M8j2J33N9J66k09k15K48N3j01J60j5K5J6o7K3o8j68
4487a06k49N94l49J83o3l05K45J70j88j37M1J61j66j05K25P7j14R7O3J84m44L53
4509A67k41K76k15J38j93j66L16l02L39L0l68L89L7k19k5R3J86l34l6N9j8j76
4531b63J03k12J20j0K35P7j85N9K0l25M49K90l41k90L71j37J28k65K35q5N1K96
4553C21l69l2L0p5N6M4J17R6j98J00k17Q9j08K77j05J50O9m41l1P5M0L29J62k44
4577A35j32j7k29K18K41j01j65J73j21L1R6R2k60j0N0Q8q8J6j46K24K3l75L43
4600H6N9k61K38r0KNr4J56p0oM2k9k1O4R7k63N9j03J65J87k60p2O5R8j22O0o5
$$ plain form
4437 -38 48 -334 -39 309 122 90 28 72 50 359 -297 30 -7 -20 33 80 -331 -134 73 40 -82 -58 -115 -87 -81
4462 -81 -24 -308 28 3 24 -106 -182 -134 -146 -13 46 212 3 -212 36 89 -12 148 133 158 174 107 130 62 -106
4487 -106 -355 239 -110 73 10 -295 -50 120 -68 -205 -164 -3 -169 -274 -49 28 -86 11 74 258 -186 167
4509 167 -74 202 -13 125 -68 -234 82 -220 119 149 -219 170 207 -12 -37 56 242 -92 -128 -69 -87 -263
4531 -263 -160 -372 -252 -262 -27 50 -135 -76 -56 -381 68 358 17 -273 98 -39 89 -176 59 -26 25 321
4553 321 -48 -80 -50 -125 -69 -25 92 188 -10 90 -127 -38 -146 131 26 176 245 -196 -227 -152 -112 217 379 135
4577 135 3 -14 -243 -25 216 115 -50 123 2 33 129 221 -39 -49 1 89 1 17 -129 95 118 -257 86
4600 86 145 -116 122 32 34 39 -55 101 31 25 67 38 17 81 178 -85 -26 -129 36 223 -37 -109 -44 54 -68 -8 -73
4627g3o9J77j96q9K15K59k40l46N42K4j45k45M24j07m71J74J31L93k03n1J0N3
4649A67N2k86k7L20J20r1l32P3P6k16n2L90j19l3n0J0J09n8j07R9K3k31N3n2K11
4674D9L1L21n79L17j45J41j95k20L72k02qL51j15j58K10j76J4J23p2k14M81l20
4696FJ50J6j37K16j72n7Oj51jj14J61K65L4k99J54O2k85L57k90J88K0p3r1k14
4720b49K22J1J21j43k31L90j62K9N6p0j47K57P4n5J1j35O7JJ4K08k89L9k11R4
4744i8O6K98jr6l6j09J10J87k81k24J20j09K89N4k43J42q1L24m95J15K20j52j84
4767a84M4K27Q5k31L85J1m89J29j41M27n04K30j73k16K54n9K56K0J43r7q0oQ1
4790A12j26J2K36k59J32j44P6K45r8n1j02l1J19k86J78r5j6J79k57K87J9k95K49
$$ plain form
4627 -73 -142 35 -161 -250 -35 224 -16 -362 180 204 59 -186 238 131 -340 -166 -35 358 155 104 114 167
4649 167 219 -67 -94 226 346 255 -77 -4 72 -144 -196 194 75 42 -8 2 111 53 -54 45 68 -163 -110 -162 49
4674 49 80 401 -178 139 -6 135 -60 -280 92 -110 -118 233 118 -40 170 -6 8 131 59 -155 326 6
4696 6 156 172 35 251 79 22 28 -123 -124 -238 -77 188 222 -77 77 139 -146 211 -79 109 129 56 -35 -249
4720 -249 -27 -16 105 -38 -269 121 -41 -12 44 -26 -173 84 158 103 114 -21 46 47 61 269 -20 19 -192 -98
4744 -98 -32 266 265 169 133 24 134 321 40 -184 -64 -173 116 170 -73 69 -12 312 -183 -68 152 0 -184
4767 -184 -140 87 172 -59 326 337 -152 -23 -164 263 -241 -11 -184 -400 -146 -205 51 71 214 117 37 31 112
4790 112 -14 -2 234 -25 107 -37 39 284 186 135 33 2 121 -165 13 -82 -98 81 -176 111 130 -165 84
4813H4n3J7j40J33K16l67L63k56l7j72q0O06k15j28Q7K01k50p7J38k56M90n15
4835b11J89j41M5N2j8J41P9j30L0J93l48K24j27R6R5k62Q2J47n5J94M0k45l17
4858b47K88o8j89J41K19r7Q3Q1l48R2J64k12j86J80R7r6M11k13k94n4L68j61J33
4881I2l6M2p6M8k59K65j27L78j35Nj38o1J49m9R3m50J48p5Q0J87j19N4k7j08Q1
4906c8o5j31M59l89M36l76o5K33j26L05l17J10n9m1N4l90L73J43K3k66K2J71p4
4929hK2J91k70J65j07P8R5j64j63K45m5k4O0j21J35L7J60k50p1J83r9M9J02Nm27
4954b22Q0J84p4J60j88J60o6J9k3K21k92j30J76o0J21r0O7k11K23r2j08J50K2
4977B7L35m37J4J08J45J49k83J07l32K60k55J70J84k38J5J26J02r7l11M30k18
$$ plain form
4813 84 31 48 -92 41 257 -110 253 -3 -40 -212 -292 314 99 -29 58 259 9 -68 70 -186 304 -211
4835 -211 -22 -163 -118 -66 -84 57 136 6 36 229 -119 105 -22 74 169 -93 -11 136 81 275 315 70 -247
4858 -247 41 -27 -216 -75 144 47 130 211 -137 -45 119 -93 -279 -99 -2 -98 313 100 -194 -248 120 -41 92
4881 92 56 98 22 70 -189 76 -51 327 192 197 59 -2 147 98 191 -259 -111 -186 -106 81 -38 16 -11 -119 -38
4906 -38 -103 -234 225 -164 272 -104 -169 64 -62 243 -74 36 -23 -64 -10 -400 -27 116 139 -127 -105 66 -8
4929 -8 14 205 -65 100 -7 71 166 2 -161 84 39 15 75 -46 89 126 286 36 -35 148 49 98 200 205 -222
4954 -222 -142 42 -32 128 -60 100 34 53 30 251 -41 -171 5 -55 66 -24 43 -168 55 -37 -145 5 27
4977 27 362 -75 -61 47 192 341 58 165 -167 93 -162 8 192 -46 -31 95 197 100 -211 219 1
4998Am6r0J11q7j2J38J88p5j95K78j88L7j48j93K85L52m0j22l20K16q7R7Q4j49
5022C5M3j15J3O8l47N52j63j8J83p65M52J5Q3n4j09K69M0m91M24k00K56j01k2
5045D8J15l29j45M22oj87Q5O3o1n8K79n23N12rk02m7k8J03O1j85M24l28L5J59
5069A98K9k43K46l38j2O2K76l32l5M2k19K04K19J7n1J55k82N2l7J34j48K57q9
5092A05J8p4L8m9rJ61k86R3L2j78n1K89j36J10J76l31O9J30J08K0k94l07O17j66
5116H5r2n4o6N1J70l00L45j64J84n2q1J7p9K35l16o9L33p1m09M26j56l0J73K33
5140C13l37J47j8k91J78J39K65m21n3j59J77K08j84P5J67l66P0J86j73M6j11L97
5162B55l1n1l47J53j1K5p5o6K19j75qK65q4nJ66k14oL58l34k1J50Mj73M0pj39
$$ plain form
4998 1 -45 -135 -24 -111 -123 15 203 128 -67 211 23 60 -88 -281 4 356 316 194 -126 90 3 100 184 35
5022 35 78 -37 -24 44 -303 249 86 68 251 -514 -62 -47 36 -18 -127 142 182 -309 115 -85 171 70 48
5045 48 163 -166 -311 111 105 -82 3 66 5 -53 226 -297 215 206 4 -43 -71 32 93 -92 332 4 39 198
5069 198 227 -16 230 -108 -120 -58 218 -114 -149 -107 -326 -122 97 114 63 218 -64 -12 -49 85 -63 194 105
5092 105 123 49 87 38 29 190 -96 -3 29 -149 -200 89 -47 63 239 -92 -23 107 215 235 -59 -366 251 85
5116 85 -7 -61 -127 -76 94 -206 139 -25 159 107 26 43 -36 199 -117 -186 147 76 -333 93 -63 -93 80 313
5140 313 -24 123 105 -186 -8 131 396 -25 -78 -237 -60 148 -36 39 206 -160 -90 96 -77 -31 -142 255
5162 255 224 173 -174 -21 -32 -7 -82 -148 71 -104 -112 153 69 64 230 16 10 368 34 13 163 167 -6 34 27 -112
5188a12J58J88j27j5k13R3j15J88n2k76J30K03K1j94K38P3m74l9L51M2j43N3%
5211b2j21K70L7j66Q3k65K06p0j15K79p7J51q9J66j87j58L53n64L13o8K27k47
5233f4j31N9L2M00m14J00O9K23o1k90M2N6r6m8J02j82J79k45L54j59j23K70k02
5256a29M36j76l3j11k60K15j82K34n5N0K5j34L3Q4J78k09J02r4K31l88L63k15
5278c5J09l7m1L6j23N9p3J09r9J13M5r6j66K32O1j75J08m8R1j2q5L87k51k54K16
5303G1K32l44K83j78l14K46L80k46j06R1n33J09K20jL74j84l41M20m40J33L9J15
5325B6J11Rj42n7n6L5Q0j20L01k19k5J68l69K69m3j7J86j86K57k09M6j28J15p0
5349c8N3oJ60K1l26M6n0L19J82m27P2Q0k7k93M93j32q5po8J08j52R9K5m8j52K1
$$ plain form
5188 -112 46 234 107 92 -121 -28 -143 45 -7 -283 -153 50 71 -123 115 188 -286 -325 26 68 -75 -22 -22
5211 -22 -143 127 164 -2 81 -184 22 -48 -163 116 39 190 101 267 80 -78 275 -289 24 -44 183 -64
5233 -64 -195 -136 -104 296 -118 -18 51 274 213 -77 -35 21 -75 -123 -21 -203 -24 -269 85 -74 -197 73 -129
5256 -129 307 131 98 -13 -273 -58 -240 -6 -61 -11 14 -120 -87 -3 175 -34 68 -26 205 -183 180 -35
5278 -35 74 37 -4 32 -91 -32 -105 4 -95 18 63 -33 -199 33 94 -81 27 -21 70 58 -27 360 109 -145 71
5303 71 303 -41 242 64 -250 -4 376 130 24 115 -418 -309 -89 -90 284 100 -241 179 -261 -128 -89 26
5325 26 137 146 4 -53 -109 -74 6 -114 187 -32 -57 111 -258 11 -32 -49 137 -49 208 -1 45 -83 32 -38
5349 -38 15 9 169 190 -136 -90 -140 179 361 -66 6 86 59 -234 259 127 42 35 -33 75 -77 22 47 -1 -153 -132
5375a32J50J4o8l38K11K56K43j80j09P7L6k03J57j75K9J02j03J6k08J44J47O9
5397A35m8o5k00J69p4K17k13K41J1j34J5P0j74k97K72P7o1j48M48k36p8j76J88
5420f1Q1J77j10k18KJ05K39j59r1J85n6k32J78j31J54q8K30k10Mj82K60J30l53
5443a46l9K64O0k82K84o6j50J23o5k04J33q6Q8J01J02J9k41K69j46n1K64k59K0
5466ho2J29K57l83K7k3Q5l4KJ29j08K03k99L31m46L13K47p5l16J08k14K80K0j77
5490a4J0J00J04k9q2pK9K81m74Q4J83l82K4J77J33p6K16m07L0K41j58k2K12r5
5514G8J9k09mnJ1J73M3l01L37m98L71J55j08K14p5n3l38K65j13k86K03L20Jm98
5538b98L82K01l15K9j21J50p2o8L18J86l65o2K28l66K6L61j52P6j60K7J20l8K5
$$ plain form
5375 -132 18 32 -36 -374 -163 93 336 156 47 124 160 -43 114 -61 -32 70 -33 -17 -225 -81 66 135
5397 135 87 22 -178 -9 -83 134 -79 162 173 39 54 124 -50 -347 -75 2 -59 -207 241 5 -73 -249 -61
5420 -61 20 197 87 -131 -129 -24 215 56 -35 150 94 -138 40 -91 63 -25 205 -5 -1 -183 77 207 -146
5443 -146 -185 79 139 -143 141 75 -75 48 -17 -221 -88 -174 -86 15 117 136 -105 164 18 -33 231 -28 -8
5466 -8 -70 59 316 -67 -40 -63 22 -12 -10 119 11 214 -85 246 -200 113 360 285 -31 77 -137 143 163 -14
5490 -14 -4 96 200 171 89 82 111 392 -82 2 185 -197 -173 4 137 61 277 -130 -100 141 -17 -39 173 78
5514 78 97 -112 -116 -121 -110 63 106 -195 142 -356 15 170 62 276 201 148 -190 75 -38 -324 -121 199 200 -298
5538 -298 84 285 -30 -1 -122 28 -44 -112 206 392 27 -35 193 -173 -147 214 62 138 -22 5 125 87 112
5561A12P5l01J11j0r3J2j29K07j38L15q0j40J27o1p0K82j81q7j79m8O8L77k13
5584d4J61j07j56Q8j14J51l7rK08j99r7J95M3R2R4l55M58n65L1R2K19l8j97O7
5608a9k10J02K1m8L13k69J12l98P06k81n9j40K65r8r4L52l34L56j46p2k94J02
5630a33K02k23K42J8j79J35o4j70J28N70m48o8oj30L43j88q0P7j17n6l8N3P3J36
5654G7k13J42rL6j85K44q7j64L04m7q0n5j5j34R0R8j09J35RJ16J9k21M8j9p0K30
5680A40j17M2O8O8l75L01L1k06J50J13r8K6o2j15k8M2P9k11oN8j5P7J17j34L12
5705B57j99m1k3J75j24j04J78j94K86j85p1K12m81M45l3J80m21L36k42j11K01
5726D1q7P9p7L24m41K41Q3j31N4k17p0R5J27L36m07J03L5p7j18R2n8J37K3P3n1
$$ plain form
5561 112 187 -114 -3 -13 -106 -94 -223 -16 -154 161 81 -59 68 7 -63 219 38 -49 -228 -276 -208 169 -44
5584 -44 117 10 -146 -58 -172 -21 -58 -67 141 -58 -155 40 83 175 269 -86 372 -193 -162 -70 149 111 -86 -19
5608 -19 -229 -127 -106 -154 159 -110 2 -396 310 29 -30 -170 95 -3 -97 255 -79 277 131 59 -235 -133
5630 -133 69 -154 88 106 -73 62 -2 -172 -44 526 78 10 4 -126 217 29 -51 26 -91 -147 -185 -132 -59 77
5654 77 -136 6 -3 33 -152 92 5 -159 145 98 18 -37 -52 -186 -96 2 -107 28 37 153 172 -49 -1 -20 -90 140
5680 140 23 65 133 201 -174 127 158 -48 102 215 117 143 81 -34 -62 -20 59 -152 -158 -100 -115 -38 79 -55 257
5705 257 58 17 -6 169 45 -59 119 -75 211 26 -45 167 -314 131 98 278 -143 193 -49 -160 41
5726 41 -46 33 -44 280 -161 80 163 32 86 -131 -201 -106 21 357 -50 53 88 11 -107 -15 -73 64 87 160 109
$$ [...]
8191i1
##END NTUPLES=NMR FID
##END=
