##TITLE=1H_desoxyDHA_2
 200.13MHz, CDCl3,
 8 sc
 
 14.2.2025
##JCAMPDX= 6.0         $$ Bruker NMR JCAMP-DX V2.0
##DATA TYPE= NMR FID
##DATA CLASS= NTUPLES
##ORIGIN= UXNMR, Bruker Analytische Messtechnik GmbH
##OWNER= pz
$$ XWIN-NMR		Version 3.5
$$ Fri Feb 14 13:59:11 2025 Russian Standard Time (UT+4h)  she@DPX200
##.OBSERVE FREQUENCY= 200.1313
##.OBSERVE NUCLEUS= ^1H
##.DELAY= (6, 6)
##.ACQUISITION MODE= SIMULTANEOUS
##.ACQUISITION SCHEME= undefined
##.AVERAGES= 8
##.DIGITISER RES= 18
##SPECTROMETER/DATA SYSTEM= spect
##.PULSE SEQUENCE= zg30
##.SOLVENT NAME= D2O
##.SHIFT REFERENCE= (INTERNAL, D2O, 0, 14.3821)
##AUDIT TRAIL= $$ (NUMBER, WHEN, WHO, WHERE, WHAT)
$$ ##TITLE= Audit trail, XWIN-NMR		Version 3.5
$$ ##JCAMPDX= 5.01
$$ ##ORIGIN= Bruker BioSpin GmbH
$$ ##OWNER= she
$$ F:/spectra/data/she/nmr/H-C/1/audita.txt
$$ ##AUDIT TRAIL=  $$ (NUMBER, WHEN, WHO, WHERE, WHAT)
(   1,<2025-02-14 13:56:39.65 +0400>,<she>,<DPX200>,
      <created by zg, POWCHK disabled, PULCHK disabled
       configuration hash MD5:
       00 E9 B6 7A A2 85 ED C7 34 08 36 98 17 FE 4E 26
       data hash MD5: 16K
       40 A4 3B 9B AA 1C 41 D5 46 C8 3C 91 14 5E 0A CD>)
$$ ##END=
$$ 
$$ hash MD5
$$ 9E 2A F1 9C 88 82 62 EB 25 C6 78 68 4E A0 F3 DE
##$RELAX= 
##$RELAX= 
##$RELAX= 
##$RELAX= 
##$RELAX= 
##$RELAX= 
$$ Bruker specific parameters
$$ --------------------------
##$DU= <F:/spectra>
##$EXPNO= 1
##$NAME= <H-C>
##$PROCNO= 1
##$TYPE= <nmr>
##$USER= <she>
##$AMP= (0..31)
100 100 100 100 100 100 100 100 100 100 100 100 100 100 100 100 100 100 
100 100 100 100 100 100 100 100 100 100 100 100 100 100 
##$AQSEQ= 0
##$AQ_mod= 1
##$AUNM= <au_zg>
##$AUTOPOS= <>
##$BF1= 200.13
##$BF2= 200.13
##$BF3= 200.13
##$BF4= 200.13
##$BF5= 200.13
##$BF6= 200.13
##$BF7= 200.13
##$BF8= 200.13
##$BYTORDA= 1
##$CFDGTYP= 0
##$CFRGTYP= 5
##$CHEMSTR= <none>
##$CNST= (0..31)
1 1 145 1 1 1 1 1 1 1 1 1 1 1 1 1 1 1 1 1 1 1 1 1 1 1 1 1 1 1 1 1 
##$CPDPRG= <>
##$CPDPRG1= <>
##$CPDPRG2= <>
##$CPDPRG3= <>
##$CPDPRG4= <mlev>
##$CPDPRG5= <mlev>
##$CPDPRG6= <mlev>
##$CPDPRG7= <mlev>
##$CPDPRG8= <mlev>
##$CPDPRGB= <>
##$CPDPRGT= <>
##$D= (0..31)
0 0.7 0 0 0 0 0 0 0 0 0 0.03 0 0 0 0 0 0 0 0 0 0 0 0 0 0 0 0 0 0 0 0 
##$DATE= 1739526999
##$DBL= (0..7)
120 120 120 120 120 120 120 120 
##$DBP= (0..7)
150 150 150 150 150 150 150 150 
##$DBP07= 0
##$DBPNAM0= <>
##$DBPNAM1= <>
##$DBPNAM2= <>
##$DBPNAM3= <>
##$DBPNAM4= <>
##$DBPNAM5= <>
##$DBPNAM6= <>
##$DBPNAM7= <>
##$DBPOAL= (0..7)
0.5 0.5 0.5 0.5 0.5 0.5 0.5 0.5 
##$DBPOFFS= (0..7)
0 0 0 0 0 0 0 0 
##$DE= 6
##$DECBNUC= <off>
##$DECIM= 32
##$DECNUC= <off>
##$DECSTAT= 4
##$DIGMOD= 1
##$DIGTYP= 9
##$DL= (0..7)
0 120 120 120 120 120 120 120 
##$DP= (0..7)
150 150 150 150 150 150 150 150 
##$DP07= 0
##$DPNAME0= <>
##$DPNAME1= <>
##$DPNAME2= <>
##$DPNAME3= <>
##$DPNAME4= <>
##$DPNAME5= <>
##$DPNAME6= <>
##$DPNAME7= <>
##$DPOAL= (0..7)
0.5 0.5 0.5 0.5 0.5 0.5 0.5 0.5 
##$DPOFFS= (0..7)
0 0 0 0 0 0 0 0 
##$DQDMODE= 0
##$DR= 18
##$DS= 0
##$DSLIST= <SSSSSSSSSSSSSSS>
$$ [...]
##$SUBNAM0= <"">
##$SUBNAM1= <"">
##$SUBNAM2= <"">
##$SUBNAM3= <"">
##$SUBNAM4= <"">
##$SUBNAM5= <"">
##$SUBNAM6= <"">
##$SUBNAM7= <"">
##$SUBNAM8= <"">
##$SUBNAM9= <"">
##$SW= 18.0517328524113
##$SWIBOX= (0..15)
0 0 2 0 0 0 0 0 0 0 0 0 0 0 0 0 
##$SW_h= 3612.71676300578
##$TD= 16384
##$TD0= 1
##$TE= 0
##$TE2= 300
##$TE3= 300
##$TEG= 300
##$TL= (0..7)
0 120 120 120 120 120 120 120 
##$TP= (0..7)
150 150 150 150 150 150 150 150 
##$TP07= 0
##$TPNAME0= <>
##$TPNAME1= <>
##$TPNAME2= <>
##$TPNAME3= <>
##$TPNAME4= <>
##$TPNAME5= <>
##$TPNAME6= <>
##$TPNAME7= <>
##$TPOAL= (0..7)
0.5 0.5 0.5 0.5 0.5 0.5 0.5 0.5 
##$TPOFFS= (0..7)
0 0 0 0 0 0 0 0 
##$TUNHIN= 0
##$TUNHOUT= 0
##$TUNXOUT= 0
##$USERA1= <user>
##$USERA2= <user>
##$USERA3= <user>
##$USERA4= <user>
##$USERA5= <user>
##$V9= 5
##$VALIST= <valist>
##$VCLIST= <CCCCCCCCCCCCCCC>
##$VD= 0
##$VDLIST= <DDDDDDDDDDDDDDD>
##$VPLIST= <PPPPPPPPPPPPPPP>
##$VTLIST= <TTTTTTTTTTTTTTT>
##$WBST= 1024
##$WBSW= 4
##$XGAIN= (0..3)
0 0 0 0 
##$XL= 0
##$YL= 0
##$YMAX_a= 98382
##$YMIN_a= -116973
##$ZGOPTNS= <>
##$ZL1= 120
##$ZL2= 120
##$ZL3= 120
##$ZL4= 120
##$ABSF1= 10
##$ABSF2= 0
##$ABSG= 5
##$ABSL= 3
##$ALPHA= 0
##$AQORDER= 0
##$ASSFAC= 0
##$ASSFACI= 0
##$ASSFACX= 0
##$ASSWID= 0
##$AUNMP= <proc_1d>
##$AZFE= 0.1
##$AZFW= 0.1
##$BCFW= 1
##$BC_mod= 2
##$BYTORDP= 1
##$COROFFS= 0
##$CY= -3
##$DATMOD= 1
##$DC= 2
##$DFILT= <>
##$DTYPP= 0
##$F1P= 0
##$F2P= 0
##$FCOR= 0.5
##$FTSIZE= 0
##$FT_mod= 4
##$GAMMA= 1
##$GB= 0.15
##$INTBC= 1
##$INTSCL= 1
##$ISEN= 128
##$LB= 0.25
##$LEV0= 0
##$LPBIN= 0
##$MAXI= 10000
##$MC2= 0
##$MEAN= 0
##$ME_mod= 0
##$MI= 1.114404
##$NCOEF= 0
##$NC_proc= 0
##$NLEV= 6
##$NOISF1= 3.799351
##$NOISF2= 2.8
##$NSP= 1
##$NTH_PI= 0
##$NZP= 0
##$OFFSET= 14.38212
##$PC= 1
##$PHC0= -469.3214
##$PHC1= 14.59221
##$PH_mod= 1
##$PKNL= yes
##$PPARMOD= 0
##$PSCAL= 0
##$PSIGN= 0
##$REVERSE= no
##$SF= 200.129724274929
##$SI= 16384
##$SIGF1= 3
##$SIGF2= 2
##$SINO= 400
##$SIOLD= 16384
##$SREGLST= <1H.CDCl3>
##$SSB= 0
##$STSI= 0
##$STSR= 0
##$SW_p= 3205.1282051282
##$SYMM= 0
##$S_DEV= 0
##$TDeff= 0
##$TDoff= 0
##$TI= <>
##$TILT= no
##$TM1= 0
##$TM2= 0
##$TOPLEV= 0
##$USERP1= <user>
##$USERP2= <user>
##$USERP3= <user>
##$USERP4= <user>
##$USERP5= <user>
##$WDW= 1
##$XDIM= 8192
##$YMAX_p= 0
##$YMIN_p= 0
$$ End of Bruker specific parameters
$$ ---------------------------------
##NTUPLES= NMR FID
##VAR_NAME=  TIME,          FID/REAL,        FID/IMAG
##SYMBOL=    X,             R,               I
##VAR_TYPE=  INDEPENDENT,   DEPENDENT,       DEPENDENT
##VAR_FORM=  AFFN,          ASDF,            ASDF
##VAR_DIM=   8192,          8192,            8192
##UNITS=     SECONDS,       ARBITRARY UNITS, ARBITRARY UNITS
##FACTOR=    0.0002768,     1,               1
##FIRST=     0,             0,               0
##LAST=      2.2672688,     0,               0
##MIN=       0,             -116973,         0
##MAX=       2.2672688,     98382,           0
$$ Real data points
##PAGE= N=1
##DATA TABLE= (X++(R..R)), XYDATA
0@%%%%%%%%%%%%%%%%%%%%%%Nj3J6j6J6j6J6j6K1k8L1l2L3l9M6m9N5o3O9p5Q4r2
$$ 0 0 0 0 0 0 0 0 0 0 0 0 0 0 0 0 0 0 0 0 0 0 0 5 -8 8 -8 8 -8 8 -8 13 -15 16 -16 17 -22 24 -25 30 -33 36 -39 45 -47
44d7J01j11J21j35J48j62J78j96K17k41K68k99L34l74M22m82N56o50P75r45J192
$$ -47 54 -57 64 -71 77 -85 93 -103 114 -127 141 -158 176 -198 224 -258 298 -352 423 -522 670
65F70j578K248l601P278l4675q7315J34851N3223j17350J5827R1025n5995m8089
$$ 670 -908 1340 -2261 5017 -29658 -116973 17878 71101 -46249 -30422 60603 4608 -43481
78d3481O9874J5936n1777J85Q732j4586J3624P007j3121J3090n381l5635K6574
$$ -43481 26393 42329 -9448 -9263 -531 -15117 -1493 5514 -7607 5483 102 -35533 -8959
91h959M3943m0594k7184M5955K211l3065L4359K5308m4977j2560K8785j0331j2229
$$ -8959 34984 -5610 -32794 13161 15372 -17693 16666 41974 -3003 -15563 13222 2891 -9338
104i338J5723j3148k0471K1871J4044j2339N668K890j6146N380J3289q368K831
$$ -9338 6385 -6763 -27234 -5363 8681 -3658 2010 4900 -11246 -5866 7423 -945 1886
117A886R980j6069j848K3597j0035j6959J8473n701k9419K3557K9970l2133j4325
$$ 1886 11866 -4203 -6051 17546 7511 -9448 9025 3324 -26095 -2538 27432 -4701 -19026
130a9026L3282p329k9468K2790J6898l2599p118K8713N13j2706J0803O447r030
$$ -19026 14256 6927 -22541 249 17147 -15452 -22570 6143 6656 -6050 4753 11200 2170
143B170n02M593j75J1m537p042L517L656m177J41J722q923j581R591o4m761O753
$$ 2170 1668 6261 6086 6097 1560 -5482 -1965 1691 -2486 -2345 -623 -9546 -11127 -1536 -1600 -6361 392
160C92M654l256K615O748k321n887k898J077L4l170j894L828j03m804K754K998
$$ 392 5046 1790 4405 11153 8832 2945 47 1124 1158 -2012 -3906 -78 -181 -4985 -2231 767
176G67n931M33P343o434o026J3808N608j3169J674J3100p999r558J0813M343j1812
$$ 767 -5164 -4731 2612 -3822 -9848 3960 9568 -3601 -1927 11173 3174 -6384 4429 8772 -3040
191c040q09Q357j312m242J623j75k681k786j408L915J514n338J447Q029j471k241
$$ -3040 -3849 4508 3196 -1046 577 402 -2279 -5065 -6473 -2558 -1044 -6382 -4935 3094 1623 -618
207f18P702j84q825M329O738p760l215O824l088p327M783L293p933l175M154J395
$$ -618 7084 6900 -1925 2404 9142 1382 -1833 4991 1903 -5424 -641 2652 -5281 -8456 -4302 -2907
223b907j47K65Q72M612J271l473L368M446p606l666R442p84r932N191N243j0819
$$ -2907 -3054 -2789 -1917 2695 3966 493 3861 8307 701 -2965 6477 5693 -4239 952 6195 -4624
239d624j600J0817n253r552P489N085p979K068Q661m661n234O044L839l268p36
$$ -4624 -6224 4593 -660 -10212 -2723 2362 -5617 -3549 5112 451 -4783 1261 5100 1832 1096
254A096Q34J26P97j115K67J313m023k990M132N78o485J534L927n549o29Q900p39
$$ 1096 1930 2056 2853 1738 2005 3318 -705 -3695 437 1015 -5470 -3936 -9 -5558 -6187 2713 1974
271A974p325N811N025o279L65Q379k187o525K203L176k472k675j244n25j96j955
$$ 1974 -5351 460 5485 -794 -429 7950 5763 -762 1441 4617 2145 -530 -1774 -2299 -2495 -4450
287d450o42M886r1n477K754N749l295j000P175j366p006M990N435o577k314N268
$$ -4450 -5092 -206 -297 -5774 -3020 2729 -566 -1566 5609 4243 -2763 2227 7662 1085 -1229 4039
303D039k706o276M258M233n099l377K688J362j443m1J640J184k130j738M910L317
$$ 4039 1333 -4943 -685 3548 -1551 -4928 -2240 -878 -2321 -2362 -722 462 -1668 -3406 1504 4821
319D821l966j018L516r94k919L946J630n387j767K990j734j385K074j839k976
$$ 4821 855 -163 3353 2359 -560 3386 5016 -371 -2138 852 -882 -2267 -193 -2032 -5008
334e008R92K177Q7J647O76j466J327K931q21Q43K173m311l571M704K372n997j098
$$ -5008 -4016 -1839 -1752 -105 571 -895 432 3363 2542 3385 5558 1247 -2324 2380 4752 -1245 -2343
351b343K280l554k158N325J748m123q17K448M58J769K872k076l295J600K343l9
$$ -2343 -63 -3617 -5775 -450 1298 -2825 -3642 -1194 -736 1033 3905 1829 -1466 134 2477 2438
367B438k5l7k268k083J635K992q32l337k213Q41K318Q4p33J81j303j097K006M429
$$ 2438 2413 2376 108 -1975 -340 2652 1820 -1517 -3730 -2889 -571 -487 -1220 -1039 -2342 -3439 -1433 2996
385B996k87l561O72K668j0L94J685j825m685K86K955j433k135O32j502j941L223
$$ 2996 2709 -852 -180 2488 2478 2872 4557 2732 -1953 -1667 1288 -145 -2280 -1648 -3150 -5091 -1868
402a868L368j930j649J175J677O92J193L59r6j341j251J183K245k848l714J579
$$ -1868 1500 -430 -2079 -904 773 1465 2658 3017 2921 1580 329 1512 3757 909 -2805 -1226
418a226J243k846J200K824l016k319L712R37k432K327J640m167O07N524j376l115
$$ -1226 17 -2829 -1629 1195 -1821 -4140 -428 509 -1923 404 2044 -2123 -1516 4008 2632 -483
434d83K893P05l706Q63K783k588j659Q65q85K40M56j599j172K241m46j833L303
$$ -483 2410 3115 -591 272 3055 467 -1192 -327 -1212 -972 -516 -2115 -3287 -1046 -1492 -3325 -22
451b2K189k743J025L656k380j368L899j531m342K655J631n216m9M314k887l940
$$ -22 2167 -576 449 4105 1725 357 4256 2725 -1617 1038 2669 -2547 -2596 1718 -1169 -5109
467e109L418J441k845K046K235k054J57K329m94Q90J003k588j473L594m19k778
$$ -5109 -1691 -250 -3095 -1049 1186 -868 -711 1618 1124 2014 3017 429 -1044 2550 2131 -647
483f47J277N47l755P46M066k254k763J640l76k507L911K993m448r63M619k55j829
$$ -647 630 1177 -2578 -1832 2234 -20 -2783 -1143 -1519 -4026 -115 2878 -1570 -2533 2086 1831 2
500BK385N11l114J60J901Q6K13j574l399P45K090j276j393J222j131j271M463
$$ 2 2387 2898 -216 -56 1845 1931 2144 570 -2829 -2084 6 -1270 -2663 -1441 -2572 -3843 620
517F20K110l322K45L034k261n04M767m08o268J566L568k796j909K521j100m357
$$ 620 2730 -592 -347 2687 426 -78 4689 4281 -1987 -421 3147 351 -1558 963 -137 -4494
533d494J583L350r73j628O82N98O71J251K31L14o62j666J017K824r53k339J688
$$ -4494 -2911 439 -534 -2162 -1480 -882 -211 1040 1271 1585 923 -743 274 3098 2145 -194 1494
550A494nk877J063K952m049l055L428J460l147J085L177l277j666M220J896k760
$$ 1494 1489 -1388 -325 2627 -1422 -4477 -1049 411 -2736 -1651 1526 -1751 -3417 803 2699 -61
566f1L07K086q59m89J815j69j637j535o14N79J142k071j346M02N66O9J432P46
$$ -61 246 2332 1473 984 2799 2630 993 -542 -1156 -577 565 -1506 -2852 -2450 -1884 -1815 -383 363
584C63j731Q84J990j106J27K902p96l990J928L501k801k682J137L43k527L67K475
$$ 363 -1368 -484 1506 400 527 3429 2633 -1357 571 4072 1271 -1411 -274 69 -2458 -2091 384
601C84j230j393Q13J140o03L63J146n02j101J174K355k94j973P11J586j766j514
$$ 384 -846 -2239 -1426 -286 -889 -526 620 118 -983 191 2546 2252 279 990 2576 810 -704
618g04J675Q80l364j144K411l18k218J198J646k017n89K821J029j436l4K158P4
$$ -704 971 1851 -1513 -2657 -246 -564 -2782 -1584 62 -1955 -2544 277 1306 -130 -164 1994 2068
635B068j546J699R90j888k292Q52R05k076k19J184j533j208J818J455o96r08R98
$$ 2068 522 2221 3211 1323 -969 -117 788 -1288 -1507 -323 -1856 -3064 -1246 209 -487 -1395 -397
652c97N89k75P84J464K59k040o67K154P39k371j113J484r18j370J943Q20k906
$$ -397 192 -83 701 2165 2424 384 -283 1871 2610 239 -874 610 -308 -1678 265 1085 -1821
669a821n68K067n47r45K162K22k579J341K839l84r68P09K58j164L57Q85m64j549
$$ -1821 -2389 -322 -869 -1814 348 570 -2009 -668 2171 1787 819 1528 1786 622 979 1864 1400 -149
687a49j863L74J728o67j946O26J187j664O43L568j195j583K289O63j290J062J682
$$ -149 -2012 -1638 90 -577 -2523 -1897 -710 -2374 -1731 1837 642 -941 1348 2011 721 1783 3465
704C465l036j940K631J46k514Q70P55k610m73K224Q41j440o8j86P81J424l77j85
$$ 3465 429 -1511 1120 1266 -1248 -378 377 -2233 -2706 -482 359 -1081 -1149 -1335 -554 870 493 308
722C08J107j116p95K341N09k029q8J640k085j173K848p95l318Q62K201k253p17
$$ 308 1415 299 -496 1845 2354 325 237 1877 -208 -1381 1467 672 -2646 -1784 417 -1836 -2553
739b553L065o55k561J719K853j105k4P26K97q65k72M26P12o78k724P0J627j048
$$ -2553 512 -143 -2704 -985 1868 763 739 1465 1762 897 625 1051 1763 1085 -1639 -1569 58 -990
757i90j031J194L9k058J644L126j930q09K150m71j665K501K078l180k011K236
$$ -990 -2021 -827 -788 -2846 -1202 1924 -6 -815 1335 864 -801 1700 3778 598 -1413 823
773H23N27j235R6P94j900j192J358J733q23j706n61J053M32J34J441J34j944J67
$$ 823 1350 115 211 1005 -895 -2087 -729 1004 181 -1525 -2086 -1033 -601 -467 974 1108 -836 -669
791f69K791L44j483J21l39j191M33J686n84k709p82Q84P3o3N03O79j368k82K444
$$ -669 2122 2466 983 1104 765 -426 7 1693 1109 -1600 -2382 -1498 -1425 -1488 -985 -306 -1674 -1956 488
810D88K105j031j533Q44M22m90R05N64k253j688J322O96m28J53r08j603j15K558
$$ 488 2593 1562 29 873 1295 805 1710 2274 21 -1667 -345 351 -77 76 -832 -2435 -2550 8
828HJ229j335r71O06L51Q01Q48L61j569j747J092K756m37j819l17K38j337P84
$$ 8 1237 -98 -1069 -463 -112 689 1537 1898 329 -1418 -326 2430 1993 174 -143 95 -1242 -458
846d58K110j923k805R47J734K05P3M08j195q61K301J926n90j121j20P8M17M68
$$ -458 1652 -271 -3076 -2129 -395 -190 -117 291 -904 -1765 536 2462 1872 751 631 709 1126 1594
864A594K4j361j703r53J704J353j585j165O88M60k95K052J161j999j127J922R62
$$ 1594 1618 257 -1446 -2399 -695 658 -927 -2092 -1404 -944 -1239 813 1974 -25 -1152 770 1732
881A732l47K4q2j643l33J549L62j793o62K85m67L56J144N36j784o70J172J588
$$ 1732 1385 1409 1327 -316 -649 900 1262 -531 -1193 -908 -1375 -1019 125 661 -1123 -1793 -621 967
899I67k66p40P98n17n91J045J252l80j845L45O51l03n32K34l43j615K82J573k98
$$ 967 701 -39 759 242 -349 696 1948 1568 -277 68 719 416 -116 118 -225 -1840 -1558 15 -283
918b83j348P81O98r99P22K258k39j695M45J733n89o28P5n76j191k33J096j72r14
$$ -283 -1631 -850 -152 -1151 -429 1829 1590 -105 340 2073 1484 856 931 355 -836 -1069 27 -145 -1059
937a059k97k32Q53M54j65N20O8o42P61J470o06p02O69m75q52P42M46j319r13J448
$$ -1059 -1356 -1588 -735 -281 -446 74 142 -500 261 1731 1125 423 1092 617 -235 507 953 -366 -1279 169
957A69n02q31P33P82j376l52J203j44k27Q01O0l90K96L49P9O95m26q23K58N70
$$ 169 -333 -1164 -431 351 -1025 -1377 -174 -318 -545 256 316 -74 222 571 650 1345 919 96 354 924
977I24o45k01J83q47j081J184J03j364O28J353j366K2K460J86j942N44J671o31
$$ 924 279 78 261 -586 -1667 -483 -380 -1744 -1116 237 -1129 -1107 1353 1539 -403 141 1812 1181
995A181m74P57m74j789N06M52j70r38P4n85K9N87M09M40o3n86Q03R64l9p08M66
$$ 1181 707 1464 990 -799 -293 159 -11 -949 -875 -1460 -1431 -844 -435 5 -58 -644 159 1123 1084 376 842
1016H42m7j038P77R84j580q43Q38M91j320M14P91r04r98J165K96l77L64J07k51
$$ 842 795 -243 534 1518 -62 -905 -67 424 -896 -482 309 -595 -1593 -428 -132 -509 -145 -38 -289
1035b89L11O29n7P5K56%l86O32o11m74m7p20n47M21M39o59m49J163j06r44J592
$$ -289 22 651 594 669 925 925 539 1171 560 86 39 -681 -1228 -807 -368 -1027 -1476 -313 -419 -1363 229
1056B29R09j249m1J596k28o32L10J57j025k97O20n72l15j0J35q53N20N29k02j1
$$ 229 1138 -111 -152 1444 1216 584 894 1051 26 -271 349 -223 -538 -548 -413 -1266 -746 -217 -419 -430
1076d30Q1J75P26p8p12O84N99j012L6J149k89j558K97J368j228q88J140k40j204
$$ -430 -349 -174 552 474 -238 446 1045 33 69 1218 929 -629 -332 1036 -192 -1080 60 -180 -1384
1095a384M92Q40j132M75P01m56j73J100O86o59N47Mn92L25J32o12k70N6j114o1
$$ -1384 -892 -52 -1184 -709 -8 -464 -637 463 1149 490 1037 1041 449 774 906 294 24 80 -1034 -1095
1115a095J171q13q27P09N41p63R74J419j023j074J513M47r49M14N15j358m65J669
$$ -1095 76 -737 -1564 -855 -314 -1077 -103 1316 293 -781 732 1179 230 644 1159 -199 -664 1005
1133A005k99j297K47q5l84J62J002n33m46k87K51P45M76o46l65J105k63o40J587
$$ 1005 706 -591 -344 -429 -813 -651 351 -182 -628 -915 -664 81 557 -89 -454 651 388 -252 1335
1152A335J67j706l43J451m00r26O90k79j315J60J337j054K0N12r6l42J074O68
$$ 1335 1502 -204 -547 904 504 -422 268 -11 -1326 -1166 171 -883 -863 -351 -447 -789 285 953
1170I53m84j45J65J37L43M0n29l62l1p65P4Q19p34j451J298J017j158L40R74o59
$$ 953 469 324 489 626 969 1009 480 118 87 -678 -604 215 -519 -1970 -672 345 -813 -473 501 -158
1190a58m58J311M25q69l1O07l63m55P53L34j418K52L20n76L7J5k18k60J72k49
$$ -158 -616 695 1120 251 220 827 464 9 762 1096 -322 -70 250 -326 -289 -274 -492 -752 -580 -829
1210h29R24K80p61R6Q69m2o28J058K47j162J24J217j029m54MK38r03j18P25l59
$$ -829 95 375 -386 -290 579 537 -91 967 1214 52 176 1393 364 -90 -86 152 -751 -869 -144 -503
1230e03o76N36M41j79j2N89L97l81J87K57J45l33k06L00o2p95J11L18m93m77K27
$$ -503 -1179 -643 -202 -381 -393 196 593 212 399 656 801 468 262 562 500 -295 -184 134 -359 -836 -609
1251f09N8k14J27P64J26n27K4L65p7L71M53n37k95M19L41m84j59k27k0l43L7L51
$$ -609 -551 -765 -638 126 252 -275 -251 114 37 408 861 324 29 448 789 305 146 -81 -101 -444 -407 -56
1273e6O8r42m01O47Q32m64J02K58m03L94P43K41q43l04P67k18m8o2J45p33p50
$$ -56 12 -930 -1331 -684 148 -316 -214 44 -359 35 778 1019 176 -128 639 421 373 311 456 -277 -1027
1294a027P55K91r93K05J68O4kR36K09p31l08J020N70m82j72P8l94o03N17N49p35
$$ -1027 -272 19 -974 -769 -601 -537 -539 397 606 -125 -433 587 1157 675 503 581 187 -416 101 650 -85
1315h5o81K28L00k30J86M48p13l14P42R22n20l12J53J59j33R6J306n13j500L42
$$ -85 -766 -538 -238 -468 -282 166 -547 -861 -119 803 283 -29 124 283 150 246 1552 1039 -461 -119
1335a19Q80o58l84J90jp30n6P15J22q01L09N02k05K78P65n1p62PO62L41q00J35
$$ -119 761 103 -281 -91 -92 -822 -878 -163 -41 -842 -533 -31 -236 42 807 756 -6 1 663 1004 204 339
1357C39r1r43j59Q90M1j029j80N89J07k55N59N95n34m27Q20Q94q45j58K67m65
$$ 339 248 -695 -854 36 77 -952 -1132 -543 -436 -691 -132 463 -71 -498 322 1216 371 213 480 15
1377A5k06P21j03q00j48K34K83r60O77K21n8o80P84M54n31n32P26K25l60J84R52
$$ 15 -191 530 427 -373 -521 -287 -4 -964 -287 -66 -124 -804 -20 434 -97 -629 97 322 -38 146 1098
1398A098l52p91K65P83p86k53p0O5r34K27O68k30m53n7Q85l33O4R05j4n77j5N58
$$ 1098 746 -45 220 1003 217 -36 -106 -41 -975 -748 -80 -310 -763 -820 65 -268 -204 701 687 110 95 653
1420F53Op71M62J02p07k45N76K89q85M6L49j99l08Q38l0o89J17P52K61n02M25
$$ 653 659 -112 350 452 -255 -500 76 365 -520 -474 -125 -324 -632 206 176 -513 -396 356 617 115 540
1441E40J51m2r23P02M21p47n21L26N32r06L19J61l55j046R25Q36p79qJ01N65m32
$$ 540 691 649 -274 428 849 102 -419 -93 439 -467 -148 13 -342 -1388 -463 373 -406 -414 -313 252 -180
1462a80P56L90n45l42K55K9l8j08l60k13j16l96Q04J27q31JQ30j97k14P72M20
$$ -180 576 966 421 79 334 363 325 217 -143 -356 -472 -868 -64 63 -768 -767 63 -134 -348 424 844
1483H44r59j87J399m01r69O40M66j007KN40k41o90Q7J32o5J25K54j50k11N2L97
$$ 844 -115 -302 1097 696 -273 367 833 -174 -172 368 127 -563 -476 -344 -409 -284 -30 -180 -391 -339 58
1504E8J47k5j18K16N30p26J03Q75m80j577J051O99j389L8J151q27r41Q89L67n60
$$ 58 205 180 62 278 808 82 185 1060 580 -997 54 753 -636 -598 553 -274 -1215 -326 41 -519
1524e19j07P05j05k15Q33m7m24J77J35j9J11m68o8K14m23n10N77M69r83j49O93
$$ -519 -626 79 -26 -241 592 545 121 298 433 414 525 57 -11 203 -220 -730 -153 316 -667 -816 -123
1545a23k21n31J168L23q94q9J342l78n20O62n0r62K01O60m01m13K47j29o07L34
$$ -123 -344 -875 293 616 -278 -367 975 597 77 739 689 -273 -72 588 187 -226 21 -108 -715 -381
1565c81N70m59l57J99K68N15l50p9J94L76m26K27P87l29j284O07L38l26m67Q82
$$ -381 189 -270 -627 -428 -160 355 5 -74 120 496 70 297 1084 755 -529 78 416 90 -377 505
1585E05r72q59P97Q48p60p2O84p36J55J078K53q98J25l0M03n6m0n9n06K06m53
$$ 505 -467 -1326 -529 319 -441 -513 171 -565 -410 668 921 23 148 118 521 465 425 366 -140 66 -387
1606c87L12N07r06n11M43K29J97L60k46n43O2J082j42m11L15l85m38Q87N14n33
$$ -387 -75 432 -474 -985 -542 -313 -116 244 -2 -545 -483 599 457 46 361 -24 -462 425 939 406
1626D06p43j42M10k14O40j83n72n29K25O81J62j19n90L14P52j67j21Q22m90r12
$$ 406 -337 -479 -69 -283 357 174 -398 -927 -702 -21 141 22 -568 -254 498 331 210 1032 542 -370
1646c70L64P29k65q73L52m79q7J84O46n40l55M64j28J79O96J41p74L19K42J31
$$ -370 -6 723 458 -415 -63 -542 -629 -445 201 -339 -694 -230 -358 -179 517 658 -116 203 445 576
1666E76J50j96k75k6j22M1M5o4p25L5K61K39k50r6M26l64k1P23L37q07N06j06
$$ 576 726 530 255 229 107 148 193 129 -596 -561 -300 -61 -311 -407 19 -345 -366 357 694 -113 393 287
1688B87k47J88O52m43o47N1M04k78j39Om98J68J01M61j45j23j45K68L11O2j76
$$ 287 40 228 880 437 -210 -159 245 -33 -172 -166 -664 -496 -395 66 -79 -202 -347 -79 232 294 118
1709A18L35k93P3K85J44l23m62J07K28o12K83K7k75j49K0M11l8j07O80l99n7K58
$$ 118 453 160 233 518 662 339 -123 -16 212 -400 -117 -90 -365 -514 -494 -83 -121 -228 452 53 -4 254
1731B54K67O8n27K20J4k36RO8j23j12p3qJ13k77R4n7M5q2M24K10m77L87R1Qp9
$$ 254 521 589 62 282 296 60 69 137 14 -98 -171 -179 -66 -343 -249 -306 -261 -343 81 291 -186 201 292 300 221
1756B21K51k5n51j5M32o4m92O5q7j33J17k73L01j84L83o0K53M8J34L0j88K75j88
$$ 221 472 447 -104 -119 313 249 -243 -178 -265 -398 -281 -554 -253 -437 -54 -114 139 187 321 351 163 438 250
1779B50M20l43j77k99J70r6l08J77k32r1K08J1M23k80K20J70l29N51J38j2k56
$$ 250 670 327 150 -149 21 -75 -383 -206 -438 -529 -321 -310 113 -167 53 223 -106 445 583 571 315
1800C15j61J09j78J59N2r0l20l98M36J50j53l07qK06j69L00J30k16J48P4M06k16
$$ 315 154 263 85 244 296 206 -114 -512 -76 74 -79 -386 -394 -188 -357 -57 73 -143 5 79 485 269
1822B69j16K89J20l89K3J79l44k55n5P0j23p4L01j45j45J47M67p9n5J56k4k15
$$ 269 153 442 562 173 196 375 31 -224 -279 -209 -332 -406 -105 -250 -395 -248 219 140 85 241 217 2
1844BK17L80k17m96J98j07p4O2N5M9n11j08N16L0Qj46r5L32l23N15R1j27n9j13
$$ 2 219 599 382 -114 84 -23 -97 -35 20 69 -442 -550 -34 -4 4 -142 -237 95 -228 287 378 251 192 79
1868G9L91k37j48Q4k97J39k14K21j64q5j79O1q8M39Rj27N5L88k38L50q1k51K08
$$ 79 470 233 85 169 -128 11 -203 18 -146 -231 -410 -349 -437 2 11 -116 -61 327 89 439 358 107 315
1891C15j42Q1j63K43m70j66J55n34M44K32J09o61RL44K85J98L34k33l48k0O43
$$ 315 173 254 91 334 -136 -302 -147 -681 -237 -5 104 -557 -548 -204 81 279 613 380 32 12 655
1912F55k52m24J19j0ok71L31k72j69R0M5J75k11M7P4J57m49L60K20J34k19L5N87
$$ 655 403 -21 98 88 82 -189 142 -130 -299 -209 -164 11 -200 -153 -79 78 -371 -11 209 343 124 159 746
1935G46n32J39K05m50o49M70J00l49k0K35n31J19N43j8l81K22M11K7r2l0K08k17
$$ 746 214 353 558 108 -541 -71 29 -320 -340 -105 -636 -517 26 8 -373 -151 260 287 195 165 373 156
1957A56k6J1N4k6j66l83J67J64l97L77J51o44j04M71K84o57O71L88m32j84O03
$$ 156 130 141 195 169 3 -380 -213 -49 -446 -69 82 -562 -666 -195 89 -568 103 491 59 -125 478
1978D78L34r83N40l30o1J53r1q7j99o6JJ42P6k53J76K51k44k59N81k3k24J49K33
$$ 478 812 -171 369 39 -22 131 40 -47 -246 -312 -311 -169 -93 -346 -170 81 -163 -422 159 136 -88 61 294
2001B94Q8k86K40ql63O8L09k79n12M94k92k54R5L41j39M3K32K58k77j25L75p3
$$ 294 382 96 336 328 -35 33 342 63 -449 45 -247 -501 -406 -65 -204 -161 71 329 52 -73 302 229
2023B29l2k80L53K18m72j47J61q2k35N8J66l42k95P62k14j23L91K63o50N3M87
$$ 229 197 -83 270 488 16 -131 30 -52 -287 -229 -63 -405 -700 62 -152 -275 116 379 -271 -218 269
2044B69j3k05K6K41l02N6J70n7m86%K65K13k87o8r6k06o5L76L54J6l95n9P95j72
$$ 269 256 51 77 318 16 72 242 185 -301 -301 -36 177 -110 -178 -274 -480 -545 -169 185 201 -194 -253 542 370
2068C70k63M74j17m92J12J32j7k58l13J31l03L03L78m37k96M04K36J45J05L8l8
$$ 370 107 581 464 -28 84 216 199 -59 -372 -241 -544 -241 137 -300 -596 -192 44 189 294 332 294
2089B94l74O9N49k64k62J11k60J05J34k71J04k85MJ84mj2M9Q7J1l0J80M23l07
$$ 294 -80 -11 538 274 12 123 -137 -32 102 -169 -65 -350 -346 -162 -166 -178 -129 -42 -31 -61 119 542 235
2112B35j11K12k32M1K0K22m53r5K16j56J70l18J10j62k01N12J27m2l72N17q4L23
$$ 235 124 336 104 145 165 387 -66 -161 55 -101 69 -249 -139 -301 -502 10 137 95 -277 240 156 479
2134D79pl15J69m15K38N32m52p24K44J24j24L9J42j34l90L20N46j87q0l8l5k57
$$ 479 472 157 326 -89 149 681 229 -495 -251 -127 -251 -212 -70 -204 -594 -274 272 85 5 -33 -68 -325
2156c25N01L46n17N7M5R9k2p1n1J0J15l38Q2m2j37M94p38N09j84M5L31j16N1J38
$$ -325 176 522 5 62 107 206 184 113 62 72 187 -151 -69 -111 -248 246 -492 17 -167 -122 209 93 144 282
2180B82L01l55N8lm21J1L31l65M3q2r3J19k62M49J62l44L5L09j03J57m3J03k9
$$ 282 583 228 286 283 -138 -127 204 -161 -118 -200 -293 -174 -436 13 175 -169 -134 175 72 229 186 289 260
2203B60L0j00k2p0l60k26O83m14J51n5j06q7k6M12p1j90M39k02k07L06K52J7k58
$$ 260 290 190 168 98 -262 -488 195 -219 -68 -123 -229 -316 -342 70 -1 -191 248 46 -161 145 397 414 156
2226A56j13L17p0k24l06L15j65n8M1j44J73j9k95J70M22l31L09k5k01M48l63j0
$$ 156 43 360 290 66 -240 75 -90 -148 -107 -251 -78 -97 -392 -222 200 -131 178 153 -48 400 37 27
2248B7L97k74k8k47J50J11j94k10J22j8PK65J36n74Q3K88l49M80o8q6K10k33R0
$$ 27 424 150 122 -125 25 136 -58 -268 -146 -164 -157 108 244 -330 -247 41 -308 172 104 18 228 -5 85
2271H5p9M4J32k53L0j47L90j13j11j62k53K84m7k5P0J4N8L43P4k21j04N8j13k2
$$ 85 6 50 182 -71 -41 -188 202 89 -22 -184 -437 -153 -200 -225 -155 -141 -83 260 334 113 9 67 -46 -68
2295f8J93j13o6n1Q9p7K07l6m27P7k3J71J13o2M7n9P8L11L6j65o6o1p8J00K11
$$ -68 125 12 -54 -105 -16 -93 114 78 -349 -272 -295 -124 -11 -73 -26 -85 -7 304 340 175 109 48 -30 70 281
2320B81j7m48N3J38K3k59K03k26J24o6L51J59k78J29n3Kk8L42p7n22J64Q0l32
$$ 281 264 -184 -131 7 30 -229 -26 -252 -128 -194 157 316 38 167 114 116 88 430 353 -169 -5 75 -257
2343b57K57J82j68j61k40J34k3J60R8j67J59n6l2K95n4k22q8N59k21o8l6r5j6
$$ -257 0 182 14 -147 -387 -253 -276 -116 -18 -185 -26 -82 -114 181 127 -95 -183 376 155 87 51 -44 -60
2366f0Q9j4k87m5J6n13N16K07L35l28p6K58L39l07j25K91k2k97lJ08l8j47j59
$$ -60 29 15 -272 -317 -301 -814 -298 -91 244 -84 -160 98 437 130 5 296 274 -23 -26 82 44 -103 -262
2389b62J70j13L54k99J0k86K08J50M6R2J3J2J06N6M09n20J9l4p8L89k65O9l25
$$ -262 -92 -205 149 -150 -140 -426 -218 -68 -22 70 83 95 201 257 666 146 165 131 53 442 177 246 -79
2412g9j31K47m6r7J19k78q8K74l2L59l7j70O5O8J58k38O4j52J41l00N80q6n96
$$ -79 -210 37 -9 -106 13 -265 -353 -79 -111 248 211 41 106 174 332 94 158 6 147 -153 427 341 -255
2435b55J00O6jP7j85O9q7R6o0J97J71J64l37K07n0k63J88o3j99R9L3L22k93j23
$$ -255 -155 -89 -90 -13 -198 -129 -216 -120 -180 17 188 352 15 222 172 -91 97 34 -165 -66 -33 289 -4 -127
2459a27o5k8lM73l15l20L09Q8M4K16k86P6p2J21j86M51j13k12j64K1Q6L3J58k88
$$ -127 -192 -220 -223 250 -65 -385 -76 12 56 272 -14 62 -10 111 -75 376 263 51 -113 -92 -6 27 185 -103
2483a03l38K70L24k08o5J40O6j02K4L31l61K5K16j00j37m3J00j61m5J81n5j93
$$ -103 -441 -171 153 -55 -120 20 86 -16 8 339 -22 3 219 119 -18 -61 39 -122 -167 14 -41 -234
2505b34J62j36J28j89K24j08N19m72K00J96k16M2J42P6q7J91k52Q1m46j9J17p4
$$ -234 -72 -208 -80 -269 -45 -153 366 -106 94 290 74 116 258 334 247 438 186 267 -179 -198 -81 -155
2527a55p7K57k22J00r1K31k03K84J86k69R0J30l47L08l57j41K01p4p8J41JP2k24
$$ -155 -232 25 -197 -97 -188 43 -160 124 310 41 131 261 -86 222 -135 -276 -75 -149 -227 -86 -85 -13 -237
2550b37K26k56L09j29N3J24k40M02q6j78O6M6K30m34K02j2m8l05J87j38K06p4
$$ -237 -11 -267 42 -87 -34 90 -150 252 166 -12 54 100 330 -104 98 86 38 -267 -80 -218 -12 -86
2572h6P8J27l89M88k53Q2p3K02q7J09j17R0j4j97j27K91p2L12k44l34lmn0K56
$$ -86 -8 119 -270 218 -35 47 -26 176 89 198 81 171 157 -40 -167 124 52 364 120 -214 -217 -221 -271 -15
2596a5r0rj09K27lJ85kj13R2Kk50J9K29J42p0l95J1M5J15k3o9rj16qK45n6o5J82
$$ -15 -105 -114 -223 4 1 186 184 71 163 165 -85 -66 163 305 235 -160 -149 -104 11 -12 -81 -90 -206 -214 31 -25 -90 92
2624I2p9l6L57k52P1k68J91mJ8n7k70K86K5l76Q6k8k19K91N0k9p8L36%j7J72L5
$$ 92 13 -23 334 82 153 -115 76 72 90 33 -237 49 74 -302 -216 -244 -463 -172 -122 -151 -229 107 107 90 262 297
2650B97r3J02m17K28K69k40l11K10R6n04L04K12r4j53k65M41l84J46K82l42J3
$$ 297 204 306 -111 117 386 146 -165 45 141 -363 -59 153 59 -94 -359 82 -302 -156 126 -216 -203
2671b03K76N0J20l81K55q1q6L58o7K4m04J12l18L34Lj86m4J10j62N05L0m28K37
$$ -203 73 123 243 -138 117 36 -50 308 241 265 -139 -27 -345 -11 -8 -194 -238 -128 -290 215 245 -183 54
2694E4J00L69m07K37k3n33M21k50P6k50M18j66l32K66K0J32k43K3Q9P3j80K56
$$ 54 154 523 116 353 330 -203 218 -32 44 -206 212 46 -286 -20 0 132 -111 -88 1 74 -106 150
2716A50N2j58L8p9K45q1j29k57Q7j06J59K11k64j47J48j95J86R2M5j92K04L61
$$ 150 202 44 82 3 248 167 38 -219 -132 -238 -79 132 -132 -279 -131 -326 -140 -48 -3 -195 9 370
2738C70j19L1m46K05mK65j23k21p2J66J71n28K13J9M8J24m27P9M69k35j28K32
$$ 370 251 282 -164 41 37 302 179 -42 -114 52 223 -305 -92 -73 -25 99 -328 -249 220 -15 -143 89
2760H9K58m39K88j31k8q3p7L25l1l29J39k95q7O7K50J22m67M25P6o1M2k07K19
$$ 89 347 -92 196 65 37 -46 -123 202 171 -158 -19 -314 -401 -334 -84 38 -429 -4 72 11 53 -154 65
2783F5L6J86j51J40l96l4L06j32K28j2j86k45j99M52n3j95K32k3Jj75K46p9%p
$$ 65 101 287 136 276 -120 -154 152 20 248 236 50 -195 -394 58 5 -190 42 19 20 -155 91 12 12 5
2807EK83j43K19j37k85Q3r7M9k00J19J30P0k47j78J28L32m4q2K01k57j69L63M3
$$ 5 288 145 364 227 -58 25 -72 -23 -223 -104 26 96 -151 -329 -201 131 87 5 206 -51 -220 143 186
2830A86l73K88K88l31m3n8J26j82J98k05J06L6j82k64K51J15j42K83L2j52q1L98
$$ 186 -187 101 389 58 15 -43 83 -99 99 -106 0 36 -146 -410 -159 -44 -186 97 129 -23 -104 294
2852B94P7k81J19k36J26j23R5J70m69K48K4k7K28k65j80K4j52L87j8N7j07R6P
$$ 294 371 90 209 -27 99 -24 71 241 -228 20 44 17 245 -20 -200 -176 -328 59 41 98 -9 87 94
2875I4K95j01J35l17P4l05R6J8n8j17j29R6K02J28J10m95L3J88O2L70J37m13%
$$ 94 389 288 423 106 180 -125 -29 -11 -69 -186 -315 -219 -17 111 221 -274 -241 -53 9 379 516 103 103
2898A03m26P54l39r2Q1j42Q6k00J44j02Nj67L58k15R1J12q4oK59l6M2m4n38N24
$$ 103 -323 431 92 0 81 -61 25 -175 -31 -133 -128 -295 63 -152 -61 51 -33 -39 220 184 226 182 -356 168
2922A68J25J4o4p8m71L1J06pOR8J05k48J2P4L03k21J14J78n4j01J90k29j92K55
$$ 168 293 307 243 165 -306 -275 -169 -176 -170 -72 33 -215 -203 -129 174 -47 67 245 191 90 280 51 -141 114
2946A14L04l69K69l91j54K83N3j44M3k33j6l0N80l17K8J64j45j74M97j62q7K03
$$ 114 418 49 318 -73 -227 56 109 -35 8 -225 -241 -271 309 -8 20 184 39 -135 362 200 113 316
2968C16k74j0j04l6K23l13j21K44pJ52m81L60j96K96j45K47Q1j38J8j95K52J26
$$ 316 42 32 -72 -108 115 -198 -319 -75 -82 70 -411 -51 -247 49 -96 151 232 94 112 -83 169 295
2990B95l60j7J24J1j61J23l5p4m3l39M93JRk5p0J17RJ09K6K87o94L07N8J08k28
$$ 295 -65 -82 42 53 -108 15 -20 -94 -137 -476 17 18 27 2 -68 49 58 167 193 480 -214 93 151 259 31
3015C1n7l82L76K40r6J46n06J80j68R1K7%L39r6o0L7p0m6J84l16L52Oj85Rj63
$$ 31 -26 -408 -32 208 112 258 -248 -68 -236 -145 -118 -118 221 125 65 102 32 -14 170 -146 206 212 27 36 -127
3040a27O2O2k79J79q8k5j57K38K90j82K14k95N4m5N63o89K31K13l78M7M3Q3k98
$$ -127 -65 -3 -282 -103 -191 -216 -373 -135 155 -27 187 -108 -54 -99 464 -225 6 219 -159 -112 -69 14 -284
3063b84K25k3j54L09J45k87r4K07J10l20J13M12m5l41O1J27Q6k19j34j01N18j63
$$ -284 -59 -82 -236 73 218 -69 -163 44 154 -166 -53 359 314 -27 34 161 247 28 -106 -207 311 148
3085A48j25k79K92K20n03L28p0J26P6k40j99M97j54j74l4L2j25J09L68n57L80
$$ 148 23 -256 36 256 -247 81 11 137 213 -27 -226 271 117 -57 -91 -59 -184 -75 293 -264 116
3106A16k64l7N6l30K27K96k30jK82j75J4Q0j53L17j45L3j89K36p0j87O8J54j74
$$ 116 -148 -185 -129 -459 -232 64 -166 -167 115 -60 -46 34 -119 198 53 86 -103 133 63 -124 -56 98 -76
3129g6J86k68q6J59l9L2J84j94J7J23J05K9j89L50l06l9J5J07Q9k61J52l20K83
$$ -76 110 -158 -244 -85 -124 -92 92 -102 -85 38 143 172 -17 333 27 -12 3 110 199 -62 90 -230 53
3152E3l6j64oj53K00L36l35r8K78j65P3j52K18Nj49O1J64J45j54j09j51lR4Q7
$$ 53 17 -147 -153 -306 -106 230 -105 -203 75 -90 -17 -169 49 54 -95 -34 130 275 121 12 -139 -142 -48 39
3176C9N0l6J6j79L7K3N9L7J55k36J26m5Q4q2j85K47j3N4k95K60j12l36J45J92
$$ 39 89 53 69 -110 -73 -50 9 46 201 -35 91 46 130 48 -137 110 97 151 -144 116 4 -332 -187 5
3200EK0j34J55m8r0M1J39M6k96k3J87rJ01J82k96K43k6k41L86l71r3k53L05J09
$$ 5 25 -109 46 -2 -92 -51 88 134 -162 -185 2 -7 94 276 -20 223 197 -44 342 -29 -122 -375 -70 39
3224C9r6r0OJ37Pj35R5j08N6J06K34l04K7M5m1k36K49M9j26j38J11j95L24j12
$$ 39 -57 -147 -141 -4 3 -132 -37 -145 -89 17 251 -53 -26 19 -22 -258 -9 40 -86 -224 -113 -308 16 -96
3248i6M7K8k09L46k17K10l61M26mn4j9m2j68O2K17j37L6j64J75r6j25M08j02m6
$$ -96 -49 -21 -230 116 -101 109 -252 174 170 116 97 55 -113 -51 166 29 65 -99 76 -20 -145 263 161 115
3272A15k52O1Q7m7M2M3j79K53K4O1j07r4K15l23L00k81l7q3J32k3M2j16L16j72
$$ 115 -137 -76 11 -36 6 49 -130 123 147 208 101 7 222 -101 199 -82 -119 -202 -70 -93 -51 -167 149 -23
3296b3J67k96J84j9J42Ok38K59m38L89K5j97l04K26Q5k06L84m98J45L35J97m99
$$ -23 144 -152 32 13 155 161 -77 182 -256 133 158 -39 -343 -117 -32 -238 146 -352 -207 128 325 -174
3318a74K69o1O2j66K56k16K19O4m03L38k33J64j96P1j53K36j34k37M51l25J88
$$ -174 95 34 96 -70 186 -30 189 253 -150 188 -45 119 -77 -6 -159 77 -57 -294 157 -168 20
3339B0j01K31j37R0O5j52J15j8k95J63K5J48m6j46loJ22k07L05j36j83K7m4K38
$$ 20 -81 150 13 103 168 16 131 113 -182 -19 6 154 108 -38 -41 -47 75 -132 173 37 -146 -119 -163 75
3363G5rj70J12J40R6p3l34K58l3lK96m50k27M50P0k70R4k29J41j12m4J09K3j4
$$ 75 66 -104 8 148 244 171 -163 95 62 59 355 -95 -322 128 198 -72 22 -207 -66 -178 -222 -113 -90 -104
3387a04n4K8k4J76J70J0k56K12k3l62J68r7j05L54j38Q1j4q4k62L13p2m3J15N7
$$ -104 -158 -130 -154 22 192 202 -54 158 135 -227 -59 -156 -261 93 -45 36 22 -62 -324 -11 -83 -126 -11 46
3411D6r2K23j09k37L02j79K37j0j38q1q7J24N4j82L0P8O2J31j42k64M16m7J12
$$ 46 -46 177 68 -169 133 -46 191 181 43 -38 -125 -1 53 -129 -99 -21 41 172 30 -234 182 135 247
3434B47j48J50l74L17k6q1l3j3j04O9K6J40J22m53K88l6j91R1Q8j4q1j56N66j94
$$ 247 99 249 -125 192 166 85 52 39 -65 4 30 170 292 -161 127 91 -100 -9 79 65 -16 -172 394 200
3458B00l35K30m2O5J4K7j6n9R3m58P1L39m50K95J55r0j32l12J69M45L3j99J81
$$ 200 -135 95 53 118 132 159 143 84 177 -281 -210 129 -321 -26 129 39 -93 -405 -236 209 242 43 224
3481B24k69K49l20K85k10L5l5j4J20j61l10L06L84k90j31M6J32q4O2M6k03R9L16
$$ 224 -45 204 -116 169 -41 -6 -41 -55 65 -96 -406 -100 284 -6 -137 -91 41 -43 19 65 -138 -39 277
3504B77K4o5j46r4p0K50m4J16n3j74N7k36R8k5L03p0l78M96J5k2J11k98L6j91
$$ 277 301 236 90 -4 -74 176 132 248 195 21 78 -158 -60 -85 218 148 -230 266 281 259 370 72 108 -83
3528h3m1J25K03k53l09K45J41j73K8p3O8k27L68k4j03j28K78L58l81j4J29l87
$$ -83 -124 1 204 -49 -358 -113 28 -145 -117 -190 -122 -349 19 -5 -108 -236 42 400 19 5 134 -253
3550b53K74M6J18l23K64l35K05o1R2J45j11k60J49M1l27K84M00m85OP8M8qj1J24
$$ -253 21 67 185 -138 126 -209 -4 -65 27 172 61 -199 -50 -9 -336 -52 348 -137 -131 -53 -5 -13 -24 100
3574A00j84KJ06mk15J9K08k39J57o4k21L73j81J99j41j15J33R1J48Q0l46K01R7
$$ 100 -84 -82 24 20 -195 -176 32 -207 -50 -114 -335 38 -143 56 -85 -200 -67 24 172 252 -94 107 204
3597B04kk30j66P4MO4MK0O5l24l1O15k35okK27k31l3l2J5J06j19K3j90o4K34R0
$$ 204 202 -28 -194 -120 -116 -52 -48 -28 37 -287 -318 297 62 56 54 281 50 17 -15 0 106 -13 10 -180 -244 -10 80
3624H0j14n6n6J7J25L7k65L89n6mj46J90N5k3L4mj04j27K59k66m1P6j67L72m25
$$ 80 -34 -90 -146 -129 -4 33 -232 157 101 97 -49 141 196 173 207 203 99 -28 231 -35 -76 0 -167 205 -220
3649b20K1K13J94k28k7K6M13l59j38J02j56K8N7m0R7p6KJ6mK71n06J30mnJ53J11
$$ -220 -199 14 208 -20 -47 -21 392 33 -105 -3 -159 -131 -74 -114 -17 -93 -91 -75 -79 192 -314 -184 -188 -193 -40 71
3675G1m30L52o8L40k57j13J22mL5j2J33k75l7K63j95J4K6j16P7P7j67K32j38l01
$$ 71 -359 -7 -75 265 8 -105 17 13 48 36 169 -106 -143 120 -75 -61 -35 -151 -74 3 -164 68 -70 -371
3699c71N06l66J47J82j93K96k69K16q5j73J56j80k17Q2L61j25k25Q0J57O3j46
$$ -371 135 -231 -84 98 -95 201 -68 148 63 -110 46 -134 -351 -269 92 -33 -258 -178 -21 42 -104
3720a04K08p8j39l8J58j86O4K57j90N2q1J45L91l85l39L80k65NK92K9m84L58J7
$$ -104 104 26 -113 -151 7 -179 -115 142 -48 4 -77 68 459 74 -265 115 -150 -145 147 176 -308 50 67
3743F7L2j99J07M9j94K56J77l12j36Q1m4Q2rN1k46K32k55K17j74L23m27K42J14
$$ 67 99 -100 7 56 -138 118 295 -17 -153 -72 -116 -34 -43 8 -238 -6 -261 -44 -218 105 -322 -80 34
3766C4l08M17j36l2J7O0k4K67l10J69l34k5K06j6j32j02K53N4k72m1J9J14j0j5
$$ 34 -274 143 7 -25 -8 52 28 295 -15 154 -180 -205 1 -15 -147 -249 4 58 -214 -255 -236 -122 -132 -147
3790a47Q5N8M1j03k6K72k76l0K50l01N3k4K00q6k71K32n0K0q5J53L04j47k45K49
$$ -147 -62 -4 37 -66 -92 180 -96 -126 124 -177 -124 -148 52 -34 -305 -73 -123 -103 -188 -35 269 122 -123 126
3814A26r8r3L02k92J56l06L71j48l8j27k12K12J34q5L0L1j58NO0J08j19J66j40
$$ 126 28 -65 237 -55 101 -205 166 18 -20 -147 -359 -147 -13 -98 -68 -37 -195 -190 -130 -22 -141 25 -115
3837a15P9j3J96J27l29L90j46j68p1J19k63n4M58k57jJ55k05K1q8L16k97m8J94
$$ -115 -36 -49 147 274 -55 335 189 21 -50 69 -194 -248 210 -47 -48 107 -98 -77 -165 151 -146 -194 0
3860@N4m4j9K03o2J29j70j31K05k01J77J4l23rJ03J25k01m8rJ19L17n3k74j08
$$ 0 54 10 -9 194 132 261 91 -40 165 -36 141 155 -168 -177 -74 51 -150 -198 -207 -88 229 176 -98 -206
3884b06N08m80K14o7j62K85j92K14o8k59R5K22k2k83L45J72m2l31J78j92J21k54
$$ -206 302 -178 36 -31 -193 92 -100 114 46 -213 -118 104 82 -201 144 316 274 -57 121 -71 50 -204
3906b04K07J06K1k5lP8k8k70p8mJ69R5l66J3L17L4J1O2Ll14J67j19M11p3k99M9
$$ -204 3 109 130 105 102 180 152 -118 -196 -200 -31 64 -302 -289 28 62 73 135 138 -176 -9 -128 283 210 -89 -40
3932d0o6mJ13r6M68m26j39K02M8k96M44k22N5j60j23Q8L07k08J50K06m7J75k05
$$ -40 -106 -110 3 -93 375 -51 -190 12 60 -236 208 -14 41 -119 -242 -154 153 -55 95 301 254 429 224
3955B24n50L98r3N5J18l30j1J26q8J86j29l41M19K3r0L25l46Q3P8r1J50l35K82
$$ 224 -326 72 -21 34 152 -178 -189 -63 -151 35 -94 -435 -16 7 -83 242 -104 -21 57 -34 116 -219 63
3978F3j31J86j60M8Mm7m7r4J05J85k85L23k19R7Pk18L56k90L63k01m0rk91M80
$$ 63 -68 118 -42 6 10 -37 -84 -178 -73 112 -173 150 -69 28 35 -183 173 -117 246 45 5 -4 -295 185
4002A85n6k18rK44r4l50K04j34K37K33n80L70j42K47k23P4R9J30r9j24O5j25J24
$$ 185 129 -89 -98 146 52 -298 -94 -228 9 242 -338 32 -110 137 -86 -12 87 217 118 -6 59 -66 58
4025E8J21n23L87k29l6K0J50K4Nj0L1Q1j38M53m83O5Q2k92J51l1J12QJ7j9M3j5
$$ 58 179 -344 43 -186 -222 -202 -52 -28 -23 -33 -2 79 -59 394 -89 -24 58 -234 -83 -114 -2 6 23 4 47 32
4051C2l07K21J27J7k67K47R0j16J22l57K18J47k34p8K02j03N8n8K1l33N75j57
$$ 32 -275 -54 73 90 -177 70 160 44 166 -191 27 174 -60 -138 64 -39 19 -39 -18 -351 224 67
4073F7k9l19J40L74k46l0N5n5K01j87J64o0j08J03k49M14k53K12l12K81n40J97
$$ 67 38 -281 -141 233 -13 -43 12 -43 158 -29 135 75 -33 70 -179 235 -18 194 -118 163 -377 -180
4095a80L84m36J97o0J90j90qj03L1J3K61o1j21J14K11l79j70J40K38k64P8l04
$$ -180 204 -232 -35 -95 95 -95 -103 -206 -175 -162 99 38 -83 31 242 -137 -307 -167 71 -193 -115 -419
4117d19J01L55j02j82N9J42k25K68K68l98J2L91l63K78J1k4q5J75m17K01p4O3
$$ -419 -318 37 -65 -247 -188 -46 -271 -3 265 -133 -121 270 -93 185 196 172 87 262 -155 46 -28 35
4139C5l02K83J57K05n63K10j64o4L39l60L02p1J02j94K11m4mJ50k38J01k75p3
$$ 35 -267 16 173 378 -185 25 -139 -203 136 -224 78 7 109 -85 126 82 78 228 -10 91 -184 -257
4161b57J49N5j6J95q2l8j47L9R1r8J91Q2j12J62m64J27L69O4o2k1j95j02O8k21
$$ -257 -108 -53 -69 126 44 6 -141 -102 -11 -109 82 164 52 214 -250 -123 246 310 248 227 32 -70 -2 -223
4185b23J73pk30L26n8pK26m00K47Nj0n0j03J52l2j70J3J42M4k17J45K30j69j7
$$ -223 -50 -57 -287 39 -19 -26 200 -200 47 52 42 -8 -111 41 9 -161 -148 -6 38 -179 -34 196 27 10
4209A0j27o8K35j6q2K2k11L29r6j04J82k21M04l61L44k72J40O7l67J79r4M2l6
$$ 10 -117 -185 50 34 -48 -26 -237 92 -4 -108 74 -147 257 -104 240 -32 108 175 -192 -13 -107 -65 -101
4232a01m2J16P7k17r9L73l37J65N46m58J29l52N13m74k8j08J52J61j66J87J15
$$ -101 -143 -27 50 -167 -266 107 -230 -65 481 23 152 -200 313 -161 -189 -297 -145 16 -150 37 152
4253A52j22l2n9m5M1j10L10l85Q5K04m5k72O15j56k10Q0r7J71J25j43l51K69l54
$$ 152 30 -2 -61 -106 -65 -175 135 -250 -165 39 -6 -278 337 181 -29 51 -46 125 250 107 -244 25 -329
4276c29M03l09J24O2Q1r7J8L30m71J22L8J57K7pj08j11n2J34r7K94k93o8M01P1
$$ -329 74 -235 -111 -49 32 -65 -47 283 -188 -66 -28 129 156 149 41 -70 -122 12 -85 209 -84 -152 249 320
4300C20l55J2q2J15k30K56K34j17o7m0j78K13J70L5p4j14O1k56j63L12%k02L24
$$ 320 -35 -23 -105 10 -220 36 270 153 86 46 -132 81 251 286 212 98 159 -97 -260 52 52 -150 174
4323A74k31m7J50r1j57Q3O9j19M7M15k99J5k8J07m84O31k60k58K60J07o5j70O0
$$ 174 -57 -104 46 -45 -202 -119 -50 -169 -122 293 -6 9 -19 88 -396 235 -25 -283 -23 84 19 -151 -91
4346i1j58K69k19M17l73J10K06l43N4K46l6R2l15K57J79k13j21j60J02n1L6K42
$$ -91 -249 20 -199 218 -155 -45 161 -182 -128 118 82 174 -141 116 295 82 -39 -199 -97 -148 -112 130
4368A30j82N3r7j14k04L54M3K60k53N2O5r4R8j40J54Rk12k32M43L8j47Q8p0j21
$$ 130 -52 1 -96 -210 -414 -60 -17 243 -10 42 107 13 111 -29 125 134 -78 -310 133 171 24 112 42 -79
4392g9L27k31j40m8J38r1n4j4O13j43k06K59k92J83l27J34P2j29J45k63J90j67
$$ -79 248 17 -123 -171 -33 -124 -178 -192 421 278 72 331 39 222 -105 29 101 -28 117 -146 44 -123
4414a23q6J9K32o9o6j38J38K81j6l28J82J19n3k41K23m28M55J03k6j40j44j24
$$ -123 -209 -190 42 -27 -93 -231 -93 188 172 -156 26 145 92 -149 74 -354 101 204 178 38 -106 -230
4436b30L0J56k3M6k27N36k83O1J79n82J31L01k59J28Jp5K07%r5K48Pm05M06m14
$$ -230 -200 -44 -67 -21 -248 288 5 66 245 -337 -206 95 -164 -36 -35 -110 97 97 2 250 257 -148 258 -156
4460a56r9R1K4L22j6k98J06p1J79j53K00J18k30j57J07K17j61q5Q1q1j0K21j86
$$ -156 -255 -164 -140 182 166 -132 -26 -97 82 -71 129 247 17 -140 -33 184 23 -62 19 -62 -72 149 -37
4483c7k32J89o6L27k68J95k60J2J55j1J98m92K28K81j25J3k1j54L4j1k00M26j79
$$ -37 -269 -80 -146 181 -87 108 -152 -140 15 4 202 -290 -62 219 94 107 86 -68 -34 -45 -245 181 2
4506Bk56L92m2J50m59L46j45m5k16J11jo0J05J39J09j03j23P3LK60k75k44N18
$$ 2 -254 138 96 246 -213 133 -12 -57 -273 -162 -163 -223 -118 21 130 27 -96 -23 -20 240 -35 -279 239
4529B39Ol19J46j85L10k41J14k86L20O5l37L07k66j16j5J56r6J11k8Q4N0j42K7
$$ 239 245 -74 72 -113 197 -44 70 -216 104 169 -168 139 -127 -243 -258 -102 -198 -87 -115 -31 19 -123 -96
4552i6J26k28M29Kr5k68k4J05R3j82L42j19K6k53q0K70k91K58K53j71k28m4K03
$$ -96 30 -198 231 233 138 -130 -154 -49 44 -138 204 85 111 -142 -222 48 -243 15 268 97 -131 -175 28
4575B8k1R0j84K53k75J39J47k37PO0j39M02j73k54K43N0j90K92j13k51J17q2K49
$$ 28 7 97 -87 166 -109 30 177 -60 -53 7 -132 270 97 -157 86 136 -54 238 125 -126 -9 -91 158
4598A58j04k11K16o5q9K01k90N5J74j69j80N10Pj82J1j45N5J34j58J02j74J81
$$ 158 54 -157 59 -6 -95 106 -184 -129 45 -124 -304 206 213 31 42 -103 -48 86 -72 30 -144 37
4620C7j7j79J74oL4P7k08J07Q7n8J25k64j62J60l0j73K79j05Q0J01J4Ml7J19j1
$$ 37 20 -159 15 9 43 120 -88 19 106 48 173 -91 -253 -93 -123 -296 -17 -122 -42 59 73 77 40 159 148
4645A48k56k0K22j5J8J8l6k48L05k98M43l98k8J02j00J61P2j29r3J83j27M1J32
$$ 148 -108 -128 94 79 97 115 79 -169 136 -162 281 -117 -145 -43 -143 18 90 -39 -132 51 -76 -35 97
4668I7l08J03L10m0M8l00K36q1j33J51j02LR8m3m4K35k46J41K21k63JM3j59P9
$$ 97 -211 -108 202 162 210 -90 146 65 -68 83 -19 -16 82 39 -5 230 -16 125 346 83 84 127 -32 47
4692D7m4N5l01J56q9m5L79j74p8kK13j56R8k24Q6P5j17J58n0J69k32P8n1Q4l67
$$ 47 3 58 -243 -87 -176 -221 158 -16 -94 -96 117 -39 59 -165 -79 -4 -121 37 -13 156 -76 2 -49 35 -332
4717c32M39k7l2m6l0n7J07Kj1R1l31L65l50L85k47L05m37M40k29j5l5K08l58J85
$$ -332 107 80 48 2 -28 -85 22 24 13 104 -227 138 -212 173 -74 231 -206 234 5 -10 -45 163 -195 -10
4741a0K47j79L0nl59J24J49Q2Rk56K66Q7n5k56j51L77J09M2k68L56j90k29J51
$$ -10 237 58 88 83 -276 -152 -3 79 88 -168 98 185 130 -126 -277 100 209 251 -17 339 149 -80 71
4764G1n9p2k13J38MO9l13J63J23p5O1j32J84K02j08O5J07j54K45l31j02K77k68
$$ 71 12 -60 -273 -135 -131 -62 -375 -212 -89 -164 -103 -235 -51 151 43 108 215 61 306 -25 -127 150 -118
4787a18L94j80r4k70L01K9j22O6p3J13j30J17j13r7J23L10j91k2j19K7J32k33
$$ -118 276 96 2 -268 33 62 -60 6 -67 46 -84 33 -80 -177 -54 256 65 43 -76 -49 83 -150
4809a50o1J31J0J68l7N5j49j08O8L1L0Q6k45q9L89J02m16Q8k73L38j9j19R8p8
$$ -150 -211 -80 -70 98 61 116 -33 -141 -73 -42 -12 74 -171 -260 129 231 -185 -97 -370 -32 -51 -170 -72 -150
4833a50J40n9Q1o2K40k42p4K03J74j88j36J96r0R6k07J2K20j73kj28K97k83J42
$$ -150 -10 -69 12 -50 190 -52 -126 77 251 63 -73 123 33 129 -78 -66 154 -19 -21 -149 148 -135 7
4856GK22k46k7K50l20j43K4N87l82M3k55O56m00k24J14J76lJ14l36J11L4k8N3
$$ 7 229 -17 -44 206 -114 -257 -233 354 -28 15 -240 416 16 -208 -94 82 79 193 -143 -32 2 -26 27
4879B7O0j97N1j47K45j38J0j2K62j81L15J12l52J54k56K0J26j82J80K5l69J55
$$ 27 87 -110 -59 -206 39 -99 -89 -101 161 -20 295 407 55 209 -47 -27 99 -83 97 122 -247 -92
4901i2J55J2r5r8r8K51r9L51l71K07Mk96L61j96l35J70P8J50N9l20J84J99j97
$$ -92 63 75 -20 -118 -216 35 -64 287 -84 123 127 -169 192 -4 -339 -169 -91 59 118 -202 -18 181 -16
4924a6r0Q6qM8J27l90M87j25m56L39k72L04J7l21J71J87j87Q1j86L29K5p1o0j18
$$ -16 -106 -20 -28 20 147 -243 244 119 -337 2 -270 34 51 -270 -99 88 -99 -18 -204 125 150 79 19 -99
4948i9l2M22L3m22j31L31L9k90L19l7k29K23j33r4n2J42O6k73L77j29Q2m25O00
$$ -99 -131 291 324 -98 -229 102 141 -149 170 133 -96 127 -6 -100 -152 -10 56 -217 160 31 113 -312 288
4971B88k08j01J88j55p9r7K34J69k19K21k99PJ41k50Km6L22J42l63K39p0J46j68
$$ 288 80 -21 167 12 -67 -164 70 239 20 241 -58 -51 90 -160 -158 -204 118 260 -103 136 66 212 44
4994D4j05K34q6j36J11j54J56k42Q8K5r2M9j7l2M01k23M3o2K5o4J87k65J95J0
$$ 44 -61 173 87 -49 62 -92 64 -178 -90 -65 -157 -108 -125 -157 244 21 64 2 27 -37 150 -115 80 90
5018I0rj08J30k8k0j22J55J12k67R3m1J36J84k06k68K84m3j92R3j6J84l65MJ95
$$ 90 81 -27 103 75 55 -67 88 200 -67 26 -15 121 305 99 -169 115 72 -120 -27 -43 141 -224 -220 -25
5042b5j21K52r1j55P8K67j61N3k81J8K38j33O7n8J03N4j51L7k42M49k92J56q0
$$ -25 -146 106 15 -140 -62 205 44 97 -184 -166 72 -61 6 -52 51 105 -46 -9 -251 198 -94 62 -18
5065a8k07K02R4j58K7J69j80K89k67o8J98k38J65M8k9j49N2q2O1k18K37qP6p1
$$ -18 -225 -23 71 -87 -60 109 -71 218 -49 -117 81 -157 8 56 27 -122 -70 -152 -91 -309 -72 -80 -4 -75
5089g5j82L21kj32K34q4o6N0q5K40n95K37R3J76l85J57M6K6K14k94K67m8k7j21
$$ -75 -257 64 62 -70 164 80 14 64 -21 219 -376 -139 -46 130 -255 -98 -52 -26 188 -106 161 113 86 -35
5113c5J97k39K68j14j62k57L64R4j53K44J51k83o8j26k9K70k3l13K85K3l8N4k29
$$ -35 162 -77 191 77 -85 -342 22 116 -37 207 358 75 7 -119 -148 122 99 -214 71 94 56 110 -119
5136a19k9j6K03Mj40m2R0K75l20N0k8J97k36j80M48l71M74j57j9J6j56R2n5L3
$$ -119 -148 -164 39 43 -97 -139 -49 226 -94 -44 -72 125 -111 -291 157 -214 260 103 84 100 -56 36 -19 14
5160A4K20j98o3M6k37L6L4K18j00o9Q0m4m4j33L54k82j1K72k18P8J47R5o1J59
$$ 14 234 36 -27 19 -218 -182 -148 70 -30 -99 -19 -63 -107 -240 114 -168 -179 93 -125 -47 100 195 134 293
5184B93m41K32l40J71R3m1j34J44K98l78K57j29m5M5l5L5l7M6L3J8j02j28K66
$$ 293 -148 84 -256 -85 8 -33 -167 -23 275 -103 154 25 -20 25 -10 25 -12 34 67 85 -17 -145 121
5207A21j58p6l0j06K12K03j03m6k02K75o6K76l77K59j52N0N7M7l38k1K31J00m50
$$ 121 -37 -113 -143 -249 -37 166 63 17 -185 90 24 300 -77 182 30 80 137 184 -154 -175 56 156 -294
5230b94M70j67J15O3J3m65J32J62j08m3J03j2m2K12l42Q6L49m00K28m4j04J8J09
$$ -294 176 9 124 187 200 -265 -133 29 -79 -122 -19 -31 -73 139 -203 -117 232 -168 60 16 -88 -70 39
5253C9L83m17k03n1J35j73L45j28O5Mj02m1J91n4L52n84K36J78J6j95M5k85L47
$$ 39 422 5 -198 -249 -114 -287 58 -70 -5 -1 -103 -144 47 -7 345 -239 -3 175 191 -4 41 -244 103
5276A03r7J6m8P1J02m41J79K25q7l08L04r0J6K5J13r5L6J72j05o2k20q7R6J51
$$ 103 6 22 -26 45 147 -294 -115 110 23 -285 19 -71 -55 -30 83 -12 24 196 91 29 -191 -278 -182 -31
5300c1J93l26K76k72m0M5K03j17J86j58J67j02J43k71P7q5Q8K01K39n70K93J60
$$ -31 162 -164 112 -160 -200 -155 48 -69 117 -41 126 24 167 -104 -27 -112 -24 177 416 -154 139 299
5322B99l22nn0J77j34rJ4l8J01k8j91J65o4K14j76J27j29l9L68k29J20j02K41
$$ 299 -23 -28 -78 99 -35 -44 -30 -68 33 5 -186 -21 -85 129 -47 80 -49 -88 280 51 171 69 310
5345C10m86M0L16Po6j85J45k66k1K02J24q5r5OO0K56j08j80J15k61J38J4k2k3
$$ 310 -176 -136 180 187 121 -64 81 -185 -206 -4 120 35 -60 -54 6 262 154 -26 89 -172 -34 -20 -42 -65
5369f5P7j45Q2M7O5L4m1j18M6j34K32N1o2n0J2j94L1K14J45o0r2pl4j73K15m4
$$ -65 12 -133 -51 -4 61 95 54 -64 -18 -152 80 131 69 19 31 -163 -132 82 227 167 75 68 34 -139 76 32
5395C2o8J11%j04K15j62k24L88k42O6M7j25m9L9P9J29j08R5n4o2L37j41o1r6k15
$$ 32 -36 75 75 -29 186 24 -200 188 -54 12 59 -66 -115 -76 3 132 24 119 65 3 340 199 138 42 -173
5420a73r3M92j11j48j84J32K32k82J98n9m6K42k88q9K15k3j0K6j01p5L8K54j21
$$ -173 -266 226 115 -33 -217 -85 147 -135 63 4 -42 200 -88 -177 38 15 5 31 -70 -145 -107 147 26
5443B6qo6J27j07J90j74J8K3j53J30OJ70j41R6k90K55M0j33j64J13R4N6nk38J25
$$ 26 18 -48 79 -28 162 -12 6 29 -124 6 12 182 41 137 -153 102 142 9 -155 -42 52 108 103 -135 -10
5468a0j2O4N1j90K35k23j35L48k41J65N2K24m23J83j1l57M22oM4o2l03L8L45k41
$$ -10 -22 42 93 -97 138 -85 -220 128 -113 52 104 328 -95 88 77 -280 142 136 180 118 -185 -147 198 -43
5492d3k8P1O7k21L81l60L55K2l04K06r8pn5m7J27J14M9p1j77k38J31J66p0j19
$$ -43 -71 0 67 -154 227 -133 222 244 -60 146 48 41 -14 -61 66 180 229 158 -19 -257 -126 40 -30 -149
5516a49K17K49j30m7q2m09j8L22j62L23k37P37p38j72K6K18q5J87q0K11j25j0
$$ -149 68 317 187 140 58 -351 -369 -47 -209 114 -123 614 -124 -296 -270 -52 -137 50 -30 181 56 46
5538D6K32m31j32J30K48k82M18k87k14L29j97N2O9No1J52k32K59j95K25j43m0
$$ 46 278 -153 -285 -155 93 -189 229 -58 -272 57 -140 -88 -19 -14 -75 77 -155 104 -91 134 -9 -49
5560d9n0n1N4Q0q4J55k8j35n3L14j97k43K46k24P2R7J95J67k92OK50k45J2r4K11
$$ -49 -99 -150 -96 -16 -100 55 27 -108 -161 153 -44 -287 -41 -265 -193 -96 99 266 -26 -20 230 -15 -3 -97 114
5585A14k73M1O2K23n8l42L27r0j64K19Q1j04K08m8j47l6Q1Q7k0m5k13L2J73j13
$$ 114 -159 -118 -56 167 109 -233 94 4 -160 59 140 36 244 196 49 13 94 181 161 116 -97 -65 108 -5
5609eOj74J42J20k16Q3n5J81P5k66m4j77M99j38l00L50q1R4j3j67L41m15P4K4
$$ -5 1 -173 -31 89 -127 -44 -99 82 157 -109 -153 -330 169 31 -269 81 0 94 81 -86 255 -160 -86 -62
5633f2R7R6Pk61J01R2r7J43j00K63j33k25K85l04J50j59K13K72l83J69j85M5R7
$$ -62 35 131 138 -123 -22 70 -27 116 16 279 146 -79 206 -98 52 -107 106 378 -5 164 -21 24 121
5656A21j13J19K5j02j05K09j98o0J10L25k51j01J31j83Jp7j8J5L73k50O5l50L38
$$ 121 8 127 152 50 -55 154 -44 -104 6 331 80 -21 110 -73 -72 -149 -167 -152 221 -29 36 -314 24
5679B4l48J97J05J89L6n4O6l32K63k52O8K79k78rj29K73r6L9J71k47m6O5K48n24
$$ 24 -324 -127 -22 167 203 149 215 -117 146 -106 -38 241 -37 -46 -175 98 2 41 212 -35 -81 -16 232 -292
5703b92J11M59m53K36M0q6n9QK78j79k33K95m36L26j28J59J10j79n3K25q0o4P5
$$ -292 -181 278 -175 61 101 15 -44 -36 242 63 -170 125 -311 15 -113 46 156 -23 -76 149 69 5 80
5726H0J58j41r1r7QN8n9r5K90j09j35J16L42k05l51K34j97L92k8j20k69N11j53
$$ 80 238 97 6 -91 -83 -25 -84 -179 111 2 -133 -17 325 120 -231 3 -194 198 170 50 -219 292 139
5749A39k71r9K31o2M2j3K71l19kl7N4Q5O1K8j23k36K22O5O4j33j51L13k74J03
$$ 139 -132 -231 0 -62 -20 -33 238 -81 -83 -120 -66 19 80 108 -15 -251 -29 36 100 -33 -184 129 -145 -42
5773d2R3j40J24J26j35p8L0j8k7J27k9J10J90l09q0k3L0q3J64K53m79K62P7l02
$$ -42 51 -89 35 161 26 -52 -22 -40 -67 60 31 141 331 22 -58 -81 -51 -134 30 283 -196 66 143 -159
5797a59J26k72L40J49mk99K09j11J44k14J59J60k81K68Mj87L4j21K18k20J31L3
$$ -159 -33 -305 35 184 180 -119 90 -21 123 -91 68 228 -53 215 219 32 66 -55 163 -57 74 107
5819A07Mr5j43L26m11J91K8j69K43j50L87m38j3J17O0k3n2RJ87j70L7P2k85K69
$$ 107 111 16 -127 199 -212 -21 7 -162 81 -69 318 -120 -133 -16 44 21 -31 -22 165 -5 32 104 -181 88
5843H8j55K48J06m34j0K47J01K03j92m65K08K01J50l34Qk1K15k75O3j51M68j10
$$ 88 -67 181 287 -147 -157 90 191 394 202 -263 -55 146 296 -38 -30 -51 164 -111 -48 -199 269 159
5865A59l52P2K71k89K94j2m1l65K29q3J38N1J7N2j78j48J42J31j04j72K94j17
$$ 159 -193 -121 150 -139 155 143 102 -263 -34 -117 21 72 89 141 -37 -185 -43 88 -16 -188 106 -11
5887a1k22K5J97j35L28l03o7J10l0K52P2j58Jn5J03j38J13j76j61M24k41L23k66
$$ -11 -233 -208 -11 -146 182 -121 -188 -78 -108 144 216 58 59 4 107 -31 82 -94 -255 169 -72 251 -15
5910a5P0j95M8J22j37r0J62M4j33P1J05j80J26n7J81n2Q0k21K46j72k55L19J7
$$ -15 55 -140 -92 30 -107 -197 -35 9 -124 -53 52 -128 -2 -59 122 70 150 -71 175 3 -252 67 84
5933H4j00M6l4Q1j96L4J08j88K89k37Q5J99j42K54J3k24k96L45j07j1j84%L74
$$ 84 -16 30 -4 77 -119 -85 23 -165 124 -113 -28 171 29 283 296 72 -224 121 14 3 -181 -181 193
5956A93k71L7L3j13J39J07J5k95K28k17M2L41j45l14K61j53Q1N4o2k32K42J11
$$ 193 -78 -41 -8 -121 18 125 140 -155 73 -144 -102 239 94 -220 41 -112 -31 23 -39 -271 -29 82
5978H2n3j92K13k65K66k94O0K55J1q0J99j80J09j98k01J67K09L2j65M9j13J18
$$ 82 29 -163 50 -215 51 -243 -183 72 83 3 202 22 131 -67 -268 -101 108 140 -25 24 -89 29
6000B9k14O5J16O2j24l3p9L24k67Qj28J78r0P1K49r1n8k19r4K52J67m5J68j55
$$ 29 -185 -120 -4 58 -66 -99 -178 146 -121 -113 -241 -63 -153 -82 167 76 18 -201 -295 -43 124 79 247 92
6024I2l3J77m03K03P3j15J6J00j46N2n7j80K20Q4%k8j43J06J29j09L2r5K47j19
$$ 92 59 236 -167 36 109 -6 10 110 -36 16 -41 -221 -1 83 83 55 -88 18 147 38 70 -25 222 103
6048A03j45K88k69k5J75l43M37j26j77R1Kp0Q2k9n0o8Q5J09j33M7l6j46J67k4
$$ 103 -42 246 -23 -48 127 -216 221 95 -82 9 11 -59 23 -6 -56 -124 -39 70 -63 -16 -52 -198 -31 -55
6072e5J6j18J90j7K16j75k86K08l7j00L65pj13l34O44m48K85j53j89O9j58J41
$$ -55 -39 -157 33 16 232 57 -229 -21 -58 -158 207 200 87 -247 397 -51 234 81 -108 -39 -197 -56
6094e6K14k18j25L17j15o8K31n5l3j48J34j9j36K08j45o7m3P5l2J46m2J72j96
$$ -56 158 -60 -185 132 17 -51 180 125 92 -56 78 59 -77 131 -14 -81 -124 -49 -81 65 23 195 -1
6117aJ24j4j3j63Q3l5j85J8J5K38J44l44Q2Q9j4J70j62r3O0J26K4o1j64K39r2
$$ -1 123 109 96 -67 16 -19 -204 -186 -171 67 211 -133 -51 38 24 194 32 -61 -1 125 149 88 -76 163 71
6142G1q0J79k64M2j12K2J53m1K54m20j65J60J80K69j75P6k94J75k4J73j85K16
$$ 71 -9 170 -94 -52 -164 -142 11 -30 224 -196 -361 -201 -21 248 73 149 -145 30 6 179 -6 210
6164B10k80Q1j69L05j63j0J51%m98N49p6m68O20k18J07l59J07J09K32k71n3R1
$$ 210 -70 11 -158 147 -16 -26 125 125 -373 176 100 -368 252 34 141 -218 -111 -2 230 -41 -94 -3
6186cK06p5K57j98l26K27k99K56Q4l44J90J31j15k49M40n37M26j41J0p7K24k75
$$ -3 203 128 385 187 -139 88 -211 45 129 -215 -25 106 -9 -258 182 -355 71 -70 -60 -137 87 -188
6208a88K34n7j75L38j99P8j89j01J07J35M24k46P8j60p9J2K02j7j17k24K00q4
$$ -188 46 -11 -186 152 -47 31 -158 -259 -152 -17 407 161 239 79 0 12 214 197 80 -144 56 -28
6230b8K30J75k61j66lK30m9P4j11J43j67l11M76l90pJ19Qj1J68M0N5m12K0K18
$$ -28 202 377 116 -50 -53 177 128 202 91 234 67 -244 232 -158 -165 -46 -38 -49 119 159 214 -198 -178 40
6254D0K2L0k50L1M4J00j25K12k76j14J32L29m58q9L09r4J90J11j62J17R5m01J97
$$ 40 62 92 -158 -127 -83 17 -108 104 -172 -286 -154 175 -283 -372 -63 -157 33 144 -18 99 194 -207 -10
6277a0l5L05k92j98J01K68J06l96Q6R4P0m6K67l65N0J13l41K14J28l92K33Q4J03
$$ -10 -45 260 -32 -230 -129 139 245 -151 -65 29 99 53 320 -45 5 118 -223 -9 119 -273 -40 44 147
6300A47m35J73m6J68o4K07k17K87m28m3K78q4j12Q3K07P1j34n9%o7J31j29J93
$$ 147 -288 -115 -161 7 -57 150 -67 220 -208 -251 27 -57 -169 -86 121 192 58 -1 -1 -68 63 -66 127
6323A27Kk54K9J94N1k9k69K89k20k24M95m8J4l2j63m2K5O5J5O7L5p3k23L10j9
$$ 127 129 -125 -96 98 149 120 -149 140 -80 -304 191 143 157 125 -38 -80 -55 10 25 92 127 54 -169 141 122
6348A22l72L02j85K42q2k99j39M79q5J95m25K81J00o9j36L37l96L80m29L09k11
$$ 122 -250 52 -133 109 27 -272 -411 68 -17 178 -247 34 134 65 -71 266 -130 250 -179 130 -81
6369h1K24k63J64o0R1n5J88l53L35j73k47L58j37K18j66K3O0L3r9j37Q5k80L03
$$ -81 143 -120 44 -16 75 20 208 -145 190 17 -230 128 -9 209 43 66 126 159 60 -77 8 -272 31
6392C1K97m91J57K8k15K34j35p1K66n8k79K67j14J81r8J30LJ53l73j95K84P8n4
$$ 31 328 -163 -6 22 -193 41 -94 -165 101 43 -236 31 -83 98 0 130 133 286 -87 -282 2 80 26
6415B6j0M8O2k9k53R9j8R7m3O3k58M2K05P9K94k89j49O4j47J50l17L43Jj20K06
$$ 26 16 64 126 97 -156 -57 -75 22 -21 42 -216 -174 31 110 404 115 -34 30 -117 33 -284 59 60 -60 146
6440A46j6j87J29J25Rk38K50n08K42K51j02k39L06j60J80K0k22r2N7K32o6O9l83
$$ 146 130 -57 72 197 206 -32 218 -290 -48 203 101 -138 168 8 188 208 -14 -106 -49 183 117 186 -197
6463a97j3J26r0j72K97n3L1j52K13j57N12m29J90k4PPj46J25K8O7J51j11k41L8
$$ -197 -210 -84 -174 -346 -49 -102 -71 -223 -10 -167 345 -84 106 82 89 96 -50 75 103 170 321 210 -31 7
6487GJ85l2k59K1O2J94l18K01k89K40RO9LK7k68M25l59L49r7l33K24k6P8l57M39
$$ 7 192 160 -99 -78 -16 178 -140 61 -228 12 21 90 93 120 -148 277 -82 267 170 -163 61 35 113 -244 195
6512A95m23J56j37j30K61J28J71m94L72j32l05L10J92l6j59O7K92l57K8n5K24
$$ 195 -228 -72 -209 -339 -78 50 221 -273 99 -33 -338 -28 164 128 -31 36 328 -29 -1 -56 168
6533A68j88k9K7k3M9J21J45p1k77j68L55k5qj79K90l5j34l13N45l56K61j00j49
$$ 168 -20 -49 -22 -45 4 125 270 199 -78 -246 109 84 76 -103 187 152 18 -295 250 -106 155 55 -94
6556i4P7j27K53m80J05K45j39K14L2j37M9k3R6K98m97L60l08QO6r8K2n6J22j36
$$ -94 -17 -144 109 -371 -266 -21 -160 54 86 -51 -2 -25 71 369 -128 232 -76 -68 -2 -100 -78 -134 -12 -148
6580a48K27J7q9RJ52k27K27nk45J25j70j6L69k28M0J36k16k01K84k01P3J62j22
$$ -148 79 96 7 16 168 -59 168 163 -82 43 -127 -143 226 -2 38 174 -42 -243 41 -160 -87 75 -47
6603d7R0j87L10j40n3R3R4k18MR7n3n0N3Kj37Q6l11L74m0j61K36M4k63J8R7NL1
$$ -47 43 -144 166 26 -27 66 160 -58 -54 43 -10 -60 -7 -5 -142 -56 -367 7 -33 -194 42 86 -177 -159 -62 -57 -26
6630b6J27r2K01m41K11J8L40n12L04j38l18M23j05K28j29j52O8k54O4K17o6k19
$$ -26 101 9 210 -231 -20 -2 338 -174 130 -8 -326 97 -8 220 91 -61 7 -247 -183 34 -32 -251
6652b51K90j10J05j18J01r1J69%k44K67MJ5l7l7m4J59o9Q8k48j44JM71j30j35
$$ -251 39 -71 34 -84 17 -74 95 95 -149 118 122 137 100 63 19 178 109 197 -51 -195 -194 277 147 12
6676A2J74l28J54J58k40M6j09J94mj30K3J16J3o9m7J81j91J72q9j33L62l28J28
$$ 12 186 -142 12 170 -70 -24 -133 61 57 -73 -50 66 79 10 -37 144 -47 125 36 -97 265 -63 65
6699F5j29j12K35k6k58K26j16L97l12n6J17k18K65m9j7j61m3Q1Q8J80K6q1j24
$$ 65 -64 -176 59 33 -225 1 -115 282 -30 -86 31 -187 78 29 12 -149 -192 -111 -23 157 183 102 -22
6722b2M06j77n7k04k38M40j66L29k05j08j10L35j11O2k35J56k0k18K68j6L5j47
$$ -22 384 207 150 -54 -292 148 -18 311 106 -2 -112 223 112 174 -61 95 75 -143 125 109 144 -3
6744cJ48k03J03j85K24r5r3J81j01o0o9L7K57N8k17K55j81l99M09K54l93L32l46
$$ -3 145 -58 45 -140 84 -11 -104 77 -24 -84 -153 -116 141 199 -18 237 56 -343 66 320 -73 259 -87
6767h7M3O2O3k82O6l3J43K91J9l51m3K85K2k31j77L57p4Q4k50k16M41Rrk62J81
$$ -87 -44 18 81 -201 -135 -168 -25 266 285 -66 -109 176 198 -33 -210 147 73 157 -93 -309 132 141 132 -130 51
6792E1o5J3M5j98K32o9j29L4J36j61k7L7N9Q3lj80P3L18j24l50K91m3J15M3k13
$$ 51 -14 -1 44 -154 78 9 -120 -86 50 -111 -138 -101 -42 41 38 -142 -69 249 125 -225 66 23 138 181 -32
6817c2j13M13k60L54l06q2K18L8k86n0j23J30O0j42K15j97K28n6R5m39M44j30
$$ -32 -145 268 8 362 56 -26 192 230 -56 -106 -229 -99 -39 -181 34 -163 65 9 104 -335 109 -21
6839b1o9p3J60O9j07l4j54L78j05J7Rj51J2O9J72k03k7K9J12J68k53L5P7j37J6
$$ -21 -90 -163 -3 66 -41 -75 -229 149 44 61 70 -81 -69 0 172 -31 -58 -29 83 251 -2 33 110 -27 -11
6864a1j58J66o0O7o5K33k22j1j24J76j5k30K44k2m6n3J31j33P5J78P2j12k01J71
$$ -11 -169 -3 -63 4 -61 172 -50 -61 -185 -9 -24 -254 -10 -32 -78 -131 0 -133 -58 120 192 80 -121 50
6888E0j14O4k9K8J64o1j57q7q3R2N5k15N24Ll07J86Q1J20k08k30L3K17j90J09
$$ 50 -64 0 -29 -1 163 102 -55 -142 -225 -133 -78 -293 231 234 -73 113 194 314 106 -124 -91 126 -64 45
6912D5j12K15j60J51L6j38j40R4o0J90p4k1l5k57L34j84j1J43j30J74l79J92R7
$$ 45 -67 148 -12 139 175 37 -103 -9 -69 121 47 26 -9 -266 68 -116 -127 16 -114 60 -319 -127 -30
6935c0o0J58j6k62L09o3j48K47m72M26l2j20R0o1Qk99K78J09r1p7L07p7K49l97
$$ -30 -90 68 52 -210 99 36 -112 135 -337 89 57 -63 27 -34 -26 -325 -47 62 -29 -106 201 124 373 -24
6959b4k01K45k91N1L61k74M0J5j09K19P1l5j34k0%N2K9m0k30L41j97J58R2l22
$$ -24 -225 20 -271 -220 141 -133 -93 -78 -187 32 103 68 -66 -86 -86 -34 -5 -45 -275 66 -131 27 119 -203
6983b03M72n33K86K42m26J23q1M5O3N4J04K5j9k15M25m24P5o4p4K19j9r0m4q2
$$ -203 269 -264 22 264 -162 -39 -120 -75 -12 42 146 171 152 -63 362 -62 13 -51 -125 94 75 -15 -59 -141
7007a41rJ84j22j55L51j85K52j93j89j4K56R2N0M5l64K69j08O5OJ44l76L86l25
$$ -141 -150 34 -88 -243 108 -77 175 -18 -207 -221 35 127 177 222 -142 127 19 84 90 234 -142 244 -81
7030h1K01j96J45j15O9j53J39J39k5j82l0L3J7j35J03K23l41L63l19L68p88N92
$$ -81 120 -76 69 -46 23 -130 9 148 123 -59 -89 -56 -39 -174 -71 152 -189 174 -145 223 -565 27
7052B7j53O3J58P7m08K40m9N5M3j40J10J25l7k9m1l56J99K01J57l07J72j25J12
$$ 27 -126 -63 95 172 -236 4 -45 10 53 -87 23 148 111 82 41 -315 -116 85 242 -65 107 -18 94
7075I4j90N3k53L42r6O8k6R7J88k24l73J02N0R6K10j48j62L10k34j29N9J63J52
$$ 94 -96 -43 -296 46 -50 18 -8 89 277 53 -320 -218 -168 -72 138 -10 -172 138 -96 -225 -166 -3 149
7098A49Q4k35k06k1%J96j9n7q9L00k6J94o56K96J38j79j39K99L9k4L2j49K36l85
$$ 149 233 -2 -208 -229 -229 -33 -52 -109 -198 102 76 270 -386 -90 48 -131 -270 29 68 44 76 -73 163 -222
7122b22J46M45k44k68J02oK9QK26j85j07J22J41R9n41O9K50j2N9l36M7qj12L00
$$ -222 -76 369 125 -143 -41 -47 -18 -10 216 31 -76 46 187 286 -255 -186 64 52 111 -225 -178 -186 -298 2
7146BJ77j64j16M75m49j2M8O4k27J44K34o3j91Q8J33k69J78j06k85M62k92j20
$$ 2 179 15 -101 374 -75 -87 -39 25 -202 -58 176 113 -78 10 143 -126 52 -54 -339 123 -169 -289
7168b89K79L1J19j76K2J07j64L08l85J08J21L5j16r1K3o2K20J14k89N9q1J24j43
$$ -289 -10 21 140 -36 -14 93 -71 237 -148 -40 81 116 0 -91 -68 -130 90 204 -85 -26 -107 17 -126
7191a26l7J97K1k75N55m83J97m0j97n3L94m76L27J43k02j91j65L26J54j93J64
$$ -126 -163 34 55 -220 335 -148 49 9 -188 -241 153 -323 4 147 -55 -246 -411 -85 69 -124 40
7212D0R2r7q8J21j76K50J30k95K08K0m1p1k82j19K72k3o5M56l48r1n5L44j94j03
$$ 40 132 35 -53 68 -108 142 272 -23 185 205 164 93 -189 -308 -36 -59 -124 332 -16 -107 -162 182 -12 -115
7236a15k97K50J29K0J33k06J0J58j38R2j19k58L72QK35l08J0j50K12K0o6l2K76
$$ -115 -412 -162 -33 -13 120 -86 -76 82 -56 36 -83 -341 31 39 274 -34 -24 -174 38 58 -8 -40 236
7259B36ql04N3n5J12q0l7k5K0j00J67K6P8p8j23J64j28K70j22N3k8j04j75P5K82
$$ 236 228 -76 -23 -78 34 -46 -83 -108 -88 -188 -21 5 83 5 -118 46 -82 188 66 119 91 -13 -188 -113 169
7284A69P1j87q2M23n84L66j84N2L2L64n55P3J27N5l20K37J23r3m6M7K1k31K29
$$ 169 240 53 -29 394 -190 176 -8 44 76 440 -115 -42 85 140 -180 57 180 87 41 88 109 -122 107
7307A07O6j00j17n3l1j2j03L17j4M02n54Q9K93n14J80k56J97L2J8r3J08J02Ml7
$$ 107 173 73 -44 -97 -128 -140 -243 74 60 462 -92 -3 290 -224 -44 -300 -103 -71 -53 -146 -38 64 68 31
7331C1j35o2K13J86j60j09J64lj08R1k14M0L96j32j55l53K64K58m32M37m64K75
$$ 31 -104 -166 47 233 73 -36 128 125 17 108 -106 -66 330 198 43 -310 -46 212 -220 217 -247 28
7353B8j68j37P4n8K71J7P8r4N3K2O6k16L27ll16M16m03J6qP5R8j5p0L8j06k07
$$ 28 -140 -277 -203 -261 10 27 105 11 64 86 152 -64 263 260 -56 360 -43 -27 -35 40 138 123 53 91 -15 -222
7379b22K33M9j8m2%n4J54J70l06o5J97O2j93N9K0O3K03m49K0J74r9K44m09K89
$$ -222 11 60 42 0 0 -54 100 270 -36 -101 96 158 -35 24 44 107 310 -139 -119 55 -44 200 -209 80
7403H0J48q2P8m02j69N33k32K88j47rj87O5j13L05j07p6J55J24j23j06j57K93
$$ 80 228 146 224 -178 -347 186 -46 242 95 86 -101 -36 -149 156 49 -27 128 252 129 23 -134 159
7425A59k40J2J17k34J06j06J18n3J44j20L49k53j4r7L09J1k50j17J77O1m7j1j67
$$ 159 -81 -69 48 -186 -80 -186 -68 -121 23 -97 252 -1 -15 -112 197 208 -42 -159 18 79 32 21 -146
7448a46R9J84n52J70M07l44K29L6k7k71J81J21K4J58l18J21j07j8L90l98j04J87
$$ -146 -47 137 -415 -245 162 -182 47 83 56 -215 -34 87 111 269 -49 72 -35 -53 337 -61 -165 22
7470B2l6K05j73R5k78k73L43l9r1L49k07K47j89l6J16j1m5r5J11j19m9L37j74
$$ 22 -14 191 18 113 -165 -438 -95 -134 -225 124 -83 164 -25 -61 55 44 -1 -96 15 -104 -153 184 10
7493A0j70k4K96l99Q0J7N3MJ81K91n46L44r5j02o7LpJ97k46L21j08l12M05j62
$$ 10 -160 -184 112 -287 -207 -190 -137 -133 48 339 -207 137 42 -60 -127 -124 -131 66 -180 141 33 -279 126 -36
7517c6J53J0j20M1j16J43j59N6j31J26J40N1N8k15J70r7j47o7J19j23M6j55M32
$$ -36 117 127 7 48 -68 75 -84 -28 -159 -33 107 158 216 1 171 74 -73 -140 -21 -144 -98 -253 179
7540A79l56O6M76k61l23K06j00K32p4J3K1M6J4l35j42L43K50l35L0P0Q6k21r9
$$ 179 -177 -111 365 104 -219 -13 -113 119 45 58 79 125 139 -196 -338 5 255 -80 -50 20 106 -115 -214
7563b14L08J78l39J40j09r5K9J33M5l58M39MP1l49k15M26q2K35j41o5J50m96M29
$$ -214 94 272 -67 73 -36 -131 -102 31 76 -282 157 161 232 -117 -332 94 12 247 106 41 191 -305 124
7586A24m7M8O7l16K67Kj09Q3k57J88j52K3k03L22Or4j87K72jk09K67O2M2k73j2
$$ 124 77 125 192 -124 143 145 36 119 -138 50 -102 -79 -282 40 46 -48 -235 37 36 -173 94 156 198 -75 -87
7611h7J01n2q8L11j29J40k64K63n7j09L7J30j47j73L3K0r6K71k23n5pK85l12L04
$$ -87 14 -38 -126 185 56 196 -68 195 138 29 66 196 49 -124 -91 -71 -167 104 -119 -174 -181 104 -208 96
7635I6n1k39L01j04Q3k83K51J4k8K7J58mk71J45j40q3l7N12m69q0K88j32M2J10
$$ 96 45 -194 107 3 86 -197 54 68 40 67 225 221 -50 95 -45 -128 -165 347 -122 -202 86 -46 -4 106
7659A06j54OJ95k47J53o6J70m28L42L6k59N5N4J36l66N50m35n4J50j65J55J15
$$ 106 -48 -42 153 -94 59 -7 163 -265 77 113 -146 -91 -37 99 -267 283 -152 -206 -56 -221 -66 49
7681D9R5q8Q3Q8ql10R5N5l26L37q6Q3j79k2j86J92K40j85J51Mj18J26MRo3J1j69
$$ 49 144 56 139 227 219 -91 4 59 -267 70 -16 67 -112 -134 -320 -128 112 -73 78 82 -36 90 94 103 40 51 -118
7708a18L10l07J19p2JJ23j77r6J22k2Q7j35K40n8m8r2J96j8n0R9Q1o7P4nq2j61
$$ -118 192 -115 4 -68 -67 56 -121 -217 -95 -117 -30 -165 75 17 -31 -123 73 55 5 104 185 118 192 187 105 -56
7734e6j03l5J19L3j5J62n32M71k88N49m90K65l23K19K46j58Q7l59j9N36k99l26
$$ -56 -159 -194 -75 -42 -57 105 -427 44 -244 305 -185 80 -243 -24 222 64 151 -208 -227 309 10 -316
7756c16M06L5j32j11R3n7K10l90P9K21N5k87K74k42j6K34K34k09j42R5k20RQ5
$$ -316 90 125 -7 -118 -25 -82 128 -262 -183 38 93 -194 80 -162 -178 56 290 81 -61 34 -186 -177 -92
7779i2J44L1n2j27l92O10K8k67J06J72j77J28N6n2n55J22N18m35L60k5j33l16
$$ -92 52 83 31 -96 -488 122 150 -117 -11 161 -16 112 168 116 -439 -317 201 -234 126 101 -32 -348
7801c48L16k3J76L38p73K64p7o0K6J17j93K64k24K00j29N69k32k44j09K36o0L
$$ -348 -32 -55 121 459 -314 -50 -127 -187 -161 -44 -237 27 -197 3 -126 443 211 -33 -142 94 34 37
7823C7q5J06J9k02J14j1J41p9k65R3j5Q2J50j26J5j92L29K3j49N8M7J07j35k03
$$ 37 -48 58 77 -125 -11 -22 119 40 -225 -132 -147 -65 85 -41 -26 -218 111 134 -15 43 90 197 62 -141
7847a41L40k52k42J76J05L0O1k19M81n11J8J14o1M5k08L68P3P3k40O9k68J94k33
$$ -141 199 -53 -295 -119 -14 16 77 -142 339 -172 -154 -40 -101 -56 -264 104 177 250 10 79 -189 5 -228
7870b28J28j12J95R5qq6J99O2Q8o11M0K39n9J16j04P7k42L08k43J11j55J53K12
$$ -228 -100 -212 -17 78 70 -16 183 245 333 -278 -238 1 -58 58 -46 31 -211 97 -146 -35 -190 -37 175
7893A75k13k7J16p8M5j74J56j09L8n1k13L41K72j72J37m54J20n5K56j21m0o1Q
$$ 175 -38 -65 51 -27 18 -156 0 -109 -71 -122 -335 6 278 106 243 -211 -91 -146 110 -11 -51 -112 -104
7916a04J24l03L90n9j1j89L3R3m7K60j84l9R6q8Q8N8j8k36J87J95k97j5K60k15
$$ -104 20 -283 107 48 37 -152 -119 -26 -73 187 3 -36 60 -28 60 118 100 -136 51 246 -51 -66 194 -21
7940b1j4o6J51k7j03L29l12k3P0J29l7O4J17k36J44k06J44Lkj84K22J4j63K3o
$$ -21 -35 -101 50 23 -80 249 -63 -86 -16 113 76 140 257 21 165 -41 103 106 104 -80 142 156 -7 16 10
7965A0J25J41n20L88j37J26j64O4j91J83J3q1L93m77K03j85J0J49P9k91K05L64
$$ 10 135 276 -244 144 7 133 -31 33 -158 25 38 -43 350 -127 76 -109 -99 50 129 -162 43 407
7987D07j49r5m69J56M41n22K27q5L45L1k93m7o3J94j70k9J18J82k06p2J05k38
$$ 407 258 163 -306 -150 291 -231 -4 -89 256 287 -6 -53 -116 78 -92 -121 -3 179 -27 -99 6 -232
8009b32M08k13j23K77J05j77M1K13m12J75J14n2L6k88J20j62K9o5M3M53k40J47
$$ -232 176 -37 -160 117 222 45 86 299 -113 62 176 124 160 -128 -8 -170 -141 -206 -163 290 50 197
8031A97k01j11m4j06K59n0M8j01J01Q1p9QM9j82m8J01lR5j48M62l52j38Q4n1k84
$$ 197 -4 -115 -159 -265 -6 -56 -8 -109 -8 73 -6 2 51 -131 -179 -78 -81 14 -134 328 -24 -162 -78 -129 -413
8056d13J93J95J63j32q0M2Q8K7q5K27j50r0J90j17r5Mj05o3L07k4o6m0P7k27J97
$$ -413 -220 -25 138 6 -74 -32 56 83 -2 225 75 -15 175 58 -37 -33 -138 -201 106 82 16 -24 53 -174 23
8081B3M49k76o1j20J52q5j88J86j85j52L24N3mj42o8j12L82j51Qj17J39J91q3
$$ 23 472 196 135 15 167 82 -106 80 -105 -257 67 120 116 -26 -94 -206 176 25 33 -84 55 246 163
8104A63j65r4J26j22l4P9J53k03M18m59J15J7O0k09J78k61J77J10j37j00K55M1
$$ 163 -2 -96 30 -92 -126 -47 106 -97 321 -138 -23 -6 54 -155 23 -238 -61 49 -88 -188 67 108
8126A08k22J8L17r2M2l59R3j10L0J40o0J9K76k01R4p9K44j43k70K27k47L62q5
$$ 108 -114 -96 221 129 171 -188 -95 -205 -175 -35 -95 -76 200 -1 93 14 258 115 -155 72 -175 187 102
8149A02N2p7k62L63l61J65L7j95L22j85J87k05N3j20K59k94L00RJ18k74J94n9
$$ 102 154 77 -185 178 -183 -18 19 -176 146 -39 148 -57 -4 -124 135 -159 141 150 268 -6 188 129
8171A29k01n8K65Qj76J25l67J02J88Q2j61r8Q0J65N8L0l75K98k7p0
$$ 129 -72 -130 135 143 -33 92 -275 -173 15 97 -64 -162 -82 83 141 171 -204 94 67 -3
8191c
$$ Imaginary data points
##PAGE= N=2
##DATA TABLE= (X++(I..I)), XYDATA
0@%%%%%%%%%%%%%jRj6J6j6J6k4L2l9M7n5O3p2Q7j02J18j34J51j69J92k22K51k82
$$ 0 0 0 0 0 0 0 0 0 0 0 0 0 0 -1 8 -8 8 -8 8 -16 16 -23 24 -31 32 -40 47 -55 63 -71 80 -89 103 -119 132 -150
36a50L17l53L94m40M91n47O08o74P45q24R11j006J109j220J343j481J633j801
$$ -150 167 -186 208 -232 259 -288 320 -354 391 -433 478 -528 581 -639 704 -777 856 -945
54i45J989k199K439k711L026l397L835m366N025n870O999q594J1026j5228K4514
$$ -945 1044 -1155 1284 -1427 1599 -1798 2037 -2329 2696 -3174 3825 -4769 6257 -8971 15543
69A5543q5468N5821J12486j42066l874R9500l0009p3732P3566K6418o0721j0273
$$ 15543 -69925 -14104 98382 -43684 -47558 51942 21933 -51799 21767 48185 -12536 -22809
81b2809L3539j1870P080R824j6477k175N179k8258J6441M0301l4233l8451M7226
$$ -22809 10730 -1140 5940 15764 -713 -2888 2291 -25967 -9526 30775 -3458 -41909 5317
94E317J6747l8315J7508L0334m2733j8224L9073J800k0862J5999l27j8533J9507
$$ 5317 22064 -16251 1257 31591 -11142 -29366 9707 11507 -9355 6644 6317 -12216 7291
107G291J7551k0656n927N067j4432J39J5206q246n583J0843r385n645K2982k694
$$ 7291 24842 4186 -1741 3326 -11106 -10967 4239 -4007 -9590 1253 -8132 -13777 9205 6511
121F511j9853J6062P951k2962J6870L1817k9368k5238L1193J229l4201J3411K1912
$$ 6511 -13342 2720 10671 -12291 4579 36396 7028 -18210 12983 14212 -19989 -6578 15334
134A5334l0500j2323L2632M630j9523O453J0363r966j236Q790K59j392j131l976
$$ 15334 -15166 -27489 5143 9773 -9750 -3297 7066 -2900 -4136 4654 4913 3521 2390 -1586
148a586M339N891m866l489J136n510k714Q616M21q046L428N034n037r45N345k549
$$ -1586 2753 8644 3778 289 1425 -4085 -6799 1817 2238 -5808 -2380 2654 -2383 -3328 2017 -532
164e32o125J099M947L038o34M19M309J283m744k18L054n782l034M784m489p990
$$ -532 -6657 -5558 -611 2427 1793 2212 6521 7804 3060 2842 5896 114 -2920 1864 -2625 -10615
180a0615R784O241j3955j837J3543m059r677J1199Q513r912j439J1405k0o250
$$ -10615 -831 5410 -8545 -10382 3161 -898 -10575 624 9137 -775 -2214 9191 9171 2921
194B921Q75J97l788k694o77K116N52m941q74P117q95n031M891J574p620L553R374
$$ 2921 3796 3993 205 -2489 -3166 -1050 -498 -5439 -6313 804 -91 -5122 -231 1343 -6277 -2724 6650
211F650m996m660Q429Q01p704M083M720p991m069N449J610k950j274l83J792M34
$$ 6650 1654 -3006 5423 6224 -1480 2603 7323 -668 -4737 712 2322 -628 -1902 -2285 -493 -59
227e9m400L79M583m643k912R781K963r135M068Q760p840l512J0433k705j1478
$$ -59 -4459 -4080 503 -4140 -7052 2729 5692 -3443 625 9385 1545 -1967 8466 5761 -5717
242e717O207O395r431k570P305l993p573N706M829m261j376L050K157J106P11
$$ -5717 490 6885 -2546 -5116 2189 -1804 -9377 -3671 1158 -3103 -4479 -1429 728 1834 2545
257B545L79J640j748k626L580J625o291n34M236n062l152P272o19q848L282O537
$$ 2545 2924 4564 2816 190 3770 5395 -896 -1430 2806 -2256 -5408 1864 1245 -7603 -4321 2216
273B216n786j338Q729n18p242K994N852j983k272Q82L75M09r69p60K478l62o604
$$ 2216 -3570 -4908 3821 3303 -3939 -945 4907 2924 652 1534 1909 2318 1349 589 3067 2705 -3899
290c899L99N438l286m128N441k69o908M326P179n243l065P068J87m609M285N160
$$ -3899 -3500 1938 -1348 -5476 -35 -304 -7212 -2886 4293 -950 -4015 3053 3240 -1369 2916 8076
306H076n151l960L247P80k553j889L80n84k186j740L148K979l612j698M985J257
$$ 8076 2925 -1035 2212 2992 439 -1450 -1070 -1654 -3840 -5580 -2432 547 -3065 -4763 222 1479
322A479k550L451L125m383j321L979n18k197J241j103m248J153K232j145l38j46
$$ 1479 -1071 2380 5505 1122 -199 3780 3262 1065 2306 1203 -3045 -1892 340 -805 -1143 -1289
338a289k469O18L098q31l76K416k341k416N816L787n148j769L901j129k450M058
$$ -1289 -3758 -3140 -42 -873 -1249 1167 -1174 -3590 2226 6013 865 -904 2997 1868 -582 3476
354C476J452n715k069K398K35p78M24k465k785K565L419J20p03J197o04j52K976
$$ 3476 4928 -787 -2856 -458 -223 -1001 -577 -3042 -5827 -3262 157 277 -426 771 167 15 2991
371B991K548j530l415q01J374J686j390k419r48p90j311J545K920j112l544J009
$$ 2991 5539 4009 594 -207 1167 2853 1463 -956 -1904 -2694 -4005 -2460 460 -652 -4196 -3187
387c187M087O02n74J302n50l256J730L767r14k805R25n48j962J829K153l059l560
$$ -3187 900 1502 928 2230 1680 -1576 154 3921 3007 202 1127 579 -1383 446 2599 -460 -4020
404d020J210J789j44k0Kn31k99L31K075K893j758l076K870K988k181n15K386k925
$$ -4020 -2810 -1021 -1165 -1185 -1183 -1714 -2013 -1682 393 3286 1528 -1548 1322 4310 2129 1614 4000 1075
422A075l843L088J204m393M9J453k938l09N689o61l688K925K856k695P57L748
$$ 1075 -2768 320 1524 -2869 -2820 -1367 -4305 -4614 1075 414 -3274 -349 2507 -188 569 4317
438D317j851j878J655J90j408N00j637k345J918k66k741J893K413l073o77M206
$$ 4317 2466 588 2243 2433 1025 1525 -112 -2457 -539 -805 -3546 -1653 760 -2313 -2990 1216
454A216k053j654M069N97m298K596L935l801r18M910k111m741K303K586l780k89
$$ 1216 -837 -2491 1578 2175 -2123 473 4408 607 -311 4599 2488 -2253 50 2636 -1144 -1433
470a433K023k874r52K216j61r27J355j259o45L833J786k779J383J863k521M20
$$ -1433 590 -2284 -3236 -1020 -1181 -2108 -753 -2012 -2657 1176 2962 183 1566 3429 908 1328
486A328L610k481m500K033L25l088K428J853m775j780M435R67k633J715J001j608
$$ 1328 4938 2457 -2043 -10 315 -2773 -345 1508 -3267 -5047 -612 355 -2278 -563 438 -1170
502a170J035K815L60l96j108k111Q12K645j577k065P52o60j743K559J420m311
$$ -1170 -135 2680 3040 2644 1536 -575 237 2882 1305 -760 -8 -668 -2411 148 1568 -2743
518b743q45L298r06j421M197P80n490J879N280j802k618L184l06m121J345L648
$$ -2743 -3588 -290 -1196 -2617 1580 2360 -3130 -1251 4029 2227 -391 2793 2487 -1634 -289 3359
534C359j857l021j28P59J71k2o70j109j88l77J717L297n10k393K194J649k015
$$ 3359 1502 -1519 -1647 -888 -717 -739 -1409 -2518 -2706 -3083 -1366 1931 1421 -972 1222 2871 856
551H56L67K866k913l442L114K351l831j269K368k456k493L596K068l599j29K512
$$ 856 1223 4089 1176 -2266 848 3199 -632 -1901 467 -1989 -4482 -886 1182 -2417 -2546 -34
567c4K92p29J979L34j272m00O46J017P96j526j728N08O53q84L99R8k283k85K013
$$ -34 258 -471 1508 1842 570 170 816 1833 2629 1103 -625 -117 536 -348 51 149 -2134 -2419 -406
586d06r68j094K684J61l042J620M320j442l407K504J617j753q2K111j079k445
$$ -406 -1374 -2468 216 377 -2665 -1045 3275 1833 -1574 930 2547 794 712 2823 1744 -701
602g01M65O00j625o18P43n86j145R61K177p2j937J116K372o10j398K204J424k761
$$ -701 -236 364 -1261 -1879 -1136 -1722 -2867 -1906 271 199 -1738 -622 1750 1140 -258 1946 3370 609
620F09j048K287L05k752j0J314k153j165K167Q36k385m02J967O12j363J198J574
$$ 609 -439 1848 2153 -599 -609 705 -1448 -2613 -446 390 -1995 -2397 -430 182 -1181 17 1591
637A591j180j486J886J407j539k3J624r97j946J126J268k436j255R57K66p91n8
$$ 1591 411 -1075 811 2218 679 656 2280 1283 -663 463 1731 -705 -1960 -1003 -737 -1528 -1586
654a586R96mj392K82K321J302j419o20J911L50j601J376P44k805j495K032o2k133
$$ -1586 -590 -594 -1986 -1704 617 1919 500 -120 1791 2141 540 1916 2660 -145 -1640 392 330 -1803
672a803Q87L22k083J48L251p07j755J519P89q26R42J299m61j095m04J77J998m84
$$ -1803 -916 -594 -2677 -2529 722 15 -1740 -221 568 -258 684 1983 1522 427 23 200 2198 1714
690A714k648J97J343j474p18K443j297k630J553K263j953q2K290j837j452L567
$$ 1714 -934 -737 606 -868 -1586 857 -440 -3070 -1517 746 -1207 -1289 1001 -836 -2288 1279
706A279J628k530L95J709j629j254K537j63k641m32o1K29N07r78p82O31M33p14
$$ 1279 2907 377 772 2481 852 -402 2135 1972 -669 -1101 -1162 -933 -426 -1404 -2186 -1555 -1122 -1836
724a836K208J438j976j05K681j113j365K579K49l742L32K842k427j617K255n12
$$ -1836 372 1810 -166 -271 2410 1297 -68 2511 2760 -982 -650 2192 -235 -1852 403 -109
740a09l203J237L149j159j392J108n9K3M40N13N78r2j401K93K482p18j925J256
$$ -109 -3312 -2075 1074 -85 -1477 -369 -428 -405 35 548 1126 1034 -367 -74 2408 1690 -235 1021
758A021l3k036P89J918k337k445K135L69j920J484K732k738j718L398J451j274
$$ 1021 988 -1048 -259 1659 -678 -3123 -988 -619 -2539 -1055 1677 -1061 -2779 619 2070 796
774G96j39J449p81j277J196J286j968k067l43J193K60r14P74o7j875K12K601O40
$$ 796 657 2106 1325 48 1244 2530 562 -1505 -1848 -655 -395 -1309 -535 -602 -2477 -2265 336 976
792I76j300L42Q15n84P32J942q15k726K0J322o9l28J44o38j504k93J822J380k284
$$ 976 -324 18 833 249 981 2923 2108 -618 -598 724 655 327 471 -167 -1671 -1964 -142 1238 -1046
811a046j387J020J546k44O73Q75j779p98K394J571j205n16n85j101M37J691j17
$$ -1046 -2433 -1413 133 -111 562 1437 -342 -1140 1254 2825 1620 1104 519 -582 -145 1546 1429
828A429k445j303L55Q63K62K01%q21n78K153K378l85k061O6J654p50K18J394j639
$$ 1429 -1016 -2319 -1964 -1101 -839 -638 -638 -1459 -2037 116 2494 2109 48 114 1768 1018 1236 2630 991
847I91l096P90K451q73j240K1r81p45J833K433j124j683N21J061O50N39j9r94
$$ 991 -2105 -1315 1136 263 -977 -956 -1937 -2682 -849 1584 460 -1223 -702 359 1009 1548 1529 535
865E35o87N8J734O42k234j291J003K74q96Q80K91j851j274K039J381q34k83K87
$$ 535 -152 -94 1640 2282 48 -1243 -240 34 -862 18 309 -1542 -2816 -777 604 -230 -513 -226
883b26k66K89J980M24j626n35Q18K20k71P21o76j899j243J809P92j331p81P01
$$ -226 -492 -203 1777 2201 575 40 858 1078 807 1528 852 -1047 -2290 -481 311 -1020 -1801 -1100
901a100M45n25R18J379j7j576O39J790m80m97K35p08r41R9J302n52k046K98Q95
$$ -1100 -655 -1180 -262 1117 1100 -476 163 1953 1473 976 1211 503 -438 -339 963 411 -1635 -1337 -442
920d42p93k11J954r7j897O08K009l25j006R31J72j164M22J580m58q75n46L09K3
$$ -442 -1235 -1446 508 411 -1486 -878 1131 806 -200 731 903 -261 161 1741 1283 408 -138 171 194
939A94K4m12m86j1o02L25Q76n07l55K82P19n84R64J050r59m48J435j09j051N77
$$ 194 218 -194 -680 -691 -1293 -968 -92 -599 -954 -672 47 -537 427 1477 518 70 1505 1396 345 922
959I22N73k044r15J223J2j331K30O85r14P26P55PJ55M24m20O39N99j38k55j8l90
$$ 922 1495 -549 -1464 -241 -229 -1560 -1330 -645 -1559 -833 -78 -71 84 508 88 727 1326 1188 933 915 525
980E25r70J024K20j512l02J123o38q94K148l10j746K0J850k08q14R75K64j076
$$ 525 -445 579 799 -713 -1015 108 -530 -1424 724 414 -1332 -1312 538 330 -484 491 755 -321
998c21O05J028j30q30r0l34K49J04l1j93m05p89K37P84l84o99M64N20n24O76J298
$$ -321 284 1312 1182 352 262 -72 177 281 250 57 -348 -1137 -900 -116 -500 -1199 -735 -215 -739 -63 1235
1019A235m44r77J280O27r47m04P93r53j183J021K26j018m39J24l40L52R14L9j97
$$ 1235 791 -186 1094 1721 774 370 1163 210 -973 48 274 -744 -1183 -1059 -1399 -1047 -133 -94 -291
1038b91L01RJ08J075k04n45j37K77l86L81J39q37n78Q34k90j024N16R61j508n66
$$ -291 10 19 127 1202 998 453 316 593 207 588 727 -110 -688 146 -144 -1168 -652 309 -1199 -1765
1058a765J770P79j496M19O89p76M18R99o4o57M23L0m60M98n1o32o53j35K0mR3
$$ -1765 5 784 -712 -293 396 -380 38 1037 973 316 739 769 309 807 756 124 -529 -664 -644 -648 -555
1079e55o25K71Q13n97K4J389M66j854P15J547p53o11R70k07j550K39J271j317
$$ -555 -1180 -909 -96 -693 -669 720 1186 -668 47 1594 841 230 1200 993 -557 -318 953 -364
1097c64p18M43q1n79P45O76q50L07K92K16J60K99qj54J59k30j23O84k21j280L90
$$ -364 -1082 -639 -720 -1299 -554 122 -728 -421 -129 87 247 546 538 384 543 313 190 874 653 -627 -237
1118b37R07j238R1J176j114j578J514P47q55%J137j059j76K033R2j080M34J68
$$ -237 670 -568 -477 699 -415 -1993 -479 268 -587 -587 550 -509 -685 1348 1440 360 794 962
1136I62j58j41K45p67q58PJ16L45P0q07o16J422K12q41J232O03j376n4J731Mj153
$$ 962 804 663 908 141 -717 -710 -594 -249 -179 -986 -1602 -180 32 -809 423 1026 -350 -404 1327 1331 178
1157A78N28K10j451Q7J264p41j093N74N9q10P80K29o02P3L43K87P6P71n31p5O89
$$ 178 706 916 -535 -448 816 75 -1018 -444 -385 -1195 -415 -186 -788 -715 -372 -85 -9 762 231 156 845
1178H45m10n4R24m61j299M87J003j368m77Q66o06p13P26P57j063j65J018k17j21
$$ 845 435 381 1305 844 -455 32 1035 -333 -810 56 -550 -1263 -537 220 -843 -1008 10 -207 -328
1197c28Q53M61p94L15L81n0n58n1L9l47j95j15L83j44r07R4N82J09n10R14L01
$$ -328 525 986 192 507 888 838 280 229 268 -79 -274 -389 -6 -150 -1057 -963 -381 -272 -782 132 433
1218D33o34j25J483m05q64O50K16p39r9Q46n58o90K62K63o93l2M26M2k15l25L35
$$ 433 -201 -326 1157 752 -112 538 754 15 -84 762 204 -486 -224 39 -654 -686 -260 -218 -433 -758 -423
1239d23M22k13j39Q51Rj45Q9L71k15m98K75N2l67m45L96k07m89k02N37m25j05
$$ -423 -1 -214 -353 498 507 362 451 822 607 109 384 436 69 -376 20 -187 -676 -878 -341 -766 -871
1260h71M92J24l57O44O81%o07J95K86L7j06J09K90j161p46R67K64o91n45L30M2
$$ -871 -379 -255 -612 32 713 713 106 301 587 624 518 627 917 -244 -990 -23 241 -450 -995 -665 -623
1281f23q3O95J13n61j7O47M40k18j1M47o25l06P26L74j202k59K97n3k48M43K12
$$ -623 -706 -11 102 -459 -476 171 611 393 382 829 204 -102 624 998 -204 -463 -166 -219 -467 -24 188
1302A88q43o97J146N81q57J6O44k61K5P00M14r12l92O70J27j10R9j82q12n22O22
$$ 188 -655 -1352 -206 375 -482 -466 178 -83 -58 642 1056 144 -248 422 549 439 538 356 -456 -978 -356
1323c56L57m41n90M66J08Q6K37R89k74o54q4J408j46r48M27J40q69m59J151k69
$$ -356 1 -440 -1030 -564 -456 -370 -133 856 582 -72 -156 1252 1106 158 585 725 -144 -603 548 279
1343B79j032j56P37m88RL81M12q18J63J068J4l60RJ38j30j85O40K48r49m18Q25
$$ 279 -753 -909 -172 -660 -651 -270 142 -676 -513 555 569 209 218 356 226 41 681 929 -20 -438 387
1364C87Q4q07J17J65o37l48O88P13r48p5M29R9mP71L86m31o62O77M14o70N9L2
$$ 387 471 -336 -219 -54 -691 -1039 -351 362 -586 -661 -232 -133 -137 634 1020 589 -73 604 1018 348 407 439
1386D39m09o98N05J08q53m80O69N89k16K14N89j62o67L45Q24jp33M20J91l92l94
$$ 439 30 -668 -163 -55 -908 -1388 -719 -130 -346 -132 457 295 -372 -27 797 796 63 483 674 282 -112
1407a12O73p9p87N6L05m23r6L53K12q66L85P95k79n51N83N94o28j65P58M91r27
$$ -112 561 482 -305 -249 56 -367 -463 -110 102 -764 -379 416 137 -414 169 763 135 -30 728 1219 292
1428B92n37N92p5m45J79r4n46n5K77O28m86k49J36J44P3M44M40l05q03P14O18
$$ 292 -245 347 272 -173 6 -88 -634 -689 -412 216 -270 -519 -383 -239 -166 278 718 413 -390 324 942
1449I42o02k75L72k20m46j17P90p87p06N47J87l61L18O23m49P7J68N25j80J67
$$ 942 340 65 437 217 -229 -346 444 -343 -1049 -502 -315 -676 -358 265 -184 -107 61 586 406 573
1469E73k5m20J13l7M18R0j046J22K97k17l86L31M36j239m0J388k01r18K23J190
$$ 573 548 128 241 204 622 712 -334 -212 85 -132 -518 -187 249 -990 -1030 358 157 -761 -538 652
1489F52n86L3R66m8j069J71L81k18l08K33m55m49N04o7J7m60J14k19J037k47q4
$$ 652 66 99 1065 1017 -52 119 500 282 -26 207 -248 -697 -193 -260 -243 -703 -589 -808 229 -18 -102
1510a02J006l93j292J031R57j039k47O61k95j089O17Q72r25n92P13l50l29Q79
$$ -102 904 511 -781 250 1207 168 -79 582 287 -802 -185 687 -238 -830 -117 -467 -796 83
1528H3R1m48N3Q4M79LJ50k77P1J12k75L54N9l05r00O80%r24P55M15j349J40J346
$$ 83 174 -274 -221 -137 342 345 495 218 289 401 126 480 539 234 -666 14 14 -910 -155 260 -1089 -949 397
1551C97l49o96R12K76p69J03J115l52n92Q9M11o10K26N79r31n05J91L70j83Rl94
$$ 397 48 -648 264 540 -229 -126 989 637 45 134 545 -65 161 740 -191 -696 -505 -135 -318 -309 -703
1572g03M42K50l32O5R28k51r80N57R35o34n4P74p20j032P46M65r56J48L08l62
$$ -703 -261 -11 -343 -278 650 399 -581 -24 911 277 223 997 277 -755 -9 456 -500 -352 -44 -406
1592d06j88R28k26n77k66M91L13J11K73j16m69K79L11J46Nm90n63P84L00j055
$$ -406 -594 334 108 -469 -735 -244 69 180 453 337 -132 147 458 604 609 119 -444 340 640 -415
1612d15K38J85p07n6R94J62q70j1L69j85N79R77r60p89R30K93k48J92k18o92m27
$$ -415 -177 8 -699 -755 239 401 -469 -480 -111 -296 283 1260 300 -489 441 734 486 678 460 -232 -659
1633f59N59K01l15J40n86l03N34O02l09L86m63l21P20P47k95o05l3L30m98N29
$$ -659 -100 101 -214 -74 -660 -963 -429 173 -136 250 -213 -534 186 933 638 33 0 330 -168 361
1653C61L98q50o72Q61l79N6J73j24m02j1Q58p3j60l02K9J61K55L5L72j5n18k28
$$ 361 759 -91 -763 98 -281 -225 -52 -176 -578 -589 269 196 36 -266 -237 -76 179 214 586 571 53 -175
1675a75N24K22r13O3N9k23k42Q17Q9o40j44N67j56L12J87N5m53K08O66m24j68
$$ -175 349 571 -342 -279 -220 -443 -685 132 221 -419 -563 4 -152 160 347 402 -51 157 823 399 231
1696B31n8p6j90N2K56j16n34r0L27Qj36k5K95K82n23K50N36j16n26M45K53l91
$$ 231 173 97 -93 -41 215 99 -435 -525 -198 -190 -326 -351 -56 226 -297 -47 489 373 -153 292 545 154
1718A54J23J31l56l65N51j32l37k18n7N8J04O7M28k24k01K81J36K78K9J32j99
$$ 154 277 408 52 -313 238 106 -231 -449 -506 -448 -344 -277 151 -73 -274 7 143 421 450 582 383
1739C83K6k83L63k5m36q8J56o48K32J96j33r5J63J9K42k10L53K15j87P7L65j60
$$ 383 409 126 489 464 28 -60 96 -552 -320 -124 -257 -352 -189 -170 72 -138 215 430 243 320 685 525
1761E25l73M2Jm15J80J39j5j27n66L68o8M22j22j96m2o4m6O13m5j61l41R34l90
$$ 525 152 194 195 -220 -40 99 84 -43 -609 -241 -309 113 -9 -205 -247 -311 -357 256 211 50 -291 643 253
1784B53K8K09k55m76L30O4M0k39j66j89j48K33K74np2j57K60K89r2J71l03L71
$$ 253 281 490 235 -241 89 153 193 -46 -212 -401 -549 -316 -42 -47 -119 -276 -16 273 181 352 49 420
1806D20l68J13P6m7l74L01l3k33j69K34P3o18L59K70j25o2M56n15J9J95P28n24
$$ 420 52 165 241 194 -180 121 88 -145 -314 -80 -7 -625 -266 4 -121 -183 273 -242 -223 -28 700 176
1828A76k77M09j74Q4l06J02Q0k05P6J03m80q5JJ44m2K81P6Q2J65O2J43l76J10
$$ 176 -101 308 134 218 -88 14 94 -111 -35 68 -412 -497 -496 -352 -394 -113 -37 45 210 272 415 39 149
1851A49J64j29p3r9L7K07j24l83j39J80k08J69L88m34M7L19jJ41q2K78J50m93
$$ 149 313 184 111 12 49 256 132 -251 -390 -210 -418 -249 139 -295 -248 71 70 211 129 407 557 64
1873F4M55P0m52j7J08j62m13L23k76K13l82K40J11k25J90K22M3j8j98N81k12p5
$$ 64 519 589 137 120 228 66 -347 -24 -300 -87 -469 -229 -118 -343 -153 69 112 94 -104 477 265 190
1895A90l21L61J23k63K94l4n27j01J53J66l09K97j2n82J01N79N5j64K40J39p9
$$ 190 -131 230 353 90 384 350 -177 -278 -125 41 -268 29 17 -565 -464 115 170 6 246 385 306
1916C06r6J15o9k78n6K91r1j21l83K37j17J2J57k44Pk70N58K21o8j17J53j50p8
$$ 306 210 325 256 -22 -78 213 122 1 -382 -145 -262 -250 -93 -337 -330 -600 -42 179 111 -6 147 -3 -81
1939h1M66N42p53k77K72K17n74J66N9l57p3R9j1l8L29j58o9M75l33J49M33k15
$$ -81 385 927 174 -103 169 386 -188 -22 37 -320 -393 -294 -305 -343 -14 -172 -241 234 -99 50 483 268
1961B68n32M96L57m06L7R0n66kL95j67l30MK32L5j95J93L19n03J65O18k84k62
$$ 268 -264 232 589 183 220 310 -256 -258 137 -30 -360 -356 -124 -89 -284 -91 228 -275 -110 508 224 -38
1983c8M83j87O5k42O4K04j71l40K09l0J09k27j43J38l45R5N84j40j61o1L44l50
$$ -38 445 258 323 81 145 349 178 -162 47 17 126 -101 -244 -106 -451 -356 228 88 -73 -134 210 -140
2005a40K01O71l87n60L75K00k98o0K93K2p68K97m1k6K0L3j28M04m21L23L37k01
$$ -140 61 732 345 -215 160 360 62 2 295 317 -451 -154 -195 -221 -201 -168 -296 108 -313 10 347 146
2027A46j24j8M15l94J88J38k31m78M95k5m33J16J68m94m9N24K96m78k22O02j8
$$ 146 22 4 419 25 213 351 120 -358 137 112 -321 -205 -37 -531 -580 -56 240 -238 -460 142 124
2048A24k9L46O7k47k95J14K46l72l4j91j1L79J4k53l37KJ54K26J74j17J29J32
$$ 124 95 441 508 261 -34 80 326 -46 -80 -271 -282 97 111 -142 -479 -477 -323 -97 77 -40 89 221
2070B21l03J94M03j64l93M15l44k7j13L13l45n58M07J83m5q5K24l16J92LK16P7
$$ 221 -82 112 515 351 -42 373 29 2 -111 202 -143 -701 -294 -111 -156 -241 -17 -333 -141 -138 78 155
2092A55j17l05M58J12M4l6R6o11Q5Q3L66p32P9R8J2k29L56j61K09r7k36M77o8
$$ 155 38 -267 191 303 347 311 407 -204 -119 -36 330 -402 -323 -225 -213 -442 -86 -247 -38 -135 -371 106 38
2115C8K39l5k88J1L94M05p19o2j98l9j46N37p7l53k37L41O04n64K63l65J12L9
$$ 38 277 242 -46 -35 359 764 45 -17 -215 -254 -400 137 60 -293 -530 -189 415 -149 114 -251 -139 -100
2137a00j52N27k12k09J81L35j62R8J65m08J5j9Q7j3o74P86k62l33L84K02k83l04
$$ -100 -252 275 63 -146 35 370 208 306 471 63 78 59 146 133 -541 245 -17 -350 34 236 -47 -351
2159c51L54K19J03l1k55j93K85l43J57K24jk40l9r9J82k78J50k22m4M32r1j81
$$ -351 3 222 325 294 39 -154 131 -212 -55 169 168 -72 -111 -210 -28 -306 -156 -378 -422 10 -81 -262
2181b62K04L84k86q7L29q9k46O1J62p8k67K14j09j02j67p4M10Nl94K53p8L24j56
$$ -262 -58 326 40 -47 282 193 -53 8 170 92 -175 39 -70 -172 -339 -413 -3 2 -392 -139 -217 107 -49
2204d9J33K08n20M23J1M1k83K94j42k58J37L15m98r1j9K32j30m7J09L4j80Q4M28
$$ -49 84 292 -228 195 206 247 -36 258 116 -142 -5 310 -188 -279 -298 -66 -196 -243 -134 -100 -280 -196 232
2227B32k52L26O9l86j15L94o7p9J0l30J53j58L9J55P5m79K99LK65k90J61J68m81
$$ 232 -20 306 375 -11 -126 268 201 122 132 -198 -45 -203 -164 -9 66 -413 -114 -111 154 -136 25 193 -288
2250b88K89J23n7K37k26qK74l55J55n4j74l1M2L19k22l49L3n4J18M23K00o71m2
$$ -288 1 124 67 304 78 70 344 -11 144 90 -84 -115 -73 246 24 -325 -292 -346 -228 195 395 -276 -318
2273c18K64L94K2Ok7j46l16J37J04k6j2j50L5r5P7j54K28j99NJ16M12k96J15m
$$ -318 -54 340 362 368 341 195 -121 16 120 94 82 -68 -33 -128 -51 -205 23 -176 -171 -55 357 61 176 172
2297A72k42R8L94k34j08k7o9k7m1Q7M7k46o0J13K5K77k96l8K17N4J05Q1q5j62
$$ 172 -70 28 422 188 80 53 -16 -43 -84 3 50 -196 -256 -143 -118 159 -137 -175 42 96 201 282 197 35
2321C5l38N26l5m7R7k15k06L59O0l97J18m95K31K49N0k8k17K15P2mJ73K4l8N7
$$ 35 -303 223 188 141 238 23 -183 176 236 -161 -43 -538 -307 -58 -8 -36 -253 -38 34 30 203 227 189 246
2345B46k03K45k61pj47ql39L59j43K80l33K9o0M38O0l38L57K5l2n2J77J17n50
$$ 246 43 288 27 20 -127 -135 -474 -115 -258 22 -311 -282 -342 96 156 -182 175 200 168 116 293 410 -140
2368a40n6J08J08L33p05J68l04L76J9J96j55L73m99j8n1M43J48l37j08j06M41
$$ -140 -196 -88 20 353 -352 -184 -488 -112 -93 103 -52 321 -178 -196 -247 196 344 7 -101 -207 234
2389B34Q2j02J77m91K9Rl8j1J99n98J39J55J55J64j32J25k62M49k8N7P4k51j48
$$ 234 316 214 391 -100 -71 -62 -100 -111 88 -510 -371 -216 -61 103 -29 96 -166 283 255 312 386 135 -13
2412a3Q1J87k03Q5l12k8M36k70j01R9k26j84M69J37j97j62L79l38L14q7k5K29
$$ -13 68 255 52 137 -175 -203 233 -37 -138 -39 -265 -449 20 157 -40 -202 177 -161 153 66 41 270
2434B70k45J46j31M1l4k60nJ27p2J43j64Po7K51J91j2k99J51oM9J30J1J05J11
$$ 270 25 171 40 81 47 -213 -218 -91 -163 -20 -184 -177 -244 7 198 186 -113 38 32 81 211 222 327 438
2458D38m39J17j13Q5J08n39J54L08k93K5J35K3m61K96J59J51Q9J95k99m3K89j93
$$ 438 -1 116 3 88 196 -343 -189 119 -174 -149 -14 9 -452 -156 3 154 243 438 139 96 385 192
2480A92j9k01m9N1k4j34J05p1j8N8R6J09j00J84j07M4j2J95j17M5k93M9J44k43
$$ 192 173 -28 -77 -26 -50 -184 -79 -150 -168 -110 -14 95 -5 179 72 116 104 299 182 227 -66 -17 127 -116
2504a16L30q5m95K94J04j88k7j2R1j48M8M31j49j65K53j23K02K0o3j7J9r5j35
$$ -116 214 129 -366 -72 32 -156 -183 -195 -104 -252 -204 227 78 -87 166 43 245 265 202 185 204 109 -26
2527b6k95L92l11o9Q6n0K03o9L1p0n8J34L58o69M31K81j68J8l4K5J35k62K7k41
$$ -26 -321 71 -240 -309 -223 -273 -70 -139 -108 -178 -236 -102 256 -413 18 299 131 149 115 140 275 13 40 -201
2551b01M24l1l90J12n8j86L52r2j30N80k36r1J99K28k64l63L58K5j89n0o6K50
$$ -201 223 192 -198 -86 -144 -330 22 -70 -200 380 144 53 252 480 216 -147 211 236 47 -3 -69 181
2573A81l18o4K72J14k46P8m2l1N7J00M1k10J64L31j82pj13J26j22J11j50J54k91
$$ 181 -137 -201 71 185 -61 17 -25 -56 1 101 142 -68 96 427 245 238 125 251 129 240 90 244 -47
2596d7l61L59k2l54K81J87l36J94K08j93O3L0K15k42j09M70j69k75K52j05J40
$$ -47 -408 -49 -71 -425 -144 43 -293 -99 109 -84 -21 9 224 -18 -127 343 174 -101 151 46 186
2617A86l55K24l7k30l2j22L33O3m20J81J66q4J74j85Q3Q9j87M10k89J71N9k65
$$ 186 -169 55 18 -212 -244 -366 -33 30 -390 -209 -43 -127 47 -138 -55 34 -153 257 -32 139 198 -67
2639f7o2J2J95lm17J65j12L25N2q9n01L29J89J59j93J94j71O4jk61L49o7j22j55
$$ -67 -129 -117 78 75 -342 -177 -289 36 88 -1 -502 -173 16 175 -18 176 5 69 68 -193 156 89 -33 -188
2663a88L56k85m4k90L70k29KM87n61M12j70L30k65l24N42K73m37K12k59K35j04
$$ -188 168 -117 -161 -451 -81 -310 -308 179 -382 30 -140 190 -75 -399 143 416 -21 191 -68 167 63
2684F3k42n4J09j61K69Jn6k06L64m8m9J04K5P3k50k3J31K09j86NK07k94k8J49
$$ 63 -179 -233 -124 -285 -16 -15 -71 -277 87 39 -10 94 119 192 -58 -81 50 259 73 78 285 -9 -37 112
2708A12j6k19m17O01Oj46N1k13J47K1K55k05K36l22K62j52j14L52p8k57O0j6o9
$$ 112 96 -123 -540 61 67 -79 -28 -241 -94 -73 182 -23 213 -109 153 1 -113 239 161 -96 -36 -52 -121
2731a21k3r8j08J7K55K31l62L03p3k71L2M9O00l54k18J75K25k40o5K41l01rk5
$$ -121 -144 -242 -350 -333 -78 153 -209 94 21 -250 -218 -169 431 77 -141 34 259 19 -46 195 -106 -115 -140
2754a40p5J44L6j92N6L60K7j15J07kl71K56J19q8r5L25m11J36P0K53k97p7J78
$$ -140 -215 -71 -35 -227 -171 189 216 101 208 206 -165 91 210 122 27 352 -59 77 147 400 103 26 204
2777B04k75j15K54J60k68j02J19j05J55m48L42J82l3K13J55k26k73j11N76m02
$$ 204 -71 -186 68 228 -40 -142 -23 -128 27 -421 -79 103 70 283 438 212 -61 -172 404 2
2797BN5n6J50m22J80K91l07k45J30N32j94k31M34l7p5j23o1J39j99K44n19P2J46
$$ 2 57 1 151 -271 -91 200 -107 -352 -222 310 116 -115 319 282 207 84 23 162 -37 207 -312 -240 -94
2820i4J42k47K22k27N0K73m29K64j8K40j72j4N0K11j83k20K90l9OJ96j77o8j29
$$ -94 48 -199 23 -204 -154 119 -310 -46 -64 176 4 -10 40 251 68 -152 138 99 105 301 124 56 -73
2843g3k58O23m26k84K88J81l16J40N6l2J62J67l92K97K28J68l58J04j50J56j05
$$ -73 -331 292 -134 -418 -130 51 -265 -125 -69 -101 61 228 -164 133 361 529 171 275 125 281 176
2864A76k74K6o3R1k17K19J27k12o2K67k97J71Q9j82K74O1J08Rk94J41j71o1J63
$$ 176 -98 -72 -135 -44 -261 -42 85 -127 -189 78 -219 -48 41 -141 133 194 302 311 17 158 -13 -74 89
2887H9Qk38J8n1K16j48J91j28N6k44K70J85K2r7o7K7m6k11J88mJ78m07M98k28
$$ 89 97 -141 -123 -174 42 -106 85 -43 13 -231 39 224 246 149 82 109 63 -148 40 36 214 -193 305 77
2911G7Mk98Q4j07L0L57k65K1R6N4J46n8j68m0N4K27m8m4k26J33k74Q7K18N7k4
$$ 77 81 -217 -133 -240 -210 147 -118 -97 -1 53 199 141 -27 -67 -13 214 166 122 -104 29 -245 -158 60 117 93
2936I3q9j68j44L53M7l05J44nJ51RL96l61j07j06R5K89k31q5K8n17N31Ml79L49
$$ 93 4 -164 -308 45 92 -213 -69 -74 77 86 482 121 14 -92 3 292 61 -24 4 -513 18 22 -357 -8
2960hJ30j08k7N9n1MJ00m2l03L41K67k10k32N1j84J79p5J29Q9n39J04O41l95Q3
$$ -8 122 14 -13 46 -5 -1 99 57 -246 95 362 152 -80 -29 -213 -34 -109 20 109 -430 -326 315 -80 3
2984Cq6j13K05K26j70L4o6j90J13K49mk25q8J14j49L14m38M39l65l72L59K18J18
$$ 3 -83 -196 9 235 65 99 33 -157 -44 205 201 -24 -112 2 -147 167 -271 168 -197 -569 -210 8 126
3007A26Ok34J37j84J78J93k35o6J90K74l01J06p0P1l81Q3p2R0j10L00j34k2j5
$$ 126 132 -102 35 -149 29 222 -13 -79 111 385 84 190 120 191 -190 -107 -179 -89 -199 101 -33 -55 -70
3030g0J96j64JN1L1L7J93n8j10j55M31m86RK29n13R1K84k52J42J11l44J28J59
$$ -70 126 -38 -37 14 45 82 275 217 107 -48 383 -103 -94 135 -378 -287 -3 -255 -113 -2 -346 -218 -59
3053e9L21o5j29j86J23q3%L49j2l72L18J09l18J27k16K4J8K70k04K7j51m9K6J56
$$ -59 262 197 68 -118 5 -78 -78 271 259 -113 205 314 -4 123 -93 -69 -51 219 15 42 -109 -158 -132 24
3077B4k4k1O0K7J18q9K30j04%j94N6k71LK69j49N7k0l33K18K2L5Q6J37K4k08K09
$$ 24 0 -21 39 66 184 95 325 221 221 27 83 -188 -185 84 -65 -8 -28 -361 -143 -121 -86 0 137 161 -47 162
3103A62q3k34J63L24k48j73K95j76P0k31j5J15J10j90j92J28M5M14k28J89K7n25
$$ 162 79 -155 8 332 84 -89 206 30 100 -131 -146 -31 79 -111 -303 -175 -130 284 56 245 272 -253
3125b53J74L65k55Q5J0l57J79l5J58q6j5j6L1j00l30M09K29j66J70k99k15J31
$$ -253 -79 286 31 116 126 -231 -52 -87 71 -15 -30 -46 -15 -115 -445 -36 193 27 197 -102 -317 -186
3147a86M6K91Q5J9q1j18K3J62m29j72K97q3J25J50k77L59l07l79L88R6J55J59
$$ -186 -140 151 236 255 174 56 79 241 -188 -360 -63 -146 -21 129 -148 211 -96 -475 -87 9 164 323
3169C23l50kj39L91k21J06k26J85j33j99K11j82J42j08J49j29K57o3J8K23j38
$$ 323 -27 -29 -168 223 2 108 -118 67 -66 -265 -54 -236 -94 -202 -53 -182 75 12 30 253 115
3190A15J4j59J36O5m3j83K1J34n9J21j05k9r4J83k60Q3J94p0m5nM0j73o6n9L26
$$ 115 129 -30 106 171 128 -55 -34 100 41 162 57 28 -66 117 -143 -60 134 64 19 14 54 -119 -185 -244 82
3215H2j48J20K57k64R0P0j39k3O4l89K19j33l7K77j55j0P5M04p45M56M9k70L6
$$ 82 -66 54 311 47 137 207 68 45 109 -280 -61 -194 -231 46 -109 -119 -44 360 -385 71 120 -150 -114
3238a14J28J72n9k23J40j39K57k08P6j8j21kJ57P6nk26k9K88j67J90K84n06N9
$$ -114 14 186 127 -96 44 -95 162 -46 30 12 -109 -111 46 122 117 -109 -138 150 -17 173 457 -49 10
3261A0M6J44l1J89m50j56K93k11K33m6j26J69k12K33M0l18M35l41n4p7J36P5l0
$$ 10 56 200 169 358 -92 -248 45 -166 67 21 -105 64 -148 85 125 -193 242 -99 -153 -230 -94 -19 -49
3284d9J32q1L92k55k70J86l6j88K38k96K47j19J35q7R5k38M26j87J8N5J06j89
$$ -49 83 2 394 139 -131 55 19 -169 69 -227 20 -99 36 -51 44 -194 232 45 63 118 224 35
3306C5j16K01m0jn3M7j03K12k48J30k23O4k15R7J66q3J00J99j12N7j82J77j48
$$ 35 -81 120 80 79 26 73 -30 182 -66 64 -159 -95 -310 -213 -47 -130 -30 169 57 114 -68 109 -39
3329c9L32l23J16J30l05J93Pj11o8k04L38J83j68lm46N78l61J83k50K99J07l17
$$ -39 293 -30 86 216 -89 104 111 0 -68 -272 66 249 81 78 -368 210 -151 32 -218 81 188 -129
3351a29L25q2m0o2N5l9j0n2P6l21J69k26J03J36O7k05J35J10J65k47J34k7K74
$$ -129 196 114 74 12 67 28 18 -34 42 -279 -110 -336 -233 -97 -30 -235 -100 10 175 -72 62 35 309
3374C09q2l4j39K7j26J66pk56j9K43k91P8p9J25j65L35j60J75k0M8M7r7j23k7
$$ 309 227 193 54 81 -45 121 114 -142 -161 82 -209 -131 -210 -85 -250 85 -75 100 80 128 175 78 -45 -72
3398g2R1j5J55L4P7j82J96l08j32J76%Q3O4k16J52p7jj6K01k67J39K9j68J80k3
$$ -72 19 4 159 193 270 88 284 -24 -156 20 20 103 167 -49 103 26 25 9 210 -57 82 111 -57 123 100
3423A00N1k56J07K32j15k48j33J93Q5l06M04R2k23l5m1K8J55J4n9R2K04j99L6
$$ 100 151 -105 2 234 119 -129 -262 -69 16 -290 114 206 -17 -52 -93 -65 90 104 45 137 341 142 178
3446A78m64Q9m2K28J68l43L48m30K06K10j90J0O4J04j49P6J74J60m94J83j25r3
$$ 178 -286 -197 -239 -11 157 -186 162 -268 -62 148 -42 -32 32 136 -13 63 237 397 -97 86 -39 -132
3468a32K85k73k2j35O1M90k70k33L7J56L8Q9K4j28j4L47j87J78j71k72J91K7P7
$$ -132 153 -120 -142 -277 -216 274 4 -229 -192 -36 2 91 115 -13 -27 320 133 311 140 -132 59 86 163
3491A63J74l35j03q6k16L41L42j78l61K75j64M7q0O99l89o8J71%k68K17j49j47
$$ 163 337 2 -101 -187 -403 -62 280 102 -259 16 -148 -101 -181 518 129 61 232 232 -36 181 32 -115
3513a15J31j05K46m4k30L1J12j33K2k7n3L3R7K57m80J87O1n5J47M5k7j45K37o9
$$ -115 16 -89 157 113 -117 -86 26 -107 -85 -112 -165 -132 -35 222 -258 -71 -10 -65 82 127 100 -45 192 123
3537A23l4o2R8nj48Q4q2qK58l72K72p6j21K44k03K46P0l18K5J43P8k3k22J43k21
$$ 123 89 27 125 120 -28 56 -26 -34 224 -148 124 48 -73 171 -32 214 284 -34 -9 134 212 189 -33 110 -111
3562a11K26j90l0nJ03j43J77j78K23k54J69L29n90M82O5l39K10k13R1J76j50K3
$$ -111 115 -75 -105 -110 -7 -150 27 -151 72 -182 -13 316 -274 208 273 -66 144 -69 22 198 48 71
3584G1K3l4l38M58k00J3J75j58K34n2o7j64O5j14P6K28l22J4K84lo5ln50M28o4
$$ 71 94 60 -278 180 -20 -7 168 10 244 192 125 -39 26 -88 -12 216 -106 -92 192 189 124 121 -429 -1 -65
3609f5O1j04n8L54j40N8l54N25j71l5o2k4P0J96j00k20j16K39n9j8M9P5k37J46
$$ -65 -4 -108 -166 188 48 106 -248 277 106 71 9 -15 55 251 151 -69 -185 54 -5 -23 26 101 -136 10
3633A0j19K05J15j26m8J70k51K02j38M5k72j79O61k56K7J53o09K38J63q1K53o6
$$ 10 -109 96 211 85 37 207 -44 158 20 65 -207 -386 275 19 46 199 -410 -172 -9 -90 163 97
3655I7k13J7Q4q8J77j82j19K07K10j47j90L97k89K68j51N5m8j61K42m28Q1j80
$$ 97 -116 -99 -15 -103 74 -108 -227 -20 190 43 -147 250 -39 229 78 133 85 -76 166 -262 -181 -361
3677c61L33m3j07K07j28L5K7R8j41M1J96pj33j75L7R1j33K19j66k12N6J65J53
$$ -361 -28 -71 -178 29 -99 -64 -37 61 -80 -39 157 150 17 -158 -121 -30 -163 56 -110 -322 -266 -101 52
3700E2j55p8K79n1M7j88K41jj7R7j37l14N14j61j70L7K1PK25n22J22p7J67j20
$$ 52 -103 -181 98 47 94 -94 147 146 129 226 89 -225 289 128 -42 -5 16 23 248 -274 -152 -229 -62 -182
3724a82J33q8K91n37L29N28k29K22l71j28r0J34j3q1P7k6J73j04q0Q1k75j5K04
$$ -182 -49 -137 154 -383 -54 474 245 467 96 -32 -122 12 -1 -82 -5 -31 142 38 -42 39 -236 -251 -47
3747d7Q9L2K00k65m56L32r9L17J75j63j18p3J95p3k19J48l09n7M15k21J76p4j32
$$ -47 42 74 274 9 -447 -115 -214 103 278 115 -3 -76 119 46 -173 -25 -334 -391 24 -197 -21 -95 -227
3770b27K34J9j32K97j61J80j10j93L10k93k4R3J65j03K63k48j20j1Q7j72J56J06
$$ -227 7 26 -106 191 30 210 100 -93 217 -76 -100 -7 158 55 318 70 -50 -61 26 -146 10 116
3792A16K56n68L16k77M8j6K79j84K27L7k2k26K28k40K10l59J86n8J04no65O67
$$ 116 372 -196 120 -157 -109 -125 154 -30 197 234 212 -14 214 -26 184 -175 11 -47 57 52 -613 54
3814E4P0l04j78M69k69M68k05n9l50L85P0N6j90L4O3j19l9J49J15m09J01l4K16
$$ 54 124 -180 -358 111 -158 310 105 46 -304 81 151 207 17 51 114 -5 -44 105 220 -189 -88 -122 94
3837I4nJ2j15J07j45J39k7Q8j21P2J39m74J25K81j90l9p2q8L63m52J34N0K08j32
$$ 94 89 101 -14 93 -52 87 60 148 27 99 238 -236 -111 170 -20 -59 -131 -219 144 -308 -174 -124 84 -48
$$ [...]
8191B82
##END NTUPLES=NMR FID
##END=
