##TITLE=1H_bromanilin
 CDCl3
 8 sc, 
 26.10.2023
##JCAMPDX= 6.0         $$ Bruker NMR JCAMP-DX V2.0
##DATA TYPE= NMR FID
##DATA CLASS= NTUPLES
##ORIGIN= UXNMR, Bruker Analytische Messtechnik GmbH
##OWNER= root
$$ XWIN-NMR		Version 3.5
$$ Thu Oct 26 14:33:19 2023 Russian Standard Time (UT+4h)  she@DPX200
##.OBSERVE FREQUENCY= 200.13135
##.OBSERVE NUCLEUS= ^1H
##.DELAY= (6, 6)
##.ACQUISITION MODE= SIMULTANEOUS
##.ACQUISITION SCHEME= undefined
##.AVERAGES= 8
##.DIGITISER RES= 18
##SPECTROMETER/DATA SYSTEM= spect
##.PULSE SEQUENCE= zg30
##.SOLVENT NAME= CDCl3
##.SHIFT REFERENCE= (INTERNAL, CDCl3, 0, 15.7039)
##AUDIT TRAIL= $$ (NUMBER, WHEN, WHO, WHERE, WHAT)
$$ ##TITLE= Audit trail, XWIN-NMR		Version 3.5
$$ ##JCAMPDX= 5.01
$$ ##ORIGIN= Bruker BioSpin GmbH
$$ ##OWNER= she
$$ F:/spectra/data/she/nmr/H-F/1/audita.txt
$$ ##AUDIT TRAIL=  $$ (NUMBER, WHEN, WHO, WHERE, WHAT)
(   1,<2023-10-26 14:32:22.12 +0400>,<she>,<DPX200>,
      <created by zg, POWCHK disabled, PULCHK disabled
       configuration hash MD5:
       00 E9 B6 7A A2 85 ED C7 34 08 36 98 17 FE 4E 26
       data hash MD5: 16K
       E9 A2 69 CA 26 7D 74 10 23 F4 9A 2D 8A C6 13 EE>)
$$ ##END=
$$ 
$$ hash MD5
$$ 24 AB F6 D6 63 39 70 04 B4 94 0D 2F D0 93 1C F3
##$RELAX= 
##$RELAX= 
##$RELAX= 
##$RELAX= 
##$RELAX= 
##$RELAX= 
$$ Bruker specific parameters
$$ --------------------------
##$DU= <F:/spectra>
##$EXPNO= 1
##$NAME= <H-F>
##$PROCNO= 1
##$TYPE= <nmr>
##$USER= <she>
##$AMP= (0..31)
100 100 100 100 100 100 100 100 100 100 100 100 100 100 100 100 100 100 
100 100 100 100 100 100 100 100 100 100 100 100 100 100 
##$AQSEQ= 0
##$AQ_mod= 1
##$AUNM= <au_zg>
##$AUTOPOS= <>
##$BF1= 200.13
##$BF2= 200.13
##$BF3= 200.13
##$BF4= 200.13
##$BF5= 200.13
##$BF6= 200.13
##$BF7= 200.13
##$BF8= 200.13
##$BYTORDA= 1
##$CFDGTYP= 0
##$CFRGTYP= 5
##$CHEMSTR= <none>
##$CNST= (0..31)
1 1 145 1 1 1 1 1 1 1 1 1 1 1 1 1 1 1 1 1 1 1 1 1 1 1 1 1 1 1 1 1 
##$CPDPRG= <>
##$CPDPRG1= <>
##$CPDPRG2= <>
##$CPDPRG3= <>
##$CPDPRG4= <mlev>
##$CPDPRG5= <mlev>
##$CPDPRG6= <mlev>
##$CPDPRG7= <mlev>
##$CPDPRG8= <mlev>
##$CPDPRGB= <>
##$CPDPRGT= <>
##$D= (0..31)
0 1.2 0 0 0 0 0 0 0 0.06 0 0.03 0 0 0 0 0.0002 0 0 0 0 0 0 0 0 0 0 0 0 
0 0 0 
##$DATE= 1698316341
##$DBL= (0..7)
120 120 120 120 120 120 120 120 
##$DBP= (0..7)
150 150 150 150 150 150 150 150 
##$DBP07= 0
##$DBPNAM0= <>
##$DBPNAM1= <>
##$DBPNAM2= <>
##$DBPNAM3= <>
##$DBPNAM4= <>
##$DBPNAM5= <>
##$DBPNAM6= <>
##$DBPNAM7= <>
##$DBPOAL= (0..7)
0.5 0.5 0.5 0.5 0.5 0.5 0.5 0.5 
##$DBPOFFS= (0..7)
0 0 0 0 0 0 0 0 
##$DE= 6
##$DECBNUC= <off>
##$DECIM= 32
##$DECNUC= <off>
##$DECSTAT= 4
##$DIGMOD= 1
##$DIGTYP= 9
##$DL= (0..7)
0 120 120 120 120 120 120 120 
##$DP= (0..7)
150 150 150 150 150 150 150 150 
##$DP07= 0
##$DPNAME0= <>
##$DPNAME1= <>
##$DPNAME2= <>
##$DPNAME3= <>
##$DPNAME4= <>
##$DPNAME5= <>
##$DPNAME6= <>
##$DPNAME7= <>
##$DPOAL= (0..7)
0.5 0.5 0.5 0.5 0.5 0.5 0.5 0.5 
##$DPOFFS= (0..7)
0 0 0 0 0 0 0 0 
##$DQDMODE= 0
##$DR= 18
##$DS= 0
##$DSLIST= <SSSSSSSSSSSSSSS>
$$ [...]
##$SUBNAM2= <"">
##$SUBNAM3= <"">
##$SUBNAM4= <"">
##$SUBNAM5= <"">
##$SUBNAM6= <"">
##$SUBNAM7= <"">
##$SUBNAM8= <"">
##$SUBNAM9= <"">
##$SW= 18.05172834244
##$SWIBOX= (0..15)
0 0 2 0 0 0 0 0 0 0 0 0 0 0 0 0 
##$SW_h= 3612.71676300578
##$TD= 16384
##$TD0= 1
##$TE= 0
##$TE2= 300
##$TE3= 300
##$TEG= 300
##$TL= (0..7)
0 120 120 120 120 120 120 120 
##$TP= (0..7)
150 150 150 150 150 150 150 150 
##$TP07= 0
##$TPNAME0= <>
##$TPNAME1= <>
##$TPNAME2= <>
##$TPNAME3= <>
##$TPNAME4= <>
##$TPNAME5= <>
##$TPNAME6= <>
##$TPNAME7= <>
##$TPOAL= (0..7)
0.5 0.5 0.5 0.5 0.5 0.5 0.5 0.5 
##$TPOFFS= (0..7)
0 0 0 0 0 0 0 0 
##$TUNHIN= 0
##$TUNHOUT= 0
##$TUNXOUT= 0
##$USERA1= <user>
##$USERA2= <user>
##$USERA3= <user>
##$USERA4= <user>
##$USERA5= <user>
##$V9= 5
##$VALIST= <valist>
##$VCLIST= <CCCCCCCCCCCCCCC>
##$VD= 0
##$VDLIST= <DDDDDDDDDDDDDDD>
##$VPLIST= <PPPPPPPPPPPPPPP>
##$VTLIST= <TTTTTTTTTTTTTTT>
##$WBST= 1024
##$WBSW= 4
##$XGAIN= (0..3)
0 0 0 0 
##$XL= 0
##$YL= 0
##$YMAX_a= 19665
##$YMIN_a= -39906
##$ZGOPTNS= <>
##$ZL1= 120
##$ZL2= 120
##$ZL3= 120
##$ZL4= 120
##$ABSF1= 10
##$ABSF2= 0
##$ABSG= 5
##$ABSL= 3
##$ALPHA= 0
##$AQORDER= 0
##$ASSFAC= 0
##$ASSFACI= 0
##$ASSFACX= 0
##$ASSWID= 0
##$AUNMP= <proc_1d>
##$AZFE= 0.1
##$AZFW= 0.1
##$BCFW= 1
##$BC_mod= 2
##$BYTORDP= 1
##$COROFFS= 0
##$CY= 11.3945322036743
##$DATMOD= 1
##$DC= 2
##$DFILT= <>
##$DTYPP= 0
##$F1P= 15.7292609196834
##$F2P= 12.9074282941183
##$FCOR= 0.5
##$FTSIZE= 0
##$FT_mod= 4
##$GAMMA= 1
##$GB= 0.15
##$INTBC= 1
##$INTSCL= 1
##$ISEN= 128
##$LB= 0.24
##$LEV0= 0
##$LPBIN= 0
##$MAXI= 10000
##$MC2= 0
##$MEAN= 0
##$ME_mod= 0
##$MI= 1.114404
##$NCOEF= 0
##$NC_proc= 0
##$NLEV= 6
##$NOISF1= 3.799351
##$NOISF2= 2.8
##$NSP= 1
##$NTH_PI= 0
##$NZP= 0
##$OFFSET= 15.70392
##$PC= 1
##$PHC0= -23505.2
##$PHC1= 6.452721
##$PH_mod= 1
##$PKNL= yes
##$PPARMOD= 0
##$PSCAL= 0
##$PSIGN= 0
##$REVERSE= no
##$SF= 200.130013532006
##$SI= 16384
##$SIGF1= 3
##$SIGF2= 2
##$SINO= 400
##$SIOLD= 16384
##$SREGLST= <1H.CDCl3>
##$SSB= 0
##$STSI= 0
##$STSR= 0
##$SW_p= 3612.71676300578
##$SYMM= 0
##$S_DEV= 0
##$TDeff= 0
##$TDoff= 0
##$TI= <>
##$TILT= no
##$TM1= 0
##$TM2= 0
##$TOPLEV= 0
##$USERP1= <user>
##$USERP2= <user>
##$USERP3= <user>
##$USERP4= <user>
##$USERP5= <user>
##$WDW= 1
##$XDIM= 8192
##$YMAX_p= 0
##$YMIN_p= 0
$$ End of Bruker specific parameters
$$ ---------------------------------
##NTUPLES= NMR FID
##VAR_NAME=  TIME,          FID/REAL,        FID/IMAG
##SYMBOL=    X,             R,               I
##VAR_TYPE=  INDEPENDENT,   DEPENDENT,       DEPENDENT
##VAR_FORM=  AFFN,          ASDF,            ASDF
##VAR_DIM=   8192,          8192,            8192
##UNITS=     SECONDS,       ARBITRARY UNITS, ARBITRARY UNITS
##FACTOR=    0.0002768,     1,               1
##FIRST=     0,             0,               0
##LAST=      2.2672688,     0,               0
##MIN=       0,             -39906,          0
##MAX=       2.2672688,     19665,           0
$$ Real data points
##PAGE= N=1
##DATA TABLE= (X++(R..R)), XYDATA
$$ [...]
1329e15k6l0l9k60J04m9Q5J04p5J26k46J71K03r7J38K06r2J04n6j8K5N6k1P6j50
1354b76J62N7j74N6j51Mp6N9l2j67L5J31r4KQ5j62J33O6N0nJ02J11l5M1J18p2
1380c2J79J9J16j31R1Rl9J76oj12p4Q7R2o6p9J33j09n2J11L3k15P3kMQ1k76J34
1407A45M1M7m9j08M7R9P6K7m0J4N6r8N8L1J24p4j89K5P6j18P6q7K8j51J80p9n5
1434A02M0P6n3j19J64j48o2Q5j32k2L4J18r6k9p2k23J52q9J80j4K7J05j46N2j43
1459b13J94m0P8N7K8m2j2k19K51r6L9k5j48J62J03p3j66j17J61n0p2Q1j50KJ17
1484a50m1oK8j7j5J00j9N5q2K25j26J51r8J30P2j53J47j01PqJ15m7j49J98K4l96
1510a56J99m5j5k09Q5n5j79J11K4J8r2lR4J14KJ6N5j41J60L2J12J02j8k44J20
$$ plain form
1329 -515 -541 -571 -610 -870 -766 -815 -730 -626 -701 -575 -821 -650 -447 -544 -406 -200 -292 -188 -244 -262 -237 -181 -202 -126 -276
1354 -276 -114 -57 -231 -175 -326 -322 -398 -339 -371 -538 -503 -372 -466 -464 -379 -541 -408 -342 -292 -297 -195 -84 -119 -78 40 -32
1380 -32 147 166 282 151 242 251 212 388 382 270 196 283 375 309 230 363 254 202 313 346 131 204 202 206 287 11 145
1407 145 186 233 184 76 123 222 298 325 285 299 355 257 315 346 470 396 207 232 308 190 266 179 207 56 236 157 102
1434 102 142 218 165 46 210 62 0 85 -47 -69 -35 83 -13 -42 -114 -337 -185 -274 -94 -108 -81 24 -122 -70 -213
1459 -213 -19 -59 19 76 104 62 50 -169 82 -14 25 0 -148 14 117 44 -122 -239 -78 -128 -200 -119 -269 -267 -150
1484 -150 -191 -197 -169 -186 -201 -101 -120 -65 -147 78 -48 103 5 135 207 54 201 100 107 99 214 167 18 216 240 -156
1510 -156 43 -2 -17 -226 -141 -196 -375 -264 -240 -222 -314 -317 -223 -109 -107 -91 -36 -177 -17 15 127 229 211 -33 87
1535H7j16J20l9L2p9j6k3j20np6J84k02P7r1m3j23Jk7J11J8k6j17J84r0J82j8
1561b15Nj7K67o7N8K12j64L2p5J02l6J37rl7J63j65r2n4K9J49k23j98K50o9r7
1586a14J48j93J93j14J23k4q1K75p1J59O8q7o3K50q7J14k5l2K5P7J8lj25k1r8
1611C12k5j37Q0l9j07o6L3J05j73n9P9N9j01j09J28K4J12j42J91K9r1Q3j11OJ69
1636B50r9K0Q1o4M3m6p3K8Pm0m3q2o5m9k06k9j66K83k04L5R2j35M0m1N2KL6n1
1664d24N1Q2J7k4l5R9mJ32n8K0mJ21oj39j10N0m9j7j33K38p3j66O4j29J38J07
1690b52k62K16k2J29j50K8K74j44J4L6kJ43M7J07k7J43j57l2J9M5J51l3J41k08
1714B04J49p4p5l0J12m2p7K6l6k6J54j45P7m8J7j27J34J03r2q0J06J5J82k39K14
$$ plain form
1535 87 -29 91 52 84 5 -11 -34 -154 -159 -235 -51 -253 -176 -267 -310 -433 -432 -459 -348 -330 -356 -473 -289 -379 -197 -215
1561 -215 -210 -227 40 -27 31 243 79 111 36 138 102 239 230 193 356 191 99 45 74 223 0 -198 52 -17 -114
1586 -114 34 -159 34 -80 43 19 -62 213 142 301 369 282 219 469 382 496 471 439 464 541 559 556 431 410 312
1611 312 287 150 230 191 84 18 51 156 -17 -76 3 62 -39 -148 -20 4 116 -26 165 194 103 186 75 81 250
1636 250 151 171 252 188 231 185 112 140 147 107 64 -18 -83 -132 -338 -367 -533 -250 -454 -419 -327 -462 -422 -463 -411 -409 -373 -424
1664 -424 -373 -291 -274 -298 -333 -234 -238 -106 -164 -144 -148 -27 -33 -172 -282 -232 -281 -298 -431 -193 -266 -432 -368 -497 -359 -252
1690 -252 -514 -298 -320 -191 -341 -313 -39 -183 -169 -133 -135 8 55 162 135 278 121 89 108 153 304 271 412 204
1714 204 353 279 204 174 286 244 167 193 157 131 285 140 217 169 186 59 193 296 204 124 230 245 427 188 402
1739D02N3J1r3k3Q6k3l6L9p3L7q4j19O5j7r3K06k88R6P2j67K5J3k29J49Jl1j6
1766c7K0j40K22m7n5KL5K8q1J31j08k8K06l5o6j38M7Qj5K15k55l2l4m8q4R7o3
1793b55O1k69R1N8m1M7rNK14j97j30J69j47J29L1J21K7l3J34j71K50q7j13J04
1817a1m9O0J6j12K9Q7k05M7M2P8N6j01p4j65J69R1j14j89K92j22K33J0k03J46
1841A1P8N9l9J8k1J1LK24k37R9j63K46L8n0nk1pk1oj30Kj58J51j11R0l1J07r1
1869D6K6l0o9R7j03L9J64o1lL1j31q1K93R6j32K0J03j57nO5j02J3o5M0j0J17j08
1896I3m0j41n9M1P1j30k1N1r9L1J79o7Q9j11n9K65o6j76K75j93l9J40j3K2j06
1921f3J88j31N2m3j20J86o4q0q1J12l20P0K05P7j95%J2P3j64J56J12o7j09mN2
$$ plain form
1739 402 455 466 373 350 436 413 377 416 343 380 296 177 242 225 132 338 50 146 218 51 76 89 -140 9 10 -21 -37
1766 -37 -17 -157 65 18 -37 -35 0 28 -53 78 -30 -58 148 113 47 -91 -44 -36 -51 164 -91 -123 -157 -205 -289 -192 -255
1793 -255 -194 -463 -372 -314 -355 -308 -317 -312 -98 -295 -425 -256 -403 -274 -243 -122 -95 -128 6 -165 85 -2 -115 -11
1817 -11 -60 0 16 -96 -67 20 -185 -138 -96 -18 38 -63 -137 -302 -133 -42 -156 -345 -53 -175 58 68 -135 11
1841 11 89 148 109 127 106 117 120 344 107 206 43 289 327 277 272 251 244 223 217 87 89 -69 82 -29 61 30 137 46
1869 46 72 42 -27 70 -33 6 170 109 106 137 6 -75 218 314 182 202 305 148 143 208 106 119 54 94 84 201 93
1896 93 53 -88 -147 -106 -35 -165 -186 -135 -234 -203 -24 -91 -2 -113 -172 93 27 -149 126 -67 -106 34 21 43 -63
1921 -63 125 -6 46 3 -117 69 5 -75 -156 -44 -364 -294 -89 -12 -207 -207 -195 -122 -286 -130 -18 -85 -194 -198 -146
1946a46J74K8Qm2M5O5j60O6l8J63j32n8J56l1p3n4J24j26n9J49r2o3j15L31j15
1971Ej68J49p0J12j04o5%J24r0p3J14j5K32k1j44j0J23l4o8M9O5j29O3Pj27%Q1
1998FJ1k75L18Kj25J00N8j76n6J35n1j4P4j03l4J38m2qnLJ31j60O4P6k17J52O8
2025G0Q5k32J88M8k85J21J24j65L2J02or5L7L2j7q9K9J55k25p0O7J38J0n4K3j19
2051i6K10N0n8N4K6m7k7M5k3L7o8n2J3l7J5J24k0j10r3J30R2M7r8q0l4J21k8m9
2079D4q8j2L4l6J33p3R7N3j2j28NN6l6k2j0N3Q8k88K65n1j5lK8j01l5KK4j18Q3
2108f3n5Q3k6j4qJ0M5j14k7O6j5j31j44L28r0j23J75N1p2q1%O6L1n1N8K2O7k35
2136b47J66q2M9J16j7q2J9J46j85L7N7j36L1q6J05l5j01K21l9k7n4j0M3Q3k6J4
$$ plain form
1946 -146 28 56 64 22 67 132 -28 38 0 163 31 -27 129 98 25 -29 95 -31 -90 59 -33 -96 -211 120 5
1971 5 -163 -14 -84 28 -76 -141 -141 -17 -107 -180 -66 -81 151 130 -14 -24 99 65 -3 46 111 -18 45 52 -75 -75 6
1998 6 17 -258 60 62 -63 37 95 -81 -137 -2 -53 -67 7 -96 -130 8 -34 -42 -47 -44 87 -73 -9 67 -150 2 70
2025 70 155 -77 111 159 -126 -5 119 -46 -14 88 82 -13 24 56 39 -50 -21 134 -91 -161 -94 44 54 0 23 -96
2051 -96 114 164 106 160 186 139 112 157 134 171 103 51 64 27 42 166 146 36 -57 73 165 212 114 34 0 121 93 44
2079 44 -44 -56 -22 -58 75 2 99 152 140 12 17 73 37 15 5 58 146 -142 123 72 57 54 82 -19 -54 -52 -28 -146 -63
2108 -63 -118 -35 -61 -75 -83 -73 -28 -142 -169 -103 -118 -249 -393 -65 -155 -278 -103 -52 -124 -205 -205 -139 -108 -159 -101 -79 -12 -247
2136 -247 -81 -163 -114 2 -15 -97 -78 68 -117 -80 -23 -159 -128 -214 -109 -144 -245 -24 -63 -90 -144 -154 -111 -28 -54 -40
2162d0J41p5n7J7qQP6rJ75q1q4P7p1R3q9J61r7q8J5L05l24J36o3kO4k02O2P2L7
2191A49m9r6r4K09l1N9J07k33J03Q9q8q0P0J06j5o1o4N9%n5J69j57q0J24K9q9
2217H1Q9j94Q5r0N8j6p9K8q7J05j61K10j60K07k45J99o5J09k53J13J2m3J41L1
2241G5n8JJ47l24R4J63n6O0j97l7K76l21K20j09j23R4rj0j05J4Q7k18K59K0J3
2266d4m3p2r5K77j27oJ05np6N5J25j03J84k2J6j02j16J9J6n4Q1j27j06J90K33
2291B03j70p5J9M0J93l62J54l6n3m9J00l4J51j78m4J22P2R0N9k11lP9Q6oJ17o7
2317A97j76O4P8j34m8P1Nj86J47m4r0P0j25J87l04J75J76j59J13n4J44j20R0j1
2341F6Q6j75l5J17l7l8j3K39j40k2qj58J48R5k13P9K4l1n8P6j2j22M5k7O3J8j7
$$ plain form
2162 -40 101 26 -31 -14 -22 -14 62 53 228 147 63 140 69 162 73 234 137 49 64 369 45 181 118 116 180 -22 40 112 149
2191 149 100 4 -90 119 88 147 254 21 124 213 125 45 115 221 206 145 81 140 140 85 254 97 17 141 170 81
2217 81 170 -24 61 -29 29 13 -66 -38 -125 -20 -181 29 -131 76 -169 30 -35 74 -179 -66 -54 -97 44 75
2241 75 17 18 165 -159 -65 98 42 102 -95 -132 144 -177 43 -66 -189 -95 -104 -114 -219 -205 -118 -336 -77 -57 -44
2266 -44 -87 -159 -254 23 -104 -110 -5 -10 -86 -31 94 -9 175 153 169 67 -49 -30 -14 -68 13 -114 -220 -30 203
2291 203 33 -42 -23 17 210 -152 2 -34 -87 -136 -36 -70 81 -97 -141 -19 53 143 202 -9 -12 67 153 147 264 197
2317 197 21 85 163 29 -19 52 57 -129 18 -26 -116 -46 -171 16 -288 -113 63 -96 17 -37 107 -13 77 66
2341 66 152 -23 -58 59 22 -16 -29 210 70 48 40 -118 30 125 -88 -9 15 -16 -74 2 -10 -132 -87 -114 -51 -33 -50
2368e0J13j21j19K20j10p4K00L1M1j12K2k8PO4q4O4n2N2j24O4j09N7P9r2J71j69
2394e9L3j1j3k8J05j2l5M1j09L5O1j7K6Pj07K85k35K4P8J25j93n8J39k23L6K11
2420A06k29J55m5MP0J4p2k51K08m7J86j79r3l3L46j81J09j03Q3K3j6J0j6N6j43
2445c8r7J12k4m8L5L1l7LJ10o5n8l2o2L3Q2O6l7Q9j81J74o1q1J1P7l8J06q0oL5
2474A9m5J50j11N7j60J49l7L2K5k8q4m5k1J22Q4j00J3k0j41K63l1p5L6j4N4k11
2500a19L83j39k7L5j17Q8J36p2NQ5l47k8J62M6k53R6J41k28J52q1k8J42j59N8
2524f9K2N4L9l6j14J27J52r5j04K26k07J82q8l8J80l30K60j25J76l00p6K06j75
2547a33K8J17j66mJ09P9k38O4J71r1N3j29M3n6J39j21o2J90N3j98J93O9qo2L3
$$ plain form
2368 -50 63 -58 -177 43 -67 -141 59 90 131 19 41 13 20 84 0 64 12 64 -60 4 -105 -48 31 -61 110 -59
2394 -59 -26 -37 -50 -78 27 15 -20 21 -88 -53 8 -9 17 24 -83 202 -33 -9 69 194 1 -57 82 -141 -105 106
2420 106 -123 32 -13 -9 61 75 3 -248 -40 -87 99 -80 -173 -206 140 -41 68 -35 48 71 55 65 49 105 -38
2445 -38 -135 -23 -47 -95 -60 -29 -66 -63 47 -18 -76 -108 -170 -137 -55 11 -26 63 -118 56 -5 -86 -75 2 -36 70 -10 -16 19
2474 19 -26 124 13 70 -90 59 22 54 79 51 -33 -78 -99 23 107 7 20 0 -141 122 91 16 52 38 92 -119
2500 -119 264 125 98 133 16 104 240 168 173 258 -89 -117 45 91 -162 -66 75 -153 -1 -82 -110 32 -127 -69
2524 -69 -47 7 46 10 -104 23 175 80 -24 202 -5 177 89 51 231 -99 161 36 212 -88 -164 42 -133
2547 -133 -105 12 -154 -158 -49 30 -208 -144 27 -64 -11 -140 -97 -153 -14 -135 -197 -7 46 -152 41 110 102 40 73
2572G3j23l2R8k0k7o3J41k25K59j83N6K6q1N4o2j39J17K9K1j49K10N7k1j12J78
2597H2O5j42K03j1k6m8R0q3j10J87p0j57J12L6m2j03N1k1Pk0n0m1J57k39Q3J3
2623g7j08K00J3j6R3o6Q2p2j83K53Nk5J37j73J5O3j40jp1J24MJ0j4k20J83l7r1
2650a12J07n3N5K5j08R2%j33R4Q8K7q8O2j15J58r6q7K21j06p2l5K07j78O0M2L6
2676I1j54J50m5j99R0mj14J75On6N5p6P7k27J48J01l0r9O5p5J11m4K33j21j38
2701h0K17j33k0N6j0j2n5J11k27J94k13J63J16k51K01R7k85J52m4j22J21O2j8
2724B0Nj0p1k1J82q5q7J78q3N3j00R1N8oj49j27Q8L8j10K09j31pJ01j37pN1jJ20
2752F2p7j56K14p3mp2n6J66r7P1q9Q5j39J69K9k4j25N4J76j08Qr7J12L4j7K2q0
$$ plain form
2572 73 -50 -82 16 -4 -31 -94 47 -178 81 -102 -46 -20 -101 -47 -109 -248 -131 -102 -81 -230 -20 37 16 -96 82
2597 82 147 5 208 197 171 123 213 130 20 207 137 -20 92 128 86 -17 34 13 20 0 -50 -91 66 -173 -90 -77
2623 -77 -185 15 28 12 105 39 121 49 -134 119 124 99 236 63 78 141 1 0 -71 53 57 67 53 -167 16 -21 -112
2650 -112 -5 -58 -3 22 -86 6 6 -127 -33 55 82 -6 56 -59 99 3 -84 137 31 -41 -76 131 -47 13 55 91
2676 91 -63 87 42 -157 -67 -71 -185 -10 -4 -60 -5 -81 -4 -231 -83 18 -12 -111 -46 -121 -10 -54 179 58 -80
2701 -80 137 4 -16 40 30 18 -37 74 -153 41 -172 -9 107 -144 57 154 -131 21 -23 -145 -24 38 20
2724 20 25 15 -56 -77 105 20 -67 111 28 81 -19 72 130 124 -25 -152 -64 -26 -136 73 -58 -65 36 -101 -108 -57 -58 62
2752 62 -15 -171 43 -30 -34 -106 -162 4 -93 -22 -111 -26 -165 4 33 9 -116 -62 114 6 14 -83 29 63 46 68 -12
2779a2j17R3o4P6j35K16o8j03J96j01o0J8J88j27J3KJ75j01k0j58M5M3qN8q1O4
2805C2m0J2o1J34j25p4J25q1J07M0J9k4l2M0K6Q6j81q3K6J64j43O5Q7o1M7p0R
2832D4j29J98J4j19P7n4o8P4k0R0k9k4l3RL0k9q9k4K9J3j09J24L9P1lp2K4o3L7
2861HmP5K7L1j35o8J28j52n7K61q6rJ5n8mk66J61J6p4J28j44N4J25j41J24KQ8
2888D5qq3J62o2n6P6j64J19j61Q6J48j53J8j07j8O8J73k08Q8j17J29j26o5K57
2912D1o3k19K29k1q7J45j12J4P1jO5o4K9k5J46K6j4j47m6m8j11K11n2L3MOk24
2939b14K34K5j79P2J75k55J06m2J1J0P5m0m2m6J15J63j74Q2J16j71O2PN8M5p3
2964A20p8J20O6j63J05j79q1Q7K8m3Qj09K57j83L7Nj07Q7o6J09M4n3j7N0L0j95
$$ plain form
2779 -12 -129 -36 -100 -24 -159 57 -11 -114 82 -19 -79 -61 127 0 13 15 190 89 69 -89 -44 -1 -9 49 -32 32
2805 32 -8 4 -57 77 -48 -122 3 -78 29 69 88 64 32 72 98 184 3 -80 -54 110 -33 32 119 58 105 35 44
2832 44 -85 113 127 8 85 31 -37 37 17 107 78 54 21 30 60 31 -58 -82 -53 -40 -149 -25 14 85 82 10 34 -29 8
2861 8 4 79 106 137 2 -66 62 -90 -147 114 28 19 34 -24 -28 -294 -133 -117 -191 -63 -207 -153 -28 -169 -45 -43 45
2888 45 37 -46 116 54 -2 74 -90 29 -132 -46 102 -51 -33 -140 -158 -90 83 -125 -37 -154 -25 -151 -216 41
2912 41 -22 -241 -12 -33 -120 25 -87 -73 -2 -3 62 -2 27 2 148 174 160 13 -33 -81 -192 19 -33 0 4 10 -214
2939 -214 20 45 -134 -62 113 -142 -36 -78 -67 -57 18 -22 -64 -110 5 168 -6 76 192 21 83 90 148 193 120
2964 120 42 162 228 65 170 -9 -90 -3 25 -18 -10 -119 138 -45 -8 -3 -110 -23 -89 20 64 11 -6 44 74 -121
2990a21J49o7L4L9K31r5k62L0j7n4J35J78k11j18R8L9Lr7J89j58j98J43J56k02
3014a76J77m1p0PP3J09j65R4N3r0K38j41p7O4O0j08qP8o0%j2O3k44J67j08Q4j20
3041a53J08l1n9M0L3J8j1J2j01R9Q0n3j07K47j18QJlR8j89K00j66J82j15n7R7
3067F0q4O2J04M2j96M4J0m9j46Q3o3q0J50M4K36m5j70n6k7R5mN5K5p7K4j63J53
3094B7P6o4K2q1J09R8J5j79n0L6m4o3Q4m4K0p7R4k4j78K26j04Q8J4j08L5J8J59
3121A05j39J32j06LQ0j87j4J27Q1j59k3l4J75j9k7K1K5k56J15L3j03J23l7N3q4
3146a15K79p0o8j40R5J37k67K03j17K8P9j00K26p7j08J22k4mk8n7j79pL11j80
3170f1Q6j8j17K5j19R3L5o4K22j78O8M5m9N5m2J37k2P8j19p5l2K0lj38K34j20
$$ plain form
2990 -121 28 -39 -5 34 265 170 -92 -62 -79 -133 2 180 -31 -149 -51 -12 -9 -106 83 -75 -273 -130 26 -176
3014 -176 1 -40 -110 -103 -30 79 -86 8 61 -29 209 68 -9 55 115 7 -1 77 17 17 5 68 -176 -9 -117 -33 -153
3041 -153 -45 -76 -135 -95 -62 -44 -55 -43 -144 -45 35 -18 -125 122 4 12 13 10 108 -81 119 -47 135 20 -37 60
3067 60 -24 38 142 184 -12 32 42 -7 -153 -70 -133 -213 -63 -19 217 172 2 -54 -81 14 10 65 90 13 37 -126 27
3094 27 103 39 61 -20 89 187 202 23 -27 9 -35 -98 -14 -58 -38 -115 -21 -45 -223 3 -101 -13 1 -107 -72 -54 105
3121 105 -34 98 -8 -5 75 -112 -126 1 82 -77 -100 -134 41 22 -5 16 41 -215 -100 -67 -170 -47 -84 -31 -115
3146 -115 164 94 26 -114 -19 118 -149 54 -63 -35 44 -56 170 93 -15 107 83 79 51 -6 -185 -192 119 -61
3170 -61 25 7 -110 -85 -204 -111 -76 -140 82 -96 -28 17 -32 23 -19 118 96 174 55 -20 -52 -32 -35 -173 61 -59
3196e9Q1j69K41k33K34k10J12j18K5j26J96M6k11J15J9J26k75K45o2k0N4j01J17
3219B7J09k05K8M3q7O6j64J29J95j60r0j0Q5Jn5J1K8m8N0j03O4J46j2j63k3J52
3245A4J65j87oR5p6J87j45l6K8P8r3j90K9J51o5Q0m4j4OpJ15r9n6p0J14N0M7j72
3273a01J28j20K58j07J28k0j83J78m0m1J75mj17N4J5q5j20J02N8q1r8N0j70O3
3297g8R7k5Q3p1k9p5P5J05k4j6Qj34J54m8R6N8p2m4Q3N5j20j35P0p1NL7q7J75
3325G2jr8n2P9j11j6%m6Q9m3n3R4K9L1p2N8j52o8J95J30j04j9J55p2k3l8M8L2
3353D4jk8n1m4K2J1j4O7j14KQ9p8j92K19M3j7l2m9J52j63j6J41p5J51rk10J95
3380D3mn4J09l4j7L0Q4l8j8j72K24r2N8Kj44o1q5n4K94j94J83k5j77j0K81q4r3
$$ plain form
3196 -59 22 -147 94 -139 95 -115 -3 -121 -96 -222 -26 20 -191 -76 -57 69 -206 39 -23 -43 11 -90 27
3219 27 136 -69 -41 2 -85 -19 -183 -54 141 -19 -109 -119 -34 -33 -88 -77 -49 -97 -47 -150 -86 60 48 -115 -138 14
3245 14 179 -8 -14 81 5 192 47 11 39 117 24 -166 -137 14 -51 29 -15 -29 -23 -30 85 -14 -70 -140 -26 24 71 -101
3273 -101 27 -93 165 58 186 166 -17 161 121 80 255 251 134 188 203 118 -2 100 158 77 -21 29 -141 -78
3297 -78 19 -6 77 6 -23 -98 -23 82 58 42 50 -84 70 22 118 176 104 60 143 198 78 -57 13 -58 -53 -16 -103 72
3325 72 71 -27 -79 0 -111 -127 -127 -173 -84 -127 -180 -86 -57 -26 -98 -40 -192 -260 -65 65 -39 -58 97 25 2 -36 12 44
3353 44 43 15 -36 -80 -58 -47 -61 6 -108 -106 -17 -95 -287 -68 -25 -42 -74 -123 29 -134 -150 -9 -84 67 58 -152 43
3380 43 39 -15 94 60 43 73 157 119 101 -71 153 61 119 121 -23 -84 -169 -223 71 -123 60 35 -142 -152 129 45 -48
3407d8M6j5m5P2M4J49q5J9p8J74jk6j65m4K71q2k9l9j8j7k2L3p8M2K5j40j0L8
3435b9j6m3J25r1OK1P1q9J34R1r1P9n3P3k46J64m5J2J2j22l7J46n2k7m1J9l6j1
3463g6k3L8k5p9O9P3jo2k3Q0J6j7n9Q9kk2k7J55j08n0N4R6j58N6P1qk5p6J22j04
3493b6q3J73o8o0r9J40p6j30J88K0l2j0o3J45nm9J44j39K7r5J36m7N2Rm8M0J1
3520E5j38K13R2k52M7R7j60J09p8O5j08k8R3k37K31k9j13J72j54NL9J20k9k8J08
3545I2j7j37M6J14j04Q2l4lJ1p9J60j18j44J94j37L0J23j54l6J02j85K53m7K4
3569C6m5rk4K0J0O3J30r0k19K09R5l4j60O0l8N1j8N1k9p9K0Q7k2j33k6J2P1K3
3597A2M8n3J47r6mn9L1k4J34k4o2O2q5j15J90N5J1j59n5M0N6j35J20j78J02L4
$$ plain form
3407 -48 -2 -17 -62 10 54 203 118 137 59 233 232 206 41 -3 268 186 157 118 100 83 61 94 16 58 83 -57 -67 -29
3435 -29 -45 -88 37 -54 -48 -27 44 -45 89 180 89 168 115 188 -58 106 61 73 85 -37 -74 72 20 -7 -48 -29 -65 -76
3463 -76 -99 -61 -86 -165 -96 -23 -24 -86 -109 -29 -13 -30 -89 0 -2 -24 -51 104 -4 -54 0 96 -62 -6 65 57 32 -44 78 -26
3493 -26 -109 64 -4 -64 -163 -23 -99 -229 -41 -21 -53 -63 -126 19 14 -35 109 -30 -3 -98 38 -9 43 52 4 44 55
3520 55 -83 130 222 -30 17 114 -46 63 -15 50 -58 -86 7 -230 1 -28 -141 31 -123 -118 -79 41 12 -16 92
3545 92 75 -62 -16 98 -6 76 42 39 50 -29 131 13 -131 63 -74 -44 79 -75 -111 -9 -194 59 12 36
3569 36 -9 -18 -42 -22 -12 51 181 91 -128 81 176 142 -18 42 4 55 37 88 59 -20 0 87 65 -68 -94 -82 -11 12
3597 12 60 7 154 58 54 -5 26 2 136 112 50 112 27 -88 102 157 168 9 -46 -6 50 -85 35 -143 -41 -7
3623gl2j42J45j7j61L24r4M9n9O5o8j8k7R3l6MMO5r3l0J79j10rK4p3J57k08J84
3651A09m9j37p8J14N2J06k17l0O7J11j3l2j76J90j18j0J59J19k25n6L30k62K49
3674B03j02n1m5J1l5K6j47J26N8k1L7j47o5P9Q5j69j10R5K0o9L21k41J16j4on1
3700i6K10k01J01n5J11j00J40o2Q3r6j29K4J92l9o1J7l1j0r1j08J40J64k31M3
3724h5J97l11j5K49Kj15J38j68K66J04k90JMMN9R4q0M3j12J52q4j00P3J43k23
3749e4R6j15O6p5J10q3o0p7P9Q2j6j54J50R0q2N3n6M7p9J03K4Q4o2j14L1P8q0
3776a4J7J38K6j91R6J2j29j45M7J38n0L7l1K3K0p3Oj46rK00o0M4R9j24J4L5J32
3803A12j50j2N9N4q2J01j01l3o2J11N5j21p7P6j23L01k20M0k1J56k05m9K30j5
$$ plain form
3623 -7 -39 -181 -36 -53 -214 110 16 65 6 71 3 -15 -42 51 15 19 23 88 -5 -35 144 34 25 49 -24 133 -75 109
3651 109 60 -77 -155 -41 11 117 -100 -130 -63 48 35 3 -173 17 -101 -111 48 167 -58 -114 216 -46 203
3674 203 101 50 5 16 -19 7 -140 -14 44 23 60 -87 -152 -73 12 -157 -267 -172 -152 -221 100 -141 -25 -39 -45 -96
3700 -96 114 -87 14 -41 70 -30 110 48 131 35 -94 -70 122 83 22 39 8 -2 -93 -201 -61 103 -128 -85
3724 -85 112 -199 -214 35 37 -78 60 -108 158 262 -28 -27 -23 -19 40 134 54 97 -15 137 53 -47 26 169 -54
3749 -54 42 -73 -7 -82 28 -55 -115 -192 -113 -31 -47 -201 -51 39 -43 10 -46 1 -78 25 49 133 71 -43 -12 66 -14
3776 -14 3 141 167 -24 72 84 -45 -190 -143 -5 -55 -18 -49 -26 -6 -79 -73 -219 -228 -28 -88 -44 55 -69 -55 -20 112
3803 112 -38 -50 9 63 -19 82 -19 -52 -114 -3 52 -69 -146 -70 -193 108 -112 -72 -93 63 -142 -191 39 24
3827B4m7On5R3q2N2QJ20M4j80J50K8j63R4q1M8k6j7P2q5p9Q5j5n8P1p8l6J61r8
3856d4L1L1O5j4j7J07j67KN6j72J62J0p0J02r3J22l8n8l6M2R2R9j49j16K24r9
3882G2j27J07j85K24O5j26j7j98J92N6n1p6PM0j9N7n4m7K69j36K0l0NJ09k97L06
3908A66k92J49J19j52j9j07k0K80j98k3qR2p9j2P7J60k86L30k62R3J19p4jJ06
3932A58j92O6K4n8n3Q9K7N6j59J9j5Oj1J94j01J76k11R6j50M2K9o9J32j25M6M6
3958F2o8L7o5j13P9J17P2q8p5j3J67r8kP0m9n4j20J53j5r4O6P6n0N6j04J26q3
3985a0pK8K8o3j34K05J5P6j72J98k49J79k9j5R3o7j21M7j15j8O7M7PO0p9O0Mn9
4013b4k5o5J80j60k3J14J07k50J70j10Q7p1K2O7K0j30K40k09O4M3N3n8lr7R6O8
$$ plain form
3827 24 -23 -17 -72 21 -61 -9 -1 119 163 -17 133 161 -2 92 11 59 33 16 88 3 -76 9 -6 -64 7 -71 -107 54 -44
3856 -44 -13 18 83 69 52 159 -8 -6 50 -122 40 50 -20 82 -11 111 73 15 -21 21 113 212 63 -53 171 72
3882 72 -55 52 -133 91 156 30 13 -185 7 63 12 -64 -57 -17 -36 21 -33 -80 189 53 73 43 48 157 -140 166
3908 166 -126 23 142 -10 -29 -136 -156 124 -74 -97 -105 -13 -92 -104 -27 133 -153 177 -85 8 127 53 52 158
3932 158 -34 32 56 -2 -55 34 61 117 -42 -23 -38 -32 -43 151 50 226 15 111 -39 3 32 -37 95 -30 16 62
3958 62 -6 31 -34 -147 -68 49 121 33 -42 -55 112 14 12 82 33 -21 -141 12 -3 -97 -31 45 -5 51 -53 73 -10
3985 -10 -17 11 39 -24 -158 47 62 138 -34 164 -85 94 65 50 143 76 -45 2 -113 -131 -64 -17 -10 50 -29 31 35 -24
4013 -24 -49 -114 66 -94 -117 -3 104 -146 24 -86 1 -70 -48 19 39 -91 149 -60 4 47 100 42 39 -58 38 106
4039A06j07J09j88J69j62P2Q3j02K48q3q3m9j12j46L45k6k4l8j2O4P2k04J91k23
4063a00O0M0J1M0M8j97J30%j9J9r6P0lpp4n8L41k31J77j36j88J68o3O2n2J44r4
4090hj01K11j50j13L36j79L6j6n9J41j08o0J37K5l3n9J03k2K1k38J61j2q1P8p1
4115f1J7j05J28k1N6K3N4N7k46N2J55m1k1p1Q6q3K9mL2K06j53M0k20L0J66j90
4141h5P0R7k08K01q3K1J02k31P3n0O7l4J20O0m4M0p3q1M8j26J99p1K2P1J19j97
4167B7J1j05RM8P7q4N8n4J84k46R8n1r9O8j5J25j06N0j7j31J37K2q6J28l6J08
4193A20p2j47J49j70J72M8k9l2j10P1Q6L9k53J79k6K6j41J57j31j9J7O0lN1j40
4218i8P7J9q1j5O0R2J30j47j3o2J30j60j4R1J39jj10l6j62J63M9M4j8J3j86N6
$$ plain form
4039 106 -1 108 -80 89 -73 -1 82 -20 228 145 62 13 -99 -245 100 74 50 12 0 64 136 -68 123 -100
4063 -100 -40 0 11 51 99 -98 32 32 13 32 -64 6 3 -4 -78 -136 205 -26 151 15 -173 -5 -68 -6 -58 86 -8
4090 -8 -109 102 -48 -161 175 -4 32 16 -43 98 -10 -70 67 92 59 0 103 81 102 -136 25 13 -68 10 -61
4115 -61 -44 -149 -21 -42 14 37 91 148 -98 -46 109 68 47 -24 62 -21 8 4 36 242 89 129 -91 -61 105 -85
4141 -85 -15 82 -126 75 -8 13 115 -116 -43 -93 -26 -60 60 120 76 116 43 -38 10 -116 83 12 34 105 224 27
4167 27 38 -67 -58 -10 67 -17 41 -13 171 -75 23 -28 -127 -59 -74 51 -55 -5 -22 -153 -16 6 -80 48 12 120
4193 120 48 -99 50 -120 52 100 71 39 -71 0 86 125 -128 51 25 51 -90 67 -64 -83 -66 -6 -9 42 -98
4218 -98 -21 -2 -83 -98 -38 54 184 37 24 -38 92 -68 -82 9 148 147 37 1 -161 2 51 95 77 90 -96 -40
4244d0K9p2J08m2j0r9J58K0O6r1l1j05J68j26P8J62j87l4M1m1jN6pJ88j92oJ50
4271A40j20p3o2L1J25L4n9q2L8KoK7j19J56j8J04o5j16QJ17kj00R1Kq8k9K71j35
4299G2pj08O3M4p5l3K6j13P6J62k25%J58j06K36j78k4m8J6L0jj1J32j15Q1n1n6
4326e5P3M0P7k72P1K18m1j26P3j14J38j33L8L1m5J77j71P7j88J06j57K6J84j30
4350a03J23J58l28J76j05P6r7M1J28Qj19N9j8J09k66J53j84K23k8L6o0l5J35j21
4374c9M1j53J64m8o9O9L6L8J2JJ6k9k4j02J72r9M5j3J13k00PjM6J04j75j1M3J11
4402E5J0j19l8J05J41k42M7J00r9J37j82Q1j21l9P2K51j21K03j77qm8K4L5j70
4426a03J57j11J13P5o5q1j26L3J78j32J18l9k0p9o8R6J08j57J19J17j96J26j75
$$ plain form
4244 -40 -11 -83 25 -17 -27 -126 32 52 118 27 -4 -109 59 -67 11 173 -14 -48 -7 -48 -49 7 0 188 -4 -10 140
4271 140 20 -53 -115 -84 41 75 16 -66 -28 -26 -32 -5 -124 32 14 118 53 -63 -55 62 60 -40 51 53 -35 -64 207 72
4299 72 65 -43 20 64 -11 -44 -18 -131 -55 107 -118 -118 40 -66 170 -8 -32 -80 -64 -34 -35 -46 86 -29 52 1 -55
4326 -55 18 58 135 -137 -66 152 111 -15 58 -56 82 -51 -13 18 -27 150 -21 56 -132 -26 -183 -157 27 -103
4350 -103 20 178 -150 26 -79 -3 -100 -59 69 77 -42 17 -1 108 -158 -5 -189 34 6 42 -18 -53 82 -39
4374 -39 2 -151 13 -35 -104 -35 1 39 51 52 68 39 15 -87 85 -14 31 18 131 -69 -62 -63 -17 87 -88 -99 -56 55
4402 55 65 -54 -92 13 154 -88 -41 59 -40 97 -85 -4 -125 -164 -92 159 38 241 64 56 8 32 67 -103
4426 -103 54 -57 56 131 66 -15 -141 -108 70 -62 56 17 -3 -82 -150 -54 54 -103 16 133 -63 63 -112
4449a12K70l3K8j83K17j51J4L7j40l7L2J87m1r7K3j46J90j25m3J05O8j82k0P4
4473f5p3J35n4nMJ29j24J05k4j4N2NO7j28n1OJ75J8j49R1j6J15o6k39J40m0K6
4500B0K4p5M2lK9o3J23p0L3%q9K2l3R5j41J54%jP1j17m7O0o3knN7r5P3q2Q6j10
4531a07k2K14j32O3O8o9j74J91j03J63j48m9J42j0r0L4K1MJ91N9k01j20N8N4L3
4556G0j3j99Q3O0q7R2q7J08q0R6p6m7J11l1M3lj61N9m1J30j4J1r6O9j0N0j18Q4
4584Cl2n4k3K04j13L9L1M5j76l2o5J67j14P7n1K22r2j36J02l3qR3L7j43J06j71
4610a17J93r1r0K32j64J02mq8K1kk8Q7K7L3j9k12K80r6J33j24j49O5m9Q1j1O1
4636G1l7k0j07L5J93Jj21M1j52J46o1o3J61j07R6j20J31j22L9O5NM8q3n6K0j5
$$ plain form
4449 -112 158 125 153 -30 187 36 50 87 -53 -90 -58 129 88 -9 14 -132 58 -67 -110 -5 63 -119 -139 -65
4473 -65 -138 -3 -57 -62 -58 71 -53 52 28 14 66 71 138 10 -41 -35 140 158 9 100 84 199 133 -106 34 -6 20
4500 20 44 -31 11 8 37 -26 97 27 60 60 -29 -7 -40 55 -86 68 68 67 138 21 -26 34 -29 -31 -36 21 -74 -1 -83 3 -107
4531 -107 -129 85 -47 16 84 15 -159 32 -71 92 -56 -105 37 27 -63 -29 -8 -4 187 246 45 -75 -17 37 70
4556 70 57 -142 -59 1 -86 6 -81 27 -53 43 -33 -80 31 0 43 40 -121 -62 -103 27 13 24 -72 -3 -13 37 -81 3
4584 3 -29 -83 -106 98 -15 24 55 100 -76 -108 -173 -6 -120 -43 -94 128 36 -100 2 -31 -39 54 91 -52 54 -117
4610 -117 76 -15 -105 127 -37 65 61 -27 -6 -8 -36 51 78 111 92 -120 160 64 197 73 -76 -11 -60 21 10 71
4636 71 34 14 -93 -58 135 136 15 56 -96 50 -11 -74 87 -20 76 -44 87 -35 4 69 74 122 39 -17 3 -12
4662a2j40R3K6j08J33O3oL2j16Q6j18J72j61J21n6m2j5j0K8O2j57J25q7K1Q3O8
4688H5n9Q9j28l7p1J47o7n8J29j97J89N7q5nK9L9K9j50J70j25N6O2j11n1L6M4
4714A7m4m7P4o5J72k34J29m2J40l4q8o4JO5K8K2j10J63k25J42RJq6N8K09k65K3
4741e1O6j6m0j23J43p1Q2L6j47j4P7J67j68j04J46O4oJ48j12j1J10j04j60k7j1
4766a26nN4J90p4r9J67k36p4K25krp2p0K40M9j23L6n6p7k7m5K55p2j59J08j09
4792a11J54j9k49K68n4JR0k9j43k0J59p9M0l5J8J6N7p9P7J21p4Kl3J22r4k36K33
4819A03j37j01J77j0j6j01p0J14j77J58J98l25K22j8P9o3p2J07JJ14j4j50%n7
4843c8nR0n3Q3M1j64o0k3R6L1K4k04J33o8O4P1p8J09j93Q3J11j3j47l0K21j88
$$ plain form
4662 -12 -152 -59 -33 -141 -8 55 49 81 -35 51 -67 105 -56 65 9 -33 -48 -58 -30 32 -125 0 -87 -66 17 85
4688 85 26 115 -13 -50 -121 26 -41 -99 30 -167 22 79 -6 -11 18 57 86 -64 106 -19 37 99 -12 -63 -27 17
4714 17 -27 -74 0 -65 107 -127 2 -40 100 66 -22 -86 -85 -20 8 30 -80 83 -142 0 9 10 -76 -18 191 -74 -51
4741 -51 15 -1 -41 -164 -21 -92 -10 26 -121 -135 -58 109 -59 -163 -17 47 41 189 77 66 176 72 -88 -115 -126
4766 -126 -131 -77 113 39 -60 107 -129 -203 22 20 11 -61 -131 109 158 35 71 15 -62 -89 -134 121 49 -110 -2 -111
4792 -111 43 24 -225 43 -11 -10 80 51 -92 -112 47 -32 8 -27 -9 7 64 -15 62 183 109 111 78 200 106 -130 103
4819 103 -34 -135 42 32 16 -85 -155 -41 -218 -60 138 -187 35 17 96 33 -39 68 69 183 169 19 19 -38
4843 -38 -43 47 -6 77 118 -46 -106 -129 -33 -2 22 -182 -49 -117 -53 18 -60 49 -144 -61 50 37 -110 -140 81 -107
4869a07Q3j55N3K20m6N0k93K18j30J58j10o0K19q6R6%p8n7n8k3R2r4J95k05O9
4894d9K57k77Q4j2r7J17pj08Ll0q0K78j21K5k9J2j0o4K52k64J41o1J64r0Q0j09
4920Ej56P0J59j5j68J83K5k3j64l6Q9j6n8j21J76k4n1J53m3k2M4J07n2M2j37R0
4946E7j56J47n2k2n4J08L5l3J4p7L7j17J4J01j86J31N1ol5k6R0P6j97J29l4j4
4972a9N9M8n3k5K5j18O3m8J4n8JJ44j7j09M5j7J05j43l3J28Q7j07j02J54j14J58
4998F8Rk12l7M9J02Q5q9K49j97k2K5k45K75j14k1O1N6j3%J5o6R5p6J5N5l9o2L1
5026cr9M8J21r5O1m7N1k18J34o5J85j4j84J57M8n3j56O9J6J74j18j4j7kk3J8o5
5053i1J20J61l35J54M5j83J64P0o2j67J05J83k97J87p5j1K7rj5%mR3o8po4M0M6
$$ plain form
4869 -107 -24 -179 -126 94 48 98 -195 23 -107 51 -59 -119 100 14 110 110 32 -25 -83 -106 -14 -108 87 -118 -49
4894 -49 208 -69 15 3 -94 23 16 -92 -89 -119 -199 79 -42 -17 -46 -34 -44 -108 144 -120 21 -40 124 34 114 5
4920 5 -151 -81 78 63 -105 78 103 80 -84 -120 -31 -47 -105 -226 -50 -74 -125 28 -15 -37 7 114 62 104 -33 57
4946 57 -99 48 -4 -26 -80 28 63 30 44 -33 4 -113 -99 2 -184 -53 -2 -8 -43 -69 21 97 -100 29 -5 -19
4972 -19 40 88 35 10 35 -83 -20 -68 -54 -112 -111 33 16 -93 -48 -65 40 -103 -136 -8 79 -28 -130 24 -90 68
4998 68 77 -135 -172 -123 -21 64 -25 224 27 5 30 -215 60 -54 -75 -14 42 29 29 44 -22 73 -3 12 67 28 -34 -3
5026 -3 -102 -54 67 -28 33 -14 37 -181 -47 -112 73 59 -125 32 80 27 -129 -60 -44 130 12 -2 -19 -21 -44 -26 -91
5053 -91 29 190 -145 9 54 -129 35 105 43 -124 -19 164 -133 54 -21 -32 -5 -14 -29 -29 -33 60 -8 -15 -79 -39 7
5080GK3j38N5PJ22Nj6j11j02K30j50J5J39k34R5L2M5j26J58o1j21K09J33l22J03
5105cp3Kj8Q2L4NP8p3j06J80O6j43Rk27P5J3R2J7nR7r3j6M2m0r1p0J92l5Rq7J66
5136G9Pj21O6p5l0J15j34R2m6L1k6l8mJ09J06m6k24K61j51N7j51j3R9L6O1j25
5162f5J20r7k9J07k54M69k25O6j83O1J92p6j36j18J45J42j53R7m3l3J5n2O0p4
5186f4J77l3J1j03N0k12K26j12No4J94m3J32j1j22J33k03Q5m3Mk5K4Q1O7l41Q5
5212a02J21l2J16j37K7J22j56Oo8J58m3l8O1J5o8m0l4J97j58L4m2M8J20p8qm9
5238b8J00k5j53R4r5K1J7R5j6J21j15j5j06Q7L8j16K39j47P5k33J84q7mM8R6j85
5264a10J72k13J51j08J49n3n0N9j47K54j05K2J7j2K2j70J17K6jqj5q2Q9J01k75
$$ plain form
5080 7 30 -108 -53 -46 76 81 65 -46 -148 82 -68 -53 86 -148 -53 -21 24 -102 56 -5 -126 83 216 -106 -3
5105 -3 -76 -74 -92 -10 24 29 107 34 -72 108 174 31 40 -187 -112 -99 -7 10 5 102 9 -7 35 -5 -96 -166 26 -9 0 -87 79
5136 79 86 -35 31 -44 -74 41 -93 -1 -47 -16 -42 -80 -84 25 131 85 -139 122 -29 28 -123 -136 -37 -1 60 -65
5162 -65 55 -42 -71 36 -218 251 26 92 -91 -30 162 86 -50 -168 -23 119 -34 63 20 -13 2 -50 10 -64
5186 -64 113 80 91 -12 38 -174 52 -60 -55 -119 75 32 164 153 31 164 -39 46 3 7 -18 6 87 154 -187 -102
5212 -102 19 -13 103 -34 -7 115 -41 -35 -103 55 12 -26 35 50 -18 -58 -92 105 -53 -19 -61 -13 107 29 21 -28
5238 -28 72 47 -106 -12 -107 -86 -69 26 10 131 16 1 -105 -18 20 -96 143 -4 71 -162 22 -65 -69 -21 75 -110
5264 -110 62 -151 0 -108 41 -12 -62 -3 -150 104 -1 21 38 26 48 -122 -5 21 20 12 -3 -85 4 105 -170
5289a70J92J32j04j50N2q2J12M1m6r8J66j29J01L8j01J64k66K16j2J09k45P3j
5312hK0K7j11P6nL4j00J04J4l9m7MQ4j82R2qR8p6Rk5O1k3K4j61J26J25j79J44
5340G8m3j9r7O4k21J16K75k45N1q9j4n5K51M3k0j79N5K1R6k15J32l8Q9j76J8N9
5366f3P0R0k28M5nP1j47Q8Q7j4R0k25J35j00l2Q6N3j99J05K8m7k2L0P4M0j00Q8
5393bm3J14N5j53J08j01J93nj23o5Q6j12KK9k9Q6O5n9k03K40K9K0j48J6Q9j21
5419c2l2O5J21p8r3Q3O0o6k2R7L7j09q5J60j67R4L1o4j62P2J73j07M9J6R6j44
5445gL5p0J64j08j16M7Q7L8j55N5J11l1n4J38j80nj57L49j63K2L3K1jj55J13M3
5471E4p8M0j23l5K24k56K38k9N0j3p7J3n6p1R3J12j00j02J28j5j17K51Pj03J48
$$ plain form
5289 -170 22 154 50 -100 -48 -130 -18 23 -23 -121 45 -84 17 55 -46 118 -148 68 56 165 -80 -7 -8
5312 -8 12 39 -72 4 -1 33 -67 37 51 12 -35 -31 53 -129 -37 -45 53 -23 -14 -39 22 -1 23 -138 -12 113 -66 78
5340 78 35 16 -81 -17 -238 -122 153 -92 -41 -130 -144 -199 52 95 75 -104 -49 -28 68 -147 -15 -53 36 -140 -122 -63
5366 -63 7 97 -131 -86 -91 -20 -167 -79 8 -6 84 -141 -6 -106 -138 -52 1 -198 -93 -65 -112 -134 -104 -30 10 -90 -2
5393 -2 -45 69 124 -29 79 -22 171 166 43 -22 64 -48 -46 -17 -46 40 105 46 -157 83 112 132 -16 0 89 -32
5419 -32 -64 1 122 44 -49 34 94 28 6 103 140 31 -54 106 -61 33 64 0 -162 -90 83 -24 25 41 137 -7
5445 -7 28 -42 122 14 -102 -55 32 70 -85 -30 81 50 -4 134 -46 -51 -208 141 -22 0 33 54 53 -102 11 54
5471 54 -24 16 -107 -142 82 -174 64 35 85 72 -5 8 -48 -119 -26 86 -14 -116 12 -3 -120 131 138 35 183
5496A83k93N8K6n8J47r9M4j09J9J12k8p3O0J2rJ6j9J00q5j22K20j57J43nj32J84
5522A35m8j6j03n2J00j23K89k02rnQ2r5J16j03M9R7j84k0J59j49J33Lj36N8j39
5547a63K27Q9j84jJ24j52M9j9j26K50j31R1k02J78L2j7r3M5R1j79j5J87J02k08
5571b5N2j26N8J64j28R3k6j97K05r1q7N6M5P6j83J55j31P6Q1j00o7R2M3P7j57
5596d5q3J66M1j3o8M1l0k8k7kNN6k9N6k1j58J10Q3p0M2L8J60k72n7J44q9P0k0
5624@m3N8m2J54j23j79N3L1M4J89r3j78J46oK8Po7J4M5j11N4M1q4L0J81j79J66
5651A36j26O9n8r4j5J2J29Om4j3J0p5J21Lp7J19j83M1O1m0j3k0qJ28L5k04J16
5678A6j4N6l9mJ6n9kq2J71j2l2lM9j79O4r7J57R6j68o0K36k26L8J3l4R6j06J5
$$ plain form
5496 183 -110 -52 -26 -84 63 -36 8 -101 -82 30 2 -71 -11 1 -8 8 -11 89 4 -118 102 -55 88 83 -49 135
5522 135 87 71 -32 -84 16 -107 182 -20 -29 -34 48 -47 69 -34 15 112 -72 -92 67 -82 51 54 -82 -24 -163
5547 -163 64 153 -31 -32 92 -60 -11 -30 -156 94 -37 54 -148 30 62 45 -48 -3 88 -91 -106 81 183 -25
5571 -25 27 -99 -41 123 -5 88 62 -135 70 -21 -108 -52 -7 69 -114 41 -90 -14 67 -33 -100 -8 35 112 -45
5596 -45 -128 38 79 66 -2 39 9 -19 -46 -48 -43 13 -16 40 19 -139 -29 54 -16 26 64 224 -48 -105 39 -50 20 0
5624 0 -43 15 -27 127 4 -175 -122 -91 -47 142 49 -129 17 11 39 46 -21 -7 38 -73 -19 22 -62 -32 149 -30 136
5651 136 10 79 21 -73 -88 -76 53 59 15 2 12 -63 58 61 -16 103 -80 -39 22 -18 -31 -51 -59 69 104 -100 16
5678 16 2 58 19 15 31 -28 -30 -112 59 47 15 12 61 -118 -54 -151 6 102 -66 -126 110 -116 -78 -65 -99 -3 -109 -94
5706i4J66j13k9L9J04j12j04L39k89j2N3R4R6j95oJ22n5K3M0o2M7l5j11M5J28
5731G9n0m4j02K00n9q5N2p3P6RK7p9Q4o1j33J79P2p0k7pN7J2J19k28R9j29J83
5758A01j47Q9r9K5L4R6kj54K46j64K01k54j35K87l1o9j3M7l9m7k3O3J77j55O2
5783I6k11P9m5JN0M3o0J27j8q3m0K4J18r8J54j84QP9j67K34j88J83j7k3K1j61
5809g8J17l9ON9l1r5L2j9j2l5K39k0k70J37j01P2K1P0K5k06Q8r1J28K9L9j00j7
5836e2J0J45k2k00P9l1J08q7J02j7J0R5m7M2k22K0K2p2J30j04R5Q4j68J12r0J75
5862A17j73J35j10r6J45j36J83l0o1P1Q3P8k20K20j71j49L42k89J12o2OJ87p8
5885A04Qn9p3K7r3J20r1J5o5J27O5j57N6Q7j70J30l1j4k0J7K7r1k5K3M5J29j00
$$ plain form
5706 -94 72 -41 -70 -31 73 -39 -143 196 -93 -105 -52 42 138 -57 -63 59 4 27 67 5 52 17 -94 -49 79
5731 79 29 -15 -117 83 24 -61 -9 -82 -6 3 30 -49 35 -26 -159 20 92 22 -5 -12 45 57 176 -52 47 -82 101
5758 101 -46 43 -56 -31 3 99 97 -57 189 25 226 -28 -163 124 93 24 11 58 19 -28 -51 12 189 34 96
5783 96 -115 -36 -81 -80 -30 13 -47 80 62 -21 -61 -37 81 -17 137 -47 -39 40 -127 107 -81 102 85 62 83 -78
5809 -78 39 0 6 65 34 -61 -29 -48 -60 -95 144 124 -146 -9 -110 -38 -17 53 78 -128 -40 -131 -3 26 65 -35 -52
5836 -52 -42 103 81 -119 -40 -71 37 -50 52 35 45 140 93 135 -87 -67 -45 -117 13 -91 4 88 -80 32 -58 117
5862 117 -56 79 -31 -127 18 -118 65 35 -26 45 128 206 -14 206 35 -114 228 -61 51 -11 -5 182 104
5885 104 112 53 -20 7 -86 34 -57 -42 -107 20 85 -72 -16 71 -99 31 0 -14 -34 -17 10 -81 -106 -83 -38 91 -9
5912iL2J19j39N3j6L3k10J90M6j75K7Q6J6m4q6K8J84j99K51j93J43j56N0J4n3
5937hm4P5K9Q4k62J18O2k5j65K67k23L5J36j9J5j34R7JJ3N8K0j05l6l1jM6j3M8
5965C8q8K39l4k23J47q8o2k9M0K1m7JK74l14J21l3O3P3k6k26J60J75j01r0J20
5990A11k68J00J04k99K77k7m9QJ36j13J07j02o7J10j09L6m2J80j93R1m9j2O4J8
6014A2o5R4j16J35n9Q5o4m9l4N0k4n2L7L7o3M2L5k7M7p1J35j31pl9J14Q1K5k46
6042a18K82k55N9l7J17j9J9P5j52L3m1p2K01p4N7j34n7J79n1j56J09p8K12k6r6
6067b3o2K35n2j12l3N3q6M1qK9J04j7l4j4j22J36o0o0J35p2m7K35k09K6J08j34
6093d3M8q7K49k03M1l02M19j09p0J70n0L6m6R8j06K1j02J04q0N4N5j66P7n6M6
$$ plain form
5912 -9 23 142 3 56 40 73 -137 53 99 -76 -49 37 53 9 -77 -49 135 -64 187 -6 137 -19 31 45 -8
5937 -8 -52 23 52 136 -126 -8 54 29 -136 131 -92 -57 79 60 75 -59 38 39 52 110 130 25 -11 -42 -43 3 -10 38
5965 38 -50 189 155 -68 79 -9 -71 -100 -60 -39 -86 -85 189 -125 -4 -37 26 99 73 -153 7 182 81 -9 111
5990 111 -157 -57 47 -252 25 -2 -51 -43 93 -20 87 -15 -82 28 -81 -45 -87 93 -100 -9 -58 -70 -6 12
6014 12 -53 41 -75 60 1 86 22 -27 -61 -11 -35 -87 -50 -13 -76 -34 1 -26 21 -50 85 -46 -53 -92 22 103 128 -118
6042 -118 164 -91 -32 -69 48 29 48 123 -29 4 -37 -109 92 18 75 -59 -116 63 12 -144 -35 -113 99 73 -23
6067 -23 -85 150 98 -14 -47 6 -80 -39 -47 -18 86 69 35 21 -101 35 -25 -85 50 -22 -69 166 -43 -17 91 -43
6093 -43 5 -82 167 -36 5 -297 122 13 -57 113 63 99 53 151 45 66 -36 68 -12 42 97 -69 8 -48 -2
6118bq6K18r1Pm6R9r5q9J67Kj64P8j1p2J15j23m8K35q9j37J2Q9J7J0N0k0k1j65
6146a60KJ82nj30J16m5O2j5j4l6l4M7O2m2j1j23J54J82j68Q9q2q1j1J34p4j13
6172a14M3m9lM0J28j13J51j37L8j6j61J04K39k13N1p2J59K5j74qO6P5mk49K08
6197A4K2L8l1m3l4o0M9P2J7o8q2J39Jl19L05k9J08L1o8kJ4j47M5O7j6p3J0O2r5
6226g3J62o8m7M1j34J91r4j36K30N0j31J68l2l29K69j13K1P8j5K1K6k18K02j10
6250d1P7j64K38j56L1j7J01j59j5J04R9k05K45qk63J50r7Q7j7O4o1J06j15N6M2
6275H2Qn7Q4k56J48n4N8q9L1j13N2J67l3m5P6J26n0j29ol1L9L1j07J70M9j44n9
6302e2J14p7N2o0m2J36o9l3o4J79k85K05q1lP2K9j71J62k09K21Mj9J5j10J59n9
$$ plain form
6118 -2 -88 130 39 46 0 99 4 -85 82 84 -80 -2 -13 -85 30 -93 -141 94 5 -132 -120 -31 -14 -4 46 26 5 -160
6146 -160 -158 24 19 -111 5 -40 22 7 -7 -43 -77 -30 32 -10 -21 -144 10 192 24 113 31 -50 -61 73 -1 -114
6172 -114 -71 -120 -123 -83 45 -68 83 -54 -16 -32 -193 -89 150 -63 -12 -84 75 100 -74 -82 -16 59 55 -194 14
6197 14 36 74 43 0 -34 -94 -45 27 44 -24 -106 33 34 -285 20 -9 99 130 62 60 74 -73 -28 39 23 -50 -40 22 -73
6226 -73 89 21 -26 15 -119 72 -22 -158 72 122 -9 159 127 -202 67 -46 -25 53 38 59 85 -133 69 -41
6250 -41 36 -128 110 -46 -15 -32 69 -90 -105 -1 98 -107 138 130 -133 17 -80 7 -10 54 -7 99 -16 40 82
6275 82 90 33 117 -139 9 -45 13 -76 -45 -158 -106 61 28 -17 59 185 135 6 0 -31 8 39 -68 102 151 7 -52
6302 -52 62 -15 37 -23 -65 71 2 -31 -95 84 -201 4 -77 -80 -8 21 -150 12 -197 24 28 9 24 -86 73 14
6328A4k00K36n4K4n3k5q6J15N8j58k1K12J8j31N4k4M3J12k69P0L1J2Q0M8K5r6
6354C5q1R1l9p8K3J20j29K21k59J02k0m6J16jj27lJ25j67J64m0L7l4l4j7O6L8
6380F3N3k74K66j65j31J64J5L1Pm8p5K4Q2O0m2j4j97K45l43L29n7m8Q9r1k6M0
6406d3J12j6j5R5m6j19k64J97J40K0j57Q6l4R1j50L4O3J36j7n6j13J43j21K1R5
6431H2j18O5k4k4J0R0j23P1o0L2N2m4P5mj02J41j26o8K46j13O2q4j09K70l51R9
6457e5NM9O4o9J04j39M2j1J26q2j26J66R8k33N1L4q0M0L8n2N8p3P0J3j16K8MJ
6485d5M9l13K88M3P9r8n0lm2Q4j5N5lM0j15K00k53J06L7j80J56Pq5M4J71r3n5
6512IN2j5o9M0l6j12J47l1J57j92R7k1p7Q8m2J62j89J0l2P1j00J33Q2j73J62j31
$$ plain form
6328 14 -186 50 -4 20 -33 -58 -144 -29 29 -129 -150 62 80 -51 3 -21 22 134 -135 -65 -34 -22 58 106 131 35
6354 35 -46 45 6 -72 -49 71 -58 163 -96 6 -14 -60 56 55 -72 -75 50 -117 47 7 44 10 -24 -41 25 63
6380 63 116 -158 108 -57 -188 -24 -9 22 29 -19 -94 -70 12 72 30 16 -181 64 -279 50 -7 -55 34 -57 -83 -43
6406 -43 69 53 38 133 87 -32 -296 -99 41 61 -96 -10 -44 47 -103 -69 -6 130 113 57 -56 87 -34 -13 82
6431 82 -36 29 5 -19 -9 81 -42 29 -31 1 53 9 84 80 -22 119 -7 -75 171 58 120 36 -73 197 -154 -55
6457 -55 -50 -1 63 -6 98 -41 1 -10 116 34 -92 74 172 -61 -10 24 -56 -16 22 -30 28 -45 25 38 -78 -50 -46 -45
6485 -45 4 -309 -21 22 101 3 -47 -50 -92 -8 -23 32 29 69 -46 154 -99 7 44 -136 20 27 -58 -14 157 64 9
6512 9 61 46 -23 17 -19 -131 16 -15 142 -50 47 26 -51 37 -5 157 -32 -22 -54 17 -83 50 132 -41 121 -10
6538a0L8mn5P4q2R2p1J57j58P5j41L6K13k54Q7P9r1m4N5%j79K32J12k16R4J03
6564A42j47l3N8r4JK7K4L2k0J1q6J10j91k0K29m9o1m6J75n8r8K1J34j33o4K64
6590A28o8r8K0J15l6j82K58j4L3k99nJ0K42j31P2m3r0J6q7K47k28J32O1l9m4j8
6616d8K4m3J9n1J42p0mk7P8l7o4K4K44j83J28j33l4k0L8J17l27J84J7L1J25j96
6642f6Q0lj9r4J29Q1K8k92M9K5O3J8Oj01Q8K6Jn0P5j1p7L4j17J87kj56M4K14K
6671A62j25j52J48l7j0O5Mj31K2P3R3j8m7L2k26ll7J96j45K90j75j8o0J71k13
6696a41Q2J58j25n5l2Q0J51k31P2L2m3Pj6k9oJ73j39J23o2J20r1Q2LK3q2R0k37
6723i3O7L8l3P9j80K27j87L8N9nN4j27j71R7J43j01P2r5NL7J33Q0j30K2j20OJ19
$$ plain form
6538 -10 28 24 -31 43 -39 53 -18 139 -19 56 -85 -49 164 -90 -3 76 -15 -59 -4 -4 -183 49 161 -55 39 142
6564 142 -5 -38 20 -74 -73 -46 -22 10 -10 1 -85 25 -166 -186 43 -6 -67 -113 62 4 -94 -73 61 -72 -136 128
6590 128 60 -38 -18 97 61 -121 137 123 156 -143 -148 -138 104 -27 45 2 -88 -72 -159 88 -140 -8 53 14 -30 -48
6616 -48 -24 -67 -48 -99 43 -27 -31 -58 20 -17 -81 -57 187 4 132 -1 -35 -55 -17 100 -227 -43 -26 5 130 -66
6642 -66 14 11 -8 -102 27 108 136 -156 -107 -82 -19 -1 5 -96 -8 18 19 -31 44 33 -44 -10 -127 60 58 -98 -54 160 162
6671 162 37 -115 33 -4 -14 51 55 -76 -54 19 112 94 47 79 -147 -150 -187 9 -136 154 -21 -39 -99 72 -141
6696 -141 -59 99 -26 -81 -113 -33 118 -113 -41 -9 -52 -45 -61 -90 -96 77 -62 61 -1 119 28 110 113 136 54 144 -93
6723 -93 -26 12 -21 58 -122 105 -82 -44 15 10 64 -63 -234 -137 6 -95 -23 -118 -113 -76 57 137 7 29 -91 -85 34
6750C4P6j13J41k36R9Pj01K57j41j78J95K7k02J24q9K0L4mR9l4Q0o2j12J12jm1
6776iJ02p4l3m9J15O7k19O1q0J60RM3j33n7Q4K9L4j59R6J06j14r7N9J08j99J58
6802HM5J2l0r7K02R1l36L5P4k5R7j95K0J29m7l1P2m1j15Q1J4O5k11Q2R1N4j07
6829f3J65k51N3J81n7k72K51J88k16K24l06L6Q8J7O9p7r8J1OJ23j47l1J66q9k
6854c1PL3j66J02n8J17m9J71j35Q2o7m0L1O4n4j09J25JQ2j28Q4k03J92o0q6K26
6880A31j47n0J37M9j50J4ON5m5Q9j97J69N5p4N5k6N4j28l7N1j17Q6j4J4j29K17
6906F8k28K18j65J02j8J1K0n5R2j13L6l5K8N9N0j52O5Q2k55J11J44k26J01J49
6930H9l7j32J75p1j2J2K3o0O5q6L8k3m1J83nj20J7n4j6J06L5j39L2J01j79J09
$$ plain form
6750 34 110 -3 138 -98 1 8 -93 164 23 -155 40 67 -135 -11 -100 -80 -46 -50 49 15 95 33 -79 33 32 -9
6776 -9 93 19 -14 -63 52 119 -100 -39 -119 41 50 93 -40 -97 -13 16 50 -109 -13 93 -21 -118 -59 49 -150 8
6802 8 53 65 35 -62 140 231 -105 -70 4 -21 76 -119 -99 30 -17 -48 24 -17 -132 -51 -37 28 -183 -101 -10 44 -63
6829 -63 102 -149 -96 85 28 -244 7 195 -21 203 -103 -67 21 38 107 30 -68 -57 -51 72 -75 -106 60 -29 -31
6854 -31 -24 9 -157 -55 -113 4 -45 126 -9 73 6 -34 -3 61 7 -102 23 24 106 -22 62 -141 51 -9 -95 131
6880 131 -16 -66 71 120 -30 -16 -10 45 0 89 -108 61 116 42 97 71 125 -3 -40 11 -106 -20 -34 -20 -149 68
6906 68 -160 58 -107 -5 -23 -12 8 -47 45 -68 -32 -67 -39 20 70 -82 -17 65 -190 -79 65 -161 -60 89
6930 89 52 -80 95 24 12 24 47 -13 52 -34 4 -19 -60 123 118 -2 15 -39 -55 51 86 -53 -21 80 -99 10
6956A0n5M3k02J07J40L3k12J95j44J54k0j09J22j20mO9m7J20o6R3j37j5P9K7n8
6981CP9j50JJ92j69M3J79j89j83J07K41k69M6p7Q9L3J21j01N3o9M4k5J13o8j14
7006g0K22o0j68Jj9k3J37l9J60mk04J21j45J67j67J29N4r0j23J44M1p5p5L7m5
7031i4Q6O4K1N8q4l9j48K99j73J95j22l8M9j04J19K3k80K61j01L1qJ18k75K37
7055I5r0JJ9P2j00n8j0N5M4k03J99j33P5R3o6j68K25Oj01J45j75NnJ33n9rK1l7
7083b6J34n2j30J79j62j39J02J06j17K7J35q1mN8K3L1o8p0KJ06o0J8m7QO8k8j3
7110@J00j13P9q5J08R4k27K05k34J29p6k2j2M1P8r3j79K63j01J57j09P0j04Ok9
7135e4j20Q1J65k1j74K28pj66K6p2MK00m5m3R4j58L6j45J30o1J52r0m4J08L7l8
$$ plain form
6956 10 -45 -2 -204 -97 43 76 -136 59 -85 69 49 -60 62 -58 -62 7 -40 80 14 107 -30 -45 34 61 3
6981 3 82 -68 -67 125 -44 -1 178 -11 -194 -87 154 -115 -69 -146 -57 -24 97 -4 49 -20 24 -1 112 44 -70
7006 -70 152 92 -76 -75 -94 -117 20 -19 141 137 -67 54 -91 76 -91 38 92 2 -121 23 64 -11 -86 -49 -94
7031 -94 -8 56 77 135 51 12 -136 163 -10 185 63 25 74 -30 89 112 -168 93 -8 23 15 133 -142 95
7055 95 5 6 25 97 -3 -61 -71 -16 28 -175 24 -109 -34 59 -7 -175 50 56 -45 100 -75 -70 -75 58 -1 -10 11 -26
7083 -26 108 56 -74 105 -57 -196 -94 12 -105 -78 57 -24 -28 30 53 84 16 -54 -52 54 -6 12 -35 -27 41 13 0
7110 0 100 -13 66 -19 89 183 -44 161 -73 56 -20 -42 -54 -13 65 -28 -207 56 -45 112 3 73 -31 -25 -54
7135 -54 -174 -93 72 51 -123 105 98 -68 -42 -114 -110 90 45 2 96 -62 -26 -171 -41 -102 50 -40 -84 24 61 23
7161B3j3ro0N5J10n3P2k3j45J26p3j42rj7J95pJ3O9qJ6j12J70l04K40j62O1L7
7188E0j46J99j10r1O5l3J71j34p5P3o8J24k22P2J36J38j52p3J09O9j48J12j29
7211f3RJ26M7j51K8O4q4P8j00N5O2p0Ol0J07m9q3p9N9K33k69Q5P8j04j45K42j84
7238a32JQ8j4NN2J2J15p4p0J1n3K27j93R3k7l6P8p6j48K04j27J95k08J25lj39
7264i4L9n5j0K8k2O5J59k28J88j07J02j17K7M9o3K5k2J13j11j48J58r4j9J59k5
7289cM3J23j30j46R1J05m05L24n7o3J71K1j34n4K97j60k7J33q3r9O3k11J22K27
7313A48j46j21J79k6nl1J01j24J72j68j83J74j3j2K1L6n2J22k26K08j2p1k6P0
7337A5J5n7JJ23p9q7J92k26J82j80m2L9J6J62k2j46M3O3O8j83M7o5J13J2Q3p3
$$ plain form
7161 23 10 1 -59 -4 106 53 125 102 -43 83 10 -132 -141 -158 37 30 43 112 104 120 8 178 -126 114 -48 13 50
7188 50 -96 103 -7 -98 -33 -66 105 -29 -104 -31 -99 25 -197 -125 11 149 -3 -76 33 102 -46 66 -63
7211 -63 -54 72 119 -32 -4 60 -24 54 -46 9 71 1 7 -23 84 35 -48 -127 -68 165 -104 -19 59 -45 -190 52 -132
7238 -132 -131 -43 -57 -52 0 12 127 53 -17 -6 -59 168 -25 68 41 5 83 7 -141 63 -64 131 -77 48 45 -94
7264 -94 -55 -110 -120 -92 -114 -49 110 -118 70 -37 65 -52 -25 24 -39 -14 -36 77 -34 -182 -24 -118 -137 22 -3
7289 -3 40 163 33 -113 -22 83 -322 2 -55 -118 53 74 -60 -114 183 23 -4 129 46 -53 10 -201 -79 148
7313 148 2 -119 60 34 29 -2 99 -25 147 -21 -204 -30 -43 -55 -34 2 -50 72 -154 54 42 -29 -55 15
7337 15 30 -27 -26 97 18 -69 123 -103 79 -101 -143 -104 -88 74 52 -94 -51 12 80 -103 -56 -121 -8 4 87 14
7363A4m4K55k56n3J00K7r0K25j68j45J92R1j53J44j78J44j47O3m6J9o4J75j47
7386d2o5Q1j58J09J23n7K23k99JQ3j9j39R2oMK8L0K5o6n0J17J5k24J16J62j61
7412g7J30j42J09q3O0p4J16M3j16j52K86j2r7l7n2K8N5P6r7Q7kr3O0j20j4N4k1
7439h5k3j01J93j36K23r5m8K60l01J36J21j15k35J53M0m9J71r6M6r8J03m0l0J15
7463A09k73J82l3o5L0k4q8J53R0k5o9L7m4K5l3R5q1J4P1k9q1N9jM5o8N2l4k9r9
7492a14M1J92j18m4P7j14P0O6m5j45J37jJ9l0J71j78J37k4j66Q0l3q2L2M7M0j60
7518a45m4K90k78L51j28j09j48J61Q2J70j47J55k93M3j05Q9Oq5J70l2l1k9p0J04
7542b3J26j50L1P3m4K8o4n3J1J70Mk14J55k2j46J15J0n7L0M4l2j04J97j13j20
$$ plain form
7363 14 -30 225 -31 -84 16 43 -47 178 10 -135 57 148 -5 139 -39 105 -42 21 -25 -6 -70 105 -42
7386 -42 -107 -26 -184 -75 48 -9 214 -85 -84 -1 -20 -159 -67 -73 -69 -41 -11 14 -52 -102 15 30 -194 -78 84 -77
7412 -77 53 -89 20 -63 -3 -77 39 82 -34 -186 100 88 -9 -46 -98 -70 -15 61 -36 51 49 -44 16 -104 -118 -64 -85
7439 -85 -108 -209 -16 -152 71 -24 -72 188 -113 23 144 29 -206 -53 -13 -62 109 13 59 -39 64 24 -6 109
7463 109 -164 18 -15 -80 -50 -74 -162 -9 81 56 -13 24 -20 5 -28 67 -14 0 71 42 -39 20 19 64 -4 48 14 -15 -114
7492 -114 -73 119 1 -43 34 -80 -10 56 11 -134 3 2 21 -9 162 -16 121 97 -69 11 -22 -104 -72 -25 15 -145
7518 -145 -189 101 -177 174 46 -63 -211 -50 32 202 55 210 -83 -40 -145 -56 -50 -135 35 3 -28 -57 -127 -23
7542 -23 103 -47 -16 57 13 41 -23 -76 -65 105 109 -105 50 28 -118 -3 7 -50 -20 24 -8 -112 85 -28 -148
7567a48k7J55Q0j18r2K02r4J4Jr1O3L7o6K0qK9J12r5K45l29J12j0J8J18o9Jm6
7594A4n4j13K34l2mj46R5j15j59M07k69j1K09j48J00j9R5ln0kj55J83N3j10J54
7619A54j26q9R1N6p5j03O5Q3j33K9r1J34lL5j23j7P3J09J67j68q7m2O7j24J87
7644F9p6o9M1R9q0j06K21n0j13J28o8p0m9J74l4Q8j02o8Q2q6O8j7j28nJ10j14
7670a55J92N4j03j89N5O9Q1k9n2J04j35J03N5l5p3P0m9J34q0k25J57J14k4R6m8
7695H7l4r6o0K6J02O2j42k1P5Lr1J69j62J37j73m9K5J6J02o9P7J3k4J27l8j03
7721d1Q6j56J23L6o8j1LJ77j62k6L3J27j42n1R0n6k0J59j82J98j67Q1j1o3J32
7746H9N3j25j15J89k23k5J87Q9J4j12oR0m8j06K2J7O7K0j02J6jp6J27L7j18O1
$$ plain form
7567 -148 -175 -20 60 -58 -150 52 -42 -28 -27 -118 -55 -18 -84 -64 -72 -43 69 -26 219 -110 2 -8 10 128 59 60 14
7594 14 -40 -153 81 49 45 -101 -6 -121 -280 127 -142 -153 56 -92 8 -11 84 81 31 29 -126 57 110 0 154
7619 154 28 -61 30 86 11 -92 -27 56 -77 -48 -139 -5 -8 27 -96 -113 -40 69 236 68 -19 -61 6 -118 69
7644 69 -7 -76 -35 64 -16 -122 99 49 -64 64 -4 -74 -123 51 17 105 3 -65 17 -69 -1 -18 -146 -151 -41 -155
7670 -155 37 91 -12 -201 -146 -77 4 -25 -77 27 -108 -5 50 15 -58 12 -37 97 17 -208 -51 63 39 135 87
7695 87 53 -43 -103 -77 25 87 -55 -76 -1 2 -89 80 -82 55 -118 -167 -142 -126 -24 -93 -16 -3 -27 100 62 -41
7721 -41 45 -111 12 48 -20 -31 -28 149 -13 -39 -6 121 -21 -72 18 -38 -58 101 -81 117 -50 31 20 -43 89
7746 89 142 17 -98 91 -132 -157 30 119 133 21 15 105 57 -49 -27 -10 57 77 -25 -9 -10 -86 41 78 -40 21
7772B1k09J12J01m6j38R2RL4J19j5k57K06j34M8K06j75j4pQ6j1p6O4Q3j97k2J7
7798a03l7K26j3q4J67j98p5q6K1P6M0j5J47p6j28O4J82o5j0j72K07N2k01M2MR
7824b6l1K9M9j6j47J82m2j01J33m6J67j31o1R0m3J00o1N9l6j02k5l6J24M4l9n0
7850a6r0K2R2j62P8Q9k11J36Q2n7J30j39m7Q3Q9k08J27L6L2o0K5j93J56J7j0J2
7876A3k8R1p6K4M1K6mq1m6M8n6k0J32k0o0o3J44P9j58j69P6J22o3O7j02J00R8
7903A15j03J13k4p8k1r6L8J7q1o0K14p6m7L7N5j00J06j07R2k0j3mj09K68p2j17
7929g3J18J03k70J41j58J00k0J5n0Q9l9P1j51K35j43K2%j22J05Q0P5j59K1j3K33
7954B10k6n8j92M2M8l4O1j12j0J7K7m6O5NJ10r9p9M3J3J00j56J62m6j39M7J17
$$ plain form
7772 21 -188 -76 25 -21 -159 -67 -58 -24 95 80 -177 29 -105 -57 149 -26 -40 -47 39 28 -48 16 99 -98 -120 -103
7798 -103 -140 86 73 -11 156 -42 -117 -203 -182 -106 -66 -81 66 -10 -138 -74 108 43 33 -139 68 120 -81 -39 -35 -26
7824 -26 -57 -28 21 5 -142 40 -2 -103 30 -16 151 20 -41 49 6 106 45 104 68 -34 -59 -95 29 73 34 -16
7850 -16 -106 -84 8 -154 -76 13 -198 -62 20 -37 93 -46 -93 -10 79 -129 -2 34 66 6 31 -162 -6 11 1 13
7876 13 -15 76 0 24 65 91 87 6 -40 8 -48 -68 64 44 -16 -79 65 144 -14 -183 -107 15 -48 19 -83 17 115
7903 115 12 125 101 23 2 -94 -56 -39 -120 -180 34 -42 -89 -52 3 -97 9 -98 -6 -26 -39 -43 -152 116 44 -73
7929 -73 45 148 -122 19 -139 -39 -59 -44 -94 -5 -44 27 -124 111 -32 -10 -10 -132 -27 53 128 -31 -10 -23 210
7954 210 184 126 -66 -24 24 -10 51 -61 -71 -54 -27 -73 -8 -3 107 8 -71 -28 -15 85 -71 91 45 -94 -47 70
7980G0j16J45k59J30Q3j22K3O9j62J08m9P1Q0q7Q5r1Q3j27J59p0l3m8k3J18j17
8005h0K17r0J4q5qr7k6J84r7J92k59J01J10j12J1M7pr9K00j28p4J61l13K61N3
8030G6K5p8j59J11jJ70l53Q0N5%N5p6K37o0r8J89l06L8K8j85J41j5R7pq8QK00
8057H4o2l7n4k5N5j0K9%ll7lJ31j78QR6Q8j02o1rm0J77n8m1J04Q8l71K08J53k75
8086a45J51k56K96P6k93J03j63L20r4q3P5M2l9J3n6Q8k02K71p1J1M4j51o6J23
8110fQ7oJ28j01q3M7k5j83J15K8L2o0R4j3nm5k8lL7%j75J60k5m0ON8j05R9j50
8139a62K16j00L9OP4n0J11m5p7Pm3Q2j23j7L04k67m2Q9KQ6m1M0n4j05P8J47j98
8166d3J42k67K66j65J04L6N9j00m7j15MJ05O9o5nJ30r7j4n1j1K10j5k49Q0k22
$$ plain form
7980 70 -46 99 -160 -30 53 -69 -46 23 -139 -31 -80 -9 71 -16 69 -22 61 -66 93 23 -10 -58 -81 37 -80
8005 -80 137 47 61 -24 -32 -129 -155 29 -68 124 -135 -34 76 -36 -25 22 15 -84 116 -12 -86 75 -238 23 76
8030 76 101 23 -136 -25 -26 144 -209 -129 -74 -74 -19 -95 142 82 -16 173 -133 -95 -67 -252 -111 -126 -29 -36 -124 -116 84
8057 84 22 -15 -69 -94 -39 -49 -20 -20 -23 -60 -63 68 -110 -102 -6 82 -20 -81 -90 -130 47 -11 -52 52 140 -231 -23 130 -145
8086 -145 6 -250 46 122 -171 -68 -231 89 -5 -88 -13 29 -10 3 -53 35 -167 104 33 44 88 -63 -129 -6
8110 -6 81 75 203 102 19 66 41 -142 -27 1 33 -27 67 54 49 4 -24 -27 10 10 -165 -5 -30 -70 -64 -6 -111 -12 -162
8139 -162 54 -46 -7 -1 73 23 134 89 12 19 -24 58 -65 -82 222 -45 -87 2 4 90 49 89 35 -70 8 155 -43
8166 -43 99 -168 98 -67 37 73 132 32 -15 -130 -126 -21 48 -17 -22 108 11 -3 -54 -65 145 130 -119 -39 -261
8191b61
$$ Imaginary data points
##PAGE= N=2
##DATA TABLE= (X++(I..I)), XYDATA
0@%%%%%%%%%%%%%%%%%%%qJ6j6J6j6J6j7K5l2L2m0M8m9N7o5P3q6R5j05J20j35J50
41G9j66J84k03K25k49K74l03L34l68M06m48M94n43N98o63P36q18R12j023J157
61F15j320J524j786K134k633L408m786Q015l2789j2288K5645l080l196j0508L9
76c1006Q207J7658M799m444p573K026Q500J1693L144m997q129p57N717P033o81
91A1190p053q243k681L259M599j939o789o639j382L778M675j3m226l197J467N605
107g589O135J747j746p35L006N388N850K099k267r04K277L447K854J03l507l256
123A2902m9J560J18j971m048m001r24Q37l17j806l013k400M32J706J464j39j151
140h00j18J871L186K108J207r2M12K076K711J453N2p77q75N11P58o04j512k406
$$ plain form
0 0 0 0 0 0 0 0 0 0 0 0 0 0 0 0 0 0 0 0 0 -8 8 -8 8 -8 8 -9 16 -16 16 -24 24 -25 32 -33 40 -46 49 -56 64 -71 79
41 79 -87 97 -106 119 -130 144 -159 175 -193 213 -235 259 -284 314 -349 387 -431 481 -542 615
61 615 -705 819 -967 1167 -1466 1942 -2844 5171 -27618 -39906 -14261 -17341 -20537 -31045 -31006
76 -31006 -22799 -5141 -342 -4786 -12359 -10333 -1833 9860 13004 8007 -122 -879 4838 11871 11190
91 11190 4137 -4106 -6787 -3528 1071 -868 -7657 -14296 -15678 -11900 -7225 -7238 -11464 -14661 -13194 -7589
107 -7589 -1454 293 -1453 -2188 818 6206 12056 14155 11888 10984 13261 16708 19562 19665 16158 12902
123 12902 12853 14413 14531 12560 8512 4511 3587 4424 4107 2301 -712 -3112 -2680 -974 490 351 -800
140 -800 -918 953 4139 6247 7454 7362 7774 9850 12561 14014 14066 13289 12414 12925 13683 13079 11567 9161
158I161k044j192k28j430k436k348j668r46l9l82j187j154j00M01J016Q51K43
175c482L19P10J338J232J257K46J68L35P67O28R7o39p02o52n62l21p62j434j289
194b746r85o83o74o13r30r99r6q7J72J06M1M4P87Q74Q69O92P93M63P51Q17P75
215f29P26nK90M9P06k81j80k46n68j97l13k61m54n55m51m05N3j67j98j52K07J12
237b919M31L80L69L34M98K39Q09L43J77M86J88K98L37J45l2Qj42r5k3l80k84l51
259H16l22L4l04k17j7l07j44J5J79l9K61q4J69K76P4K47m1L19J80P0J1R0r1k39
283I36Q0l64k6j31k37l33k01n8k1q5j43Q1j87J37P8J35J21J64J80L63K09J6N5
306G69M26K0p5J99Lp4J1j80j53j27k95k00j94l27j1k48j12o4j68J11J65J17K25
$$ plain form
158 9161 7117 5925 5697 4267 1831 -517 -2185 -3131 -3170 -3552 -4739 -5893 -5993 -5592 -4576 -3725 -3482
175 -3482 -3163 -2453 -1115 117 1374 1620 1788 2123 2890 3518 3615 2976 2274 1622 1060 739 -23 -1457 -2746
194 -2746 -3731 -4414 -5088 -5701 -6631 -7630 -7726 -7813 -7641 -7535 -7494 -7450 -6663 -5789 -4920 -4228 -3435 -2972 -2221 -1404 -629
215 -629 97 92 382 431 1137 856 676 430 -138 -335 -648 -909 -1363 -1918 -2369 -2774 -2721 -2888 -3086 -3238 -3031 -2919
237 -2919 -2488 -2108 -1739 -1405 -907 -668 141 484 661 1147 1335 1633 1970 2115 2083 2091 1949 1854 1831 1451 1167 816
259 816 494 528 224 7 -10 -317 -461 -446 -267 -306 -45 -129 40 316 390 637 596 915 1095 1165 1176 1266 1175 936
283 936 1016 652 626 495 258 -75 -276 -334 -355 -440 -583 -502 -689 -552 -474 -339 -218 -54 126 489 698 714 769
306 769 1195 1215 1140 1339 1342 1268 1279 1099 946 819 524 324 130 -197 -208 -456 -568 -632 -800 -689 -524 -407 -182
329a82L37L29L02K28K63K99L73L11K57J30K40J36j25m4q0j78m16j13k87m25k54
350A101l89m75l70l12k99j08l99K14k85K26R7J63L84J57L60K12M03J68M27K76
370A551J26L16q9j8R1j70l10k87m67l22l53m76n89l31n26m22n00l39k94k35K20
391c424j73M5Q8J96L21L28K52M40O06K01N01K73L15M38R7P7J36m4j03k74k04l09
413b17k63m11m78m36m56j77m21k85k31j07n6k5L13K79J48N23L71M80K92N41N57
434e9O11L51M96L57L11L53N1R9q1j59k15p8k48n39l14k89k18k90l92k49j81M3
456f40p1j2K1J35J34M71J43L84M58L74N86K37M70R4M94N2L26J04o7J44k35k2l36
479C244m33l31k31l58n60n10l48k85m80k16j54m90j3q4J08J18J07J58J94K26M50
$$ plain form
329 -182 155 484 786 1014 1277 1576 1949 2260 2517 2647 2887 3023 2898 2854 2774 2596 2180 2067 1780 1355 1101
350 1101 712 237 -133 -445 -744 -852 -1251 -1037 -1322 -1096 -999 -836 -452 -295 65 277 680 848 1275 1551
370 1551 1677 1993 1904 1886 1977 1807 1497 1210 743 421 68 -408 -997 -1328 -1854 -2276 -2776 -3115 -3409 -3644 -3424
391 -3424 -3597 -3552 -3464 -3268 -2947 -2619 -2367 -1927 -1321 -1120 -619 -346 -31 407 504 581 717 673 570 296 92 -217
413 -217 -480 -891 -1369 -1805 -2261 -2438 -2859 -3144 -3375 -3482 -3538 -3563 -3250 -2971 -2823 -2300 -1929 -1449 -1157 -616 -59
434 -59 552 903 1399 1756 2067 2420 2471 2570 2489 2330 2115 2037 1789 1250 936 647 429 139 -253 -502 -683 -640
456 -640 -711 -723 -702 -567 -433 38 181 565 1023 1397 1983 2220 2690 2784 3278 3330 3656 3760 3693 3837 3602 3580 3244
479 3244 2811 2480 2249 1891 1331 821 473 188 -292 -508 -662 -1152 -1165 -1249 -1141 -1023 -916 -758 -564 -338 112
500A12P6O35o1K85K58K14M6k7kk99j15p8m88j95m02n09l24m35m11m16l63j98k26
523b923j7k61j07K3K38J20J90K79L29K64L57L36K91M20J16M9M23m1K19j24J99
544C80j98j17j28r0m34l48%l36j45k65q3j9p3k33J04n6K11J07K82K31J89K75M02
567c44K34K15N48J79J90K53P6J05J55N0O7j3k25j85k2l41M0o2l71J07m37j32R
590I6Oj05j17o8M28j67K02O7K33k4L17J36J45K87K69k3K03j3j06j44K69k09j82
613A500j57j58j13k35k85J6j02l47j03k30l2m7q9J13j46O9L0M1R4J09N1Q7l6K73
637C03j09J1O7R9l1l57J70j13N4k31N4k43M2j48Nj40j41j30J8K7j7K5j34L02j97
662h14K35ML2j3J78J0K93j99j40L00j31R3J03q5j27n2L5L9l0k45J03J24k40J81
$$ plain form
500 112 188 823 762 1047 1305 1519 1565 1538 1536 1237 1122 1044 556 361 -41 -550 -874 -1309 -1720 -2136 -2499 -2697 -2923
523 -2923 -2940 -3201 -3308 -3285 -3047 -2927 -2737 -2458 -2129 -1865 -1508 -1172 -881 -461 -345 -296 127 86 305 181 380
544 380 182 65 -63 -153 -587 -935 -935 -1271 -1416 -1681 -1764 -1783 -1856 -2089 -1985 -2041 -1830 -1723 -1441 -1210 -1021 -746 -344
567 -344 -110 105 653 832 1022 1275 1351 1456 1611 1661 1728 1715 1490 1305 1283 942 982 920 549 656 219 87 96
590 96 102 -3 -120 -188 240 73 275 342 575 551 868 1004 1149 1436 1705 1682 1885 1872 1766 1622 1891 1682 1500
613 1500 1343 1185 1072 837 552 568 466 119 16 -214 -246 -293 -382 -269 -415 -346 -316 -275 -181 -72 -21 66 30 303
637 303 194 205 272 371 340 -17 153 40 94 -137 -83 -326 -284 -432 -427 -567 -708 -838 -820 -793 -810 -785 -919 -617 -814
662 -814 -579 -575 -543 -556 -378 -368 -75 -274 -414 -114 -245 -152 -49 -134 -261 -313 -278 -239 -269 -514 -411 -287 -527 -346
686c46m3m5K6K1K41j11L5P2J29l2Q3O5J06j45K25j77M9K42k13j60P5m6J4j13K3
711b5j93J19lk62K07j94K75p5O9j2J7M8M6Q6J72j03J07K3Q8L4N3j41J00k23O1
736B74L2j95p5q5J04k57Q6j18j16j31J3ok0J02pj09L13q8J16K40m4J5K14O4RQ9
762D20J42J03M8Kj83M7o3J8l22L2J24k28k8k56l5r9Oj2J0q9O7o9J1L52J8N7jK31
790C03R7K73N2L2J37J57j45J96k3j06J83k09j42j8k59o2j36k61R6k31k63j47o0
813e36R1K1K5j78N1J18J31p5K01Q9P4JL76m4M7R5R6P7Lj46L4J6k65mk92j7k43
840b54Jk22j27k20r1p5j32j10QN3p6P4K72j77L03J88J5O9K84j0J26j5J68L5J15
865B02J88k57J23j94J4k7j83k57J29k91j21j62M4k2j87R9j09J11J27j21kK43j4
$$ plain form
686 -346 -389 -434 -408 -387 -146 -257 -222 -150 -21 -53 30 95 201 56 281 104 153 395 182 22 97 51 65 -48 -25
711 -25 -218 -99 -102 -364 -157 -351 -76 -151 -82 -94 -77 -29 17 103 275 172 279 302 390 424 477 336 436 213 274
736 274 306 111 36 -49 55 -202 -116 -234 -350 -481 -468 -474 -494 -392 -399 -508 -195 -283 -167 73 29 44 258 322 331 420
762 420 562 665 713 715 532 579 516 534 212 244 368 140 112 -144 -179 -278 -272 -284 -274 -363 -296 -365 -354 -2 16 73 72 303
790 303 400 673 725 757 894 1051 906 1102 1079 973 1156 947 805 787 528 466 330 69 165 -66 -329 -476 -536
813 -536 -445 -424 -399 -577 -526 -408 -277 -352 -151 -62 12 13 389 345 392 487 583 660 663 517 551 567 302 298 6 -11 -254
840 -254 -253 -475 -602 -822 -913 -988 -1120 -1230 -1222 -1169 -1245 -1171 -899 -1076 -773 -585 -570 -501 -217 -227 -101 -116 52 87 202
865 202 390 133 256 62 76 49 -134 -391 -262 -553 -674 -836 -792 -814 -1001 -902 -1011 -900 -773 -894 -896 -653 -667
888f67K85O2M03K3J30J80J10L4J28J35O1J4O7o5j61l7M1k90J20k02j51j09P6J07
912B94k82J06q0k69K37m5Q1J62l7n6J40J84K27oJ16M0J64M0k6j7n6J89j19on0
937I31k66R1k0l81J37m04j06j5P2j53j20p0n1j22Q5q9J23n2k2K83Qr5K23Q4j24
962e3J93j2O6l0o9qJ27j97j54J40k66J52k05j16N4j14k09L8m4n7j57K14L5j32
986h04J70j4K7l8J33r9K14J47ML7JJ46p1l8J72j74P8p8P2j73nJ12j56L6Q6J16
1012i9r4P2j46p6J22K1m4oJ66J3j49J28M0L0P1J29j77J95M5o6r5j03K25j13k7
1037F2K21n3k9k55J45pJ95r8J63k65K52m1j98J16o6J18n7Kj7J33L0j28L3o6J7
1062B07J34j90p2l8R0K4l3j76j5M1M7M9n1j13rK7J64j61J49j04Q2J58j81N6J80
$$ plain form
888 -667 -382 -320 83 106 236 416 526 560 688 823 884 898 965 900 739 702 743 453 573 371 220 111 187 294
912 294 12 118 38 -231 6 -39 42 204 167 111 251 435 662 656 772 812 976 1016 990 973 917 1106 987 981 931
937 931 665 756 736 355 492 88 -18 -33 39 -114 -234 -304 -355 -477 -392 -481 -358 -410 -432 -149 -141 -236 -13 71 -53
962 -53 140 128 194 164 95 87 214 17 -137 3 -263 -111 -316 -432 -378 -492 -701 -663 -707 -764 -921 -707 -672 -804
986 -804 -634 -648 -621 -659 -526 -625 -411 -264 -260 -223 -222 -76 -147 -185 -13 -187 -109 -187 -115 -288 -293 -181 -337 -301 -215 -99
1012 -99 -193 -121 -267 -343 -221 -200 -244 -250 -84 -71 -220 -92 -52 -22 49 178 1 196 241 175 80 -23 202 89 62
1037 62 283 230 201 -54 91 84 279 181 344 79 331 290 92 208 142 260 203 205 188 321 351 223 256 190 207
1062 207 341 151 79 41 131 155 122 -54 -69 -28 19 68 17 -96 -105 -78 86 -75 74 -30 52 210 29 85 265
1087B65J5j06Q2o4Q3j89k8R4J0r9Lj37Q6j72p9j01J44j44J35k4Q2k3j9K0K31J3
1113G8O1l8L08n2L2r9K47k02J10n0m9J8m1r4k8n3p4o3j27J34k28Q3k28P3O2j97
1139d17K3J39o9Q8j13K79j7j0r3L42l7RJ42k2O1O7N6j98K42j67j00p7j74J26l77
1164b97j2j44q9J18j84p2j11R1k09K01M3ko9J73Q9QQ0M8J11PK79N9k9L2qM5j03
1191E5M9j9p0m0j4j20k9j71m1m7l2lk25j0PJ41k02J84O3m3J86J59JJ77K45n4K21
1218C68J62Q2M3J92j10O1%jp8O3r6J2j28Pk02p6r2n2j53J38j49q3Q8r7O9J12L7
1245A17j7K34M2M7J69P5r7J36J16J94k2o9j9M5j30m0j28R7l25n6J28l46M4l7j62
1270dK0k41m0O9p2o3l0MJJ61j26L7J15Q5N1m8J15J28q7O8j00J64k2j05L0k27J9
$$ plain form
1087 265 280 174 256 192 275 86 58 152 162 63 66 -71 15 -157 -236 -337 -193 -337 -202 -226 -144 -167 -186 -166 65 78
1113 78 139 101 409 357 389 290 537 335 445 395 346 364 323 229 201 148 74 11 -116 18 -210 -127 -355 -282 -220 -417
1139 -417 -394 -255 -324 -236 -349 -70 -87 -97 -190 152 115 124 266 244 305 372 428 230 472 305 205 128 -46 80 -297
1164 -297 -309 -453 -542 -424 -608 -680 -791 -700 -909 -708 -665 -667 -736 -563 -474 -466 -386 -338 -227 -220 59 118 89 121 113 158 55
1191 55 104 85 15 -25 -39 -159 -188 -359 -400 -447 -479 -482 -707 -717 -710 -569 -771 -587 -524 -567 -381 -222 -221 -44 201 147 368
1218 368 530 612 655 847 737 798 798 797 719 782 686 698 570 577 375 299 207 155 2 140 -9 -92 -4 -101 -32 80 117
1245 117 100 334 376 423 592 667 570 706 822 1016 994 925 906 951 821 781 653 750 425 369 497 151 195 158 -4
1270 -4 16 -225 -265 -196 -268 -331 -361 -357 -356 -195 -321 -284 -169 -84 -33 -81 34 162 75 143 43 207 185 80 110 -117 -98
1297i8p1k33O4r4J97m13k24O6j07R0j73K9N3Q1j03PJ46L5j45L08J27rR8J01J45
1322a23p1J97j0roj6O9n8o3k05J70j66O5k0l00N4L5J19o9M2p6K37mL9J9n4%K31
1350B7L7J36j6J35J16j51R2J08J44k3on8J58k81N1j51M0M4r5J65k80J80p5J2o3
1375B46Kk3j21K2P6O5L2r1R8K0P0K8p2o1n9J33M9M9l7J2k4O0k43Q3l8o5J21r9
1403B33j36j8o5jO7k26K66k64M4q0L7N7m2L1n0Q1o4M5k10K34j94J24K1r3O2P1
1429g0r2J7K9L5J10o3j46K7JkP2k6orj54K58j45J04j18m8J73k47P2O9j32J16k1
1456a96j42K1J51k23K75k0r7K3J28P0j13K75k05R1L0j02J32j42K92J0k33K31l3
1479B23o6K2n8o8o5k84L02j06j4J17k9k23L4L1P0rn0j52K25k9P0L0m5j6Q9J64
$$ plain form
1297 -98 -169 -402 -338 -432 -235 -648 -872 -806 -913 -823 -996 -967 -914 -833 -936 -929 -783 -748 -893 -585 -458 -467 -369 -268 -123
1322 -123 -194 3 -7 -16 -22 -38 31 -27 -90 -295 -125 -291 -226 -246 -546 -492 -457 -338 -407 -365 -441 -204 -208 -169 -150 -204 -204 27
1350 27 64 200 184 319 435 284 376 484 628 605 599 541 699 418 469 318 358 402 307 472 192 372 297 309 246
1375 246 248 225 104 126 202 267 299 208 306 326 396 424 352 291 232 365 414 463 426 438 414 474 231 314 276 211 332 233
1403 233 97 79 14 13 80 -146 120 -144 -100 -180 -143 -86 -128 -97 -147 -66 -130 -85 -295 -61 -255 -131 -110 -203 -141 -70
1429 -70 -162 -145 -116 -81 29 -34 -180 -153 -152 -154 -82 -108 -114 -123 -277 -19 -164 -60 -178 -226 -53 -300 -228 -159 -291 -175 -196
1456 -196 -338 -317 -166 -389 -114 -134 -231 -208 -80 -10 -123 152 -53 38 68 -34 98 -44 248 258 25 256 223
1479 223 157 179 121 53 -12 -296 6 -100 -114 3 -26 -249 -215 -184 -114 -123 -173 -325 -100 -129 -59 -29 -74 -90 -1 163
1505A63q1K8N9K8j19O2P4j70OJ5oL6k69ML8J62k74j5J03j64J43j51OP0Q2j73J18
1532b25P0J07n4P0N6J1J54M7J07k00J87M6k74Q9Q9%n3P6j24M8j32r8J6K8j17L3
1558d3j31J78nL3q7l2Q7k5J07r9K47j08J91j93K20k3J47p9L0Q3k9K4n0j2j66J31
1584C96r4Lk49K91l22J90k41J74n3k50n0O5l7o8J94j49J45J33o5J12j63J51O7
1607A80k13J64oo8R6N2k5Q1J4r6k34J30p5j36j00q9q6K06o7j56j7R3j78Kn4J98
1633c84Jk8j56J71o3m3J66J73J6m2P0j40M7Q9J2J10j23j1M1k9M8q0M2j4o1j01
1659b89j80K37l2m9P4o4o8n0L27j84q9J44K71j94Q5J34M2J63j37P3QJ08K3M0j73
1684B20K34k27J60K7k53J16m9O6j83K6m4P6j39K17m3m6M0j17J69M2j2j42J43J21
$$ plain form
1505 163 82 110 169 197 78 140 214 44 50 65 59 95 -174 -170 -132 30 -244 -259 -156 -320 -177 -328 -322 -252 -170 -343 -225
1532 -225 -155 -48 -102 -32 24 35 189 236 343 143 330 376 102 191 280 280 227 303 179 227 95 -3 13 41 -76 -43
1558 -43 -174 4 -1 32 -55 -87 0 -25 82 -17 230 122 313 120 340 317 464 385 415 498 469 493 443 431 265 396
1584 396 302 305 56 347 25 215 -26 148 95 -155 -205 -140 -177 -245 -51 -200 -55 78 13 125 -38 113 180
1607 180 -33 131 125 57 153 205 180 261 275 179 -55 75 0 -136 -236 -325 -411 -205 -272 -428 -445 -352 -530 -528 -582 -384
1633 -384 -383 -411 -567 -396 -459 -502 -336 -163 -147 -189 -119 -259 -212 -123 -111 -1 -124 -135 -94 -123 -75 -155 -113 -127 -188 -289
1659 -289 -469 -232 -264 -313 -239 -303 -371 -421 -94 -278 -367 -223 48 -146 -61 73 115 278 141 214 222 330 353 393 220
1684 220 454 227 387 414 161 277 228 294 111 137 93 169 30 247 204 158 198 81 250 292 280 138 281 402
1708D02l5j40J05o7m4J89p1J33j00J3P3Kr2j52J58q6q7J19k65j0K90l45J45j01
1732C4o8j34R6M2j07J77j98O8l2k27K95N5l7r6q2K22j25m7P8K39k08M1j5K4j0
1757a5j34j08J62k49l4J37k66K74n3q5k3Ql2N7r9n3K58k8o4n7J63q5j1K9R5J56
1783e7M8n2k48J90K1o9Q4N8n8P0j27J32P4j17Q8r9J19k26K50k23O7j03J40o2q
1808a08KO4j44L3L41j37J49j49J39m7p9J68j2R6j0K8Q1j41l5J38j69O3j07K67
1832D31k18Q3k00o8J0R0j48R6k9j15P4j05M5J67j29O1MLJ18j7R1R7j66J09O4j47
1858B01M8m7Lj44K04o9O7j32j74P1Q9j04%j65J03j23k1j7J0j16J15m8l6L4pJ7
1884b41N9K9J43j95J35N3P1O2r1j97J26K2N1P1j47n0K6k6p9R2rj05L9Q2j44M0
$$ plain form
1708 402 367 227 332 265 221 410 339 472 372 385 458 460 368 216 374 288 201 320 55 45 335 -10 135 34
1732 34 -34 -168 -72 -30 -137 40 -158 -90 -122 -349 -54 1 -36 -132 -214 8 -117 -164 -86 153 -55 -14 -29 -5 -15
1757 -15 -149 -257 -95 -344 -378 -241 -507 -233 -286 -371 -394 -386 -418 -361 -460 -513 -255 -283 -347 -404 -241 -326 -337 -308 -213 -57
1783 -57 -9 -61 -309 -119 -98 -167 -83 -25 -83 -13 -140 -8 66 -51 37 -62 57 -169 81 -142 -75 -178 -38 -100 -108
1808 -108 -106 -42 -186 -153 188 51 200 51 190 143 64 232 220 316 306 334 415 274 239 377 208 271 164 431
1832 431 213 296 96 28 38 128 -20 76 47 -68 6 -99 -54 113 -16 45 49 52 170 153 244 341 175 284 348 201
1858 201 249 202 205 61 265 196 263 131 -43 28 117 13 13 -152 -49 -172 -193 -210 -200 -316 -201 -249 -285 -251 -258 -241
1884 -241 -182 -153 -10 -205 -70 -17 54 116 25 -172 -46 -24 27 98 -49 -99 -73 -99 -178 -86 -95 -200 -161 -79 -223 -183
1910a83o8J42j56k5K32k69K06L0O0J1R7L5k07J77r0k0jJ67j28q0O0Q2Nj87J51
1935D1K8j58J64L7j08R5j63k3K03j80J9q5N0K6nj1M2L0lo3J50N9j18n3J63N5p6
1962A16N2j16j6J51J2j75K25k11k6KM4j00J79J7l95J80m0j08J85m0pMl2J28q4
1987e5O8n7L8l3k6J29L7j25J21j55K03m8M1l7m6O4o7l7j0m3J94j65oQ1n5n2Q2
2014D1p2j23J56k9K7L1l1O3j54K25kkj23M6J3K62j89N6o6K1j28K72j83O2p4J18
2040B17m4j75J72J5j7j28J04k31K29p8j03J2N3p1%J49Rj54J90m1j74L4j08R2J18
2065G0q1k6j54L44l8r7m9Lj81P4q4K50j16K00q9k00Q1n0O8p7m6J04kj57P0KKQ
2093a71O0r8J07j41K12r4n1M2J9qo6J34j79J68K4K4q9J6O5o6M1n1k9%K9j5p8O2
$$ plain form
1910 -183 -251 -109 -265 -290 -58 -327 -121 -91 -31 -20 77 112 -95 82 -8 -28 -29 138 10 -70 -10 72 77 -110 41
1935 41 69 -89 75 112 4 99 -64 -87 116 -64 -45 -130 -80 -54 -59 -70 -28 2 -1 -64 86 145 27 -26 137 192 116
1962 116 168 52 36 187 199 24 249 38 12 14 58 -42 137 154 -241 -61 -101 -209 -24 -64 -71 -67 -99 29 -55
1987 -55 13 -44 -6 -39 -65 64 101 -24 97 -58 145 97 138 101 55 119 52 15 5 -38 156 -9 -15 66 11 -41 41
2014 41 -31 -154 2 -27 0 31 0 63 -91 134 132 130 7 53 66 328 139 195 129 150 22 294 111 173 99 217
2040 217 173 -2 170 185 168 40 144 -87 142 64 -39 -27 26 -45 -45 104 113 -41 149 108 -66 -32 -140 -48 70
2065 70 -11 -37 -191 153 115 18 -31 -28 -209 -135 -219 31 -85 115 26 -174 -93 -143 -75 -152 -198 -94 -96 -253 -183 -181 -179 -171
2093 -171 -111 -209 -102 -243 -31 -125 -176 -134 -115 -123 -189 -55 -234 -66 -42 -18 -107 -91 -26 -92 -51 -102 -131 -131 -102 -117 -195 -133
2121a33o9J93Qk5O8L9n3j06J92k35r7K16J07l3p3J64L2j23k3J18o4l5P1n7J6J51
2147B49J6j25K2n3J07Pq4K7r0j5L3KO8R7k48K87k29M8l9J9k6J23o3J18k46L3k1
2174A7K07k50R9j5Q7j7O9p7J04o8J3j55l7J05j64J37j52MR5k60J90N2j73J63j30
2199a56R5J7j19k5J2j39J52L7L5r2J28J28j11n9P1n9J31r9J1J28j31O3l6j21M7
2224i2J5O1L4r9Jk6Mo4k31K06P5lk02K07P4j68P6J14j9O1m7P5j02K4L0J66j75
2251ep2J79j02J45j03j1N4m3j3j31J5J99k31J20J07j71l7K52l30J09n5J02k6K3
2275b5Mj00J51k5l0J12N8j34K04n5K5p7J00J00n6j83J07M2m0mj58J00r6n2m7N2
2301b7m0K0k08L00j94J54n9K4j09K60q1q3K9J73j49Q5j56K25J5j25J17p2J11j57
$$ plain form
2121 -133 -202 -9 -1 -26 42 81 28 -78 114 -121 -218 -2 105 72 -1 163 195 72 49 167 103 68 139 82 98 249
2147 249 265 140 162 109 216 223 139 166 76 61 94 96 164 261 13 300 71 119 80 99 73 196 133 251 5 38 17
2174 17 224 -26 73 58 145 128 197 120 224 156 169 14 -23 82 -82 55 -97 -93 2 -258 -68 -16 -189 -26 -156
2199 -156 -61 -44 -163 -188 -176 -315 -163 -126 -91 -183 -55 73 -38 -97 -26 -85 46 -53 -42 86 -45 18 -18 -139 -92
2224 -92 -77 -16 18 -81 -80 -106 -102 -166 -397 -191 -116 -119 -321 -114 -40 -208 -132 -18 -37 24 -23 52 -50 -26 4 170 -5
2251 -5 -77 102 0 145 42 31 85 42 29 -102 -87 112 -119 1 108 -63 -100 152 -178 -69 -124 -22 -48 -25
2275 -25 -21 -121 30 5 -25 87 145 11 215 160 185 108 208 308 252 69 176 218 178 174 16 116 20 -32 -79 -27
2301 -27 -67 -47 -255 45 -149 5 -54 -30 -139 121 40 -43 -14 159 10 95 -61 164 179 54 171 99 210 53
2325E3M5j15j5J16j00P6J1j49pQJ9j46J91o1N7j8OM2j49J41j49L9J4J73q5j15
2351a18J7J11P2n5K0l0Q7k22Q2m8P5q9J93j68q3J93k49K36j71M0p2N3J97k34K70
2376A07j19J78j59k1O7J1J8P7j45k3mO1o0P1R8m5J3r4L8r1M5k60K14k0p9NJ38
2403B1j34P4L2O4p8o3k7n1r1L14n1j1l8J12m1nk0j87Q6Q2n7L0m9J37o1J83k38
2430f7j2J37j46R5j10r9N4K22o2j9J53k65p4K70J0K8j48R7l0j3P4j49J01J4l9
2455B2N2l6qn0M6R3j87K1Q5j3l4M7o7P9L7j12O8O7L7k23J74J10Kl7j55m3K69k04
2483D0KL2l7J42j72m4O4L3J31l78J08lJ36r9J9M4oLj29K18q8N1K6k8j22Q4l5R0
2511H2jk1j14P7p7M2J18j77J29k70P8K09j75J09k36J98n4J34j06j99J63m5q1R1
$$ plain form
2325 53 98 -17 -32 84 -16 60 71 -78 -85 -77 -58 -204 -13 -74 -17 -35 -29 13 -136 5 -144 -105 -91 82 -3 -118
2351 -118 -101 10 82 27 47 17 104 -118 -36 -84 -9 -98 95 -73 -156 37 -212 24 -147 -107 -179 -126 71 -163 107
2376 107 -12 166 7 -14 53 64 82 159 14 -9 -13 48 -12 59 157 112 125 31 69 -22 23 -237 -23 -43 -122 -117 21
2403 21 -113 -39 -7 57 -21 -84 -111 -162 -253 61 10 -1 -39 73 32 27 7 -180 -94 -12 -69 -39 -88 49 -12 171 -67
2430 -67 -79 58 -88 7 -103 -202 -148 74 12 -7 146 -119 -193 77 87 115 -33 64 34 21 95 -54 47 61 22
2455 22 74 38 30 -20 26 119 -68 -47 38 25 -9 38 -29 50 87 -25 43 110 147 -76 98 208 210 173 18 -25 244 40
2483 40 42 74 37 179 7 -37 27 60 191 -187 -79 -82 54 -45 -26 18 12 15 -114 104 16 67 93 65 -57 27 -8 82
2511 82 81 60 -54 23 -54 -12 106 -71 58 -212 -134 75 -100 9 -227 -29 -83 51 -55 -254 -91 -136 -217 -126
2535a26L2L4J75j96M1R8J58k46Q1k5Kj4q1KR5R6j77Pl9J9l1J11j11j1n9J65r5
2562i5K6o0J80j12Nk0J63j94J30r2J96r8R6n0L3O6q8R6j37Q8j32n5J63r9j23P6
2588c7J3Q4J9k9l7R7j49j6P2m5J07j36j14R8R6J99k84k1J20J57k20K10l8Q3j52
2613G7Q4l9l9Pp2J27p6j51jL2p5L9Mj05J98m7L8j3j7N5j73O9K10k6K8M0q8P0j25
2642C1j0J6J36o7L6j32N5p3k5M6j07Q2j07j17J74j40J68j37J09k1Nk1J17l1J0
2667cj2l8m2J77j16MJ02k5l2o8J11q8K7n7K0R7n5l1r1K57l8j88J52k20J20R5j68
2694a10l4J41j0P0p1Pj04l8J78r7J06Q4j27l3K7L3j86K8J10J3J98o8n0j27J66
2719A06j35P5n4N6j21O8J40j53k6m5J78k05l6J48P5k29J91j35O8R3K6p2L5K0k5
$$ plain form
2535 -126 -94 -60 115 -81 -40 58 216 -30 51 26 28 14 -67 -65 30 126 -51 -44 -83 -64 -95 16 -95 -106 -165 0 -95
2562 -95 -69 -129 51 -61 -56 -76 87 -107 23 -69 127 29 125 75 108 174 86 182 45 133 1 -54 109 10 -113 -37
2588 -37 -24 60 79 50 13 110 -39 -55 17 -28 79 -57 -171 -73 23 222 -62 -83 37 194 -26 184 146 229 77
2613 77 161 122 83 90 18 145 69 -82 -83 -51 -126 -87 -83 -188 10 -37 1 -12 -29 26 -147 -78 132 106 134 174 86 156 31
2642 31 21 37 173 106 142 10 65 -8 -33 13 -94 -12 -119 -236 -62 -202 -34 -171 -62 -83 -78 -99 18 -13 -3
2667 -3 -15 -53 -95 82 -34 -30 72 47 15 -53 58 -30 -3 -60 -40 57 2 -29 -120 137 99 -89 63 -157 -37 58 -110
2694 -110 -144 -3 -13 57 -14 -7 -111 -149 29 -68 38 122 -5 -38 -11 22 -164 -136 -26 -13 185 117 67 -60 106
2719 106 -29 46 -8 48 -73 -5 135 -18 -44 -89 89 -116 -152 -4 71 -158 33 -102 -34 59 85 13 48 68 43
2744D3j55J32RP8k5J45k50J2L0N3k71K60n0p0K02j18l6j82K29J7Q1p6N1%j35K8
2770Bqj11J26k3J17K4m2o6o2p9J85M4j49J10k6p0J74j31j43R3P0PN3p7j4MJ15
2797A23j4p5o9N7j32K01l3k4n4O8J40k24L12l26N5J22j50mO7K1Qm8j58J21P0J07
2823A61j74O6M0p5j63J13Mj18J17m3Q2J2n1k9J29r8j70K48No7p7q2K52j07j66
2848a91K04j36R3k4J5N0l0j25k5J07Q6N0j32J1l7P1K1j56J42l8L9P9l8P4j09j15
2874a14K93j30j54O6q0O9J0K8M7k33L7R1N8r0K4j05J66k1j64J43P8p2LN0R3K11
2900C04j04j56J81j38l5m5P0m6Q7O0j91K34j70j62O4J36j44L9K5K2k6M8R3p6o1
2925Ij50J55l9p3J96j37M8R5J6n2J55j14n2K3J3oq9r3p2K59j44L4M8n9j02L6p3
$$ plain form
2744 43 -112 20 29 107 82 227 -23 -11 19 72 -199 61 11 -59 143 25 -11 -193 36 53 134 58 109 109 -26 2
2770 2 -6 -117 9 -14 103 127 85 19 -43 -122 63 107 -42 68 42 -28 146 15 -128 -35 35 42 95 18 4 8 123
2797 123 109 34 -35 22 -110 91 58 34 -20 48 188 -36 276 -50 5 127 -23 -27 40 61 69 21 -137 -16 54 161
2823 161 -13 53 93 18 -145 -32 -28 -146 -29 -72 10 22 -29 -58 71 -27 -197 51 56 -11 -88 -170 82 -25 -191
2848 -191 13 -123 -30 -54 -39 11 -19 -144 -169 -62 24 74 -58 -47 -84 -13 8 -148 -6 -44 -5 74 36 110 1 -114
2874 -114 179 49 -105 -39 -119 -50 -40 -12 35 -198 -161 -70 -12 -102 -78 -183 -17 -38 -202 -59 19 -53 -50 0 93 304
2900 304 200 44 225 87 52 7 77 31 118 178 -13 221 51 -111 -47 89 -55 -16 9 31 5 53 146 70 9
2925 9 -141 14 -25 -98 98 -39 9 104 120 68 223 109 57 80 93 87 -2 -95 -167 92 -52 -18 30 -29 -131 -95 -168
2952a68K38j68J19j61J68j3k51L32k91J76J95j77O6j17O1j64J28J01N7l5oj13
2974b3L4J20jk69J32n8P4J1o3j0j13K2J3k1j9J65j23k5J54m7j04M9J78j66Q4Q8
3000H2j20J3J51j96LJ43j34J62q8j11J37j67J95r0J2nj82J72j31J1j08K23j05
3023a33l6Q2j2N7L9k8o4K59k3k78K51j37P0j6N7k34K44j3o3r6RJ92n6j62K17r4
3049C2j61J01j49O5J65j4N4j66J39j11J13n3j43K84j68J13pJ4k4r9J97j19oq5
3073b8K10k20J08j23J31l8N4j12L5j48K2mJ64j56M7j77K46k4P1J78k37R6j93K02
3097A04%n1o7l7M2M5n2K9K35j45j10j27J54q3J97j87k1J91j34K2O4k02P3j0J27
3122E7j5p4J10p9J31k91J17P6l4q2K1J63j19OK14j96L1J31j04r8l2O8j22J49o3
$$ plain form
2952 -168 70 -98 21 -140 28 15 -236 96 -195 -19 176 -1 65 -52 9 -155 -27 74 131 96 90 -23
2974 -23 11 131 130 -139 -7 -65 9 20 -43 -53 -166 -144 -131 -152 -171 -6 -129 -154 0 -47 -151 -102 76 -90 -6 82
3000 82 -38 -25 126 -70 -67 76 -58 104 16 -95 42 -125 70 -20 -8 -13 -195 -23 -154 -143 -251 -28 -133
3023 -133 -169 -87 -99 -42 -3 -31 -95 164 141 -137 114 -23 47 31 88 -146 98 85 22 -74 -65 127 71 -91 126 32
3049 32 -129 -28 -177 -112 53 39 93 -73 66 -45 68 15 -128 156 -12 101 94 108 84 -15 182 63 57 -28
3073 -28 182 -38 70 -53 78 40 94 -18 17 -131 -109 -113 51 -105 -58 -235 11 -13 58 236 -1 95 -98 104
3097 104 104 53 -14 -51 -9 36 -16 13 248 103 -7 -134 20 -63 134 -53 -74 117 -17 5 69 -133 -60 -70 57
3122 57 42 -32 78 -1 130 -161 -44 32 -2 -84 -63 100 -19 -13 201 5 36 167 63 -35 -67 1 -121 28 -35
3147c5N0N5j06l0lJ0J18k63K45Nl1Q7K2j43K36k00p0J04m2j0K12k45O9o7J47o5
3173E0nl9J5j68J6O0m2Q8j06J54m4L3o4j10J14J49p9O9k3j4J08l0j35O2pl1p5
3200e4Op2j58J68M4J46j64L0OL5j8QP1j30O4Oq4J46r9n0J62j6j43n8K87J2k60
3227a15R8J06J39q4j47J3J17j54K9M4j01PJ15rN8k75J57o0Q6J13j7k20J71j01
3251c0K03n0j2j20L3R8N5j62Q7L8j44M8J29j78J6n4J63P1j45N4j77J71J13k93
3275h6J5J20o0n3L0M0n2J28j85J20Rn4q7J82J55j19J8l6k16J28K06j63OP0o5Q1
3301A32k69R6J1J33j78N5p0M0j62o3K38L2j49R9o5l1J01L7N0q6J51n4j12P7m1
3326b8Q6O7j68kOl0J20n3k4n4J2j01J65No6j20M7R1p4n2l2J44J07N9m9p0p7R2
$$ plain form
3147 -35 15 70 -36 -66 -69 -59 59 -204 41 46 15 102 124 -19 217 17 -53 51 9 -1 211 -34 35 -32 115 50
3173 50 45 6 21 -147 -131 -71 -113 -25 -131 23 -21 12 -52 -162 -48 101 22 91 68 54 162 132 -3 59 52 21 -54
3200 -54 -48 -120 -278 -110 -66 80 -84 -54 -48 -13 -31 -23 48 -82 -18 -12 -96 50 -49 -99 63 47 -96 -154 133 145 -115
3227 -115 -17 89 228 144 -3 10 127 -27 2 46 -55 -48 67 58 116 -159 -2 -62 24 137 120 -100 71 -30
3251 -30 173 123 111 -9 24 122 177 15 102 140 -4 44 173 -5 11 -43 120 191 46 100 -77 94 207 -86
3275 -86 -71 49 -11 -64 -34 6 -46 82 -103 17 26 -28 -115 67 222 103 121 85 -131 -3 203 40 46 116 51 132
3301 132 -137 -41 -30 103 -75 -20 -90 -50 -212 -275 -37 -5 -154 -55 -120 -151 -50 -13 37 -49 102 48 -64 13 -28
3326 -28 58 125 -43 -45 -39 -69 51 -2 -26 -80 -68 -169 -4 1 -65 -185 -138 -47 -121 -173 -205 -61 46 105 56 -14 -91 1
3354An7J63k2k8qklJ24K3r2J1j39R6J8j8p9J4j20J32o6N0n7jj52J35J62j42J89
3382A32q1r9J47p1o0J08P7j31J59r4J28m9k8j93P0R8l8M1j07j39L19j23j97P4
3406e7l2R2JMNnp3R6j45l1J35r6J41n1R7k0O4q4M0j22K50k66K8R5n5Jr6J52j57
3435h9J24j01q3J80p0Kj29M1k0L1R7J9j50MJ38o1J13l5p2R9L7Pj10J4KQ7o5M0
3463E0N1j51L2o4J3N8r1OJ16n6q3J33k22J41J85j78K8P4o5n2L4J22j17N3K19k62
3489b6M3J55j40j35K18P6j8j79K10k35kp1K96j42j51J19p0J42j88k5J28Kl7l6
3513f6N6q7J92j33J34j89M9J1J31J2n8jL6mM2k82R7K45j15j51J6R8Ql1o1kO4l7
3541b6m6J2J08R2j73M0l4j09J15q1O3KR4l7n0P1p7p8K07q8j37J60j45J34K2n4
$$ plain form
3354 1 -56 107 85 57 49 47 44 168 191 99 110 -29 67 85 67 -12 2 -118 14 -52 -2 -59 -60 -212 -77 85 -57 132
3382 132 51 -48 99 28 -32 76 153 22 181 87 215 166 138 -55 15 113 75 116 9 -130 189 66 -131 -57
3406 -57 -89 3 4 8 13 8 -65 31 -114 -145 -10 -106 35 -16 81 61 125 41 81 -41 209 -57 -29 66 11 12 -84 68 -89
3435 -89 35 -66 -149 31 -39 -37 -166 -125 -145 -114 -17 2 -148 -144 -6 -67 46 11 -61 38 75 82 -28 -14 -12 75 10 50
3463 50 101 -50 -18 -82 -69 -11 -102 -96 20 -36 -119 14 -208 -67 118 -60 -32 42 -23 -75 -41 81 -36 17 236 -26
3489 -26 17 172 32 -103 115 191 173 -6 204 -31 -33 -104 192 50 -101 18 -52 90 -98 -123 5 7 -30 -66
3513 -66 -10 -97 95 -38 96 -93 -44 -33 98 110 52 51 87 83 125 -157 -60 185 70 -81 -65 33 41 10 -51 -53 11 -26
3541 -26 -72 -60 48 140 -33 7 -27 -136 -21 -102 -39 -37 57 20 -30 41 -36 -114 93 5 -132 28 -117 17 39 -15
3567a5r7J40j21J30q8J30q4n6m3J91j75R2K9J84k36J83q4J8M1q6N3q6R6q3Ok5
3593A4J53j79Nl7J05j28K48j84n9n1J08o7J60j79J4k3J84N8k31Q0J7m3P8n2K30
3618B21k12J8j07Q1q0R7j6L7p4oj25K85j73j91J09K0OO8j8L7M2j19o7R4Ok4jK78
3646A86k32J90j03R6j00l5J06O1r1j76J30jo8J68j85J0j49J10Q7q7Q7k08J73Q6
3670E5k26J70m3j34J25L3J70j20J9QJ43j17j93J43L5j7m8O2O8Lk03J61j42J63
3694A15j38J34Nk12J24p9k7O5L7pj07J4J38l8J3k4l3Q8lm1J47j95R6J03p0j22
3720a7J10l1RL1J16j70o1J4K02k14J7r5j33J61j40k9J78J35p0p7Q1K73l48K7J20
3745H9k9Jm6J27j81m4J83q0J38j02j81K73j65N2q0P0Rj38J54k19Q5p8q3K26o0
$$ plain form
3567 -15 -112 28 -93 37 -51 79 -5 -61 -104 87 -88 4 33 217 -19 164 80 98 139 53 106 20 116 33 39 14
3593 14 167 -12 -7 -44 61 -67 181 -3 -62 -113 -5 -72 88 -91 -77 -100 84 142 -89 -9 8 -35 43 -9 221
3618 221 9 27 -80 1 -79 18 2 39 -35 -41 -166 119 -54 -245 -136 -116 -110 -42 -60 -23 19 -100 -167 -73 -67 -91 -92 186
3646 186 -46 144 41 137 37 2 108 169 78 -98 32 31 -37 131 -54 -44 -193 -83 4 -83 4 -204 -31 55
3670 55 -171 -1 -44 -178 -53 -20 150 30 49 57 200 83 -110 33 68 51 3 65 133 136 -67 94 -48 115
3694 115 -23 111 116 -96 28 -51 -78 -13 24 17 -90 -76 62 24 37 13 -20 68 65 24 171 -24 72 175 105 -17
3720 -17 93 62 71 102 218 48 -13 1 203 -11 6 -89 -222 -61 -201 -230 -52 83 13 -64 17 290 -58 -31 89
3745 89 60 61 15 142 -39 -83 100 20 158 56 -125 148 -17 35 -45 25 34 -104 50 -169 -84 -162 -245 -19 -79
3770g9m1J09n1K5J01J17k43R6J82j11j1j25J81j01K1m9Q4Mr9l5m0K75j52n2j55
3795a49J46n1p9K7J38j35N8k5o3J66J09r7J0p7P5j18%J05l0LM9j33N1J39JM4k30
3822f6R9k4m0r3J38K5q5J16o8p6m0J19j62J92p6K4O7L2Kn9j62J21J45q2r3J77
3848A31o9o7P3NJr3n8L4nn2J98r5q2o3J58jo0J4N1j4J07j83J12j33J20j7M6L0
3876H8l4k15K15pR0j67R4J7lj31j4l9K65j1j72m4J73k11k3J38o8J29k06J17j3
3901c2j77J49N0j7J27Rk3j02pO7m3K06k29J21j34M1kN8N7j63M2l7N2P5l1j92L5
3928a00J26r4n3J52n1J50o8q2J96j76o4N9Q7k4q2k7N6m9J29j25R3j67J51Q1r9
3953A9m6o1J96j46k6P2n8jN4j1L4O3j37j4N9l2J24p0q0Q6N6k34N9L3O1r1k8L7
$$ plain form
3770 -79 -120 -11 -62 -37 64 181 -62 34 216 105 94 -31 150 49 70 21 105 109 10 -25 -65 210 58 6 -149
3795 -149 -3 -54 -133 -106 32 -103 -45 -70 -133 33 142 45 55 -22 53 -65 -65 40 10 13 62 -71 -20 119 120 164 -66
3822 -66 33 9 -31 -124 14 39 -46 70 2 -74 -114 5 -157 35 -41 -17 50 82 84 25 -137 -16 129 47 -46 131
3848 131 62 -5 68 73 74 -19 -77 -43 -48 -100 98 3 -79 -142 16 15 -45 -31 20 6 113 -70 42 -91 29 12 58 88
3876 88 54 -161 54 47 137 -30 64 81 78 -53 -67 -106 159 148 -24 -68 105 -106 -129 9 -59 70 -136 -19 -32
3901 -32 -209 -60 -10 -27 100 109 86 -16 -23 44 1 207 -22 99 -35 6 4 62 119 -44 -2 -39 13 88 57 -135 -100
3928 -100 26 -68 -121 31 -20 130 62 -20 176 0 -64 -5 82 58 -24 -51 5 -44 85 -40 53 -114 37 118 19
3953 19 -27 -88 108 -38 -64 8 -50 -51 3 -8 26 89 -48 -62 -3 -35 89 19 -61 25 81 -153 -94 -61 0 -91 -119 -82
3981h2K20j63k4p6N8Jn1J63j89J97o1p2R7O7l4j46K44n6j51P8P1ol4K6N1p5l7
4008A6J32k30J64m2J1j01m6R3n2k7p4K28j71O8J98k83K29j07p3n7K41m1j60J86
4032A02j36q2K16j98p0J62J52j29O1L8p5K0O1j24N2o7L5L3o0o2Mq8J25J8q2J72
4058G8k41J05j20J93r6O1n0J00J78q3j10p0J83j18P7k24J56J0ko4P1oj57J38O9
4083G8n9j0K0j19J13k3m0K7j10o3K56rq0j08J64N4q4o9J34k13K03k4p8L1o7P4
4109bP1j78J87J29k26rk7J68k86k0M7p2N6M5K32k75MQk3K25M0r1L5J8L6j7q2J96
4137A89r0o0j26Q9O4M9j76K4J82K1j27j91L3rJ5J43p1L0J28j13o7N1k5L2l9K0
4163b4K6L1L7q6n9J35J25j65M7q5qJ22k6qp2J76j37m2J9p3J4K53k15J4l3J9K5
$$ plain form
3981 -82 138 -25 -49 -125 -67 -66 -117 46 -143 54 -7 -79 18 85 51 -95 149 93 -58 20 91 85 51 77 128 53 16
4008 16 148 -82 82 40 51 -50 -96 -3 -55 -82 -156 72 -99 -31 167 -116 113 6 -67 -124 117 76 -84 102
4032 102 -34 -116 100 -98 -168 -6 146 17 78 116 41 61 122 -2 50 -17 18 51 -9 -71 -67 -155 -30 -12 -94 78
4058 78 -163 -58 -178 15 -81 -20 -70 30 208 125 15 -55 128 10 87 -137 19 29 27 -37 34 28 -129 9 78
4083 78 19 9 29 -90 23 0 -40 -13 -123 -186 70 61 -19 -127 37 91 7 -62 72 -141 62 38 -40 -9 -76 -2
4109 -2 69 -109 78 207 -19 -28 -55 113 -173 -193 -146 -218 -162 -117 115 -160 -156 -148 -171 54 94 3 38 56 92 75 -7 189
4137 189 99 39 -87 2 66 115 -61 -37 145 166 39 -152 -119 -128 -113 30 -41 -11 117 4 -63 -12 -37 -5 -44 -24
4163 -24 2 33 70 -16 -75 60 185 20 67 -18 -26 96 70 62 -10 166 29 -13 6 -67 -53 200 -15 -1 -34 -15 10
4190A0l3k8p8J24NOm6J23j00kL1j08J02j0N9p3O0Q3r3j71K47o2P3k02J02r7J67
4217H9j33J33n9JO0q2R7j41Q9l9J12k68J51L0j15n1K03l6j59J04p6MK25k34R4
4242ak3o4J43J02%r7n2l7r1Q3P4j33K8KJJ7J06j05K1J75j70qj7k4j2J17P4j16
4270gP2j13OJ14k7Jj36N4J00m4j13L30k86q1J54N0k45K10j35M8L8j24N4J75p7
4295A8p3J66m9j13M3O3q7K6N6P9j73R6k3q8n2R6q0J53L3j71%J9J24j20J11l8p3
4322e7N5n7R0LM4RJ44k08j5OPn6P6L7j32nK29j00j57j9J92o2k8K1L8j76N5op1
4351a43M9Q3L9M5R7j09j4m9n9J23q6m2J47l6L4o5MQ6p0n0j2J3N1j6pl5O9Moj12
4381f7K9J66j47R4o9j45K01r3P2p3K0j2OK23l6j64l0J47kj23J70j05O3k14K4p3
$$ plain form
4190 10 -23 -51 -129 -5 0 6 -40 83 -17 -19 12 -96 6 -4 55 -18 42 125 32 -139 108 46 119 -83 19 -78 89
4217 89 -44 89 30 31 91 9 106 -35 54 15 127 -141 10 40 -75 -126 77 41 -118 -14 -90 -86 139 -95 -1
4242 -1 -24 -88 55 157 157 60 8 -29 -120 -37 37 -96 -68 -66 -65 -48 58 -47 -26 149 -21 -29 -46 -70 -82 35 109 -7
4270 -7 65 -48 -42 72 45 46 -90 -36 64 20 -93 237 -49 -130 24 74 -171 39 -96 -48 -10 -134 -80 95 18
4295 18 -55 111 62 -51 -8 55 -32 -6 50 129 -44 52 29 -59 -111 -15 -95 58 91 -80 -80 -61 63 -57 54 16 -57
4322 -57 -2 -59 31 34 78 87 231 23 8 14 21 -35 41 78 -54 -59 170 70 -87 -106 86 24 -4 17 55 -121 -66 -72 -143
4351 -143 -94 -11 28 73 170 61 47 -2 -61 62 -24 -66 81 45 79 14 18 104 34 -16 -28 -15 36 20 13 -22 47 51 45 -67
4381 -67 -38 128 -19 75 6 -139 62 -31 41 -32 -12 -24 -18 205 169 5 -25 122 120 -3 167 62 125 -89 -65 -138
4407a38m5K35j33R8j42P9j2P7J7p7J56k57K03q0k0oj07R7j31R7J10m3P4q5J4o0
4433g9K04o6l6P7l3n5Rl8j07J62j67oJ84l4m5J01j54k9k4J50j7k8R3j30NR6m0
4460gJ7L6j22P8K6p0Q3oN9p3n9L7Q6k09J30o0O7ro4J85j00j01JR3L3J4j04J21
4488H2q4N4j87J72M2j64J41l2J8m4N8j62K26j29Q0j09m7Q4RJ51j71L9L7qO7j99
4514g6J11k12K04J2N0Oj0QK3j53O9m5l4J05R4j53NJ85k59K36j40N1lj64j0M6j46
4541b00Q6k0J82L7j32j1K6qM7m9j9LJ8K19j57r2j00L01k91J52J31j08l9j7pK37
4567A89j96N1m0o3k7R4J23j80J1j04J56j01K5J21K4j56K1LK0P1j28P9LrJ06j77
4593h4J44nj32J04j24Q2oK7j24J83%n1RJ15j45J0l7O5m9k7P1J9O8Pm0L7M9k32
$$ plain form
4407 -138 -183 52 -81 17 -125 -46 -58 19 36 -41 115 -142 61 -19 -39 -45 -152 -55 -186 -89 21 -22 52 -33 -19 -79
4433 -79 125 59 23 100 67 12 21 -17 -124 38 -129 -135 49 15 -30 71 -83 -112 -136 14 -3 -31 62 -68 -63 33 -7
4460 -7 10 46 -76 2 28 -42 41 35 94 21 -38 -1 85 -124 6 -54 13 4 -60 125 25 -76 -75 18 51 65 -39 82
4488 82 -2 52 -135 37 79 -85 56 24 42 -2 56 -106 120 -9 71 -38 -85 -1 8 159 -12 27 64 56 123 -76
4514 -76 35 -177 27 39 89 95 85 93 116 -37 32 -13 -47 58 152 -1 4 189 -70 166 26 77 74 -90 -100 -54 -200
4541 -200 -114 -134 48 85 -47 -58 -32 -40 7 -42 -61 -58 -40 179 22 -70 -170 131 -160 -8 123 15 -24 -41 -48 189
4567 189 -7 44 4 -59 -86 8 131 -49 -38 -142 14 -87 -62 59 83 -73 -52 -49 -29 42 -86 -7 -4 -13 93 -84
4593 -84 60 55 -77 27 -97 -15 -21 6 -118 65 65 14 23 138 -7 3 -34 31 -18 -45 26 45 113 120 80 117 166 -66
4621f6J47j05l1N7K6j61J10J6J48j53M0m4rO8q3K49k83J53r2m3J92r1n4m2J99
4646A48j54l1Q1j27P6l7J71o3j03J37ml4j02K6M4j89J01K04Pk81j5k9LJ21J8k4
4672e6J42j66L0J08j21J35j50J27j36o1K53j32Q5j8K7J59k63o8M0J34M4n3j63
4695a03LK34q0o9Q7o7O3p5J13k63J76j32j25K90J81j92j35J57j74l6K6N2m3R6
4719a6J62k52L1M3J77Pk12l3M7L1o1J38m6k5k8j50K25r1J18r9kl4J66nj99J59
4745E1qo0k8Q0j11J4O7P0N9k92J48O1o0o8n0K86n3r6p0K14j97J6K5n8n4K16q7
4772A5l7O6j21L2J85k19R5n0J22p5r7J35J15r9m6j9L5j53J98r7R5j30M0k9J14
4797G5J2k92K51k29P3J08Ko5O1j06J12j06K38j56m7J06n6J26o5K2N4r1j32J03
$$ plain form
4621 -66 81 -24 -55 2 28 -133 -23 -7 141 -12 28 -16 -25 43 -40 209 -74 79 -13 -56 136 45 -9 -51 148
4646 148 -6 -37 44 -83 -7 -44 127 64 -39 98 94 60 -42 -16 28 -161 -60 144 151 -130 -145 -174 -171 -50 -32 -56
4672 -56 86 -80 -50 58 -63 72 -78 49 -87 -148 105 -27 58 40 67 226 -37 -105 -65 69 113 60 -103
4695 -103 -100 134 54 -15 72 5 68 -7 106 -157 19 -113 -238 52 233 41 -94 63 -111 -147 -121 -69 -112 -16
4719 -16 146 -106 -75 -32 145 152 -60 -93 -46 -15 -76 62 16 -9 -37 -187 38 -53 65 -34 -36 -70 96 91 -108 51
4745 51 43 -17 -45 35 -76 -62 5 75 134 -158 -10 51 -9 -77 -127 159 106 10 -60 154 -43 -27 -2 -60 -114 102 15
4772 15 -22 44 -77 -45 140 -79 16 -34 88 13 -84 51 166 67 21 2 37 -116 82 -15 80 -50 -10 -39 75
4797 75 87 -205 46 -183 -110 -2 0 -65 -4 -110 2 -104 134 -22 -69 37 -19 107 42 64 118 27 -105 -2
4821bJ37j44J9J41m9k1r5j0R7j22J11j70J20j14P5K1j0j95K36N4k03M9J10n0L7
4846B2j16p0J33m7P8J14j37j5J24J1k24J53J22k49J78j54N5J66q6j27M2J6j13
4869a24J31k1O4J34j99K7qk8l2J8n1O4O1k4j24J39j78J4K6Q5nJ38O2k12L3JK0
4896A1j3J22j23J4j27J65l4j0N3m8N9L3j73J44p5J3m9M7j64J07Q9J00K1k23J4
4921d7j6j7J38j4o7J00K6j06K5P8L8q3q0Oj4p7J71o2L0j80J05J5J08Ln5J01j78
4948e2Q6N0N3O9k36K09j07%l9M8Q3j51O8q1L0l5o1J18r0P2p8Q2L2j41k2O0M4o1
4976e0J29j68J26j04m0K29j16p6R7M1pm6r1R9q1J02l8J41j30o5J64n8j17J72p7
5001C6l0K0k08J78l1q0J50L4j04L6o6K29j05n9J12j84J65q7j52J95p4p3K9N6m2
$$ plain form
4821 -2 135 -9 10 151 102 81 -14 -24 73 -49 62 -108 12 -102 -27 -6 -16 -211 25 79 -124 -75 35 -15 22
4846 22 -94 -164 -31 -78 0 114 -23 -38 86 97 -127 26 148 -101 77 -77 -22 144 58 -69 -27 -11 -124
4869 -124 7 -14 50 184 -15 12 4 -24 -56 -38 -89 -25 36 12 -112 27 -151 -137 -111 -26 -31 107 169 -43 -10 -9 11
4896 11 -2 120 -3 11 -116 49 15 5 58 10 69 102 -71 73 -2 11 -38 9 -155 -48 41 141 162 -61 -47
4921 -47 -63 -80 58 44 -23 77 103 -3 22 100 138 55 -25 -19 -33 -110 61 -1 29 -151 -46 -31 77 80 25 126 -52
4948 -52 34 84 137 206 -30 179 72 72 33 81 164 13 81 0 30 -5 -66 52 -38 34 -44 38 70 -71 -93 -33 11 -50
4976 -50 79 -89 37 -67 -107 122 6 -70 27 68 61 15 -76 23 -58 44 6 147 17 -48 116 58 -59 113 36
5001 36 6 26 -182 -4 -35 -115 35 69 -35 1 -65 164 59 0 112 -72 93 6 -146 49 -25 -98 -69 -13 -55
5026e5O9j3K3O5j88J18nR9K7r7mo6L0J0kjl2R8k45J50Oq1K8m2J34n3m2K0Q4j05
5056g0K5m4J00j45J80J70l9j37O2j85K07j77J47N6j55lJ53m4k04L3p9L1O0Q1q5
5081f2K18j25q6N0j7R1r0J70j71l3l6J32j63L19l02o8K01MM5o1L2J1j78J4J0K68
5107A73j23j43O0k9Q0lj8O0j09M6j4K5o2R6O7k33j6J99p1R5m0j09l8M4R3q3J2
5134d1k1Q2L2j51K77j02N1j23L9l7q1R5k07K35k37K98l7m3j18N3L5L6J91m7r4
5159H5j40K31k32q3K67j66R5j51J82j7N8j01N7j16q8P2N9k3J09M8q0r0N5J92o6
5184A57j68m7J46j06j35J45O0r0O1J18j67J06L9o2j32K11k45J92q5k2J01N6k20
5207h7J92j05m2K12j03M2j77o2J69p2P7J26k20j5J57j51JJ04k01Q0J50r5q1m1
$$ plain form
5026 -55 14 1 24 89 -99 19 14 113 140 43 39 -27 3 13 11 10 -22 76 -169 -19 -13 -94 -66 -108 26 -27 -69 -49 35 -70
5056 -70 -45 -89 11 -134 46 216 177 40 102 -83 124 -53 94 150 -5 -8 145 101 -103 -70 -149 -118 -58 23 -62
5081 -62 156 31 -55 -5 -22 69 -21 149 -22 -55 -91 41 -122 197 -105 -173 28 32 77 16 48 59 -119 -105 -95 173
5107 173 50 -93 -33 -62 18 15 -3 57 -52 -6 -20 5 -57 39 106 -127 -143 56 -15 80 40 -69 -107 -63 30 -53 -41
5134 -41 -62 20 52 -99 178 76 127 4 43 6 -75 20 -187 48 -189 109 72 29 -89 -36 -1 35 226 179 85
5159 85 -55 176 -56 -139 128 -38 57 -94 88 71 129 28 85 -31 -119 -47 12 -11 98 146 66 -24 31 223 157
5184 157 -11 -58 88 -18 -153 -8 52 -38 23 141 -26 80 119 57 -75 136 -109 83 -2 -24 77 133 -87
5207 -87 105 0 -42 170 67 109 -68 -130 39 -33 44 170 -50 -65 92 -59 -58 46 -155 -75 75 -20 -101 -142
5231a42J37L4P5j60J19j37L1m2R2o8l5J57n9J5J34k55M6Q1J20j58J71q6j6n0l5
5256c1j92J30J55j11M7K2J3R1m1k09J21j4m7J93l2q2J8k0o5j02R4L4J74q0N4m6
5282G4Rk05J33JJ38j39P7j66J7M1K9J40O4k54J34j50K34l40J45P4p4J26l3j55
5306h0Q0o0K4j7J52j28P4k21K12p2K3N8k1L4K4jj33Q9PM9k07L20l57J28K7O3m0
5333B7J22j03q8j6K8J27j57K1q0O9M8Jq0j02K34j59J5L8m8J97j83R6j78J62q0
5358h9J87r2n5J33p8J22p5l5o4r3L16j28%K1r5n5J55p9J36o9k07K57lr5O6rp6
5385dk7n9J87m2N3M2j92RJ52j35J6P5o1K6j4k0L0pP7k38J90Oj11J54k17J22mM8
5413E6j62Q0k9J17n3N3j0J27j37J8j10L7K2k21L11j72Q8M1J3L6j46J49j88L2l9
$$ plain form
5231 -142 -5 29 104 -56 63 -74 -43 -85 7 -61 -96 61 2 17 151 -104 -58 23 143 -15 156 70 54 4 -31
5256 -31 -223 -93 62 -49 -2 20 33 124 83 -126 -5 -19 -66 127 95 13 31 11 -54 -156 -62 -28 146 66 120 74
5282 74 83 -122 11 12 150 11 88 -78 -61 -20 9 149 213 -41 93 -57 177 -163 -18 56 -18 108 75 -80
5306 -80 0 -60 -36 -53 99 -29 45 -176 36 -36 -13 45 24 58 82 81 -52 37 44 93 -114 206 -151 -23 4 67 27
5333 27 149 46 -42 -58 -30 97 -60 -39 -119 -50 -2 -1 -81 -183 51 -108 -93 -55 -103 94 -89 7 -171 -9 -89
5358 -89 98 6 -49 84 6 128 53 18 -46 -139 177 49 49 70 -25 -80 75 -4 132 63 -144 113 110 15 81 72 -4
5385 -4 -31 -90 97 55 108 150 -42 -33 119 -16 0 75 14 40 26 6 36 29 106 -132 58 64 -47 107 -110 12 8 56
5413 56 -106 -26 -55 62 9 62 52 179 42 60 -50 -13 9 -212 99 -73 15 56 69 105 -41 108 -80 -48 -87
5438h7M9m5N6O3Q7j71R7j21O4q9J72J21j12j18R6L9m8m3J0J65j71J74k36N7K3
5463C2K9Q0j25P5j37j2J13P2j79o8J75Qj92M0MJ37l7K9o8k8P2j1k3J69j45J02
5489A12j33mL9r7J30J19q1j78O7k0P8J3q0J47j21K4O4q2O5Rq1K4n4J70j18n3k8
5516f9P9k5M0J15k06J18rj94J82j6l1j79J83r6J79q3j5R5q7J3j7J13j74p5K75
5541A16p9j18J42L5O7k36P7M5k8j37J35k8K0PM0q8Q4j47J80j53K0P3l2j07J44
5566C2j99R3J09N5l7J8j08M5K6j73Q9K06j34J84j11j9j60P8J13KO3j58L0pl7K2
5592B2P7j55J28j3p2j04J22R3n0q6%J11k64J86J9n6l0m2J45j10J17oN8p9Pk23
5618b05L16l1r5Kj8J90j13p3Q5o4N3j14J29j40Q9N7j25J93l5j39K6N0p1q8J44
$$ plain form
5438 -87 -38 -83 -27 36 123 -48 49 -72 -8 -97 75 196 84 -34 62 101 53 10 20 185 14 188 -48 9 32
5463 32 61 141 16 91 -46 -58 55 127 -52 -120 55 63 -129 -89 -85 52 15 44 -24 -52 20 9 -14 155 10 112
5489 112 -21 -25 14 -83 47 166 85 -93 -26 -46 32 45 -35 112 -9 15 79 -3 62 71 -10 14 -40 130 12 -41 -69
5516 -69 10 -15 25 140 -66 52 43 -151 31 15 -16 -195 -12 -108 71 -12 -27 68 -19 -6 -23 90 -84 -159 116
5541 116 37 -81 61 96 163 -73 4 49 21 -116 19 -9 11 18 58 -30 54 -93 87 -66 -46 27 -5 -112 32
5566 32 -167 -74 35 90 53 71 -37 8 34 -139 -50 156 22 206 95 76 -84 -6 107 109 172 14 44 37 0 22
5592 22 99 -56 72 59 -13 -117 5 98 48 -38 -38 73 -191 -5 14 -42 -72 -114 31 -79 38 32 90 11 18 -205
5618 -205 111 80 -15 -13 -31 159 46 -27 58 -6 47 -67 62 -78 11 68 -57 136 101 -38 -12 38 -33 -121 23
5643B3J60o5m9j62M7P9L6N1r0K1j29q4m6J91J44j12o3m4N9P7k4l7J03J4j53P3
5669B0O5j75M7R4q8Q4Oj15K05k18J71j42m9J07o5N6p7M2J40j04j17J63j91j1J07
5694d5k3J50Q4l8J6r7q6pJ20q0k3o5J41j92J78q5Q8j66J83m3J2j51J39P9k0l7
5720C2o7n9P6J30n1oj37K59j53j5q1L9J80j58j46N9J24j19N1K0Q0m5LO4r9OL6
5747B3N4j45J29j81J81j02M9J83k10O8j46nJ03n0M5j03NK56j59o4M3NK4l6O4n2
5773b1O2l0p7L0p6M2n0J36L8p7Q3L6j85J65p8p0N7pRn7K7J25j87J13N5m6Q8lj17
5802a5L4P6K6k0j02j7m0J1nJ8J07k46J53j4N4L4j4j25J67J0j15N6np3o0P4Q6j64
5830a09R6J48j28J38j12P0j97J95Q2l16J10kJ16l6J30l26J58Q9J9q6m3k3J46k31
$$ plain form
5643 23 183 118 69 -93 -46 33 69 120 30 51 -78 -162 -208 -17 127 15 -48 -92 -33 44 20 -17 86 100 -53 20
5669 20 85 -90 -43 51 -37 47 53 -62 143 -75 96 -46 -95 12 -53 3 -74 -32 108 4 -113 50 -141 -152 -45
5694 -45 -68 82 166 128 144 47 -39 -46 74 -6 -29 -94 47 -145 33 -52 36 -130 53 10 22 -129 10 89 69 32
5720 32 -35 -94 -18 112 61 55 -82 177 24 9 -72 -33 147 -11 -157 -98 26 -93 -42 -22 58 13 16 80 -19 -13 23
5747 23 77 -68 61 -120 61 -41 8 191 -19 49 -97 -102 1 -49 -4 -107 -102 154 -5 -69 -26 -21 3 -33 31 -21
5773 -21 41 11 -66 -36 -112 -70 -120 16 54 -23 60 96 -89 76 -2 -72 -15 -22 -13 -70 -43 82 -105 8 63 17 105 102 -15
5802 -15 19 95 121 101 -1 -18 -58 -47 -52 -34 73 -173 -20 -34 20 54 40 -85 82 92 -23 33 28 -45 -105 -31 55 -109
5830 -109 -13 135 7 145 33 103 -94 101 183 -133 -23 -25 91 55 185 -141 17 106 125 39 -4 -27 119 -112
5854a12j6L1Q9j18J34K2p2M8L7j52K01k20J57p4J6k2N3jq2K3J07j15K17j26j35
5879a10J3J47L1j21J10J6j70K68k16J00m8j2o3J01M3k25J17J33r1j3n1j1K18k54
5903h8J69o6p3j54R5K34j32j19J4L7J20K7k7l0L6m3l7J1R7j59J93L1j58J96J4
5928A88k30K51k77K9J82l3m2K5j36O6J22j25k1R9r0j04P1J10j26P7r0J0r3J08
5952b9K3qN2j7q2J42q9O7J4j04p5M6N3kJ2k8k2J40pj19k8J27q6M3m6P9J0j06J9
5981b1l9J83K9r6k02J69m0J46j04nJ9l4M0m5J0M9Lr5Q4m1J6J52n9j43L9o5j00
6008a50J96p5Q4J4k3k9p3J1P0J31j12or7M7r7J60j68J91l9j09k1J64j00j5J2J19
6034H5o8k09Q8p6J03L4r2J06J32j38J6r4Q0J21j04J33q9r3J18j20O2O5p2J72o3
$$ plain form
5854 -112 -128 -97 -8 -126 8 30 -42 6 43 -109 92 -128 29 -45 -29 -51 2 1 -81 -58 49 -66 151 25 -110
5879 -110 -97 50 81 -40 70 86 -84 184 -32 68 20 8 -55 46 89 -136 -19 114 23 10 -41 -52 166 -88
5903 -88 81 15 -58 -212 -117 117 -15 -134 -120 -83 37 64 37 7 43 0 -37 -26 71 -88 105 136 -22 174 188
5928 188 -42 209 -68 -39 143 110 68 93 -43 23 145 20 -1 98 8 -96 -25 85 -41 36 -54 -44 -137 -29
5952 -29 -6 -14 38 21 -61 81 -8 59 73 -31 -106 -60 -7 -9 3 -25 -47 93 86 -33 -61 66 -20 23 -23 56 66 -40 -21
5981 -21 -60 123 152 56 -146 23 -17 129 25 20 39 5 45 0 10 59 62 -33 51 10 26 178 119 -24 15 -50 -150
6008 -150 46 -29 55 69 46 17 -56 -45 25 156 44 38 -59 -12 -109 51 -117 74 35 -74 -95 69 -31 -46 -34 85
6034 85 17 -192 -104 -180 -77 -43 -135 -29 103 -35 -19 -113 -33 88 -16 117 28 -65 53 -67 -5 60 -12 160 97
6059I7k28J15m5P6n2p6K70j23J04j39j28P7M6r4P8L0n8K3P0q9Q9o3N5J37j56m3
6085b7K8o3j1J69K6j28pK1j04J75pM2p6n8L5K7j1L9r0N0n2k4k08K78j5J17Rr8
6113C7M3j87Q2J72j86Rl1M2K24k57lO4J04j40J19j04M8j42J5L5l8J10P4j35M5
6138@J85k24J98k38M7KJ3j0R6j09P7J5J3j57k0pj3J11L8M1j39Q4J9j5N6Rl7L8
6166G3j6m8O6k25P5M4N9r9J38k67J20N0K7J22M9k03K07j02M7j49q9J91n3mn8N6
6192A1j5P8JK0P0j50j54P5K1J69k06J19o5QQ8lJm5l0L3j31J57n6l9j17J77J4K9
6220F0l0n1P7j78O5%P4O0p8rJ31q7Q1l6p8j39L8J01j07J0J31q7N2J03n5J43q5
6247A06j65r1K09k33J25Q9L4k12O6K8M9j4P5p0J11j90J72J48l50K17q4M2p0O3
$$ plain form
6059 97 -131 -16 -61 15 -37 -113 157 34 138 -1 -129 -52 -6 -100 -22 8 -50 -27 43 -46 43 -20 35 172 16 -27
6085 -27 1 -62 -73 96 122 -6 -13 8 -96 79 72 114 38 -20 15 42 31 70 -20 30 -22 -46 -254 24 9 126 135 37
6113 37 80 -107 -25 147 -39 -30 -61 -19 205 -52 -55 9 113 -27 92 -12 36 -106 -91 -56 -94 16 90 -45 0
6138 0 185 -39 159 -79 -32 -30 -17 -27 69 -40 37 52 65 -92 -112 -119 -132 -21 17 58 -81 3 22 7 63 72 35 73
6166 73 57 9 75 -150 -75 -31 28 -71 67 -200 -80 -30 -3 119 168 -35 172 70 117 -32 -121 70 17 13 -45 11
6192 11 -4 74 75 95 165 15 -139 -64 -43 126 -80 39 -26 -18 70 67 68 23 -7 26 -105 52 -4 -43 -160 17 31 60
6220 60 30 -21 56 -122 -57 -57 17 77 -1 -10 121 34 115 79 1 -138 -100 1 -106 -96 35 -52 0 103 48 191 106
6247 106 -59 -150 59 -174 -49 40 74 -138 -72 -44 5 -9 66 -4 107 -83 89 237 -113 104 20 62 -8 55
6271E5P1j63R7o6J08j07m5J06n0m6r5j09J13K01q3N0p9L7k4N0j64K09j57lj4R
6297i9J0J47r2k0K8M9O2m1k27K29k08J03J0j%J38k6l1J55k26L5J6J44j53k6J26
6323A02o8L4K4r8P0k28J54j3J49j42K5J49k24j31M0K07kp8J7P5j9k40L02k7j37
6348e9o6J32j14J04J6N5Kr3l0J23j53k0J74j72j0R5l2J03j0o5Q3Rm5r8J21o2R8
6375H6l7o7N3r4P4n8P1j65J37qj7N6J3j18L0J49l5l03O8J20p5J97j08O6k09J73
6401aO2k9J05j22Jq2l2J5J11Op2O6Q2j87J89p0k79K67j73K34j19L2P4k27O3J13
6427B7n8l6J47n6j1K7r2J00K7L5j95J66R8j69M9m2jn4P0K1M5q6r5M4j22J96k7
6454HN0m0l7J22j16L8o0Q3Q9j55qQ6m6P4m9o2j7n5J16O3j43L7M7m6J9j55J4J31
$$ plain form
6271 55 126 -37 60 -6 102 -5 -50 56 6 -40 -135 -244 -131 70 -13 37 -42 -5 -29 21 -143 66 -91 -94 -108 -99
6297 -99 -89 58 -34 -54 -26 23 85 44 -183 46 -162 -59 -49 -50 -50 88 62 31 186 -40 -5 11 155 2 -24 102
6323 102 34 68 92 -6 64 -164 -10 -23 126 -16 9 158 -66 -197 -157 50 48 -30 -13 62 43 -197 105 78 -59
6348 -59 -125 7 -107 -3 13 68 70 -23 -53 70 -83 -103 71 -101 -111 -16 -48 55 45 -20 63 72 27 -71 50 -12 86
6375 86 49 -18 35 -59 15 -43 28 -137 0 -8 -25 31 44 -74 -44 105 70 -233 -165 -45 -120 77 -31 35 -174 -1
6401 -1 61 32 137 15 16 -66 -98 -83 28 34 -38 28 110 -77 112 42 -237 30 -143 91 -28 4 78 -149 -86 27
6427 27 -31 -67 80 24 13 40 -52 48 75 110 -85 81 179 10 59 17 16 -38 32 53 98 12 -83 -39 -161 35 8
6454 8 58 18 -19 103 -13 25 -35 48 137 -18 -26 60 14 88 39 -23 -40 -95 21 84 -59 -22 25 -21 -2 -157 -143 -12
6482a2m1k5N4N4Q1j50j6pn0P5M8m9R9r4Qp5J33r0j7J00k4k5j19K24j24K4j39K49
6510I2j41j12P1n7J92j7Oj46mO5O1o4O1nk6K6O2r2J58k3j81R1J26o4l7O3q6m6
6538b7J17j43P4L2J5l2O0k89J65J11n7k5r1R5J1q1lO2J4j38J25m0l8J36j14J5
6564d6L4J80l6l41K06R6j59K7P0R0j44LK7q8K75j82o6L4m5J29j20J49j55P9on2
6590d1O9K4j39J29n1J36j11N9j01K4Q2j4j8J1j31o5O8pn6J25q9l7J64j45R5R4
6616G5j06q1K51k06J1J4moR7r8J27j34J87k33J77j82mj05K38r3k8N3J65j13M0
6641D2l9nj4k7L3r7P5o0J22o0J28j34J19j31N1P2j40M6pj2j3R6J8o2P6j32J08
6668E3ln5Ok1lP8o4o8k2K0N9j33J10M4Q9r6R1k3j16P9RP6k02K21p3n1N1K6rrj14
$$ plain form
6482 -12 -53 -78 -24 30 111 -39 -55 -62 -112 -37 11 -38 61 -33 -25 -100 33 -57 -74 26 2 -23 -142 82 -42 -18 -157 92
6510 92 -49 -161 -90 -147 45 28 34 -112 -116 -51 10 -54 7 2 -24 2 64 -28 130 107 -74 17 143 79 42 105 19 -27
6538 -27 90 -53 21 53 68 36 96 -193 -28 83 26 1 -90 5 16 -65 -68 -6 8 -130 -5 -45 -83 53 -61 -46
6564 -46 -12 168 132 -209 -3 93 -66 -39 31 121 -23 -20 7 -81 194 12 -54 -20 -65 64 -56 93 -62 17 11 -41
6590 -41 28 52 -87 42 -9 127 16 75 -26 -2 80 66 48 59 -72 -137 -69 -76 -132 -7 -96 -133 31 -114 -19 75
6616 75 -31 -112 139 -67 -56 -42 -46 -52 45 -53 74 -60 127 -106 71 -111 -115 -220 18 -75 -103 -50 115 2 42
6641 42 3 -2 -16 -43 -10 -107 -32 -92 30 -30 98 -36 83 -48 3 75 -65 -19 -26 -38 -51 45 63 1 77 -55 53
6668 53 50 -5 1 -20 -23 55 -9 -77 -99 -79 -20 -153 -43 1 90 -6 85 62 -54 25 34 110 -92 129 56 5 56 82 73 64 -50
6699e0nj0M9j20L8J37J47l07N8l0J35j0j3m8M9j16k7R5o3J0M5O7n5k9J22j61P7
6726a5L0r9J06J34m4k19J00l8N3Mj21R0J05p8Kpr3J04qJ6J02p2j9j00n3N2P3n4
6754d9K6p4J87r5n3J92k19k0M5J34j52J02N7p7k2R0K8r5J0o3J79k30J05LR8k3
6780H4q6J8Q9O7l16J23l3k4J9j33K61m9k2LK2R8q7j21m1J30j09J86N7o9j98J92
6806F1N6k8L6r0j90K81j68QK02j97J69j36j00R3M5j80K30o1j28J80r7pp9J89o4
6831B5m6J13j84K97K9j25K%k08J2K3R6k9Lk97K19k0l2J10K7j09r7O2J05J09j23
6857c8P2M4n7P1o8j78J02R2j50J32L1lq9nP6L6m8Pq8L1M1P7j04J6rL1p7Q2l3R3
6887H7j16M6ro0J27j18O5n7m3J98k18J54o5o4k0o9J83oL4o3j40K43p6q8NM5J96
$$ plain form
6699 -50 -55 -65 -16 -136 -98 39 186 -121 -63 -93 42 32 19 -29 20 -96 -123 -28 -91 -81 -36 31 -24 -53 69 -92 -15
6726 -15 15 -84 22 156 112 -107 -7 -45 8 12 -109 -19 86 8 10 3 -90 14 6 22 124 52 33 -67 -120 -68 5 -49
6754 -49 -23 -97 90 -5 -58 134 -85 -105 -60 74 -78 24 81 4 -18 72 100 5 15 -48 131 -99 6 9 107 84
6780 84 -2 16 105 172 -144 -21 -54 -78 -59 -192 69 20 -2 1 23 121 34 -87 -128 2 -107 79 136 67 -131 61
6806 61 117 89 125 35 -155 126 -42 -34 168 -29 140 4 -96 -3 42 -138 92 31 -97 83 -14 -21 -100 89 25
6831 25 -21 92 -92 205 234 109 111 111 -97 -85 -62 34 5 8 -289 -70 -90 -122 -12 15 -94 -191 -129 -24 85 -38
6857 -38 34 78 21 92 24 -154 -52 40 -110 22 53 50 -39 -44 32 68 20 27 -61 -30 11 88 -16 0 -9 22 -55 27 -6 87
6887 87 -29 17 8 -52 75 -43 22 -35 -78 120 -98 56 -9 -73 -93 -162 21 15 49 -14 -154 89 13 -75 -70 -25 171
6914A71k25J45Rr0j05J87n3k31J09K75k12J03j59J00j55J97j38R7J09j54K5nL9
6937C9n1O8j1j64N7J02M5j7k17Q3M8O9j76J62jq4K6J8m9J04n5oK0J02j33RK9j77
6965a60P2K5n3N9Q8r0o1J07n5l9J34Q6Lk21K03j35K5O8M1J0j28J4r0K65j47l4
$$ plain form
6914 171 -54 91 100 10 -95 92 39 -192 -83 192 -20 83 -76 24 -131 66 -72 25 134 -20 5 0 39
6937 39 -12 56 45 -119 -62 40 85 68 -149 -66 -18 51 -125 37 36 -48 -22 -4 -53 51 -4 -10 10 112 -21 -12 17 -160
6965 -160 -88 -63 -116 -57 31 -59 -120 -13 -68 -107 27 113 116 -105 98 -37 -12 56 97 107 -21 -7 -97 168 21 -13
$$ [...]
8191D1
##END NTUPLES=NMR FID
##END=
