##TITLE=1H_X2 (SAV-54)
 CDCl3, 8 sc, 
 7.7.2020
##JCAMPDX= 6.0         $$ Bruker NMR JCAMP-DX V2.0
##DATA TYPE= NMR FID
##DATA CLASS= NTUPLES
##ORIGIN= UXNMR, Bruker Analytische Messtechnik GmbH
##OWNER= root
$$ XWIN-NMR		Version 3.5
$$ Tue Jul  7 10:05:04 2020 Russian Standard Time (UT+4h)  she@DPX200
##.OBSERVE FREQUENCY= 200.1315
##.OBSERVE NUCLEUS= ^1H
##.DELAY= (6, 6)
##.ACQUISITION MODE= SIMULTANEOUS
##.ACQUISITION SCHEME= undefined
##.AVERAGES= 8
##.DIGITISER RES= 18
##SPECTROMETER/DATA SYSTEM= spect
##.PULSE SEQUENCE= zg30
##.SOLVENT NAME= CDCl3
##.SHIFT REFERENCE= (INTERNAL, CDCl3, 0, 15.7039)
##AUDIT TRAIL= $$ (NUMBER, WHEN, WHO, WHERE, WHAT)
$$ ##TITLE= Audit trail, XWIN-NMR		Version 3.5
$$ ##JCAMPDX= 5.01
$$ ##ORIGIN= Bruker BioSpin GmbH
$$ ##OWNER= she
$$ F:/spectra/data/she/nmr/H-F/1/audita.txt
$$ ##AUDIT TRAIL=  $$ (NUMBER, WHEN, WHO, WHERE, WHAT)
(   1,<2020-07-07 10:04:06.95 +0400>,<she>,<DPX200>,
      <created by zg, POWCHK disabled, PULCHK disabled
       configuration hash MD5:
       00 E9 B6 7A A2 85 ED C7 34 08 36 98 17 FE 4E 26
       data hash MD5: 16K
       F3 24 E5 5C EB 60 B4 3D 84 39 2B 7A 9F 2E FC 0F>)
$$ ##END=
$$ 
$$ hash MD5
$$ E5 8E 45 ED 94 B6 7A 00 88 3B BF BC 60 02 C1 12
##$RELAX= 
##$RELAX= 
##$RELAX= 
##$RELAX= 
##$RELAX= 
##$RELAX= 
$$ Bruker specific parameters
$$ --------------------------
##$DU= <F:/spectra>
##$EXPNO= 1
##$NAME= <H-F>
##$PROCNO= 1
##$TYPE= <nmr>
##$USER= <she>
##$AMP= (0..31)
100 100 100 100 100 100 100 100 100 100 100 100 100 100 100 100 100 100 
100 100 100 100 100 100 100 100 100 100 100 100 100 100 
##$AQSEQ= 0
##$AQ_mod= 1
##$AUNM= <au_zg>
##$AUTOPOS= <>
##$BF1= 200.13
##$BF2= 200.13
##$BF3= 200.13
##$BF4= 200.13
##$BF5= 200.13
##$BF6= 200.13
##$BF7= 200.13
##$BF8= 200.13
##$BYTORDA= 1
##$CFDGTYP= 0
##$CFRGTYP= 5
##$CHEMSTR= <none>
##$CNST= (0..31)
1 1 145 1 1 1 1 1 1 1 1 1 1 1 1 1 1 1 1 1 1 1 1 1 1 1 1 1 1 1 1 1 
##$CPDPRG= <>
##$CPDPRG1= <>
##$CPDPRG2= <>
##$CPDPRG3= <>
##$CPDPRG4= <mlev>
##$CPDPRG5= <mlev>
##$CPDPRG6= <mlev>
##$CPDPRG7= <mlev>
##$CPDPRG8= <mlev>
##$CPDPRGB= <>
##$CPDPRGT= <>
##$D= (0..31)
0 1.2 0 0 0 0 0 0 0 0.06 0 0.03 0 0 0 0 0.0002 0 0 0 0 0 0 0 0 0 0 0 0 
0 0 0 
##$DATE= 1594101846
##$DBL= (0..7)
120 120 120 120 120 120 120 120 
##$DBP= (0..7)
150 150 150 150 150 150 150 150 
##$DBP07= 0
##$DBPNAM0= <>
##$DBPNAM1= <>
##$DBPNAM2= <>
##$DBPNAM3= <>
##$DBPNAM4= <>
##$DBPNAM5= <>
##$DBPNAM6= <>
##$DBPNAM7= <>
##$DBPOAL= (0..7)
0.5 0.5 0.5 0.5 0.5 0.5 0.5 0.5 
##$DBPOFFS= (0..7)
0 0 0 0 0 0 0 0 
##$DE= 6
##$DECBNUC= <off>
##$DECIM= 24
##$DECNUC= <off>
##$DECSTAT= 4
##$DIGMOD= 1
##$DIGTYP= 9
##$DL= (0..7)
0 120 120 120 120 120 120 120 
##$DP= (0..7)
150 150 150 150 150 150 150 150 
##$DP07= 0
##$DPNAME0= <>
##$DPNAME1= <>
##$DPNAME2= <>
##$DPNAME3= <>
##$DPNAME4= <>
##$DPNAME5= <>
##$DPNAME6= <>
##$DPNAME7= <>
##$DPOAL= (0..7)
0.5 0.5 0.5 0.5 0.5 0.5 0.5 0.5 
##$DPOFFS= (0..7)
0 0 0 0 0 0 0 0 
##$DQDMODE= 0
##$DR= 18
##$DS= 0
##$DSLIST= <SSSSSSSSSSSSSSS>
$$ [...]
##$SUBNAM2= <"">
##$SUBNAM3= <"">
##$SUBNAM4= <"">
##$SUBNAM5= <"">
##$SUBNAM6= <"">
##$SUBNAM7= <"">
##$SUBNAM8= <"">
##$SUBNAM9= <"">
##$SW= 24.9337058887773
##$SWIBOX= (0..15)
0 0 2 0 0 0 0 0 0 0 0 0 0 0 0 0 
##$SW_h= 4990.01996007984
##$TD= 16384
##$TD0= 1
##$TE= 0
##$TE2= 300
##$TE3= 300
##$TEG= 300
##$TL= (0..7)
0 120 120 120 120 120 120 120 
##$TP= (0..7)
150 150 150 150 150 150 150 150 
##$TP07= 0
##$TPNAME0= <>
##$TPNAME1= <>
##$TPNAME2= <>
##$TPNAME3= <>
##$TPNAME4= <>
##$TPNAME5= <>
##$TPNAME6= <>
##$TPNAME7= <>
##$TPOAL= (0..7)
0.5 0.5 0.5 0.5 0.5 0.5 0.5 0.5 
##$TPOFFS= (0..7)
0 0 0 0 0 0 0 0 
##$TUNHIN= 0
##$TUNHOUT= 0
##$TUNXOUT= 0
##$USERA1= <user>
##$USERA2= <user>
##$USERA3= <user>
##$USERA4= <user>
##$USERA5= <user>
##$V9= 5
##$VALIST= <valist>
##$VCLIST= <CCCCCCCCCCCCCCC>
##$VD= 0
##$VDLIST= <DDDDDDDDDDDDDDD>
##$VPLIST= <PPPPPPPPPPPPPPP>
##$VTLIST= <TTTTTTTTTTTTTTT>
##$WBST= 1024
##$WBSW= 4
##$XGAIN= (0..3)
0 0 0 0 
##$XL= 0
##$YL= 0
##$YMAX_a= 90739
##$YMIN_a= -55007
##$ZGOPTNS= <>
##$ZL1= 120
##$ZL2= 120
##$ZL3= 120
##$ZL4= 120
##$ABSF1= 10
##$ABSF2= 0
##$ABSG= 5
##$ABSL= 3
##$ALPHA= 0
##$AQORDER= 0
##$ASSFAC= 0
##$ASSFACI= 0
##$ASSFACX= 0
##$ASSWID= 0
##$AUNMP= <proc_1d>
##$AZFE= 0.1
##$AZFW= 0.1
##$BCFW= 1
##$BC_mod= 2
##$BYTORDP= 1
##$COROFFS= 0
##$CY= 11.3945322036743
##$DATMOD= 1
##$DC= 2
##$DFILT= <>
##$DTYPP= 0
##$F1P= 16.9975609425685
##$F2P= -3.02152046262296
##$FCOR= 0.5
##$FTSIZE= 0
##$FT_mod= 4
##$GAMMA= 1
##$GB= 0.15
##$INTBC= 1
##$INTSCL= 1
##$ISEN= 128
##$LB= 0.24
##$LEV0= 0
##$LPBIN= 0
##$MAXI= 10000
##$MC2= 0
##$MEAN= 0
##$ME_mod= 0
##$MI= 1.114404
##$NCOEF= 0
##$NC_proc= 0
##$NLEV= 6
##$NOISF1= 3.799351
##$NOISF2= 2.8
##$NSP= 1
##$NTH_PI= 0
##$NZP= 0
##$OFFSET= 15.70392
##$PC= 1
##$PHC0= -9814.488
##$PHC1= 50.40086
##$PH_mod= 1
##$PKNL= yes
##$PPARMOD= 0
##$PSCAL= 0
##$PSIGN= 0
##$REVERSE= no
##$SF= 200.130013532006
##$SI= 16384
##$SIGF1= 3
##$SIGF2= 2
##$SINO= 400
##$SIOLD= 16384
##$SREGLST= <1H.CDCl3>
##$SSB= 0
##$STSI= 0
##$STSR= 0
##$SW_p= 3612.71676300578
##$SYMM= 0
##$S_DEV= 0
##$TDeff= 0
##$TDoff= 0
##$TI= <>
##$TILT= no
##$TM1= 0
##$TM2= 0
##$TOPLEV= 0
##$USERP1= <user>
##$USERP2= <user>
##$USERP3= <user>
##$USERP4= <user>
##$USERP5= <user>
##$WDW= 1
##$XDIM= 8192
##$YMAX_p= 0
##$YMIN_p= 0
$$ End of Bruker specific parameters
$$ ---------------------------------
##NTUPLES= NMR FID
##VAR_NAME=  TIME,          FID/REAL,        FID/IMAG
##SYMBOL=    X,             R,               I
##VAR_TYPE=  INDEPENDENT,   DEPENDENT,       DEPENDENT
##VAR_FORM=  AFFN,          ASDF,            ASDF
##VAR_DIM=   8192,          8192,            8192
##UNITS=     SECONDS,       ARBITRARY UNITS, ARBITRARY UNITS
##FACTOR=    0.0002004,     1,               1
##FIRST=     0,             0,               0
##LAST=      1.6414764,     0,               0
##MIN=       0,             -55007,          0
##MAX=       1.6414764,     90739,           0
$$ Real data points
##PAGE= N=1
##DATA TABLE= (X++(R..R)), XYDATA
0@%%%%%%%%%%%Nj3J6j6J6j9K7l2L5m3M8n6O7p5Q8j03J18j34J50j70J92k16K41
$$ 0 0 0 0 0 0 0 0 0 0 0 0 5 -8 8 -8 8 -11 16 -16 19 -24 24 -32 35 -40 48 -55 63 -71 79 -91 101 -115 126
34A26k67L00l35L72m12M56n07N63o24O91p65Q47r41J047j164J302j463J650j876
$$ 126 -141 159 -176 196 -216 240 -267 296 -328 363 -402 445 -496 551 -613 689 -774 876 -1000
53a000K156k509K970l610M556o118R337l1173P4824K7099j06698k0522O9047K4865
$$ -1000 1156 -1353 1617 -1993 2563 -3555 5782 -25391 49433 76532 -30166 -50688 18359 43224
67D3224o8544k5425N1861L8123l0051k6036J4179J8542j1894j8451MJ9554J0639
$$ 43224 -25320 -50745 1116 39239 9188 -16848 -2669 15873 3979 -14472 -14468 5086 15725
80A5725q558j3588Q068J3548j1188k2138J0709K6658n679k4880Q618K5674j0328
$$ 15725 7167 -6421 1647 15195 4007 -18131 -7422 19236 13557 -11323 -2705 22969 12641
93A2641l0018N598K8667Rk0954O89J5165l394j2064K974P362q47l58J274m681
$$ 12641 -17377 -11779 16888 16897 -4057 -3368 11797 8403 -3661 -687 6675 5828 5470 6744 2063
108B063l826O545K476p795J048J3018k556j9009P04J7687r73j6080N503J8060
$$ 2063 -1763 4782 7258 -537 511 13529 10973 -8036 -7332 10355 9382 -6698 -1195 16865
122A6865p903j9667O709J4937j0840j4093J5943J8419j2075j8704O438R438r428
$$ 16865 8962 -10705 -3996 10941 101 -13992 1951 20370 8295 -10409 -3971 5467 -3961
135c961o007J1753Q104o293l932K364l824p847K720P197Q38l61K382k105n428
$$ -3961 -9968 1785 9889 3596 -336 2028 -1796 -9643 -6923 274 1112 751 3133 1028 -4400
150d400L23J085n179k99J1487L504j1671k342J2138o97j7667k159J8057M826j3285
$$ -4400 -4077 -2992 -8171 -8470 3017 6521 -5150 -7492 4646 3949 -13718 -15877 2180 7006 -6279
165f279j000J2467k237j4327O89J1424j393o166N261O610o941p179M506M011k862
$$ -6279 -7279 5188 2951 -11376 -10687 737 -656 -6822 -1561 5049 -1892 -9071 -4565 -554 -3416
180c416L00L617l983m041P487N657r209o157J0430N730j1656n746J1495P283r278
$$ -3416 -3116 501 -3482 -7523 -36 5621 -3588 -9745 685 6415 -5241 -10987 508 7791 -1487
195a487m491P396K064p668p97O796j42l117L314K525n459k378O117N66o203O80
$$ -1487 -5978 1418 3482 -4186 -4983 1813 1671 -1446 1868 4393 -1066 -3444 2673 3239 -2964 -2284
211b284P319l4n205K472L492n934m680O726M869n845j653P741J301r522k361Q018
$$ -2284 5035 5001 -204 2268 5760 -174 -4854 1872 6741 896 -757 6984 8285 -1237 -3598 4420
227D420R6n614J861P721j985p256J669L938l422k741M525K775l951j20M559k525
$$ 4420 4516 -1098 763 8484 6499 -757 912 4850 1428 -1313 3212 5987 2036 1916 6475 3950
243C950n279J645N033k892l543L929L497m594k691M418R80n590j018N280J97m031
$$ 3950 -1329 316 5349 2457 -1086 2843 6340 1746 -945 3473 4453 -1137 -2155 3125 3322 -709
259g09J049M177k877m227K856K223m174j898N149K398m818j325M370k372n059
$$ -709 340 4517 1640 -2587 269 2492 -1682 -3580 1569 3967 -851 -2176 2194 -178 -5237
274e237J753N225k115k973L850K445n200l621M004J480m495N94N895K14n212k72
$$ -5237 -3484 1741 -374 -3347 503 2948 -2252 -5873 -1869 -389 -4884 -4290 1605 1819 -3393 -3665
290c665K694k522l128L921L402k683j695L682l67n548j44N279n62l522K262M628
$$ -3665 -971 -3493 -6621 -2700 702 -1981 -3676 6 -361 -5909 -6053 -774 -1336 -4858 -2596 2032
306B032k680n695K748M064l616k387M369L280l938k014K979N34k995P49L450j135
$$ 2032 -648 -6343 -3595 469 -3147 -5534 -1165 2115 -1823 -3837 -858 -324 -3319 -2570 880 -255
322b55k893K217K557k796j682K830J996k591j421K725J68j575J317J871k099q88
$$ -255 -3148 -931 1626 -1170 -2852 -22 1974 -617 -2038 687 855 -720 597 2468 369 -519
338e19K382O78m650J33N513J244m873j98M699l64n162m25M562L23k188K194J941
$$ -519 1863 2541 -2109 -1976 3537 4781 -92 -290 4409 4045 -1117 -1542 3020 3343 1155 3349 5290
355E290l326k910K803J361k617n4M256J404m271j648J344J81j087J332P10O5N01
$$ 5290 1964 -946 1857 3218 601 547 4803 6207 1936 288 1632 1813 726 2058 2768 2833 3334
372C334J560l157l780K237M347j642m284K644N353k690n733O09L622p53k094J531
$$ 3334 4894 1737 -2043 194 4541 2899 -1385 1259 6612 3922 -1811 -1202 2420 1667 -427 1104
388A104K001j664r08O29j177k235J511K954r76k854R17J635j593j463J788J58
$$ 1104 3105 1441 533 1162 -15 -2250 -739 2215 1239 -1615 -698 937 -656 -2119 -331 -173
404a73k221J226K218k343l091L284L430l645m191L413L864l403m011L588L623
$$ -173 -2394 -1168 1050 -1293 -4384 -1100 2330 -1315 -5506 -2093 1771 -1632 -5643 -2055 1568
419A568k985k736K512J043k663j031K912N71k026L12K560p72l431J27K004J90
$$ 1568 -1417 -4153 -1641 -598 -3261 -4292 -1380 -809 -2835 -2523 37 -735 -4166 -4039 -2035 -1845
435a845p20J307J38O4r5j121j752K15L843M78k875J71L598r23n035K71M837Q64
$$ -1845 -2565 -1258 -1120 -1056 -1151 -2272 -4024 -3809 34 512 -2363 -2192 1406 483 -4552 -4281 556 1420
453A420l883R88L820q70m605P45L806l13k760J264L174j421j424K05N55m11j94
$$ 1420 -2463 -1475 2345 1475 -3130 -2385 1421 1108 -1652 -388 2786 1365 -59 146 701 290 96
470I6J055J28m76J676r5j681o98K036K90j406R3K456k62k701O52J930o36k260
$$ 96 1151 1279 803 2479 2384 703 5 2041 2331 925 1018 3474 3212 511 1163 3093 2457 197
488A97J290K315j501j976J531J715j257r59J110J01j511J08Q11n57N21J920l86
$$ 197 1487 3802 2301 325 1856 3571 2314 1355 2465 2566 1055 1163 1974 1417 1938 3858 3472
505C472l390o85K831N09k931P73L688o30m360k99K783m93k291R58K950r72k747
$$ 3472 82 -603 2228 2737 -194 579 4267 3637 -723 -1022 1761 1268 -1023 -65 2885 1913 -834
522h34O79J422j566j591J469J506j276j033J625K52j832m60M47k32l10J260R02
$$ -834 -155 1267 -299 -1890 -421 1085 -191 -1224 401 653 -1179 -1639 -1192 -1424 -1734 -474 428
539D28j485p61P19o90j476J116J954n31j548P39J027j780j412J904J155j550r04
$$ 428 -1057 -1818 -1099 -1789 -3265 -2149 -195 -726 -2274 -1535 -508 -2288 -3700 -1796 -641 -2191 -3095
556c095K431L29k487m48K207K65j840K17J431n09j520J273J213r20p05Q33L2j265
$$ -3095 -664 -335 -2822 -3270 -1063 -798 -2638 -2421 -990 -1499 -3019 -1746 -533 -1453 -2158 -1325 -1293 -2558
574b558L0K013M76j478O77P38j084j695J358K139p77j298J785O94j687j257J786
$$ -2558 -2528 -515 -39 -1517 -840 -102 -1186 -2881 -1523 616 -161 -1459 326 1020 -667 -1924 -138
591a38N63l75k98J259K96r25M08J68j211L44J160M14j476Q44J811n89k170M6J568
$$ -138 425 50 -248 1011 1307 382 790 958 -253 91 1251 1665 189 1033 2844 2255 85 131 1699
610A699l33n80J375J496j565j500Q36L53j105O84J817N6j982N9J077l96j581J384
$$ 1699 1366 786 2161 3657 2092 592 1428 1781 676 1360 3177 3233 1251 1310 2387 1991 410 1794
628A794J406j110r52L78M65j015M25J448j085j708N89K138j054j371O27J253j144
$$ 1794 3200 2090 1138 1516 1981 966 1391 2839 1754 46 635 2773 1719 348 975 2228 1084
645A084j702R92J777j348j486J600O75j333o80R33k52j175P19Q17r84j034J482
$$ 1084 -618 374 2151 803 -683 917 1592 259 -421 512 260 -915 -196 621 -363 -1397 85
662H5J113j517j926J123P82j441M19J512k97j902L56Q76m84j278J009J314j058
$$ 85 1198 -319 -2245 -1122 -340 -1781 -1362 150 -147 -2049 -1693 -817 -1301 -2579 -1570 -256 -1314
679a314j001J366L40k256r79K414Q85j106n06J144n92n96M10L93j183N4J963L75
$$ -1314 -2315 -949 -609 -2865 -3844 -1430 -545 -1651 -2157 -1013 -1605 -2201 -1791 -1398 -2581 -2527 -564 -189
697a89k047k16J241K61j313K35J402l00r85P72J197j107r32J268L46o01J4J452
$$ -189 -2236 -2452 -1211 -950 -2263 -2028 -626 -926 -1911 -1139 58 -1049 -1981 -713 -367 -968 -954 498
715D98m30j447Q05J301m12j098L99J008k73m96R35K10q80j77J652l18j553L75
$$ 498 68 -1379 -574 727 315 -783 -384 624 351 -145 790 1000 120 -57 1595 1277 -276 99
733I9J670k55r29P81N77p33p90Q80N91q88r6J066j4p83L99O06j169q27J667J496
$$ 99 1769 1514 585 1366 1943 1210 420 1300 1891 1003 907 1973 1959 1176 1575 2181 1012 185 1852 3348
753C348j548j108P33J028j337q67J519L80r60J02J061o92j532M24J582n54j551
$$ 3348 1800 692 1425 2453 1116 249 1768 2148 1188 1290 2351 1659 127 551 2133 1579 28
770B8J120J090j332j065J215P66j887n37J461L57q03j55L84j045o13J577N67j325
$$ 28 1148 2238 906 -159 1056 1822 -65 -602 859 1216 413 258 642 -403 -1016 561 1128 -197
788a97p71J142L99j474n16J129P30j608N13P53j133j079J125R51p46p96M46k18
$$ -197 -968 174 573 -901 -1417 -288 442 -1166 -653 100 -1033 -2112 -987 -36 -782 -1578 -1132 -1350
806a350r61M12K032o60j346k77J337j71j235P91O73o91o71J147mq16m31J270k46
$$ -1350 -2311 -1899 133 -527 -1873 -2150 -813 -984 -2219 -1428 -755 -1446 -2117 -970 -974 -1790 -2221 -951 -1197
825a197j255L90J140J76q75O04N83q13j074M61J706K95j154L08%p10K74M06M53
$$ -1197 -2452 -2062 -922 -746 -1621 -1017 -434 -1247 -2321 -1860 -154 141 -1013 -705 -705 -1415 -1141 -735 -282
844b82k90N52P9n59RJ51J65R2M33M26n15r14J023J120q40n50L70P01j033L82J114
$$ -282 -572 -20 59 -500 -491 -340 -175 -83 350 776 261 -653 370 1490 650 100 470 1171 138 520 1634
865A634J83j489oJ429j42j267O82O91J6r36J13R08l48p40O40N78p49n02R87L23
$$ 1634 1817 328 322 1751 1609 342 1024 1715 1731 795 908 1816 1468 728 1368 1946 1197 695 1682 2005
885B005j088K40Q32k87j008L91P50l61m21J53J06m34j57P60m01r75L65Q10J46
$$ 2005 917 1157 1989 1702 694 1085 1835 1474 1053 1206 1312 878 721 1481 1080 105 470 1280 1426
904A426r29L56l3r72jO68K36n37l28Q60l57j207k19J221pq46J85O71q17j027J286
$$ 1426 497 853 820 -152 -153 515 751 214 -114 746 389 -818 -1037 184 177 -669 -484 187 -630 -1657 -371
925c71P77p90q11M94J05m75n32Q34P49p85r29O58j48l59M64M39m63n28PM30k30
$$ -371 406 -384 -1195 -701 -596 -1071 -1603 -769 -20 -805 -1734 -1076 -1224 -1583 -1119 -680 -1143 -1671 -1664 -1234 -1464
946a464j79L19L00l99j74K0Q6L99K94j06j077p1J367K19m64l70R20k66r47J48
$$ -1464 -1643 -1324 -1024 -1423 -1597 -1577 -1491 -1092 -798 -904 -1981 -2052 -685 -466 -930 -1300 -380 -646 -1593 -1445
966a445J074l2m70P06R7q03m32P17P53m70l49O16l36J83M16M7k72n21P16N98k71
$$ -1445 -371 -403 -873 -167 -70 -873 -1305 -588 165 -305 -654 -38 -374 -191 225 272 0 -521 195 793 522
987E22K7J02q5n13N02Q18m69m54P24L99o46p49R62M58P9q05O95N88j083m03N03
$$ 522 549 651 566 53 555 1373 904 450 1174 1573 927 178 1140 1598 1677 872 1567 2155 1072 669 1172
1008A172L18l97M26K86m87l74N23L55m66k84J58M61p70N4N83m45k86L57K73q84
$$ 1172 1490 1093 1519 1805 1318 944 1467 1822 1356 1072 1230 1691 921 975 1558 1113 827 1184 1457 573
1028E73j81Q41J7n32r30J029O03j007l81J125l41p37k45L96K13o49K18K36k57
$$ 573 392 1233 1250 718 -212 817 1420 413 32 1157 816 79 -166 230 443 -206 12 248 -9
1047ip94P6O09j45m44K74M44p31J54r3n72L72L39M0l23n6J5O9j121K48P82K50
$$ -9 -803 -727 -118 -263 -707 -433 11 -720 -566 -659 -1231 -859 -520 -480 -803 -859 -844 -775 -1896 -1648 -866 -616
1069f16j016M54M46j20r11K36P32j08n59L98J25k23m76L85N00m47J0K37L2m92
$$ -616 -1632 -1178 -732 -852 -1763 -1527 -795 -903 -1462 -1064 -939 -1162 -1638 -1253 -753 -1200 -1190 -953 -921 -1413
1089a413L53M76n80l62L60N68l94r7L16L57p28K82O01j34l88K10R31n58m86P89
$$ -1413 -1060 -584 -1164 -1526 -1166 -598 -992 -1089 -773 -416 -1144 -862 -261 -395 -783 -573 358 -200 -686 103
1109A03J18l68k2L91K58o57K01N14L8n72L13Q84l80l01K78j2p6l79O76k15m5j77
$$ 103 221 -147 -169 222 480 -177 24 538 576 4 317 1201 821 520 798 786 710 331 1007 792 747 570
1131E70N46J04l28K24l0k09mL93L27m80j20M52l54L4n9N81o13k42M12M52n34k19
$$ 570 1116 1220 892 1116 1086 877 873 1266 1593 1113 993 1445 1091 1125 1066 1647 1034 792 1204 1656 1122 903
1153I03L13Q8n82J2M61o00j51j18O34M2n08J72J74n09m09M67L16j01p08M43n5
$$ 903 1216 1304 722 734 1195 595 444 326 960 1002 494 666 840 331 -78 389 705 604 -104 339 284
1174B84m39l99Q31j10n01j02M58k7q13M65L41m51q61N23M70l64p87Q53K30p98
$$ 284 -155 -554 277 167 -334 -436 22 -5 -818 -353 -12 -463 -1324 -801 -331 -695 -1482 -629 -399 -1197
1194a197j85N95l97L5J37r9J70l13J06L2j62M25j51m34l1L80K95m55k63Q80Mp02
$$ -1197 -1382 -787 -1184 -1149 -1012 -1111 -941 -1254 -1148 -1116 -1278 -853 -1004 -1438 -1469 -1089 -794 -1249 -1512 -632 -628 -1330
1216a330JO59K58o65k39J255m32p55K57M22L39j026N29N73l39o47P40O51m47l35
$$ -1330 -1329 -670 -412 -1077 -1316 -61 -493 -1248 -991 -569 -230 -1256 -727 -154 -493 -1140 -400 251 -196 -531
1236e31O11j09l12j6N45p9k68M51K87n34k23M87M61k37l11O84M0o00k3Q71r1m18
$$ -531 80 -29 -341 -357 188 109 -159 292 579 45 -178 309 770 533 222 906 946 346 323 1194 1103 685
1258F85L44j02j68Q9J67L9j37n1P03m85p15N57O51m95k93K32K65m44n05J078L32
$$ 685 1029 927 759 848 1015 1054 917 866 1569 1084 369 926 1577 1082 789 1021 1286 842 337 1415 1747
1279A747r59j81K78N7m73J72M02K83r80k62O61J96n98K55O44o05o48JN60l64K16
$$ 1747 788 607 885 942 469 641 1043 1326 346 84 745 941 343 598 1242 637 -11 -10 550 186 402
1300D02l19K41l18K27J0n17J82J52J88r70O9Q35m20m95J82O13l35r58M41M87l04
$$ 402 83 324 6 233 243 -274 -92 60 248 -722 -653 182 -238 -733 -551 62 -273 -1231 -790 -303 -607
1321f07m49L07L21k55m24K77K1l51P1O80l28p63K90K08K71j78%J54m41m30L90
$$ -607 -1056 -749 -428 -683 -1107 -830 -809 -1160 -1089 -409 -737 -1500 -1210 -1002 -731 -909 -909 -755 -1196 -1626 -1236
1342a236K93k67K65N24n29o14M80L43q5l34N07N77p35m83M19L57j08K93R1l16
$$ -1236 -943 -1210 -945 -421 -950 -1564 -1084 -741 -826 -1160 -653 -76 -811 -1294 -875 -518 -626 -333 -242 -558
1362e58j0J41L44K0p4L15m8l02l83P68M96m09k37N11l27k30Q2O57K42n07L33l10
$$ -558 -568 -427 -83 -63 -137 178 130 -172 -555 213 709 300 63 574 247 17 99 756 998 491 824 514
1384E14Lk60M69L31l74J44P2L8n38L71O99j02n96R5L14n40j17Q62J46l74o67M28
$$ 514 517 257 726 1057 683 827 899 937 399 770 1469 1367 771 866 1180 640 523 1385 1531 1157 490 918
1406I18n1k01K74L74j70r39n9O82r7l81N41J78p08j09M89j95l94L9P22k42p76
$$ 918 867 666 940 1314 1144 205 146 828 731 350 891 1069 361 252 741 546 152 191 913 671 -105
1427a05M31j42L0o37O50K42o67j26P34k19o87J13M18q9l16j60J05k73l37N72J01
$$ -105 326 184 214 -423 227 469 -198 -324 410 191 -496 -383 35 -54 -370 -530 -425 -698 -1035 -463 -362
1448c62J05m23J80k97n3J03K57l41n15N19K59n01k10M90K88m38m4J19J77n42K21
$$ -362 -257 -680 -500 -797 -850 -747 -490 -831 -1346 -827 -568 -1069 -1279 -789 -501 -939 -983 -864 -687 -1229 -1008
1469a008M88K38j126J32P02m99L4N56K09m29m32R6O27l72K43J55j21L1j02J50
$$ -1008 -520 -282 -1408 -1276 -574 -1073 -1039 -483 -274 -703 -1135 -1039 -412 -784 -541 -386 -507 -476 -578 -428
1489d28j7j32O00k8m50k77P48n3m8M5N72m61n69O24L72O6m09q8O62l88k66P47
$$ -428 -445 -577 23 -5 -455 -732 16 -37 -85 -40 532 71 -498 126 498 564 155 67 729 341 75 822
1511H22P8o34J87K56l53N0j75P50k03j05L66Q8o22j02L61O87q22k31O70l58N9
$$ 822 900 266 453 709 356 406 231 981 778 673 1039 1127 505 403 764 1451 629 398 1068 710 769
1532G69j1N46j44m06K41M1j81l24L70K39m32Q9n6KM4J6k29j9k50o1K25M1j01K57
$$ 769 758 1304 1160 754 995 1036 855 531 901 1140 708 797 741 743 787 803 574 555 305 244 469 510 409 666
1556F66l09m77J25O63m23j14Mj14Q8k53M2J64o31J59M74k2n93k4L58k52l72k8
$$ 666 357 -120 5 668 245 131 135 21 109 -144 -102 62 -569 -410 64 42 -551 -575 -217 -469 -841 -869
1578h69P84l48m13M56j23l02k91K20L36m13j27P16n5n12qJ16p2o7P7K36k14j03
$$ -869 -85 -433 -846 -390 -513 -815 -1106 -886 -550 -963 -1090 -374 -429 -941 -949 -833 -905 -972 -895 -659 -873 -976
1600i76K60k1m33J91N65m29l98K55M11Lj12J51N9l01J65M80n8k83j92O23k18l77
$$ -976 -716 -737 -1170 -979 -414 -843 -1241 -986 -575 -572 -684 -533 -474 -775 -610 -130 -188 -471 -663 -40 -258 -635
1622f35N66R5m2p38P66J64l62k35O47L2k68j31L92K4J63q9O0K34m35M1M96m67
$$ -635 -69 26 -16 -754 12 176 -186 -421 226 258 -10 -141 251 275 438 349 409 643 208 249 745 278
1644B78J61L02J52o99L32lM25l37J88j39j52L03j02M36j51m33K41L86m33j61L40
$$ 278 439 741 893 194 526 523 948 611 799 660 508 811 709 1145 994 561 802 1188 755 594 934
1665I34k54l9K55j36m0k5J39n4o05K97M2K88m78Q1R2M63n78N6J40l64q2P5L94
$$ 934 680 641 896 760 720 695 834 780 175 472 514 802 324 405 497 960 382 438 578 214 132 207 601
1688F01k37m85K79q1j12k89L21j49l16L52J84m78R7L63ml83j61K95J10l86M5k12
$$ 601 364 -121 158 77 -35 -324 -3 -152 -468 -116 68 -410 -313 50 46 -337 -498 -203 -93 -479 -434 -646
1710f46k0j21K47K49k73m60M84J12l83P7kL02o16r5M57J21l46Q2K47j28n07M23
$$ -646 -666 -787 -540 -291 -564 -1024 -540 -428 -811 -734 -736 -434 -1050 -1145 -688 -567 -913 -831 -584 -712 -1219 -796
1732g96K14kJ00J15k01m26q6Q26k92l0K1K09J40l68Q7M79k17j52P2K32l10K18
$$ -796 -582 -584 -484 -369 -570 -996 -1082 -256 -548 -578 -557 -348 -208 -576 -489 -10 -227 -379 -307 -75 -385 -167
1754a67J10K32n70J55K62J6l60N16M12n68o8M71q8k29K97k2J35l80K08M78k97
$$ -167 -57 175 -395 -240 22 38 -322 194 606 38 -30 441 353 124 421 399 534 154 362 840 543
1775E43Ol7J76M0k3l1J51m12N2M84J45p06J07j00M68j93j81L94k24m38N68j9K5
$$ 543 549 512 688 728 705 674 825 413 465 949 1094 388 495 395 863 670 489 883 659 221 789 770 795
1798G95M2k06K05k94k4J83j6j56N1j42j79k3j42M98l49j80N22n32J67O0M5l35
$$ 795 837 631 836 542 518 701 685 529 580 438 259 236 94 592 243 63 585 53 220 280 325 -10
1820a0M0M1K41k27m66M68j16n56Q9N12k7l34k87N09k59k25J07K86k48l74L67L33
$$ -10 30 71 312 85 -381 87 -29 -585 -496 16 -11 -345 -632 -123 -382 -607 -500 -214 -462 -836 -469 -136
1842a36k72j25j77J21m09M13J86l57J47o6J32q1n35J92J17J42q3L55l0m31K57
$$ -136 -408 -533 -710 -589 -998 -585 -399 -756 -609 -675 -543 -624 -1159 -967 -850 -708 -791 -436 -466 -897 -640
1863f40L05P6m05M1L57o9l87M26k40O4K8J15m83K30K41L00k05M4O1O5k69K40M6
$$ -640 -335 -259 -664 -623 -266 -335 -722 -296 -536 -472 -444 -329 -812 -582 -341 -41 -246 -202 -141 -76 -345 -105 -59
1886e9K81k78k41N08j98l6r0J59L96q72P97J18k68k24M14J32j80K70l58M65m02
$$ -59 222 -56 -297 211 13 -23 -113 46 442 -430 367 485 217 -7 407 539 359 629 271 736 334
1907C34K26r0J00j8L4j1K06l36N13k91J19k6j34l08J37K12J06j52k53r2L56j99
$$ 334 560 470 570 552 586 575 781 445 958 667 786 760 626 318 455 667 773 621 368 276 632 433
1929D33k0l5K75j84m5J56l80J79R7l01K72k67J74j61L35m05J11J38n2q8l2j2J84
$$ 433 413 378 653 469 424 580 200 379 476 175 447 180 354 193 528 123 234 372 320 232 200 188 372
1952C72k03j65q4j59l6M91n72j23M91R8m49j43J18M1nm02O70m17L39o18R0j0K33
$$ 372 169 4 -80 -239 -275 216 -356 -479 12 110 -339 -482 -364 -323 -328 -730 -60 -477 -138 -756 -666 -676 -443
1975d43k2K20m05k99M05L75l47k04L20j33l53j3Q9J70j39o4L67N7m06L15J14l64
$$ -443 -465 -245 -650 -949 -544 -169 -516 -720 -400 -533 -886 -899 -810 -640 -779 -843 -476 -419 -825 -510 -396 -760
1997g60k6N29J00k09j89L69k15q5K27j46M6m6J98J67J01k20L44l32j90P0M81J24
$$ -760 -786 -257 -157 -366 -555 -186 -401 -486 -259 -405 -359 -405 -207 -40 61 -159 185 -147 -337 -267 214 338
2019C38j79m53P25l39r8J69M08o60J20K10k05L55p3J82J55l01O4J57k65k09M09
$$ 338 159 -294 431 92 -6 163 571 -89 31 241 36 391 318 500 655 354 418 575 310 101 510
2040E10M18l84m9l8K35k74p1L56k3No9J38k74R9L96l50j46M6r9r8J03J76Nj59
$$ 510 928 544 495 457 692 418 347 703 680 685 616 754 480 579 975 625 479 525 426 328 431 607 612 453
2064D53j37J67k55J08K2q4K94p35N92J4j77j27j35L08j94L7j36K26l54j34R6K18
$$ 453 316 483 228 336 358 274 568 -167 425 439 262 135 0 308 114 151 15 241 -113 -247 -151 67
2086F7k52l39K93K84k99k94N32m50P8M3l6p9p8Q2n9k33K51J41l7k01J26L34k93
$$ 67 -185 -524 -231 53 -246 -540 -8 -458 -380 -337 -373 -452 -530 -448 -507 -740 -489 -348 -385 -586 -460 -126 -419
2109d19k48j40P46m00k61k9L49k32J55L6jk55J51o1J33k28L30n8l90K09j82M76
$$ -419 -667 -807 -61 -461 -722 -751 -402 -634 -479 -443 -444 -699 -548 -609 -476 -704 -374 -432 -822 -613 -795 -319
2131c19q1N0J58j20l13J47J03K58r7l8q2M41m74J42J12L5M5lK42Pq7k06N6K78
$$ -319 -400 -350 -192 -312 -625 -478 -375 -117 -214 -252 -334 107 -367 -225 -113 -78 -33 -36 206 213 126 -80 -24 254
2155B54J05j37p7K50J74L4l9l53L69j81Mr1M29k23k68N03J87k46l2L08l29n3K5
$$ 254 359 222 145 395 569 603 564 211 580 399 403 312 741 518 250 753 940 694 662 970 641 588 613
2178F13k10M11o12K90J63L1J8l02K93r6j80KPJ18j55R7K4j40K60m45k22R3L47
$$ 613 403 814 202 492 655 686 704 402 695 599 419 421 428 546 391 488 512 372 632 187 -35 58 405
2201D05j75Q2j98J16q1l73K06l9M75k65k00M0k29j41R1J78r9K24j79M0J42l09
$$ 405 230 312 114 230 149 -224 -18 -57 418 153 -47 -7 -236 -377 -286 -108 -207 17 -162 -122 20 -289
2223b89K84n61K50Pj80J66k7l32J63k25J59l23K89L97l56J54j31l06M57j36J40
$$ -289 -5 -566 -316 -309 -489 -323 -350 -682 -519 -744 -585 -908 -619 -222 -578 -424 -555 -861 -404 -540 -400
2244d00lL1K22k63m35L99n7J37J40k29P5J05j0n6l3R2N9k15K24n4K71l35K5J16
$$ -400 -403 -372 -150 -413 -848 -449 -506 -369 -229 -458 -383 -278 -288 -344 -377 -285 -226 -441 -217 -271 0 -335 -310 -194
2268a94j67L53j42m1q8J81j03o8L60k07l3M56l6m7m95K11q9K68j6K66K3p5l1R6
$$ -194 -361 -8 -150 -191 -279 -98 -201 -269 91 -116 -149 307 271 224 -271 -60 -149 119 103 369 392 317 286 382
2292C82J46j15J19K81n46L14j6j01k51J6L34M1%j31J37k35q4J29J8k69M68Rj22
$$ 382 528 413 532 813 267 581 565 464 213 229 563 604 604 473 610 375 291 420 438 169 637 646 524
2315E24n11J03K94O8k4k14K74N9m53L14k51L18l40k01J95J59j90L09o14L99J85
$$ 524 13 116 410 478 454 240 514 573 120 434 183 501 161 -40 155 314 124 433 -181 218 403
2336D03p10M28J58j76n9j33j6Q2K00j83j47K11k28l35J57K49k00n7n4J09j02N
$$ 403 -307 121 279 103 44 -89 -105 -23 177 -6 -153 58 -170 -505 -348 -99 -299 -356 -410 -301 -403 -398
2358c98j08k15K53QK26p4L09j70l94k4K71L0J37n03K14k09k5J53k35P1J19k4L89
$$ -398 -506 -721 -468 -460 -234 -308 1 -169 -563 -587 -316 -286 -149 -652 -438 -647 -672 -519 -754 -683 -564 -588 -199
2381a99o5l68j5N16k58J50k57K0M56j28k20n3K47j6r9K12P1j51M7n7j46L87R8
$$ -199 -264 -632 -647 -131 -389 -239 -496 -476 -20 -148 -368 -421 -174 -190 -289 -77 -6 -157 -110 -167 -313 74 172
2404A72k07j26J38m2K12J05k52J75J49l82L92J33j69j57L20k77KJ95N6K13k22
$$ 172 -35 -161 -23 -65 147 252 0 175 324 -58 334 467 298 141 461 184 186 381 437 650 428
2425D28K08k02l00L62k53K27o5q0K02m7Q9r2J83l00m0l5J52J08J03M2k76l2J03
$$ 428 636 434 134 496 243 470 405 325 527 480 569 477 660 360 320 285 437 545 648 690 414 382 485
2448D85k31K20N3l87K97j66jm83N75J35k45j80J72k35m8K07N2k77J18P7l4j81
$$ 485 254 474 527 140 437 271 270 -213 362 497 252 72 244 9 -39 168 220 -57 61 138 104 -77
2470g7J54K6k26j5l9K86l51L18m81J65JJ48l84J64l7l9K59m2j93J3n8K22m78M71
$$ -77 77 103 -123 -138 -177 109 -242 76 -405 -240 -239 -91 -475 -311 -348 -387 -128 -170 -363 -350 -408 -186 -664 -193
2494a93j60k32L77l3P8j03l80L68r1NN5k04k18M49R4n05R4l08K86P26n26K42j26
$$ -193 -353 -585 -208 -241 -163 -266 -646 -278 -369 -364 -309 -513 -731 -282 -188 -693 -599 -907 -621 105 -421 -179 -305
2517c05%m5P6j9n4L8J38J62j51j92K55J2k7K41k35ql4j49L91l22M20k78K30p3
$$ -305 -305 -350 -274 -293 -347 -309 -171 -9 -160 -352 -97 -85 -112 129 -106 -114 -148 -297 94 -228 192 -86 144 71
2541G1j58L10j79M66n12M20J53l60n3k42K21L91R5r4k99j30N13j02p4j97L63l92
$$ 71 -87 223 44 510 -2 418 571 211 158 -84 137 528 623 529 230 100 613 511 437 240 603 211
2563B11N67l89j28L83j13k59K18k87n3K67n8m4O4J32q8k11k1K01K44m32L0J19
$$ 211 778 389 261 644 531 272 490 203 150 417 359 315 379 511 423 212 191 392 636 204 234 353
2585C53k5k21K5m5k4R6k41K9J46J17J95k74l9m4o6j12M6J69K47l62N9l45k45O66
$$ 353 328 107 132 87 63 159 -82 -53 93 210 405 131 92 48 -18 -130 -84 85 332 -30 29 -316 -561 105
2609A05m55K11J18k23j07K79j46j31m4K5o6j24J59j08p1J28J91m52l92P75l7j61
$$ 105 -350 -139 -21 -244 -351 -72 -218 -349 -393 -368 -434 -558 -399 -507 -578 -450 -259 -711 -1103 -328 -365 -526
2631e26J64K1j88J07k48J83J74j6m6q0J67l92K05k40J76J39M9J77k35M3r7K60
$$ -526 -362 -341 -529 -422 -670 -487 -313 -329 -375 -455 -288 -680 -475 -715 -539 -400 -351 -174 -409 -366 -463 -203
2653b03N9J13l43J31J51J74K19m36K1Q0J42j96M6K49j30K32k93Q8lJ99j39L2j47
$$ -203 -144 -31 -374 -243 -92 82 301 -135 -114 -34 108 -88 -42 207 77 309 16 104 101 300 161 193 46
2676D6J06r3j65O29p8j09n8J34J5J24m28P1K17j84nN2Q7J08K03l33j61K61j28
$$ 46 152 59 -106 523 445 336 278 412 427 551 123 194 411 227 222 274 361 469 672 339 178 439 311
2699C11K3K67n0j29mJ28n65M42j11J37k95m12O11j17O42l06l79j00l35Q29n64
$$ 311 334 601 551 422 418 546 -19 423 312 449 154 -258 353 236 878 572 193 93 -242 587 23
2720B3K08Q3p9k27j11K89j17q4j00J43j10M6m9J80p5o0k66N14l77O7Pj80p7K27
$$ 23 231 314 235 8 -103 186 69 -15 -115 28 -82 -36 -85 95 20 -40 -306 208 -169 -102 -95 -275 -352 -125
2744a25J17k55j60Q6k11K59k19j67M93m2k55K70m69R2J73j92R8K38k63J35M0p
$$ -125 -8 -263 -423 -337 -548 -289 -508 -675 -182 -224 -479 -209 -678 -586 -413 -605 -507 -269 -532 -397 -357 -364
2766c64j53J75K80k84n6N9L0j3k79J27K64K16l47O5M24n57L11l2o6J38j9j27K8
$$ -364 -517 -342 -62 -346 -402 -343 -313 -326 -605 -478 -214 2 -345 -280 144 -413 -102 -134 -200 -62 -81 -208 -180
2789a80k7J90J67k29J0J5J96j17J67R0k40K69k19L04l67N0J74j14J57J06k89K30
$$ -180 -207 -17 150 -79 -69 -54 142 25 192 282 42 311 92 396 29 79 253 139 296 402 113 343
2811C43j90j86N73J27k80k93M52m35J00J32K75l31m0Q2J25k21K55J71l24j13L5
$$ 343 153 -33 540 667 387 94 546 111 211 343 618 287 247 329 454 233 488 659 335 222 257
2832B57K06l43L88k74L05j38j15lj53L1j47O9n4K23M6j87Q8j29Q4J28n3q5k97
$$ 257 463 120 508 234 539 401 286 283 130 161 14 83 29 252 298 111 199 70 154 282 229 144 -153
2855a53K07k13K61j54k36R0K13LJ03m66K03N1j18p6J40m0j28J94k30L90n38j0
$$ -153 54 -159 102 -52 -288 -198 15 18 121 -345 -142 -91 -209 -285 -145 -185 -313 -119 -349 41 -497 -507
2877e07K46m8l4K21j92J43k29J50L0n8r4Oq5O2j81J55J79n6J40l44N54p38O20
$$ -507 -261 -309 -343 -122 -314 -171 -400 -250 -220 -278 -372 -366 -451 -389 -570 -415 -236 -292 -152 -496 58 -680 -60
2900f0j49N2K4j29k4P2r7Q4J43j28L29l17L6j21L33k23j90K50L37k47k17K94K55
$$ -60 -209 -157 -133 -262 -286 -214 -311 -227 -84 -212 117 -200 -164 -285 48 -175 -365 -115 222 -25 -242 52 307
2923C07n98K91J1K0j39J93J35j67r7j26J1K67N1K47l43L8p2K23M7r1J29R1j02
$$ 307 -291 0 11 31 -108 85 220 53 -44 -170 -159 108 159 406 63 101 29 252 299 208 337 428 326
2946C26J60J3k77L09k93j61L46k76M44j74l9n9k22N46l46K70j67jj8k17L92m02
$$ 326 486 499 222 531 238 77 423 147 591 417 378 319 97 643 297 567 400 399 381 164 556 154
2968A54K07j20K75l62L15l11J00J48l83J15k20j54J96J67k21J67j00J25J27m91
$$ 154 361 241 516 154 469 158 258 406 23 138 -82 -236 -40 127 -94 73 -27 98 225 -266
2988b66R3J90k18R8J30k11J45l33L30r9M12p96L6K15m6Oq9m0J05J26l27L09J06
$$ -266 -173 17 -201 -103 27 -184 -39 -372 -42 -141 271 -525 -489 -274 -320 -314 -403 -443 -338 -212 -539 -230 -124
3011a24J21l18O1J07j65o8M3K79j49k39l4k0L47l03J69j08l5p8L45n5J06j50k02
$$ -124 -3 -321 -260 -153 -318 -386 -343 -64 -213 -452 -486 -506 -159 -462 -293 -401 -436 -514 -169 -224 -118 -268 -470
3034d70K56j23k1J56J4j53K16O2k48K69J03m51L39L3r9o5J21O7k3j03j68M0J15
$$ -470 -214 -337 -358 -202 -188 -341 -125 -63 -311 -42 61 -390 -51 -18 -117 -182 -61 6 -17 -120 -288 -248 -133
3057a33r5L97j45J82j74K01j2j65M25l23Q8k9K8K09q1k05k74O42o7k15J05j6L69
$$ -133 -228 169 24 206 32 233 221 56 481 158 246 217 245 454 373 168 -106 536 469 254 359 343 712
3080G12n94K85j4m13K64J50L29l32Mkj9j03K59l4l39J02r6j34p6M5L8J00K56r9
$$ 712 118 403 389 -24 240 390 719 387 391 389 370 267 526 492 153 255 159 25 -51 -6 32 132 388 289
3104B89L6j90K30j30n4k90P3J67j69M7k55J86J35m5n8L96k92m8J2l88K09p2kk2
$$ 289 325 135 365 235 181 -109 -36 131 -38 9 -246 -60 75 30 -28 368 76 28 40 -348 -139 -211 -213 -235
3128b35Q4N2O7p0l3l76J14J70J39l15L89k52q5L10k18K11j04L4m80J68J4r3K40
$$ -235 -151 -99 -32 -102 -135 -511 -397 -227 -88 -403 -14 -266 -351 -41 -259 -48 -152 -118 -598 -430 -416 -509 -269
3151b69n8j8J9J62K2k00K80k15l49K82J06o4J01l31K75l06L55R5L0p0j68Lq0m4
$$ -269 -327 -345 -326 -164 -142 -342 -62 -277 -626 -344 -238 -302 -201 -532 -257 -563 -208 -113 -83 -153 -321 -318 -398 -442
3175d42L10n7j4M58j43M4J56k22k0j21j55M17j0L8r7M7J01l0J12j8j59j27K53
$$ -442 -132 -189 -203 255 112 156 312 90 70 -51 -206 211 201 239 142 189 290 260 372 354 195 68 321
3198C21L6j68k8j0J43OO4k02K84j89j30K31J50p4k46Q1J92j24j18K8j39M07Kj9
$$ 321 357 189 161 151 294 300 364 162 446 257 127 358 508 434 188 269 461 337 219 247 108 515 517 498
3222D98k10j63L1L8J41k01K03j53j93j5J30K52k59J34J3K16l89K01l57J66J18
$$ 498 288 125 156 194 335 134 337 184 -9 -24 106 358 99 233 246 462 73 274 -83 83 201
3243B01n85J92O08j85k59r0L49k57qM3j61L2L08k18m8J9k33L80l71N4Q8j79p9
$$ 201 -384 -192 416 231 -28 -118 231 -26 -34 9 -152 -120 188 -30 -78 -59 -292 88 -283 -229 -141 -320 -399
3266c99K75l08J02J08k76K21n6J56n2k64L44j59q4J62m8J54o8J31j93L41l55l6
$$ -399 -124 -432 -330 -222 -498 -277 -333 -177 -229 -493 -149 -308 -392 -230 -278 -124 -192 -61 -254 87 -268 -304
3288c04M0j39r4J34J18L07k16m6J16k72M01k0k46N7p7o8N52l95J34r0J98j59j21
$$ -304 -264 -403 -497 -363 -245 62 -154 -200 -84 -356 45 25 -221 -164 -241 -309 243 -152 -18 -108 90 -69 -190
3311a90j6O35m17J64J8p0l04L27J24m75O79k16j42K35k59L2m6K69N6k35K17o6
$$ -190 -206 429 12 176 194 124 -180 147 271 -204 475 259 117 352 93 125 79 348 404 169 386 320
3333C20J10j0k11L60k42q1J5j3j61J12J39k00m4PJ21j12K49l45K88Q3n3K12k69
$$ 320 430 420 209 569 327 246 261 248 87 199 338 138 94 101 222 110 359 14 302 385 332 544 275
3356B75j05K54k7O3m48J37o5K40k40j75L46m9Q3j63j48L11j94j41j94J43J68k2
$$ 275 170 424 397 460 12 149 84 324 84 -91 255 206 289 126 -22 289 95 -46 -240 -97 71 49
3378D9l4J4l69J01J34k3L72m27M58m95k82M22l32nK08k7j23K37J36l90J39k66
$$ 49 15 29 -340 -239 -105 -128 244 -183 275 -220 -502 -80 -412 -417 -209 -236 -359 -122 14 -376 -237 -503
3400e03K01J2q1L3O6J67l42R4K80o5k6k22m1K56m29L31N6Ok63J10L48j56k72L23
$$ -503 -302 -290 -371 -338 -272 -105 -447 -353 -73 -138 -164 -386 -427 -171 -600 -269 -213 -207 -470 -360 -12 -168 -440 -117
3424a17Q3k24K50l29K20k65l7N04p6J7k94K49k51J83R5O8j3p9L8j00o6J7M01k55
$$ -117 -34 -258 -8 -337 -117 -382 -419 85 9 26 -268 -19 -270 -87 8 76 63 -16 22 -78 -144 -127 274 19
3448A9l9L69k00n1N0M3l0q0R1O2pK48m06K74j08k9j2J24l9l4m26N34j57N3k6O2
$$ 19 -20 349 149 98 148 191 161 81 172 234 227 475 69 343 235 206 194 318 279 245 -181 353 196 249 223 285
3474B85r6j56K50j15L01p7m5j83j46K22l9K17l21j35NL78m19M9J95O6j00j48J52
$$ 285 189 33 283 168 469 392 347 164 18 240 201 418 97 -38 -33 345 -74 -25 170 236 136 -12 140
3497A40K10k45j75K03j15J10q9j97j22J74K25o0j45k23M78k86J01n2o3J68l83
$$ 140 350 105 -70 133 18 128 39 -158 -280 -106 119 59 -86 -309 169 -117 -16 -68 -131 37 -346
3518c46L56J1l18L7J40M4J17nl57k6K90k81J87m4m51O59l9j47o3J95j93M4j34
$$ -346 10 21 -297 -260 -120 -76 41 36 -321 -347 -57 -338 -151 -195 -646 13 -26 -173 -236 -41 -234 -190 -324
3541c24R1j15J69k93P4N11k48lK82j72k50K10j7q5P8Q6j75o5J7L66n34K88O8k99
$$ -324 -233 -348 -179 -472 -398 113 -135 -138 144 -28 -278 -68 -85 -170 -92 -6 -181 -246 -229 137 -397 -109 -41 -340
3565c40K6K23O4J18j64K77k40M4j30J04L6Q3L2j19N1j4J84n3J58P5l98N19l05
$$ -340 -314 -91 -27 91 -73 204 -36 8 -122 -18 18 101 133 14 65 51 235 182 340 415 17 536 231
3588B31j49J58j50J05j21J48k8K31k98J66P2K01k02q0K25k73L8j09Q5o0J3J23
$$ 231 82 240 90 195 74 222 194 425 127 293 365 566 364 284 509 236 274 165 250 190 203 326
3610C26j68K4l6j35N2kK24P7P6n93K21K11l58L09Q5j06l34N4K27j75K49J3l18
$$ 326 158 182 146 11 63 61 285 362 438 -155 66 277 -81 228 313 207 -127 -73 154 -21 228 241 -77
3633g7K71j02J65p8k8L0k86K46q4j67J63k74j2J91l3k7j29K05Q3j24j11M0j92
$$ -77 194 92 257 179 151 181 -105 141 57 -110 53 -221 -233 -42 -75 -102 -231 -26 57 -67 -178 -138 -330
3656c30K5j1K96j96j05N0J45k49K50L16m77L12j68J8j15J76k50j3j32J97J48j04
$$ -330 -305 -316 -20 -216 -321 -271 -126 -375 -125 191 -286 26 -142 -124 -239 -63 -313 -326 -458 -261 -113 -217
3678b17J18j21q5K08O5k47l3K39mk8j83mK8J32P9J36k93K60K4j00R6j32L39j08
$$ -217 -99 -220 -305 -97 -32 -279 -312 -73 -77 -105 -288 -292 -264 -132 -53 83 -210 50 74 -26 70 -62 277 169
3702A69K5k9k5n6L38j97j2l18M04J30l21j2l10M91O9j03Q1N1p1l73N7L28j39J78
$$ 169 194 165 140 84 422 225 213 -105 299 429 108 96 -214 277 346 243 324 375 304 -69 -12 316 177 355
3726C55r3K10k94K15j87J91k20K76m22J54l3L0j83M5j6J84k63J2l5%L66m81L02
$$ 355 262 472 178 393 206 397 177 453 31 185 152 182 -1 44 28 212 -51 -39 -74 -74 292 -189 113
3749A13m1o9j84K43O7n2J76j58j47K73J30k64J90j79k23L75m63Q0r6J56m5p9J37
$$ 113 72 3 -181 62 129 77 253 95 -52 221 351 87 277 98 -125 250 -213 -133 -229 -73 -118 -197 -60
3772f0K13j08l64L34l0l75K72l25N7O71k28l86J26J79j87k0l7J78k32Q9K37k63
$$ -60 153 45 -319 15 -15 -390 -118 -443 -386 285 57 -329 -203 -24 -211 -231 -268 -90 -322 -233 4 -259
3794b59j96K50j4R7l2j42L1or7l6O5K13k26J17j21J42K41k00o4j26J8L3k9K15
$$ -259 -455 -205 -219 -122 -154 -296 -265 -271 -368 -404 -339 -126 -352 -235 -356 -214 27 -173 -237 -363 -345 -312 -341 -126
3818a26K9J99k96J58J31L4Q6q8r2O4k55M31j03o2M4J3j65n0P2k96M23L16l8m67
$$ -126 -97 102 -194 -36 95 129 215 127 35 99 -156 275 172 110 154 167 2 -48 24 -272 151 467 429 -38
3842c8L31j91J10j13J00l06K35q5J73k89L89J1n1N4L2k42j45J88k38M60j53q6
$$ -38 293 102 212 99 199 -107 128 43 216 -73 316 327 276 330 362 120 -25 163 -75 385 232 146
3864A46J60o08N43Q0J3j48Q2j87J41K18j68j14k3L28n20J63J3j7k0K00l34k30
$$ 146 306 -302 241 321 334 186 268 81 222 440 272 158 135 463 -57 106 119 102 82 282 -52 -282
3886b82M43J5l51J94r1J66K61m25q3K37j29P8l73O40k02j76K57m28L03O3k63J30
$$ -282 161 176 -175 19 -72 94 355 -70 -153 84 -45 33 -340 300 98 -78 179 -249 54 117 -146 -16
3908a6k10L83k76K90m86L7P0M00k75K0k89J11K67k43K06o2J63l77j69L89j72L7
$$ -16 -226 157 -119 171 -315 -278 -208 192 -83 -63 -352 -241 26 -217 -11 -73 90 -287 -456 -67 -239 -202
3930b02Lj11L25n7k03K9M05k34jn8k02J48J87m0J16k03k79J81J53k27L27q0j71
$$ -202 -199 -310 15 -42 -245 -216 189 -45 -46 -104 -306 -158 29 -11 105 -98 -377 -196 -43 -270 57 -23 -194
3953a94J41l23M30j90J28K80l44K55l4JJ69k62P2o7j64J06O3M8j26K93j63o3K9
$$ -194 -53 -376 54 -136 -8 272 -72 183 149 150 319 57 129 62 -102 4 67 115 -11 282 119 56 85
3976H5J25j06N7r4O4j09L03j39J04R9l44kL36l12K54j95j51L74j09j46l57N46
$$ 85 210 104 161 67 131 22 325 186 290 389 45 43 379 67 321 126 -25 349 240 94 -263 283
3998B83j35o6J73j09m2m5L01j59J01p7%n6Q3l38K93m02n7L50M8QK0l53J83n5k
$$ 283 148 82 255 146 104 59 360 201 302 225 225 169 252 -86 207 -195 -252 98 146 154 174 -179 4 -51 -53
4023e3k23OJ17K08k1j78r3J90K18k49J18J41l7j12l20J76m9J18m57L70n3j02J54
$$ -53 -276 -270 -153 55 34 -144 -237 -47 171 -78 40 181 144 32 -288 -112 -161 -43 -500 -130 -183 -285 -131
4046a31j59Q5K78n24K39N7n4J03K36k18l35L08q8m11M61K37n43K82J44j21J73
$$ -131 -290 -205 73 -451 -212 -155 -209 -106 130 -88 -423 -115 -203 -614 -153 84 -459 -177 -33 -154 19
4067A9l8j80L42j12r6K9N3k8P7Rl30J4K44Rj51J60j67K86n0k72R1K9J41J42P8
$$ 19 -19 -199 143 31 -65 -36 17 -11 66 75 -255 -241 3 12 -139 21 -146 140 90 -182 -91 -62 79 221 299
4092B99o17M61j30J03n2Q2J01n42M40j31M59p42L31k59L66j17K31m4j55p1K65
$$ 299 -318 143 13 116 64 146 247 -295 145 14 473 -269 62 -197 169 52 283 239 84 13 278
4113B78k1j36qL3mJ28J98k0m99L8K84n00L55j63L62j83N0k39j07K01j03K74j19
$$ 278 257 121 113 146 142 270 468 448 -51 -13 271 -229 126 -37 325 142 192 -47 -154 47 -56 218 99
4136I9q4J14L90n75K64l00K14R5jk11O9l15J89q2M6j88J01J78J40J5j37j61R9
$$ 99 15 129 519 -56 208 -92 122 217 216 5 74 -241 -52 -134 -88 -276 -175 3 143 158 21 -140 -41
4159d1R1j10M41l10j35l37K57J19l49K38l11J79J33j37L28j99Kk73L80j26J2J14
$$ -41 50 -60 381 71 -64 -401 -144 -25 -374 -136 -447 -268 -135 -272 56 -143 -141 -414 -34 -160 -148 -34
4181c4k31O6P8k19p5J66L59m82L94m60M04j06j7j20K22q5j09J45Q1j98J41j75
$$ -34 -265 -199 -121 -340 -415 -249 110 -372 22 -438 -34 -140 -157 -277 -55 -140 -249 -104 -23 -221 -80 -255
4203b55j9K93j23J23P2l43N42l09L2k2p0r8J37j8K21rl02J86M2K00j72K24k71
$$ -255 -274 19 -104 19 91 -252 290 -19 13 -9 -79 -177 -40 -58 163 154 -148 38 80 280 108 332 61
4226F1j31N6J04j0j06K13J63k1R1j97M4j47k11K33k9J99k28J32j19m0J49k50j2
$$ 61 -70 -14 90 80 -26 187 350 329 420 223 267 120 -91 142 113 312 84 216 97 57 206 -44 -56
4249e6M24j82J26l23K02j04j89J55Q1q0k44P6L32m48L00L25p8lk18l7k63M0M47
$$ -56 368 186 312 -11 191 87 -102 53 134 54 -190 -114 218 -230 70 395 317 314 96 59 -204 -164 283
4272B83k07L1q6pl11K26Kj46J43J91l25J25K8J5lk12J74KK87o19L50j59J24j13
$$ 283 76 107 21 14 -297 -71 -69 -215 -72 119 -206 -81 -53 -38 -41 -253 -79 -77 210 -409 -59 -218 -94 -207
4296b07j36Q4R5j55N9K80m9L2j86oK8L2Q6j63l50O52j24k90M31j79K1j99k2J26
$$ -207 -343 -259 -164 -319 -260 20 -29 3 -183 -189 -161 -129 -43 -206 -556 96 -28 -318 113 -66 -45 -244 -266 -140
4320a40k82J88P3J89Q5m61LL70j27j50L92k53r2JJ79P5k42K94j9l0r5k65N23k82
$$ -140 -422 -234 -161 28 113 -348 -345 25 -102 -252 140 -113 -205 -204 -25 50 -192 102 83 53 -42 -307 216 -66
4344f6J74j9J9m3k97K59J62M3m06K72J34k51L2m7J64J02k1j37L08l98m1K49K5
$$ -66 108 89 108 65 -232 27 189 232 -174 98 232 -19 13 -34 130 232 211 74 382 -16 -57 192 217
4367B17J72r4k55J00K62j98L25o21m9N29k64p5J62r1q3K39j85N1j79K78j45N3
$$ 217 389 295 40 140 402 204 529 -92 -141 388 124 49 211 120 37 276 91 142 -37 241 96 149
4389A49p9o4K27l22K28j26L0K63Q0j34k21K09J15m42K57O0p5k26J8N23n89K2K07
$$ 149 70 6 233 -89 139 13 43 306 386 252 31 240 355 -87 170 230 155 -71 -53 470 -119 -97 110
4412A10%r9k96J51L0j92J93N84n82N5L0k9J62k3k69M6Q6j61J04j51O2J31j35M0
$$ 110 110 11 -285 -134 -104 -296 -103 481 -101 -46 -16 -45 117 94 -175 -129 -43 -204 -100 -251 -189 -58 -193 -153
4436a53J66n5p9j74K60k5k90P0J87R0L5k40J63ql40L77Mn3J65l99N30k69j00K01
$$ -153 13 -42 -121 -295 -35 -60 -350 -280 -93 -3 32 -208 -45 -53 -393 -16 -12 -65 100 -299 231 -38 -138 63
4460F3Q0J80m23N1m5n5J81O4j28oL7K76l25j84J03J42j35K57k96M7J92l09j94
$$ 63 143 323 -100 -49 -94 -149 32 96 -32 -38 -1 275 -50 -234 -131 11 -124 133 -163 -116 76 -233 -427
4483d27N02J56j52M2Q7K17j67j24j22M4p0K09l4o1nk0p7mK46r6k05k7K66J45j91
$$ -427 75 231 79 121 208 425 258 134 12 56 -14 195 161 100 95 75 -2 -6 240 144 -61 -88 178 323 132
4508A32K12l69J94k05K04J11j68Q2j13O6J17k03j46M2L2J44MJ76m48R4N4J0p6
$$ 132 344 -25 169 -36 168 279 111 193 80 146 263 60 -86 -44 -12 132 136 312 -136 -42 12 22 -54
4531e4j15J89L50k80l0K59m07K76m4l62K93mM8q1K9j36N3q0L59n50K18M14o58
$$ -54 -169 20 370 90 60 319 -88 188 144 -218 75 71 119 38 67 -69 -16 -96 263 -287 -69 345 -313
4554c13K63j17PK22k53m07J64J9N07j03K75m33P1K25n35P2j61L4K84K10O6k40
$$ -313 -50 -167 -160 62 -191 -598 -434 -415 92 -11 264 -169 -98 127 -408 -336 -497 -463 -179 31 97 -143
4576a43J56k26K15m24L84K1M7k35K01j79Q7N2k90L24j67J33J02o2L66l71J00J21
$$ -143 13 -213 2 -422 -38 -17 30 -205 -4 -183 -96 -44 -334 -10 -177 -44 58 -4 362 -9 91 212
4598B12j43n0O2k90L22O6l47K54k12L02R2n76N4L03J64k14Lr4m5J99p0K00p6j46
$$ 212 69 19 81 -209 113 179 -168 86 -126 176 268 -308 -254 49 213 -1 2 -92 -137 62 -8 192 116 -30
4622c0K32j47L3J63p7j65K22o9k1j25K77J48k85J14l11K42k57J12J45J27j3n3
$$ -30 202 55 88 251 174 9 231 162 141 16 293 441 156 270 -41 201 -56 56 201 328 315 262
4644B62j82O9K01l13J94k53K0K08l52L7J9j49L82j26P8k14K23k38K34l10K23k54
$$ 262 80 149 350 37 231 -22 -2 206 -146 -109 -90 -239 143 17 95 -119 104 -134 100 -210 13 -241
4666b41j94L78K04k28k19P0M06k56n2J93k55j30L15M7m12J99r6K49q2k05L93K7
$$ -241 -435 -57 147 -81 -300 -230 176 -80 -132 61 -194 -324 -9 38 -374 -175 -271 -22 -104 -309 84 111
4688A11k02l1K78j87j47j97J2J08M33j54r8k80K46M9j19J79r1J46q2L8m4l9Q2
$$ 111 -91 -122 156 -31 -178 -375 -363 -255 178 24 -74 -354 -108 -59 -178 1 -90 56 -26 12 -32 -71 11
4711A1J21l90l7L15j8q6j1r2k7J50j63j08J54P1k5J01J35l01J03q5L13K2j10k85
$$ 11 132 -258 -295 20 2 -84 -95 -187 -214 -64 -227 -335 -181 -110 -135 -34 101 -200 -97 -182 131 153 43 -242
4735b42K71j23L61l50J53M8j24K48n7j03K8R5Oj33O1o9K44j46k53L9J84r5R5k58
$$ -242 29 -94 267 -83 70 118 -6 242 185 82 110 205 211 78 139 70 314 168 -85 -46 138 43 138 -120
4759a20L94M7k9k75L28j88N1r6m92L89J17q2K04j29l0M26o04K01j71N12l64j05
$$ -120 274 321 292 17 345 157 208 112 -380 9 126 44 248 119 89 515 -89 112 -59 453 89 -16
4781a6K32j24j08J36m9J44k16mk17n1J33K91J3l48L39J43n26J72K14m25Q3K17
$$ -16 216 92 -16 120 71 215 -1 -5 -222 -273 -140 151 164 -184 155 298 -228 -56 158 -267 -184 33
4803C3L7j77Q3j01j60K55J90l0l93K70p9L34l15j95K47l09L95m6j92j57oL01J14
$$ 33 70 -107 -24 -125 -285 -30 160 130 -263 7 -72 262 -53 -248 -1 -310 85 39 -153 -310 -316 -15 99
4826I9p41P54j7l18K28J05p8K2l80K10J46L2J0l68Q7M2K82l23J02j97K82j22o3
$$ 99 -642 112 95 -223 5 110 32 54 -326 -116 30 62 72 -296 -209 -167 115 -208 -106 -303 -21 -143 -206
4849b06K44J30j01J25k49j11J82Oj52M88m12L03n53L5L24J61k64k05M76l00j29
$$ -206 38 168 67 192 -57 -168 14 20 -132 356 -56 247 -306 -271 53 214 -50 -255 221 -79 -208
4870b08K52J18j15q9k2K42J56r9j70j0k0k51L62p6J00k6k04J25k69K86J91j30
$$ -208 44 162 47 -42 -64 178 334 235 65 55 35 -216 146 70 170 144 -60 65 -204 82 273 143
4892A43n1j88J70K34J30m65K32j74R9l8k98L31Q3n7k24l3M52k35K3j02M49j33
$$ 143 92 -96 74 308 438 -27 205 31 130 92 -206 125 208 151 -73 -106 346 111 134 32 481 348
4914C48m61J02J05M7j73L27j28l40M10l19J35l8Q7k43L8j89L58j31J49j15J07
$$ 348 -113 -11 94 141 -32 295 167 -173 237 -82 53 15 102 -141 -103 -292 66 -65 84 -31 76
4935G6J26k66J79m33L9K24J06j77k4K92l49l26L79j97L47J25l71J8K32k63K4L47
$$ 76 202 -64 115 -318 -279 -55 51 -126 -150 142 -207 -533 -154 -351 -4 121 -250 -232 0 -263 -239 108
4957A08m97M26k24J53j18P1M5l07K98q3n1l6n4R0M1M0q2l6L17p0l65l8J85QJ19
$$ 108 -389 37 -187 -34 -152 -81 -36 -343 -45 -128 -179 -215 -269 -179 -138 -98 -180 -216 101 31 -334 -372 -187 -179 -60
4982f0J64j29n4K11j42J81L7o1k82K3r5L20k0p4j38K11K54l43Q0j06K47j70p5
$$ -60 104 -25 -79 132 -10 171 208 147 -135 -112 -207 113 93 19 -119 92 346 3 83 -23 224 54 -21
5005b1j24J67K55j58J89k3l78M03m35L24J8m3J0K29m38q2J24K5M6j2K37j53J04
$$ -21 -145 22 277 119 308 285 -93 310 -125 199 217 174 184 413 -25 -107 17 42 88 76 313 160 264
5028B64k82K2P0L5j28m5p1J21P0j05j23K71k62L48j63K09m79J24K22k0n0M7r8
$$ 264 -18 4 74 109 -19 -64 -135 -14 56 -49 -172 99 -163 185 22 231 -248 -124 98 78 28 75 -23
5051b3L31m35P1N06n20o1J56R6k56L40j5J11P2k04l03J72l00K29jO0j77J8O3J12
$$ -23 308 -127 -56 450 -70 -131 25 121 -135 205 190 301 373 169 -134 38 -262 -33 -34 26 -151 -133 -70 42
5075D2l74J10L02j64j66J00K04q3j38N9M7K1o1J67j48j84K32j18K70o5l11K02
$$ 42 -332 -222 80 -84 -250 -150 54 -29 -167 -108 -61 -40 -101 66 -82 -266 -34 -152 118 53 -258 -56
5097e6q2K24k74J08q2J19j90M45p7j52Q5k21K81k90J35J48j35k04L8L93o53L97
$$ -56 -138 86 -188 -80 -162 -43 -233 212 135 -17 68 -153 128 -162 -27 121 -14 -218 -180 213 -440 -43
5119d3p9j23J98L26k6p5k29K38n3l15K10j07J01M6l71L07J41k45L05m06L54j88
$$ -43 -122 -245 -47 279 253 178 -51 187 134 -181 29 -78 23 69 -302 5 146 -99 206 -200 154 -34
5141c4J30j58K35r0J59J44k16q3N2j55K75l7j87K86p3L4j11k11K34j97P7P0j38
$$ -34 96 -62 173 83 242 386 170 87 139 -16 259 222 35 321 248 282 171 -40 194 -3 74 144 6
5164FJ17k47N2K56j01n7j78j07O6J45J74r4K80k35R2r5J40l50j8K64j26J5r6J2
$$ 6 123 -124 -72 184 83 26 -152 -259 -193 -48 126 32 312 77 169 74 214 -136 -154 110 -16 -1 -97 -85
5188h5K70m65J54j49L42jK70j89L1O2j43j7j39k79L72K9j20K82k58K50n27J67
$$ -85 185 -280 -126 -275 67 66 336 147 178 240 97 80 -59 -338 34 63 -57 225 -33 217 -310 -143
5210a43j27L1L86m66K69K44k33l00M59L9j37j86p0L98j73j57J59l68L32J05k62
$$ -143 -270 -239 147 -319 -50 194 -39 -339 120 159 22 -164 -234 164 -9 -166 -7 -375 -43 62 -200
5231b00l1K49K13k21L3n9j53M25l21K05l41L01j08J02o2r0q9L45j82M4Q2k12P8
$$ -200 -231 18 231 10 43 -16 -169 256 -65 140 -201 100 -8 94 32 -58 -147 198 16 60 142 -70 8
5254Hk3j29R9o1M18j84j82J86k26K56j79Q3K93l85j77L59o0j05J64m0M60n53J2
$$ 8 -15 -144 -45 -106 312 128 -54 132 -94 162 -17 66 359 -26 -203 156 96 -9 155 115 575 22 34
5277C4j05K05k50J42Q9O6Nm4k01L73K1k94J11o1Nj28L37l27J62m4m6l00M67l7
$$ 34 -71 134 -116 26 115 181 186 142 -59 314 335 41 152 91 96 -32 305 -22 140 96 50 -250 217 180
5301A80k49L65m99M46k58j52K0K49k14j35O22k54P3J10k36j05L16l08l6M6J50
$$ 180 -69 296 -203 243 -15 -167 -147 102 -112 -247 375 121 194 304 68 -37 279 -29 -65 -19 131
5322A31l85L14j00L7l0j33j43L50j05Kk24J75R1r4NL26l40RK37j69j17L58k18
$$ 131 -254 60 -40 -3 -33 -166 -309 41 -64 -62 -286 -111 -20 -114 -109 217 -123 -114 123 -46 -163 195 -23
5345b3j03J48j65L14l55K37o7R0k37M0J0k42L86j74P3j74K04J32j17M32l56o9
$$ -23 -126 22 -143 171 -184 53 -14 76 -161 -121 -111 -353 33 -141 -68 -242 -38 94 -23 409 53 -16
5367a6J52k94J59J00l12L04R7k2l81M17j24k07L05k29J48j00m3k41N67k44j91
$$ -16 136 -158 1 101 -211 93 190 168 -213 204 80 -127 178 -51 97 -3 -46 -287 280 36 -155
5388a55j50N97j16j47n4K15q5j04j27O5j20J43K81k29L73k32j21Jj20J92j76J27
$$ -155 -305 292 176 29 -25 190 105 1 -126 -61 -181 -38 243 14 387 155 34 35 -85 107 -69 58
5410E8J61l18N2L61Q3k80Q4l83J93o2pK79K02m12L81l90K89J39m98M16m23K60
$$ 58 219 -99 -47 314 397 117 201 -182 11 -51 -58 221 423 11 392 2 291 430 -68 348 -75 185
5432A85j58J62Q9j89J55o02O8K91j71R6J21Oj96M63m34q7J34O1j59R2j92K64j55
$$ 185 27 189 278 89 244 -358 -290 1 -170 -74 47 53 -143 320 -114 -201 -67 -6 -165 -73 -265 -1 -156
5455a56R6P6J63j91p0K43J94n27k3M29m81M06r9P5o0k59m5J34M86o60K45j48j82
$$ -156 -60 16 179 -12 -82 161 355 -172 -195 234 -247 159 60 135 75 -184 -229 -95 391 -269 -24 -172 -354
5478c54O72k83j5j11J9r2l14K25J18K30l40J3K71P0j75L54j92l4k4k34L12k61
$$ -354 318 35 20 -91 -72 -164 -478 -253 -135 95 -245 -232 39 109 -66 288 96 62 38 -196 116 -145
5500a45J27J38o5rO8L4r1K6J38k96O7j10K38j10j61L19j65J64j14O7K9j47J52
$$ -145 -18 120 55 46 114 148 57 83 221 -75 -8 -118 120 10 -151 168 3 167 53 120 149 2 154
5523A54k23P8p9K40l57M87j24J49k04K53j41O7l12j89K83L70j14l82L39l10J75
$$ 154 -69 9 -70 170 -187 300 176 325 121 374 233 300 -12 -201 82 452 338 -44 295 -15 160
5544A60k40J95K4j34J5J31J00k93j21K90K43m1k64J62m00J09O9j60j2K59j45k8
$$ 160 -80 115 139 5 20 151 251 -42 -163 127 370 329 65 227 -173 -64 5 -155 -167 92 -53 -81
5566h1J69j49O7R3k04j52K31j98K75o3K6n1k45M79j69k02K04J96l80L1k0J98j80
$$ -81 88 -61 6 99 -105 -257 -26 -224 51 -12 14 -37 -282 197 28 -174 30 226 -154 -123 -143 55 -125
5589a25K67l87K96j41j64K62m6L98j64m29L10j89Q4K23m26K01J62r3k3l12P0J66
$$ -125 142 -245 51 -90 -254 8 -38 360 196 -233 77 -112 -28 195 -231 -30 132 39 16 -296 -226 -60
5611f0J73k22L84l58k94N34l12l41M25K68j03j07K4j24K04j83J38j5k17P5J78
$$ -60 113 -109 275 -83 -377 157 -155 -496 -71 197 94 -13 11 -113 91 -92 46 31 -186 -111 67
5632F7j0j38K56l69M67k27J40M2m3j70n0j72p6K81j95J69J84m62L92P9j78K44
$$ 67 57 -81 175 -194 273 46 186 228 185 15 -35 -207 -283 -2 -197 -28 156 -306 86 165 -13 231
5654B31k23j02R7J59l26L14j08L7J43j31K99j9l19K29k60%jk55qM95k43K8m04
$$ 231 8 -94 3 162 -164 150 42 79 222 91 390 371 52 281 21 21 20 -235 -243 252 9 37 -367
5677c67Q34m76J31J46k45j11M24k25J85k79N3j96K1K06k1l5j7n6K35l39L78p4
$$ -367 467 -9 122 268 23 -88 336 111 296 17 70 -126 -105 101 80 45 28 -28 207 -132 246 172
5699A72l86J91m4r2Q4K64k62P8j56K46l7K1p9q2J31J21l52M15l74J03l9j65L33
$$ 172 -214 -23 -67 -159 -75 189 -73 5 -151 95 58 79 0 -82 49 170 -182 233 -141 -38 -77 -242 91
5722I1l54L53j46K9k22P3j14K40J77o5j77J24k09L21j85l05K04J84j2P7Mj74j28
$$ 91 -263 90 -56 -27 -249 -176 -290 -50 127 62 -115 9 -200 121 -64 -369 -165 19 7 84 88 -86 -214
5745b14L37j42N4oJ92l35K04J9k90K61j95R9O8j96L58l90Q0K65o8j65L16n81L77
$$ -214 123 -19 35 29 221 -114 90 109 -181 80 -115 -16 52 -144 214 -176 -96 169 101 -64 252 -329 48
5768D8m6K8k29M72n03P1j58M3K85Q0j59L38j33l60L05N6K40p06N47k14J0r8L20
$$ 48 2 30 -199 273 -230 -159 -317 -274 11 91 -68 270 137 -223 82 138 378 -328 219 5 15 -83 237
5791B37k47K6K57k90k03L10J13k40J38p3r7Rk2L30P6m33Q9KK39k61J46q1L99l49
$$ 237 -10 16 273 -17 -220 90 203 -37 101 28 -69 -60 -82 248 324 -109 -20 -18 221 -40 106 25 424 75
5815G5N2Q3r5j34K04l70L93j15M3J24k68j12oJ88l47R6M34j66J7K36n26J90Q5
$$ 75 127 210 115 -19 185 -185 208 93 136 260 -8 -120 -126 62 -285 -189 245 79 96 332 -194 -4 81
5838H1j39P1J97n20K60J50K28l58j93J08L1N2J31Q5m17j94L34K19l28n1N7K44
$$ 81 -58 13 210 -310 -50 100 328 -30 -223 -115 -84 -32 99 184 -233 -427 -93 126 -202 -253 -196 48
5860D8K23n64J44J36R5j66O0J14j15j0J5o2R6k14L0Q8N2r5Rj48L85l08J37M4o7
$$ 48 271 -293 -149 -13 82 -84 -24 90 -25 -35 -20 -82 14 -200 -170 -82 -30 -125 -116 -264 121 -187 -50 -6 -73
5885g3R6R2k7n4L09n41J32j60M67j64O2L2k39N46m50j01o4K7M93m25J95l6l32
$$ -73 23 115 88 34 343 -198 -66 -226 241 77 139 171 -68 478 28 -73 -137 -110 383 -42 153 117 -215
5908b15M02Mj67J44Q7j04k87J05r8j68K53J45r0kRq6J12P3l6j71K27j25J63l6
$$ -215 187 191 24 168 255 151 -136 -31 -129 -297 -44 101 11 9 18 -68 44 117 81 -90 137 12 175 139
5932A39J8LL7k11K02j28J01r5j48n5K06M3R7l26J18j56K64k65K84k54L10l87Q6
$$ 139 157 160 197 -14 188 60 161 66 -82 -137 69 112 209 -117 1 -155 109 -156 128 -126 184 -203 -117
5955a17K88l39L91m09L67l75L52m16R0K69k21O0J14j97L61j54k47O3K5r8J43l7
$$ -117 171 -168 223 -186 181 -194 158 -258 -168 101 -120 -60 54 -143 218 64 -183 -120 -95 -193 -50 -87
5977h7L8J84l02L1p9J40R0l3nJ79m37L26J33l31L41p6k95r0J99ON9M7k80M36l83
$$ -87 -49 135 -167 -136 -215 -75 15 -18 -23 156 -281 45 178 -153 188 112 -183 -273 -74 -68 -9 38 -242 194 -189
6002a89Q5J3j91o2L05j29j89K16J18q7J05R0l67o1K61L9j27N37k86m30K77Qk13
$$ -189 -104 -91 -282 -344 -39 -168 -357 -141 -23 -110 -5 85 -282 -343 -82 -43 -170 367 81 -349 -72 -64 -277
6025b77M35j89J75o8j86K49l70L25K12k43k3m9N8L08m1k96j34J07L0m6L33m89
$$ -277 158 -31 144 76 -110 139 -231 94 306 63 40 -9 49 357 316 20 -114 -7 23 -23 310 -179
6047a79m5K84J61m77m2K98q0N0K5P5L68k92L1j52j33J34N1n2K23k81n1j4L97k03
$$ -179 -224 60 221 -256 -298 0 -80 -30 -5 70 438 146 177 25 -108 26 77 25 248 -33 -84 -98 299 96
6071I6L43n06J12j68L84l99r2M96j58O0l75K13j60L3J28k87K09K87k23J07Pj68
$$ 96 439 -67 45 -123 261 -138 -230 266 108 168 -207 6 -154 -121 7 -280 -71 216 -7 100 107 -61
6093f1J21l44K81l40L34M3k62L37k42PJ56j99M3Q7n6J22j2j35J09j54k7L8J58
$$ -61 60 -284 -3 -343 -9 34 -228 109 -133 -126 30 -169 -126 -39 -95 27 15 -120 -11 -165 -192 -154 4
6116D%l3p8j6J78n5J5n0J54l45L4k2K88q4k02nP7L02j06j44P5J60k66L4q2J37
$$ 4 4 -29 -107 -123 55 0 15 -35 119 -226 -192 -214 74 -10 -212 -217 -140 162 56 -88 -13 147 -119 -85 -167 -30
6142c0j06j25R5j0K41l1l24K88j10m6J36j72K79P8q4j76Rj6O2j08L56mL4j65o6
$$ -30 -136 -261 -166 -176 65 34 -290 -2 -112 -158 -22 -194 85 163 79 -97 -88 -104 -42 -150 206 202 236 71 5
6167Ej18N0L43o37P83k62LJ21r8j62R1p9n6L3K15q2M6l22K40%k32K80k54R1K91
$$ 5 -113 -63 280 -357 426 164 167 288 190 28 119 40 -16 17 232 150 196 -126 114 114 -118 162 -92 -1 290
6192B90l77L14RK2j82k61M36j60J36j06J9N4m64L97O3j90L1K4k29J04rro1J48
$$ 290 -87 227 236 258 76 -185 251 91 227 121 140 194 -270 127 190 0 31 55 -174 -70 -79 -88 -149 -1
6216aJ50jp4j57J68k98L95j18N6m6l71L05K0N6o0n5j50j15K91j14r1K5m0L30K1
$$ -1 149 148 74 -83 85 -213 182 64 120 74 -297 8 28 84 24 -31 -181 -296 -5 -119 -210 -185 -225 105 126
6241A26k06K61m92K35m7l8N9J93k75j43M41j87j04L18NK14n89J99N95n36J25j17
$$ 126 -80 181 -311 -76 -123 -161 -102 91 -184 -327 114 -73 -177 141 146 360 -229 -30 565 29 154 37
6263C7j2k05M6J00K28k81K02k84K16J68m84J52PJ16j31J16n6K33k88N6J12j15
$$ 37 25 -180 -134 -34 194 -87 115 -169 47 215 -269 -117 -110 6 -125 -9 -65 168 -120 -64 48 -67
6285f7K4j11J42J55J11n90N31k09R5k23j02RK35l3J83j53j41k07N50j24k73J32
$$ -67 -43 -154 -12 143 254 -336 195 -14 81 -142 -244 -235 0 -33 150 -3 -144 -351 199 75 -198 -66
6307f6P7L8P0J5O6l62N4K44m10N84j51kk35M9L08k17l87M39r5o6P7J76k16m0K80
$$ -66 11 49 119 134 200 -162 -108 136 -274 310 159 157 -78 -29 279 62 -325 114 19 -47 30 206 -10 -50 230
6332B30k20j76L47n1K3r9q3k19M00k18j04L86j84L45o17J94K27o4L5q3o9L32m62
$$ 230 10 -166 181 130 153 54 -29 -248 152 -66 -170 216 32 377 -240 -46 181 117 152 69 0 332 -130
6355a30q0L81o7k38L8l2j94K71j46L81j79Q5j80J20o0J74l2l22L19l94M81l85
$$ -130 -210 171 104 -134 -96 -128 -322 -51 -197 184 5 90 -90 30 -30 144 112 -210 109 -285 196 -189
6377a89L82m75K20L47l58R6l91M04J09k17K95m29L46j0l05L59l70J31J34j4j27
$$ -189 193 -282 -62 285 -73 23 -368 36 145 -72 223 -206 140 130 -175 184 -186 -55 79 65 -62
6398f2K02n0l71K49J45M0J1k01R7j95K3P0N2q9J5J12l32K16k6n7K21Q3j11j01
$$ -62 140 90 -281 -32 113 153 164 -37 60 -135 -112 -42 10 -79 -64 48 -284 -68 -94 -151 70 153 42 -59
6422e9j63L6J80J17n54Q08l65j5j19L14j18j8l78K03J23j36J62j00J82l3J19J31
$$ -59 -222 -186 -6 111 -443 365 0 -15 -134 180 62 44 -334 -131 -8 -144 18 -82 100 67 186 317
6444C17k06K0Q4l05J41j79M62k36J64l99j6K31J16k90L1pj67N45k03m09M56j39
$$ 317 111 131 215 -90 51 -128 334 98 262 -137 -153 78 194 -96 -65 -72 -239 306 103 -306 150 11
6466A1K72k77L40l29j91M76l19J00j78m0J33k97N70n42l8L52k94M56k23rJ01M1
$$ 11 283 6 346 17 -174 302 -17 83 -95 -135 -2 -299 271 -271 -309 43 -251 205 -18 -27 74 115
6488A15k53L59m35L41o7j28kJ67j25n3o7L1L07k22k8q5k8K32l6J24k06J35k99
$$ 115 -138 221 -214 127 60 -68 -70 97 -28 -81 -148 -117 190 -32 -60 -145 -173 59 23 147 -59 76 -223
6511b23J75p5J11M7O1o7k52LJ83j1k7j79m0J46M80m83j5L30j21L4l15P6O9j10
$$ -223 -48 -123 -12 35 96 29 -223 -220 -37 -48 -75 -254 -294 -148 332 -151 -166 164 43 77 -238 -162 -93 -203
6535b03N2K52J17k22j90M08l78J77R4l7J41k97N2J61Q1l5k54J23r0j74L00q3M6
$$ -203 -151 101 218 -4 -194 214 -164 13 107 70 211 -86 -34 127 208 173 -81 42 -48 -222 78 -5 41
6558D1k37j33N90m09J45P4k72J50m9L67k13k24L22P5Kk70J89k23Rj17K80j05K97
$$ 41 -196 -329 261 -148 -3 71 -201 -51 -100 267 54 -170 152 227 229 -41 148 -75 -66 -183 97 -8 289
6581B89j23P1l17J08j33K1K47p0q4Q6n6K2j65L51o1j52K26l33J51q9j79J19K55
$$ 289 166 237 -80 28 -105 -84 163 93 9 95 39 61 -104 247 186 34 260 -73 78 -11 -190 -71 184
6604A84J2m96K24lj72L03m0m0j64J40r6L53q1q3o3k0O7q2L56k28J02m25J84o2
$$ 184 196 -300 -76 -79 -251 52 12 -28 -192 -52 -148 205 124 41 -22 -42 25 -57 299 71 173 -252 -68 -130
6628a30k41L88l10K79m7J31k23K76n36j50P05J01j12n5J91O5l00n1j13J06m7J24
$$ -130 -371 17 -293 -14 -61 70 -153 123 -413 -563 142 243 131 76 267 332 32 -19 -132 -26 -73 51
6650E1j7j45N4J3j29L32p3j65L14n6J65m14L58l59o6J91l49K98j7M41k28Jm6j12
$$ 51 34 -111 -57 -44 -173 159 86 -79 235 179 344 -70 288 -71 -137 54 -295 3 -14 427 199 200 154 42
6674D2j96N7J98k5j27l5J38Nk49j72L85j06Q6j2k53N78j68l7j50j73K21r2j23
$$ 42 -154 -97 101 76 -51 -86 52 57 -192 -364 21 -85 1 -11 -264 314 146 109 -41 -214 7 -85 -208
6697b08L9O5N33o44J72l2M0K37l43K6K74j16N2k66k9J91J55j61J71j69L57k82
$$ -208 -169 -104 429 -215 -43 -75 -35 202 -141 -115 159 43 95 -171 -200 -9 146 -15 156 -13 344 62
6719F2k23n8K56p2Rj58K18j37Q2L0r1M0K74j89r6j9J78k4L2j17p1j06K38K33k36
$$ 62 -161 -219 37 -35 -26 -184 34 -103 -21 9 -82 -42 232 43 -53 -72 106 82 114 -3 -74 -180 58 291 55
6744E5J51k77j11L57J00j43M7k05j10K65j27P3k8j19K04j70R1K34m29j13L9K68
$$ 55 206 -71 -182 175 275 132 179 -26 -136 129 2 75 47 -72 132 -38 53 287 -142 -255 -216 52
6766E2q6n4K57p6l8k74L52k01j23L74L0k02k7j03l4K09o0j44r6K81j11j3J67k63
$$ 52 -34 -88 169 93 55 -219 133 -68 -191 183 213 11 -16 -119 -153 56 -4 -148 -244 37 -74 -87 80 -183
6790a83J56K36l23Q7J54j25j5oR6j47K12o6Q8j59l3p3q7O0j59K12L29m46R7J69
$$ -183 -27 209 -114 -27 127 2 -13 -19 77 -70 142 76 164 5 -28 -101 -188 -128 -287 -75 254 -192 -95 74
6814G4k09K82K4j97J55j93M56j65j02k22k5J70Q1J37l27J22M6l25L31j0J52n30
$$ 74 -135 147 171 -26 129 -64 392 227 125 -97 -122 48 129 266 -61 61 107 -218 113 103 255 -275
6836b75L09J07O8n0l34M17k18J87j16r6no2J05k30L20Q5k69j63K81q4O6j54K08
$$ -275 34 141 209 159 -175 242 24 211 95 -1 -6 -68 37 -193 127 212 -57 -220 61 -23 43 -111 97
6859I7q0m0K05p4J48l76N9j55K65J24k49p3K0m9j38K36QJ27j33Q4Q9j72K53k36
$$ 97 17 -23 182 108 256 -120 -61 -216 49 173 -76 -149 -129 -178 -316 -80 -72 55 -78 6 95 -77 176 -60
6883f0J89R7k22j24OK69j15j83J73J37n8l57L91J1J27l12R3r7l05N04m61lJ18
$$ -60 129 226 4 -120 -114 155 40 -143 30 167 109 -248 143 154 281 -31 62 -35 -340 164 -297 -300 -182
6906a82K10J29k13M7O5J29k14k37L92n30L13j5Q7k27M04j29K11j56l42J7p7K44
$$ -182 28 157 -56 -9 56 185 -29 -266 126 -404 -91 -106 -19 -246 158 29 240 84 -258 -241 -318 -74
6928g4J28k36J14M9J44O0l8j48J3M9j66j70L23J10j37L60m18L58l24K82m50L17
$$ -74 54 -182 -68 -19 125 185 147 -1 12 61 -105 -275 48 158 21 381 -37 321 -3 279 -171 146
6950A46k8k55J61K29k19O4j01N8k54J05M03n21K45l1j10k22L30k21J18L76k50
$$ 146 118 -137 24 253 34 98 -3 55 -199 -94 309 -212 33 2 -108 -330 0 -221 -103 273 23
6971B3k2K27j51J8k08K7N23p69K23J72k11J78j89K81O7k50K62j54k1k56L36J53
$$ 23 1 228 77 95 -113 -86 437 -332 -109 63 -148 30 -159 122 189 -61 201 47 26 -230 106 259
6993B59k29J99j05j82n7q6J39O4N4n56J85L55n0j07K64l7k81J5L01j83K98j83
$$ 259 30 229 124 -58 -115 -201 -62 2 56 -500 -315 40 -10 -117 147 110 -171 -156 145 -38 260 77
7015G7k60J69j17O5J68Q5j02j85m0o8J20K4j8O1K63k16j77L14p3r6K79n04K14
$$ 77 -183 -14 -131 -66 102 187 85 -100 -140 -208 -88 -64 -82 -21 242 26 -151 163 90 -6 273 -231 -17
7038a7j32k9M4LM4R6J56n0O7j35p0K49l72J11K09j30J52k48J27l0j37k40M10l23
$$ -17 -149 -178 -134 -131 -87 9 165 115 182 47 -23 226 -146 -35 174 44 196 -52 75 45 -92 -332 78 -245
7062b45m3L31k10M6L23k77J54o3J62l24K59K07k31j73J04j33J32%m72O01k69J27
$$ -245 -288 43 -167 -121 202 -75 79 16 178 -146 113 320 89 -84 20 -113 19 19 -453 148 -121 6
7084FJ28m3n8J43k54Q4kj01J88OL5L4k34Q9oM0K20J14n00K04n7J43k77R4o5M12
$$ 6 134 91 33 176 -78 6 4 -97 91 97 132 166 -68 21 15 55 275 389 -111 93 36 179 -98 -4 -69 343
7110C43m04K35q3k6J29p8n3j04J24K46k55k88M74O8k66Q1r4j37L25j12N6l60J07
$$ 343 -61 174 91 65 194 116 63 -41 83 329 74 -214 260 328 62 143 49 -88 237 125 181 -179 -72
7133g2j97J93J68j48K01q1L27m74o2L43l29N6J31j77k06K0K66j59L78j31Nl19
$$ -72 -269 -76 92 -56 145 64 391 -83 -145 198 -131 -75 56 -121 -327 -307 -41 -200 178 47 52 -267
7155b67J02L99j51Ol04J35J19l43L21m3Nj19p4L1o3K28o8Q7L82l16l3J59J57j0
$$ -267 -165 234 83 89 -215 -80 39 -304 17 -26 -21 -140 -214 -183 -246 -18 -86 1 383 67 34 193 350 340
7179C40l36j18J60K33p9o4pq1K05m67K06Jj6J27j89J88L2J63m53J18p7q8%R8O
$$ 340 4 -114 46 279 200 136 129 48 253 -214 -8 -7 -23 104 -85 103 135 298 -155 -37 -114 -202 -202 -104 -98
7204i8K09J26l96K85j59O4rj66O1M36l22m7M3N9l7j23J64P7m52O71k32j72K15
$$ -98 111 237 -159 126 -33 31 22 -144 -83 353 31 -16 27 86 49 -74 90 167 -285 386 154 -18 197
7227A97J95o65M46k3j15l07K99J54l07Q7J95j95J37l14J99j34J2L0m7K02J64l95
$$ 197 392 -273 173 150 35 -272 27 181 -126 -39 156 -39 98 -216 -17 -151 -139 -109 -156 46 210 -185
7249a85K78K6j70p2J98l1K1J21o2J32j79k58J3L9J76m16M25n9K6j7m5j9j39K45
$$ -185 93 119 -51 -123 75 44 65 186 124 256 77 -181 -168 -129 47 -369 56 -3 23 6 -39 -58 -197 48
7273D8Q3j23J65j86J94j38Q6k29J54k97K21J91j18J19q1K65l80j9J16r5o4l7J87
$$ 48 131 8 173 -13 181 43 129 -100 54 -243 -22 169 51 170 89 354 -26 -45 71 -24 -88 -125 62
7296F2O5k72N68n49J10j36P4J78m75L80J2k52N81k75q4J33N4rkj38l21M78k13
$$ 62 127 -145 423 -126 -16 -152 -78 100 -375 5 17 -235 346 71 -13 120 174 165 163 25 -296 182 -31
7319c1K44j20L7J76j28k90N23o63LK17K45k3k19j7L51k33N62o05j32O6M1J77k0
$$ -31 213 93 130 306 178 -112 411 -252 -249 -32 213 190 -29 -46 305 72 634 29 -103 -37 4 181 161
7342A61K9j92J48j50pJ00J54n40K19JK25m21N13k10j07k19L50J72m86K86k58K50
$$ 161 190 -2 146 -4 -11 89 243 -297 -78 -77 148 -273 240 30 -77 -296 54 226 -260 26 -232 18
7364A8R2j57O2J17l48J44L08m49O8L59k24q5K30K2j02k80M65j30M4k89K00k69
$$ 18 110 -47 15 132 -216 -72 236 -213 -145 214 -10 -95 135 157 55 -225 240 110 154 -135 65 -204
7386b04J77m2n5J38njP9J14m39L71J08j08l72M62J08l74J37j70j7j59K55K60l14
$$ -204 -27 -69 -124 14 9 8 87 201 -238 133 241 133 -239 223 331 -43 94 -76 -93 -252 3 263 -51
7409e1r0P9J57l37J65J73N2j6k02J91k49K06j50K98k86K46j14j91LJ16O9o0J3
$$ -51 -141 -62 95 -242 -77 96 148 132 -70 121 -128 78 -72 226 -60 186 72 -119 -116 0 69 9 22
7432B2R4j16j49q3J8j41M30l90K75o2L1J24n4pP7j44K39l03K14p0l54K31K35j89
$$ 22 116 0 -149 -232 -214 -355 75 -315 -40 -102 -71 53 -1 -8 69 -75 164 -139 75 5 -349 -118 117 -72
7456g2j09L46p8m%R5l66K76k28L39l9J07l12m5J86q0K65l81J65J22k21j6j98K56
$$ -72 -181 165 87 83 83 178 -188 88 -140 199 160 267 -45 -90 96 16 281 -100 65 187 -34 -50 -248 8
7480Hj62L00k86K58Nj71K23j00n0n0j19q0J40J19J3j6N5l6R2k24J57o3p5J32L21
$$ 8 -154 146 -140 118 123 -48 175 75 25 -25 -144 -224 -84 35 48 32 87 51 143 -81 76 13 -62 70 391
7505C91l88M0j50m1L24m6k74n9k31K38O8J19k71N94q9k03j37l1K06k04j8K22j1
$$ 391 3 43 -107 -148 176 130 -144 -203 -434 -196 -128 -9 -280 314 225 22 -115 -146 60 -144 -162 60 49
7528D9k09K30m07K24j2R3K22m19j3L94p4j93K43n5j28o8J34L5j99P4kK49l51L56
$$ 49 -160 70 -337 -113 -125 -32 190 -229 -242 152 78 -115 128 73 -55 -123 11 46 -153 -79 -81 168 -183 173
7552A73m0k71K18Nok63K84J23k62J02j38J3l9L88j78k71L05m74L09L28n12J67
$$ 173 133 -138 80 85 79 -184 100 223 -39 63 -75 -62 -101 287 109 -162 143 -331 -22 306 -206 -39
7574c9N4n8K5J3J87j20J34k67n2J03M5l2J10j63O7L1j59M67j31j04K54l79mJ15
$$ -39 15 -43 -18 -5 182 62 196 -71 -123 -20 25 -7 103 -60 7 38 -121 346 215 111 365 -14 -18 97
7598I7J09j81k3Q1k07J83j29r7K43J38r7j50j30J89J66j43j09%r4J9O3r9L23j32
$$ 97 206 25 2 83 -124 59 -70 -167 76 214 117 -33 -163 26 192 49 -60 -60 -154 -135 -72 -171 152 20
7622B0p9K47l40J87J61k64mj66K80J53J6j99L7l5j19J23Qj06L14k58J13q1n6l7
$$ 20 -59 188 -152 35 196 -68 -72 -238 42 195 211 12 49 14 -105 18 26 -80 234 -24 89 8 -48 -85
7646h5m1L7r5O4J15n3L3L8l01K57k25M8P9l8K7K4j41J21J68K05l23J46J36k02
$$ -85 -126 -89 -184 -120 -5 -58 -25 13 -288 -31 -256 -208 -129 -167 -140 -116 -257 -136 32 237 -86 60 196 -6
7670fk5q9N1K64m18l4L26j64K38k15M11l64K33j74k21K94k37L49k50J36k51R1
$$ -6 -31 -120 -69 195 -223 -257 69 -95 143 -72 339 -25 208 34 -187 107 -130 219 -31 105 -146 -55
7692e5J1k2J69l95J63K39k1o0j73L2J99n6P5K33k70n9L12l48r3R2kr9J56l04J38
$$ -55 -44 -66 103 -292 -129 110 89 29 -144 -112 87 31 106 339 69 10 322 -26 -119 -27 -29 -128 28 -276 -138
7717a38L25k7n0r3l69K58L3L25k11J32j4k03q8M8o4K49L36k89K3K1j29J38k66
$$ -138 187 160 110 17 -352 -94 -61 264 53 185 171 -32 -120 -72 -136 113 449 160 183 204 75 213 -53
7740e3OP5O8j12P8J02j89j68M24m21K00J7k78J38J16j3J20l9p7j60J19J00M7j90
$$ -53 -47 28 96 -16 62 164 -25 -193 231 -190 10 27 -251 -113 3 -10 110 71 -6 -166 -47 53 100 -90
7764i0R8J01j84pR3J55j54l58K95j4j95r2K72P8k3K42k95j37l8O64l45L44n48
$$ -90 8 109 -75 -82 11 166 12 -346 -51 -65 -260 -352 -80 -2 -25 217 -78 -215 -253 411 66 410 -138
7787a38R4M3L66l48m0R4m29R5K90j31N3K96l1l02J43N8j85j23J51K22n21O28m47
$$ -138 -44 -1 365 17 -23 71 -358 -263 27 -104 -51 245 214 -88 55 113 -72 -195 -44 178 -343 285 -162
7810a62J25J05j2l9k17N1L50J08l77r2R8K43j66j30K35j75ok95J85J40J23K01
$$ -162 -37 68 56 17 -200 -149 201 309 -68 -160 -62 181 15 -115 120 -55 -61 -356 -171 -31 92 293
7832B93l74j92J08P5K47r1q5P8j44J47k86N26K1m19J61l7j10J73j58J06J33l07
$$ 293 -81 -273 -165 -90 157 66 -19 59 -85 62 -224 302 323 -96 65 28 -82 91 -67 39 172 -135
7854a35K05j10J71q6m7R0k68J19j52Q5j34N23j36k06M57l12j04k92K63J13p7j07
$$ -135 70 -40 131 45 -2 88 -180 -61 -213 -128 -262 261 125 -81 376 64 -40 -332 -69 44 -33 -140
7876a40o1M3O3p2J33l7P6n9P1n5L30j70j06k9n8J53K9l74N46k91p2P3p5K74l17
$$ -140 -201 -158 -95 -167 -34 -71 5 -54 17 -38 292 122 16 -13 -71 82 111 -263 283 -8 -80 -7 -82 192 -125
7901a25j19M30n58N8M22l30P0j24K56K16j91N6k63J42M1L0j2k34J13M4J0j00j11
$$ -125 -244 186 -372 -314 108 -222 -152 -276 -20 196 5 61 -202 -60 -19 11 -1 -235 -122 -78 -68 -168 -279
7924b79J63k66L26K18q0K53j70k31k59K76K10m5j94j3L8K02n73L18J95q1j20K09
$$ -279 -116 -382 -56 162 82 335 165 -66 -325 -49 161 116 -78 -91 -53 149 -424 -106 89 8 -112 97
7946I7j99K69k33J27j77K64j34j99K41M8k34P7p8MN0K98l01J87p5r8L13l20Q7
$$ 97 -102 167 -66 61 -116 148 14 -185 56 104 -130 -53 -131 -127 -77 221 -80 107 32 -66 247 -73 14
7969A4ML34K0n56m8J52R2LM4k3K54j32k48J52l4L06m25J20j39L89J3l53j31K99
$$ 14 18 352 372 -184 -232 -80 12 15 59 36 290 158 -90 62 28 334 -91 29 -110 279 292 -61 -192 107
7993A07k31k4K52j96j59K31J01o1m0L7K6o0J9j76L29l38J86l8J41k12Q6j88J66
$$ 107 -124 -148 104 -92 -251 -20 81 20 -20 17 43 -17 2 -174 155 -183 3 -35 106 -106 -20 -208 -42
8016d2l6k91J66L07K16l26p7K3j54L8L11j5m20K36L06l43M57n57L01o7j17l31
$$ -42 -78 -369 -203 104 320 -6 -83 -60 -214 -176 135 120 -300 -64 242 -101 356 -201 100 33 -84 -415
8038d15O69j80M1k85M54j6k48qR7k07R2K7k50n0K15j42L97l6k83K49p2j23k17
$$ -415 254 74 115 -170 284 268 20 12 109 -98 -6 21 -229 -279 -64 -206 191 155 -128 121 49 -74 -291
8061b91K22J70J8j46l9R5j36j41K39j15K45k87M0J21K8J3L5j28O1p3K72j6o8j0
$$ -291 -69 101 119 -27 -66 29 -107 -248 -9 -124 121 -166 -126 -5 23 36 71 -57 4 -69 203 187 119 109
8085A09r8O3q6Q2Q6k66m7OJ44k25K20J80K82m02J25l31M18j37Mk89M42o4k8k83
$$ 109 11 74 -12 70 156 -110 -157 -151 -7 -232 -12 168 450 48 173 -158 260 123 127 -162 280 216 188 -95
8109i5j64M63k35o1J2P9l50M56l09L42j94R1J09j98N1L76l11K9k94N9O1J60j26
$$ -95 -259 204 -31 -92 -80 -1 -351 105 -204 138 -56 35 144 -54 -3 373 62 91 -203 -144 -83 77 -49
8132d9K84m6k38j19M0M0R7K79l70k4j51L91j80J16J54r2j12p2n7J01j50N16j88
$$ -49 235 189 -49 -168 -128 -88 9 288 -82 -106 -257 134 -46 70 224 132 20 -52 -109 -8 -158 358 170
8155A70n50L91j29l3J61k08J70o8J17k96K45J76k21N8K30k21L1j75R1l3l3L64
$$ 170 -380 11 -118 -151 10 -198 -28 -96 21 -275 -30 146 -75 -17 213 -8 23 -152 -61 -94 -127 237
8177B37j71L6k48n7j7L21k89j57M17R7j67j76J19k80
$$ 237 66 102 -146 -203 -220 101 -188 -345 72 169 2 -174 -55 -335
8191c35
$$ Imaginary data points
##PAGE= N=2
##DATA TABLE= (X++(I..I)), XYDATA
0@%%%%%%%%%kJ0j6J6j6K3l1L2m0M8n6O5p3Q8j03J18j35J53j71J95k23K49k79L15
$$ 0 0 0 0 0 0 0 0 0 0 -2 8 -8 8 -8 15 -16 16 -24 24 -32 33 -40 48 -55 63 -72 81 -90 105 -118 131 -148 167
33A67l52L93m40M89n44O05o69P40q20R07j004J113j233J368j523J700j905K147
$$ 167 -185 208 -232 257 -287 318 -351 389 -431 476 -528 585 -648 720 -803 897 -1008 1139
51A139k434K785l226L793m558N655p372J0452j7686O6112L6079j31653j4093P6471
$$ 1139 -1295 1490 -1736 2057 -2501 3154 -4218 6234 -11452 54660 90739 -40914 -55007 21464
65B1464K8992p2713j8928N9048L6185m3831l1587J7795K2549j4835j6475O716
$$ 21464 50456 -22257 -41185 17863 54048 10217 -21370 -3575 18974 4139 -12336 -5620
77e620K0957N405j3513j4443P315J2405r599j7738J1975K4886p567k6526O871
$$ -5620 15337 20742 7229 -7214 101 12506 2907 -14831 -2856 22030 14463 -12063 -5192
90e192K3524r387k8780Q651L0780k295k5891l5J7010k188j3576L360R652j599
$$ -5192 18332 8945 -19835 -11184 19596 17301 -8590 -8625 8385 6197 -7379 -4019 5633 4034
104D034m645L80k294l373O360L592p060q45R843k963j6798J595J9147J02j6968
$$ 4034 -611 -231 -2525 -5898 462 4054 -3006 -3851 5992 3029 -13769 -12174 6973 7075 -9893
119i893L222J6357p651j9381O715J7988q232j3334J3898J5709j4877j9984Q506
$$ -9893 -6671 9686 2035 -17346 -10631 7357 -875 -14209 -311 15398 521 -19463 -10957
132a0957J3766o574o388J1528P088r686p346L626q56m699M709Q940l92m210L16
$$ -10957 2809 -3765 -10153 1375 8463 -1223 -8569 -4943 -5799 -10498 -5789 3151 2759 -1451 -1135
147a135j785m511J006L571j801J50R264J919j1888l737J1173Q59j5041N39J8893
$$ -1135 -2920 -7431 -6425 -2854 -4655 -4505 4759 6678 -5210 -8947 2226 3085 -11956 -11417 7476
162G476M444j5861l215J1975q87j3724J997J3812l53q404L202O569o425p846O503
$$ 7476 11920 -3941 -7156 4819 3932 -9792 -7795 6017 5664 -2740 462 7031 606 -7240 -737
177g37N908l122j751L265k098l512N759M859q683n631J0127N968j0660n754J1830
$$ -737 5171 2049 298 3563 1465 -2047 3712 8571 -112 -5743 4384 10352 -308 -6062 5768
192E768O838j0583o209Q110L185p381j021P500M38m649J525K049m707k175N365
$$ 5768 12606 2023 -4186 3924 7109 -272 -1293 6207 6645 1996 3521 5570 863 -1312 4053
207D053J716n849K52P122l21p168P30L829m285l950O599N408n963l635O401Q34
$$ 4053 5769 -80 172 7294 6973 -195 535 4364 79 -3871 2728 8136 2173 -1462 4939 5773
223E773r477j644Q783J569o294Q78O818l225q003K056N232k434l202L862K979
$$ 5773 -3704 -5348 3435 5004 -1290 -412 6406 3181 -4822 -2766 2466 32 -3170 692 3671
238C671m352j473L653j642m805J668N559k122m702L410L749m486l820M561J633
$$ 3671 -681 -2154 1499 -143 -4948 -3280 2279 157 -4545 -1135 2614 -1872 -5692 -1131 502
253E02m984q79N315Q22m672P50L882k952m219L078K973l207j750N164K160n505
$$ 502 -4482 -5361 -46 776 -3896 -3146 736 -2216 -6435 -3357 -384 -3591 -5341 -177 1983 -3522
269c522j373L586q21m288K370N930k099m281L181K254m788l359M890L608m013
$$ -3522 -4895 -1309 -2130 -6418 -4048 1882 -217 -4498 -1317 937 -3851 -7210 -2320 1288 -2725
284b725j47M934k67n856l5L599p09k948M077L170k644k829L087Rm333K32O074
$$ -2725 -2872 2062 1795 -4061 -4096 -497 -1206 -4154 -77 3093 449 -2380 707 716 -3617 -3385 2689
301B689n4l643J207M182l213m873K745M412j963l037M311K603m268k878L630J247
$$ 2689 2635 -1008 199 4381 1168 -3705 -960 3452 1489 -1548 2763 5366 1098 -1780 1850 3097
317C097k517J91L481j431k487J526K832k824j986L188J556l137j490L198P35j967
$$ 3097 580 771 4252 2821 334 1860 4692 1868 -118 3070 4626 1489 -1 3197 3932 1965
333A965M86J517j196k220K282N89l513J47M834Q36n422r53M365l28n149J56N586
$$ 1965 2451 3968 2772 552 2834 3423 -90 57 4891 5727 305 -648 3717 3389 -1760 -1604 3982
350C982P4l308P41J713l019k627K322K602k350o36L720O03n576k003L003J249
$$ 3982 4056 748 1489 3202 183 -2444 -122 2480 130 -506 3214 3817 -1759 -3762 -759 490
366D90j174L52J438r56n64O39k226k965K537M571j456m639K199M328k628o079
$$ 490 -684 -332 1106 150 -414 225 -2001 -4966 -2429 2142 686 -3953 -1754 2574 -54 -6133
382f133J127N129k45k552Q39J767j839j335R56j24j653J672L291k057k875J193
$$ -6133 -5006 123 -122 -2674 -1835 -68 -1907 -3242 -2286 -2410 -4063 -2391 900 -1157 -4032 -2839
398b839J960j574j393J828J016j908J014J599j856k112K760L263l696l631L695
$$ -2839 -879 -2453 -3846 -2018 -1002 -2910 -1896 -297 -2153 -4265 -1505 1758 -1938 -5569 -1874
413a874M022l367l869M010L578k847l202K562K060k460j320K799J645k239j72
$$ -1874 2148 -1219 -5088 -1078 2500 -347 -3549 -987 1073 -1387 -2707 92 1737 -502 -674
428f74K165r67k770P16K695N69q18L50L69r59l62n12n32J072L381j49k957l99
$$ -674 1491 524 -2246 -1530 1165 1734 916 1266 1635 676 314 -198 -730 342 3723 3574 617 218
446B18L056r87l781R11M975O99m444j41L546q16l995N36M375m51k971J213K162
$$ 218 3274 2287 -1494 -583 4392 5091 647 506 4052 3236 -759 -223 4152 3701 730 1943 4105
463D105j020k573P41J239p12k99J140k4n79J90K17j798p54K093R34k274j10K348
$$ 4105 3085 512 1253 2492 1780 1481 2621 2597 2018 2208 2425 627 -127 1966 2900 626 516 2864
481B864o50k920K92K318n45k412J103K233j354k482J398J906j399j646M73R06
$$ 2864 2214 -706 -414 1904 1359 -1053 50 2283 929 -1553 -155 1751 352 -1294 -821 85
497H5j132M6J268k44q04J431j038k404q60L527P44l191N46L221j099m265l4L772
$$ 85 -1047 -1001 267 23 -781 650 -388 -2792 -3652 -125 619 -2572 -2026 1195 96 -4169 -4203 -431
515d31n0k535P06K863j432k896P10J875j057j545J860J593j307r62J281j12j454
$$ -431 -481 -3016 -2310 553 -879 -3775 -3065 -1190 -2247 -3792 -1932 -339 -1646 -2608 -1327 -1439 -2893
532b893Q0R23K41m64J361N58j742n87R29M1j312J383K085o19j876M90J116r88
$$ -2893 -2813 -1890 -1649 -2113 -752 -194 -1936 -2523 -1594 -1553 -2865 -1482 603 -16 -1892 -1402 -286 -1274
550a274j122J824J598j364j082J943Q84k538k79K375L71k210M21J876k33j463
$$ -1274 -2396 -572 1026 -338 -1420 523 1407 -1131 -1410 965 1336 -874 -453 1423 1190 -273
566b73R13J176p97j239J393M38q89K11J971l09j728K32J320r08j478J493J869
$$ -273 640 1816 1019 -220 1173 1611 722 933 2904 2595 867 1099 2419 1511 33 1526 3395
583C395l83j789J020L20j681n80K072N51q43q00J065k42q52J08L85j82m94J001
$$ 3395 3012 1223 2243 2563 882 302 2374 2925 2082 1282 2347 2105 1253 1361 1746 1564 1070 2071
601B071L81j206L26J133r39k102K64K104l94j037J116J031k279j710J099R29k67
$$ 2071 2452 1246 1572 2705 1766 -336 -72 2032 1638 601 1717 2748 469 -1241 -142 787 520
618E20M7J388q72k230L90J440k83j754J085J667j138k059Q48R33r16m61J290o50
$$ 520 567 1955 1083 -1147 -757 683 400 -1354 -269 1398 260 -1799 -951 -18 -934 -1395 -105 -755
636g55j609O46J814n15j843K75J603j185j631J250J735j141j385J282P40j411
$$ -755 -2364 -1718 96 -419 -2262 -1987 -384 -1569 -3200 -1950 -215 -1356 -2741 -1459 -719 -2130
652b130o77J252L84j087L87R50q91q85J324J210k028j303J575J475r45J4J188
$$ -2130 -2807 -1555 -1171 -2258 -1871 -921 -1812 -2697 -1373 -163 -2191 -3494 -1919 -444 -1389 -1375 -187
669a87p05j182K69J053k79j298J745J386j228j320J187P46j789k19K180J029j508
$$ -187 -892 -2074 -1805 -752 -1031 -2329 -584 802 -426 -1746 -559 187 -1602 -1821 359 1388 -120
686a20p37J122k81p15N73R28q98k24J927K20k075k95J632O37j228OJ431l20r85
$$ -120 -857 265 -16 -731 -158 770 -128 -352 1575 1795 -280 -575 1057 1694 466 472 1903 1583 598
705E98J84J140o67q01R02O61p76k11J084r2j495O60J517n90j792P23J336l25p77
$$ 598 782 1922 1255 454 1356 2017 1241 1030 2114 2022 527 1187 2704 2114 322 1045 2381 2056 1279
724A279N85P4p21k50J209N7k028O23J227J43j335J24O92q89n63Q10R45j170n35
$$ 1279 1864 1938 1217 967 2176 2233 205 828 2055 2198 863 987 1679 790 227 1037 1982 812 277
743B77P06L19j075K2M06r93n23J562J213j516j775R68J183j357p12J041O83j137
$$ 277 983 1302 227 249 655 -338 -861 701 1914 398 -1377 -409 774 -583 -1295 -254 429 -708
761g08j11J051p88j555J153J122q40j201O66R60j214r60J264N10j590l01J361
$$ -708 -819 232 -556 -2111 -958 164 -676 -1877 -1211 -251 -1465 -2425 -1161 -651 -2241 -2542 -1181
778a181P09j213n48P65n36l39J387N71j257q84J120Q15j329n72J821j92r85N86
$$ -1181 -472 -1685 -2233 -1468 -2004 -2343 -956 -385 -1642 -2526 -1406 -591 -1920 -2492 -671 -863 -1848 -1262
796a262M51q10o18J298J119j006r67M60Q8j74N12J394o39j282o9J653j81q83L50
$$ -1262 -811 -1621 -2239 -941 178 -828 -1795 -1335 -1247 -1421 -909 485 -154 -1436 -1505 148 -33 -916 -566
815e66R07k95q08P87P28o56l48J330N7j717O02J489j12j015J52K39l56o05P07
$$ -566 341 46 -762 25 753 97 -251 1079 1136 -581 21 1510 1398 383 535 774 418 -187 520
834E20J486Q0j093j27J42j20L51N73M4p86K17L38m80j25L52J27j00J48K14m93
$$ 520 2006 2086 993 866 1008 888 1239 1812 1856 1070 1287 1625 1145 1020 1372 1499 1399 1547 1761 1268
854A268p60Q19R83p66j045N20J101j143k87J386j66j293p45J869n5j709M4J206
$$ 1268 508 1327 2310 1544 499 1019 2120 977 690 2076 1910 617 -128 1741 1686 -23 21 1227
872A227K93j303Q6O22n6j236M69N26p48l52R75O6p33m50M82K49q72K53M74n5p34
$$ 1227 1520 217 303 925 869 -367 102 628 -120 -472 503 569 -164 -614 -132 117 -755 -502 -28 -83 -817
893h17l6K83o26K20M99m0j069K86P57J24j101RM22l65n30J176M31j249p7O43k64
$$ -817 -853 -570 -1196 -976 -477 -517 -1586 -1300 -543 -419 -1520 -1511 -1089 -1454 -1984 -808 -377 -1626 -1703 -1060 -1324
914a324r35J81J182N18j262r7N39m02p77J445J020j112j231O41J170p56j95O55
$$ -1324 -2259 -2078 -896 -378 -1640 -1737 -1198 -1600 -2377 -932 88 -1024 -2255 -1614 -444 -1200 -1395 -740
932g40P27q27p35Q05L58n54P38K29p31j77M9O76J8PQ18o30j09M0J14L14K7j4K0
$$ -740 -13 -840 -1575 -770 -412 -966 -228 1 -730 -907 -858 -182 -164 -157 661 31 -78 -38 76 390 417 403 423
955D23p26N64O92L73r58J25P63l74l73q4J190j32j94k26J30k14m17R84K69k39
$$ 423 -303 261 953 1326 368 493 1256 882 509 425 1615 1483 1289 1063 1193 979 562 1546 1815 1576
975A576k95J77O1l37JK02k52k03K93M75l35l80K15L39r43L55P33j77m61j56N93
$$ 1576 1281 1458 1519 1182 1183 1385 1133 930 1223 1698 1363 983 1198 1537 594 949 1682 1505 1044 888 1481
996A481q57p99R80N92m98q40M38L80m24n41J93P56q38J90j76j03o09N50O75r05
$$ 1481 624 -175 805 1397 899 59 497 877 453 -88 105 861 23 213 37 -66 -675 -125 550 -355
1016c55m90P43j00l96j37L36j75m24J73O34p06m18M69O04p02m05O07N69p73p34
$$ -355 -845 -102 -202 -598 -735 -399 -574 -998 -825 -191 -897 -1315 -846 -242 -944 -1349 -742 -173 -946 -1680
1036a680R65k48m44l82Q25M59j035q9K42M90j033N86M50%l30L11J72o11k71M30
$$ -1680 -715 -963 -1407 -1789 -964 -505 -1540 -1629 -1387 -897 -1930 -1344 -894 -894 -1224 -913 -741 -1352 -1623 -1193
1056a193q9L05J91J23k37k09N54K42q39J30J033k50l16l44Q20p0k48l82P97L13
$$ -1193 -1282 -977 -786 -663 -900 -1109 -555 -313 -1152 -1022 11 -239 -555 -899 -79 -149 -397 -779 18 331
1076C31m85J41L12l24k28L73L71j07j63O52m60j66J65N59m07j30L79M78m79P1
$$ 331 -154 -13 299 -25 -253 120 491 384 221 873 413 247 412 971 564 434 813 1291 812 883
1096H83J98J10o29P4P87op95N96o7j28k50J8Q44n65l62Q66j86k73k24P15l41l89
$$ 883 1081 1191 562 636 1423 1417 622 1218 1151 1023 773 791 1635 1070 708 1574 1388 1115 891 1606 1265 876
1118H76K86N71o34o89O21K99k60m10M41k26k13j79N70j88o12R5L75l67rP5J48
$$ 876 1162 1733 1099 410 1031 1330 1070 660 1101 875 662 483 1053 865 253 348 723 356 347 422 570
1139E70m66j21PL98l31k41J88K23j017K17Q59o10o88N31L49o70m41O62R1q27K65
$$ 570 104 -17 -10 388 57 -184 4 227 -790 -573 286 -324 -1012 -481 -132 -802 -1243 -581 -490 -1317 -1052
1160a052K71L4o69M29K33J45p24K59N30n21l71K24L02m01K3K75J53m15o2O91k76
$$ -1052 -781 -747 -1416 -987 -754 -609 -1333 -1074 -544 -1065 -1436 -1212 -910 -1311 -1288 -1013 -860 -1275 -1337 -646 -922
1181i22o06M12M98l61l08L7O31n00o8N05ok74K0K87K08l74P2L80o1l1K3M47k48
$$ -922 -1528 -1116 -618 -979 -1287 -1250 -619 -1119 -1187 -682 -688 -962 -942 -655 -447 -821 -749 -369 -430 -461 -438 9 -239
1204b39k43O09k04l12L84K63k34k87Q29o7n39J03P00J17n60k31J087j88j001K87
$$ -239 -482 127 -77 -389 -5 258 24 -263 566 499 -40 63 763 880 320 89 1176 988 -13 274
1224B74R41l82m50M99L69k09r72J012N66p46j88P6M97m64K62L48K7n65N1N57n73
$$ 274 1215 833 383 882 1251 1042 70 1082 1648 902 714 790 1287 823 1085 1433 1460 895 946 1503 930
1245I30j91P08P6o57k51K59J55k30n0L28J71o74pQ7p1j29K65K28p08l38N28J35
$$ 930 739 1447 1523 866 615 874 1029 799 749 1077 1248 574 567 654 583 454 719 947 239 -99 429 564
1267E64o19N61K95o73p64L17P01o18m15Q55Q7j127l92J563j20r04p4N51k7q40
$$ 564 -55 506 801 128 -636 -319 382 -236 -651 204 291 -836 -1228 335 215 -689 -763 -212 -239 -1079
1287a079q1N95J06m09RJ64j07l98q5P89l93M5j24m15O0R6J83J37l04J99L38p12
$$ -1079 -1160 -565 -459 -868 -859 -695 -802 -1200 -1285 -496 -889 -844 -968 -1383 -1323 -1227 -1044 -907 -1211 -1012 -674 -1386
1309a386J25N58n6j45j02N85Qj167O01Q20m35n31L90M02M6q32M72O73n95j80O60
$$ -1386 -1261 -703 -759 -904 -1006 -421 -413 -1580 -979 -159 -594 -1125 -735 -333 -287 -1119 -647 26 -569 -749 -89
1330h9L23n70rN84j82m18N17Q3l44r8O43N4l38J44L52l43o00N54R04k33m65P14
$$ -89 234 -336 -345 239 57 -361 156 239 -105 -203 440 494 156 300 652 309 -291 263 1167 934 469 1183
1352A183l0o63n14P49P45k62m70R9k27j67M39L62q5o14J45P89q03Q1M46J61m22
$$ 1183 1153 490 -24 725 1470 1208 738 837 610 443 882 1244 1159 545 690 1479 676 757 1203 1364 942
1373I42n20N51k8n47rR28R1q09r4K01J03p3K15K65p93j02J03K41o35K97M34j70
$$ 942 422 973 945 398 389 1317 1408 599 505 706 809 736 951 1216 423 321 424 665 30 327 761 591
1395E91o41J57R6j74m1L51J47m38r14Q16K07k59j66M80m01o90L35M34k93l01J20
$$ 591 -50 107 203 29 -12 339 486 48 -866 -50 157 -102 -268 212 -189 -879 -544 -110 -403 -704 -584
1416e84o0j04m98Q33N1j45m75M97J33q15K9N30m85J57K86l8n79NP59m9p55p4Q92
$$ -584 -644 -748 -1246 -413 -362 -507 -982 -485 -352 -1167 -1138 -608 -1093 -936 -650 -688 -1267 -1262 -503 -552 -1307 -1381 -489
1439d89J6n84r7K76j40k31O20K73k75l12J20J89k37K40p8J54l48M68K81k11k42
$$ -489 -473 -1057 -1154 -878 -1018 -1249 -629 -356 -631 -943 -823 -634 -871 -631 -709 -555 -903 -435 -154 -365 -607
1460f07J35P32p23K38K91K59p15M37L09P2n25K30O8R2J81m2K48m50j28L40L19
$$ -607 -472 260 -463 -225 66 325 -390 47 356 428 -97 133 201 293 474 432 680 230 102 442 761
1481G61l40j08L79L93o14J32N05l35J14J92r9m34P3M22J43l79Q9M40n55m85L04
$$ 761 421 313 692 1085 471 603 1108 773 887 1079 980 546 619 1041 1184 805 894 1334 779 294 598
1502E98P11k42l4n01K93N8m15N55O3l81o82R21j5m29J52P1J46q63L15L40l75o8
$$ 598 1309 1067 1033 532 825 883 468 1023 1086 705 23 944 929 500 652 723 869 6 321 661 286 218
1524B18P7L41o39k14P83m46m3n1K53o10j81M41m0k96l59O52J11l85j37J97P0k97
$$ 218 295 636 -3 -217 566 120 77 26 279 -331 -512 -71 -111 -407 -766 -114 -3 -388 -525 -328 -258 -555
1546e55m6L17l50k7j26L66k39k58J86K9m94J34M68n1l37n3N08j69k74J99lk83
$$ -555 -601 -284 -634 -661 -787 -421 -660 -918 -732 -703 -1197 -1063 -595 -646 -983 -1036 -528 -697 -971 -772 -775 -1058
1568a058l3L76J42n76K14N79j65m05M5L65j49j71K96M72p46N1P23N6m80j73N57
$$ -1058 -1091 -715 -573 -1149 -935 -356 -521 -926 -881 -516 -665 -836 -540 -68 -814 -763 -40 16 -464 -637 -80
1589h0K10m62O3M49P8l70J76k72K89K6L57j45k98K5O38j58k21J96L9n7k76O44
$$ -80 130 -332 -269 180 258 -112 64 -208 81 107 464 319 21 46 684 526 305 501 540 483 207 851
1611H51j21k77n4O41J5q38M77M98l3q10M49K20j55j18j62K71n6k76J51L33k46
$$ 851 730 453 399 1040 1055 217 694 1192 1159 349 798 1018 863 745 583 854 798 522 673 1006 760
1632G60J24j06j49J22k0K27l10k69N0Q15o09j88M35l5m68j48M03L3j61l80L60
$$ 760 884 778 629 751 731 958 648 379 429 1244 635 447 882 847 379 231 634 667 506 126 486
1653D86j83j51L62k37Jo00K89K25n16L00p8K09l12N1L9m32J73K90k55m97L14K40
$$ 486 303 152 514 277 278 -322 -33 192 -324 -24 -102 107 -205 -154 -115 -547 -374 -84 -339 -836 -522 -282
1675b82l7m40L23K85l84l07l8N11j51p3k28M61k45m12M95k24Km6l6L8j46K58J90
$$ -282 -319 -759 -436 -151 -535 -842 -880 -369 -520 -593 -821 -360 -605 -1017 -522 -746 -744 -790 -826 -788 -934 -676 -486
1698d86m98K05P1J46k52J13J93j78L5J2M5K5N9M70n5k52n07L36M64l36j61M39
$$ -486 -984 -779 -708 -562 -814 -701 -508 -686 -651 -639 -594 -569 -510 -40 -95 -347 -854 -518 -54 -390 -551 -112
1720a12J51m49K43q2L27j37J19M4K18m77L97J51j21l61O23K7l75k2M80J0j77M4
$$ -112 39 -410 -167 -249 78 -59 60 104 322 -155 242 393 272 -89 534 561 186 164 644 654 477 521
1742E21K8m7J39K52J59l58l10L58J0l66k10O35P9l11LN7Q2m12P63O3o50O2k8K26
$$ 521 549 502 641 893 1052 694 384 742 752 386 176 811 890 579 582 639 721 309 1072 1135 485 547 519 745
1766G45k4n2P3J20o14K99M6j05N8l78L98k56q1M6j44k2L7L11k26j59R3J43j71
$$ 745 721 669 742 862 248 547 593 488 546 168 566 310 229 275 131 109 146 457 231 72 165 308 137
1789A37r2k0O9k78k58O14L9k93j28j11J6j16J3K23m73J89MM09n54k59K65K92j61
$$ 137 45 25 94 -184 -442 172 211 -82 -210 -321 -305 -421 -408 -185 -658 -469 -465 -56 -610 -869 -604 -312 -473
1812d73l24J38K02k35p0K56j40k04M60Q8n72k51L93K20j70n6pJ66k60o3M74j33
$$ -473 -797 -659 -457 -692 -762 -506 -646 -850 -390 -302 -874 -1125 -732 -512 -682 -738 -745 -579 -839 -902 -428 -561
1834e61J3j31J12K30l19K28J66l32J15oj83K31pK12N4l45L55J78m6l55M76L06
$$ -561 -548 -679 -567 -337 -656 -428 -262 -594 -479 -485 -668 -437 -444 -232 -178 -523 -168 10 -36 -391 85 391
1856C91k56k25L70J98n22j0M25J61Qm87L49jl27L05K67M7o7j9q7l2L16J48j77
$$ 391 135 -90 280 478 -44 -54 371 532 540 53 402 401 74 379 646 693 626 607 520 488 804 952 775
1879G75k66J65q5j63j09O37J08l70J6j07J15k40n5O08l71j02K65k89j1l0J3L38
$$ 775 509 674 589 426 317 954 1062 692 708 601 716 476 421 1029 658 556 821 532 521 491 504 842
1901H42r5l72N7K41k72j65J04J80k58j28K14k48j37J62J46k84J13J9l22K04N0
$$ 842 747 375 432 673 401 236 340 520 262 134 348 100 -37 125 271 -13 100 119 -203 1 51
1922E1p8K4k61l20M47K49n03J46R2J07m18P2r9M14m58J73l40l3L39k79J81l49
$$ 51 -27 -3 -264 -584 -137 112 -391 -245 -153 -46 -464 -392 -491 -77 -535 -362 -702 -735 -396 -675 -494 -843
1944h43J80j09L16j30r6J37j19pJ38l75LO9K71r0k97M5O29q1j47j82K38j5j86
$$ -843 -663 -772 -456 -586 -682 -545 -664 -671 -533 -908 -905 -836 -565 -655 -952 -907 -278 -359 -506 -688 -450 -465 -651
1967f51K07q3K5Q0J59K26k59j22L31j79R5P0Km91L19R0M16k04k74L08K68n38L04
$$ -651 -444 -527 -502 -422 -263 -37 -296 -418 -87 -266 -171 -101 -99 -590 -271 -181 235 31 -243 65 333 -205 99
1990I9J08j11J76n1K05j34n3J33K71l39Q5L55j99M5l17K93j88O16k36l64M6Q4
$$ 99 207 96 272 221 426 292 239 372 643 304 389 744 545 590 273 566 378 994 758 394 440 524
2012E24J0M0r5J65L3r7OJ76K26o82j10O00o7j56k36n2K90J22K2j82o6k28K60n0
$$ 524 534 574 479 644 677 580 586 762 988 306 196 796 729 573 337 285 575 697 719 537 471 243 503 453
2036D53j0q4K5j00k69R3M7K73j00j83l7j61J1K09p3j49o2k96K60m6n90J05K83
$$ 453 443 359 384 284 15 108 155 428 328 145 108 -53 -42 167 94 -55 -117 -413 -153 -199 -789 -684 -401
2059d01N6Qp3R9k63J80l4j43m3K23q8k20P3O8n6N9J11j10p3j3J04o1L8j74J12
$$ -401 -345 -337 -410 -311 -574 -394 -428 -571 -614 -391 -479 -699 -626 -558 -614 -555 -444 -554 -627 -640 -536 -597 -559 -733 -621
2084f21L18j06j10QK23k93K41Jk65l46j16O86j43J27j7K56k48k31L05mJ14K68
$$ -621 -303 -409 -519 -511 -288 -581 -340 -339 -604 -950 -1066 -380 -523 -396 -413 -157 -405 -636 -331 -335 -221 47
2106D7j56K1j24J23J91M3k85J27L9j09j06K81J65l54L29k81K55J40n1K57J47k08
$$ 47 -109 -88 -212 -89 102 145 -140 -13 26 -83 -189 92 257 -97 232 -49 206 346 295 552 699 491
2128D91k20K35J05k27M97m53L3o6O0j00K4J15J62J29n44L57NJ45k56K45k07k56
$$ 491 271 506 611 384 881 428 461 395 455 355 379 494 656 785 241 598 603 748 492 737 530 274
2150B74L94j57K93L5k63j35O3L3J0k8l72o9O02l69J64PJ29l22l24J51Q8L04o13
$$ 274 668 511 804 839 576 441 504 537 547 519 147 78 680 311 475 482 611 289 -35 116 204 508 -105
2173a05M89j30l02O0j41J54k52k0J65L7j68r3J58J40o13J64M14J53p00J70j2J2
$$ -105 384 254 -48 12 -129 25 -227 -247 -82 -45 -213 -306 -148 -8 -621 -457 -43 110 -590 -420 -432 -420
2195d20k70J57K52P7j52N9l64L61J02l25L7p0p1J97r3o26R42j82k12K93k37j5
$$ -420 -690 -533 -281 -204 -356 -297 -661 -300 -198 -523 -486 -556 -627 -430 -523 -1149 -207 -389 -601 -308 -545 -560
2217e60J16k05P23o13p4K43k92P5j06M25p9L52l12j29K44P7l5p3j0K33j26L8k28
$$ -560 -444 -649 74 -539 -613 -370 -662 -587 -693 -268 -347 5 -307 -436 -192 -115 -150 -223 -233 0 -126 -88 -316
2240c16K06M6K7K03k25K04J34m07K90l5L21m87K97J3n6K38n2N2j55o9j93L75J16
$$ -316 -110 -64 -37 166 -59 145 279 -128 162 127 448 -39 258 271 215 453 401 453 298 229 36 411 527
2263E27j74j60J07q4K90nL6L42j00k75j46PJ58j03K3J61o0k57q9L02L23k09P9
$$ 527 353 193 300 216 506 501 537 879 779 504 358 365 523 420 443 604 544 287 198 500 823 614 693
2286F93l03n2k2J03O1K8j50k3k5m0j51J59J04n55L41L5P1M1m27K03Q9n25J81L79
$$ 693 390 338 316 419 480 508 358 335 310 270 119 278 382 -173 168 203 274 315 -112 91 180 -345 -164 215
2310B15j44m96K23J70j30j50J75K18k13k34J00J7l56K35L55k9l11j32m4j27L01
$$ 215 71 -425 -202 -32 -162 -312 -137 81 -132 -366 -266 -249 -605 -370 -15 -44 -355 -487 -531 -658 -357
2331c57l9j36q3j10J98J50l4j22J63M0l24L78k02l1J40j05M3j52k41L04K99l38
$$ -357 -396 -532 -615 -725 -527 -377 -411 -533 -370 -330 -654 -276 -478 -509 -369 -474 -431 -583 -824 -520 -221 -559
2353e59L29k03lJ75l24J93K39k66K13P5j13l7jr7P1M89Nk76j09K59j56J43K01
$$ -559 -230 -433 -436 -261 -585 -392 -153 -419 -206 -131 -244 -281 -282 -379 -308 181 186 -90 -199 60 -96 47 248
2376B48m92J22R4L0J07k66M21nJ63K52n58K02j9J63j46Q3N5p7J9K12L0j41P4j57
$$ 248 -244 -122 -28 2 109 -157 264 259 422 674 116 318 299 462 316 399 454 377 396 608 638 497 571 414
2400D14J82j93J12Rk93J42K05n2J92l57J71j8q6K98k55j28j7n7J00j88L2J52q7
$$ 414 596 403 515 524 231 373 578 526 718 361 532 514 428 726 471 343 326 269 369 181 213 365 278
2423B78l09L51k16K3K51k95K35L2l52J90k76J97l01L73k05j21J32k42K14l34L32
$$ 278 -31 320 104 127 378 83 318 350 -2 188 -88 109 -192 181 -24 -145 -13 -255 -41 -375 -43
2444d3k26J85J7n6j07N8k90L16j25J89l12N4J05k28P0l5qp6K2J53k64j19L78r
$$ -43 -269 -84 -67 -123 -230 -172 -462 -146 -271 -82 -394 -340 -235 -463 -393 -428 -436 -512 -490 -337 -601 -720 -342 -351
2468c51l44P5j74K60j71J06M4L27Q5m03M5L30k17m09N13k6j45J70k15N49l49j70
$$ -351 -695 -620 -794 -534 -705 -599 -555 -228 -143 -546 -501 -171 -388 -797 -284 -310 -455 -285 -500 49 -300 -470
2490d70L13K2O2k06K24j75J85MJ34l85K49m1K65o3J9j41L49k73L15n84M43R3l81
$$ -470 -157 -135 -73 -279 -55 -230 -45 -41 93 -292 -43 -84 181 118 137 -4 345 72 387 -197 246 339 -42
2513d2J79J59J48j57J96nJ26N0k90r8N5J1k33K15L56n00J93J32L9J41R0m80J61
$$ -42 137 296 444 287 483 478 604 654 364 266 321 332 99 314 670 170 363 495 534 675 765 285 446
2536D46m0p5M79n03mM88n3j63o40N73k33K67j41n8j4Q8k94J02R0j51J97j20J51
$$ 446 406 331 810 307 303 791 738 575 -65 508 275 542 401 343 329 417 123 225 315 164 361 241 392
2559C92l64M62l47j00J94r2j18j56j05K80P6m3j88J42j5o6P5Rl72p3J40L29k61
$$ 392 28 490 143 43 237 145 27 -129 -234 46 122 79 -109 33 18 -48 27 36 -336 -409 -269 60 -201
2582b01r6M7j3k15J14o4K31m98P3L16p2j68P3p9j24M72l24p0Q2P7J24j08m96N66
$$ -201 -297 -250 -263 -478 -364 -428 -197 -695 -622 -306 -378 -546 -473 -552 -676 -204 -528 -598 -516 -439 -315 -423 -919 -353
2606c53O0o3J4J81k64L38k29j45Q7M3j47Q5J38K3k03N5l9J79M49k28M2j77p3N22
$$ -353 -293 -356 -342 -161 -425 -87 -316 -461 -374 -331 -478 -393 -255 -232 -435 -380 -419 -240 209 -19 23 -154 -227 295
2630B95n54J84r1J10n4K18J44R7j83J79n07J69J21L75j28l54M10l69j9K14j09
$$ 295 -259 -75 -166 -56 -110 108 252 349 166 345 -162 7 128 503 375 21 431 62 43 257 148
2651A48J29K23j13n7J09Nj30j05J22L21l15k1Q6j39J77R1k0l42K86q3J4k9J63
$$ 148 277 500 387 330 439 444 314 209 331 652 337 316 402 263 440 531 511 169 455 372 386 357 520
2674E20l07P8J00k55J59Q8l60L17J03q0j74M2j2K22j3j91j27Q3o1k3n4m4j62P4
$$ 520 213 291 391 136 295 383 23 340 443 363 189 231 219 441 428 237 110 193 132 109 55 11 -151 -77
2698g7q8R8j18o8J32K40K8l61M5j77L77j68K8p4j3j37j30j7K92j16K13j22M3k62
$$ -77 -165 -67 -185 -253 -121 119 147 -214 -169 -346 31 -137 -109 -183 -196 -333 -463 -480 -188 -304 -91 -213 -170 -432
2722d32P9Lj44L1J23k10j36M37k24J27k1J7q3j8J01J08j41K44j92L53l31j74k1
$$ -432 -353 -350 -494 -463 -340 -550 -686 -249 -473 -346 -367 -350 -433 -451 -350 -242 -383 -139 -331 22 -309 -483 -504
2745e04m1N43j96J27j77j21K06Pk69K36j49K19J6q9K35r5j94M90n22M08l97M72
$$ -504 -545 -2 -198 -71 -248 -369 -163 -156 -425 -189 -338 -119 -103 -192 43 -52 -246 244 -278 130 -267 205
2767B05q6n1n8M74k32l24L52M8r1j34K34q0K53m44L42j47K94k43m1M11m35K61
$$ 205 119 68 10 484 252 -72 280 328 237 103 337 257 510 66 408 261 555 312 271 682 247 508
2789E08l02O0K06k6J40p9J2o5K6j56l51J34N66o89J44J14K04j01j08R9J61j88
$$ 508 206 266 472 446 586 507 519 454 480 324 -27 107 673 -16 128 242 446 345 237 336 497 309
2811C09j13L8m13P18l40R9q9k09k23P44k37k02o1k48mL08l9R8n04J81P8l33N20
$$ 309 196 234 -179 539 199 298 209 0 -223 521 284 82 21 -227 -231 77 38 136 -368 -187 -109 -442 78
2834G8k02J38m14J13N0J02r8J49p4m06J56J42o1m5K4r5L33nr5j30m4k6j26mJ81
$$ 78 -124 14 -400 -287 -237 -135 -233 -84 -158 -564 -408 -266 -327 -372 -348 -443 -110 -115 -210 -340 -384 -410 -536 -540 -359
2859c59n9L94k82k54K83J48j60k76J45K30J30p8Mk00l1K84M9Q3k53K13k18L3k2
$$ -359 -418 -24 -306 -560 -277 -129 -289 -565 -420 -190 -60 -138 -134 -334 -365 -81 -32 51 -202 11 -207 -174 -196
2882a96J48N3lr2K1M7J91l10p5J81q2K27j40j7Q1PJ80m2J8l2J15j18J35k68K59
$$ -196 -48 5 2 -90 -69 -22 169 -141 -216 -35 -117 110 -30 -47 34 41 221 179 197 165 280 162 297 29 288
2907B88r1k79M83J16J16l0n07K10j37M3L49m94K86N5l39J82K01m7k3j51J87k68
$$ 288 197 -82 401 517 633 603 96 306 169 212 561 67 353 408 69 251 452 405 382 231 418 150
2929A50J81l5j07K45P3m38L72j49J12r9l18L66l42J99j69K54M1l1k87J69n0K42
$$ 150 331 296 189 434 507 69 441 292 404 305 -13 353 11 210 41 295 336 305 18 187 137 379
2951C79k49N3o0j03p8p9L6J65j02J65j64l80J25R4N3J20k00J41j51L7j64J80l3
$$ 379 130 183 123 20 -58 -137 -101 64 -38 127 -37 -417 -292 -198 -145 -25 -225 -84 -235 -198 -362 -182 -215
2974b15j50J62j03j61M5j03J93O8k68K57k45M63l54J32l6K54o5l31K79r3J32l46
$$ -215 -365 -203 -306 -467 -422 -525 -332 -264 -532 -275 -520 -57 -411 -279 -315 -61 -126 -457 -178 -271 -139 -485
2996d85K13j06P1K42k67K72rk82j04K97Op5j62k4J63j31L45p3Q5n6l4K70m89M66
$$ -485 -272 -378 -307 -65 -332 -60 -69 -351 -455 -158 -152 -227 -389 -413 -250 -381 -36 -109 -24 -80 -114 156 -333 133
3020A33m6j66j57L76j24Q3j59J52k11J24J29K89m40K16K46r6j92N2o5j82M05K7
$$ 133 87 -79 -236 140 16 99 -60 92 -119 5 134 423 -17 199 445 349 157 209 144 -38 367 394
3042C94J03k98K97k03j18K13j23J83k25l9J54m8K00j85l08M19n5j39J43l91O82
$$ 394 497 199 496 293 175 388 265 448 223 184 338 290 490 305 -3 416 361 222 365 -26 656
3063F56l35j95M56o48K87O7j25k09K36k03L57k94O1k9J58k08K6J80jol62J44J59
$$ 656 321 126 582 -66 221 288 163 -46 190 -13 344 50 111 82 240 32 58 238 237 231 -131 13 172
3086A72j68k42p1K73p5R3j6J04j57j35K4J30J88m42o2K79J63l98M8j08M3K92l14
$$ 172 4 -238 -309 -36 -111 -18 -34 70 -87 -222 -198 -68 120 -322 -384 -105 58 -340 -292 -400 -357 -65 -379
3109c79mn3J0K74k09P9k36L67J76k71jQ6k16Q6R6k33K4N7J39m05J81o0L29P2l05
$$ -379 -383 -436 -426 -152 -361 -282 -518 -151 25 -246 -247 -161 -377 -291 -195 -428 -404 -347 -208 -613 -432 -492 -163 -91 -396
3134c96L04k66J71n4K13j72Q5N7J41j74J58k06J35j96K7K78o6P6p5Q2j26k37L23
$$ -396 -92 -358 -187 -241 -28 -200 -115 -58 83 -91 67 -139 -4 -200 -173 105 39 115 40 122 -4 -241 82
3157H2K42j72O2k61Q3J69P6j70K2K83M2k46J43m27L02k27K73K35k4l02k31M37
$$ 82 324 152 214 -47 36 205 281 111 133 416 458 212 355 -72 230 3 276 511 487 185 -46 391
3179C91p6r1L36k4Rm54J72K77k23J92k80O5k23L54k20K6j24j31L87k23K32l91
$$ 391 315 224 560 536 545 91 263 540 317 509 229 294 71 425 205 231 107 -24 363 140 372 -19
3201a9R8N66k10k58J35k52j70K55nl95J99j1R6o1K31k01j56K44k40J5Q8j20M1
$$ -19 79 645 435 177 312 60 -110 145 140 -255 -56 -67 29 -32 199 -2 -158 86 -154 -139 -51 -171 -130
3224a30J03j7J75k97oJ48k25l32L99l4N0J74n20K45p7J93j45k53L51k88J86P3
$$ -130 -27 -44 131 -166 -172 -24 -249 -581 -182 -216 -166 8 -512 -267 -344 -151 -296 -549 -198 -486 -300 -227
3246b27J6m4L8K16k46Q9k10L6l02O11n89K84O7j31M9J63J71k63P3k06P6KJ29K53
$$ -227 -211 -255 -217 -1 -247 -158 -368 -332 -634 -23 -612 -328 -261 -392 -343 -180 -9 -272 -199 -405 -329 -327 -198 55
3270E5R6j72k33K29l3j40J2J04L2K9l03M61K34k07p6j27k4J43N3Mk58J70K1K36
$$ 55 151 -21 -254 -25 -58 -198 -186 -82 -50 -21 -324 137 371 164 88 -39 -63 80 133 137 -121 49 70 306
3294C06J62j20k20N2M70m74jp1J62l13K69M2J39j72l0J36P5l76M83k60j64L42
$$ 306 468 348 128 180 650 176 175 104 266 -47 222 264 403 231 201 337 412 36 519 259 95 437
3316D37k87J84K9%k79J9J11J1J51l33L11k18K23L3j81k93j43K39J01J15j33pk47
$$ 437 150 334 363 363 84 103 214 225 376 43 354 136 359 392 211 -82 -225 14 115 230 97 90 -157
3339a57l7R9M24P6o14j14K52J76j94K10j56k43L99l48K08j50J65l26JJ78k02J50
$$ -157 -194 -95 329 405 -209 -323 -71 105 -89 121 -35 -278 121 -227 -19 -169 -4 -330 -329 -151 -353 -203
3361b03j69K01m01L62k09J99P2K1j38q7k28N89j36r9r8k06J5K95ll39J09J88J15
$$ -203 -372 -171 -572 -210 -419 -220 -148 -127 -265 -352 -580 9 -127 -226 -324 -530 -515 -220 -223 -562 -453 -265 -150
3384a50j57k64J73L22q3l1N6M1j20O2N6M0j25j75J85J90K70n09K39k95K79O5k70
$$ -150 -307 -571 -398 -76 -159 -190 -134 -93 -213 -151 -95 -55 -180 -355 -170 20 290 -219 20 -275 4 69 -201
3407b01J57q3K91n46L00J76J14j28k12K02J36j9j88k87M29o2j05J5J17J53K33
$$ -201 -44 -127 164 -382 -82 94 208 80 -132 70 206 187 -1 -288 141 79 -26 -11 106 259 492
3428D92l11L1k18l1K80j22m1K24l7P5j05Q1l5k22J97K3j40j09J32j45J69m8j01
$$ 492 181 212 -6 -37 243 121 80 304 267 342 237 318 283 61 258 281 141 32 164 19 188 140 39
3451C9K51l24M90k03R5k88j03j07K19K42j51m9j75K93j6o09N15j53K13j28j20
$$ 39 290 -34 456 253 348 60 -43 -150 69 311 160 111 -64 229 213 -396 119 -34 179 51 -69
3472f9L50l69J30Jp4q7o8O3R9J33k35M19Op64J95o2O2K47l42LL12k41L21n66K42
$$ -69 281 -88 42 43 -31 -118 -186 -123 -24 109 -126 293 299 -465 -270 -332 -270 -23 -365 -362 -50 -291 30 -536 -294
3497b94p9j63M91p8j56L0j38K27l63K65J76l20K80r8r9J12k14J38O9K70k84n7
$$ -294 -373 -536 -45 -123 -279 -249 -387 -160 -523 -258 -82 -402 -122 -220 -319 -207 -421 -283 -214 56 -228 -285
3519b85lR3pL54q8k75K01L05k76j94J10j63M75l34J32l26K62K96k07q8j09L03
$$ -285 -288 -195 -202 152 64 -211 -10 295 19 -175 -65 -228 247 -87 45 -281 -19 277 70 -18 -127 176
3541A76l43K08N9L0l85L75J68L2l49k3J57j46L14l38M03j99P8j73K37j35k08%
$$ 176 -167 41 100 130 -255 120 288 320 -29 -52 105 -41 273 -65 338 139 217 44 281 146 -62 -62
3563f2M16m02N41l19k00L34k3J49j42K04j19j59N4n0k05J09k09Q7m7L18o9K76
$$ -62 354 -48 493 174 -26 308 285 434 292 496 377 218 272 222 17 126 -83 4 -43 275 206 482
3585D82n78J30K16j68j06M00m58J60N3K76k32j06J73k40J57Lk5k44p9m8l9J77
$$ 482 -96 34 250 82 -24 376 -82 78 131 407 175 69 242 2 159 162 137 -107 -186 -234 -273 -96
3607i6J1N4j85K10K17m48J36P9k82J99mP1l24M6K60k10n9K29l4O2k52j63P9J2
$$ -96 -85 -31 -216 -6 211 -237 -101 -22 -304 -105 -109 -38 -362 -316 -56 -266 -325 -96 -130 -68 -320 -483 -404 -392
$$ [...]
8191g1
##END NTUPLES=NMR FID
##END=
