##TITLE=1H_X-1(sav-54)
 CDCl3, 8 sc, 
 5.6.2020
##JCAMPDX= 6.0         $$ Bruker NMR JCAMP-DX V2.0
##DATA TYPE= NMR FID
##DATA CLASS= NTUPLES
##ORIGIN= UXNMR, Bruker Analytische Messtechnik GmbH
##OWNER= root
$$ XWIN-NMR		Version 3.5
$$ Fri Jun  5 11:23:54 2020 Russian Standard Time (UT+4h)  she@DPX200
##.OBSERVE FREQUENCY= 200.1315
##.OBSERVE NUCLEUS= ^1H
##.DELAY= (6, 6)
##.ACQUISITION MODE= SIMULTANEOUS
##.ACQUISITION SCHEME= undefined
##.AVERAGES= 8
##.DIGITISER RES= 18
##SPECTROMETER/DATA SYSTEM= spect
##.PULSE SEQUENCE= zg30
##.SOLVENT NAME= D2O
##.SHIFT REFERENCE= (INTERNAL, D2O, 0, 15.7039)
##AUDIT TRAIL= $$ (NUMBER, WHEN, WHO, WHERE, WHAT)
$$ ##TITLE= Audit trail, XWIN-NMR		Version 3.5
$$ ##JCAMPDX= 5.01
$$ ##ORIGIN= Bruker BioSpin GmbH
$$ ##OWNER= she
$$ F:/spectra/data/she/nmr/H-F/1/audita.txt
$$ ##AUDIT TRAIL=  $$ (NUMBER, WHEN, WHO, WHERE, WHAT)
(   1,<2020-06-05 11:22:52.42 +0400>,<she>,<DPX200>,
      <created by zg, POWCHK disabled, PULCHK disabled
       configuration hash MD5:
       00 E9 B6 7A A2 85 ED C7 34 08 36 98 17 FE 4E 26
       data hash MD5: 16K
       B7 CE 7F 16 B0 C5 C1 F1 7B 73 BA B8 42 A2 B0 B2>)
$$ ##END=
$$ 
$$ hash MD5
$$ 04 30 98 B5 CB A6 1F F2 6D 4F 36 73 64 47 1F B7
##$RELAX= 
##$RELAX= 
##$RELAX= 
##$RELAX= 
##$RELAX= 
##$RELAX= 
$$ Bruker specific parameters
$$ --------------------------
##$DU= <F:/spectra>
##$EXPNO= 1
##$NAME= <H-F>
##$PROCNO= 1
##$TYPE= <nmr>
##$USER= <she>
##$AMP= (0..31)
100 100 100 100 100 100 100 100 100 100 100 100 100 100 100 100 100 100 
100 100 100 100 100 100 100 100 100 100 100 100 100 100 
##$AQSEQ= 0
##$AQ_mod= 1
##$AUNM= <au_zg>
##$AUTOPOS= <>
##$BF1= 200.13
##$BF2= 200.13
##$BF3= 200.13
##$BF4= 200.13
##$BF5= 200.13
##$BF6= 200.13
##$BF7= 200.13
##$BF8= 200.13
##$BYTORDA= 1
##$CFDGTYP= 0
##$CFRGTYP= 5
##$CHEMSTR= <none>
##$CNST= (0..31)
1 1 145 1 1 1 1 1 1 1 1 1 1 1 1 1 1 1 1 1 1 1 1 1 1 1 1 1 1 1 1 1 
##$CPDPRG= <>
##$CPDPRG1= <>
##$CPDPRG2= <>
##$CPDPRG3= <>
##$CPDPRG4= <mlev>
##$CPDPRG5= <mlev>
##$CPDPRG6= <mlev>
##$CPDPRG7= <mlev>
##$CPDPRG8= <mlev>
##$CPDPRGB= <>
##$CPDPRGT= <>
##$D= (0..31)
0 1.2 0 0 0 0 0 0 0 0.06 0 0.03 0 0 0 0 0.0002 0 0 0 0 0 0 0 0 0 0 0 0 
0 0 0 
##$DATE= 1591341771
##$DBL= (0..7)
120 120 120 120 120 120 120 120 
##$DBP= (0..7)
150 150 150 150 150 150 150 150 
##$DBP07= 0
##$DBPNAM0= <>
##$DBPNAM1= <>
##$DBPNAM2= <>
##$DBPNAM3= <>
##$DBPNAM4= <>
##$DBPNAM5= <>
##$DBPNAM6= <>
##$DBPNAM7= <>
##$DBPOAL= (0..7)
0.5 0.5 0.5 0.5 0.5 0.5 0.5 0.5 
##$DBPOFFS= (0..7)
0 0 0 0 0 0 0 0 
##$DE= 6
##$DECBNUC= <off>
##$DECIM= 24
##$DECNUC= <off>
##$DECSTAT= 4
##$DIGMOD= 1
##$DIGTYP= 9
##$DL= (0..7)
0 120 120 120 120 120 120 120 
##$DP= (0..7)
150 150 150 150 150 150 150 150 
##$DP07= 0
##$DPNAME0= <>
##$DPNAME1= <>
##$DPNAME2= <>
##$DPNAME3= <>
##$DPNAME4= <>
##$DPNAME5= <>
##$DPNAME6= <>
##$DPNAME7= <>
##$DPOAL= (0..7)
0.5 0.5 0.5 0.5 0.5 0.5 0.5 0.5 
##$DPOFFS= (0..7)
0 0 0 0 0 0 0 0 
##$DQDMODE= 0
##$DR= 18
##$DS= 0
##$DSLIST= <SSSSSSSSSSSSSSS>
$$ [...]
##$SUBNAM2= <"">
##$SUBNAM3= <"">
##$SUBNAM4= <"">
##$SUBNAM5= <"">
##$SUBNAM6= <"">
##$SUBNAM7= <"">
##$SUBNAM8= <"">
##$SUBNAM9= <"">
##$SW= 24.9337058887773
##$SWIBOX= (0..15)
0 0 2 0 0 0 0 0 0 0 0 0 0 0 0 0 
##$SW_h= 4990.01996007984
##$TD= 16384
##$TD0= 1
##$TE= 0
##$TE2= 300
##$TE3= 300
##$TEG= 300
##$TL= (0..7)
0 120 120 120 120 120 120 120 
##$TP= (0..7)
150 150 150 150 150 150 150 150 
##$TP07= 0
##$TPNAME0= <>
##$TPNAME1= <>
##$TPNAME2= <>
##$TPNAME3= <>
##$TPNAME4= <>
##$TPNAME5= <>
##$TPNAME6= <>
##$TPNAME7= <>
##$TPOAL= (0..7)
0.5 0.5 0.5 0.5 0.5 0.5 0.5 0.5 
##$TPOFFS= (0..7)
0 0 0 0 0 0 0 0 
##$TUNHIN= 0
##$TUNHOUT= 0
##$TUNXOUT= 0
##$USERA1= <user>
##$USERA2= <user>
##$USERA3= <user>
##$USERA4= <user>
##$USERA5= <user>
##$V9= 5
##$VALIST= <valist>
##$VCLIST= <CCCCCCCCCCCCCCC>
##$VD= 0
##$VDLIST= <DDDDDDDDDDDDDDD>
##$VPLIST= <PPPPPPPPPPPPPPP>
##$VTLIST= <TTTTTTTTTTTTTTT>
##$WBST= 1024
##$WBSW= 4
##$XGAIN= (0..3)
0 0 0 0 
##$XL= 0
##$YL= 0
##$YMAX_a= 156872
##$YMIN_a= -121401
##$ZGOPTNS= <>
##$ZL1= 120
##$ZL2= 120
##$ZL3= 120
##$ZL4= 120
##$ABSF1= 10
##$ABSF2= 0
##$ABSG= 5
##$ABSL= 3
##$ALPHA= 0
##$AQORDER= 0
##$ASSFAC= 0
##$ASSFACI= 0
##$ASSFACX= 0
##$ASSWID= 0
##$AUNMP= <proc_1d>
##$AZFE= 0.1
##$AZFW= 0.1
##$BCFW= 1
##$BC_mod= 2
##$BYTORDP= 1
##$COROFFS= 0
##$CY= 11.3945322036743
##$DATMOD= 1
##$DC= 2
##$DFILT= <>
##$DTYPP= 0
##$F1P= 16.9975609425685
##$F2P= -3.02152046262296
##$FCOR= 0.5
##$FTSIZE= 0
##$FT_mod= 4
##$GAMMA= 1
##$GB= 0.15
##$INTBC= 1
##$INTSCL= 1
##$ISEN= 128
##$LB= 0.24
##$LEV0= 0
##$LPBIN= 0
##$MAXI= 10000
##$MC2= 0
##$MEAN= 0
##$ME_mod= 0
##$MI= 1.114404
##$NCOEF= 0
##$NC_proc= 0
##$NLEV= 6
##$NOISF1= 3.799351
##$NOISF2= 2.8
##$NSP= 1
##$NTH_PI= 0
##$NZP= 0
##$OFFSET= 15.70392
##$PC= 1
##$PHC0= -9798.552
##$PHC1= 20.20082
##$PH_mod= 1
##$PKNL= yes
##$PPARMOD= 0
##$PSCAL= 0
##$PSIGN= 0
##$REVERSE= no
##$SF= 200.130013532006
##$SI= 16384
##$SIGF1= 3
##$SIGF2= 2
##$SINO= 400
##$SIOLD= 16384
##$SREGLST= <1H.CDCl3>
##$SSB= 0
##$STSI= 0
##$STSR= 0
##$SW_p= 3612.71676300578
##$SYMM= 0
##$S_DEV= 0
##$TDeff= 0
##$TDoff= 0
##$TI= <>
##$TILT= no
##$TM1= 0
##$TM2= 0
##$TOPLEV= 0
##$USERP1= <user>
##$USERP2= <user>
##$USERP3= <user>
##$USERP4= <user>
##$USERP5= <user>
##$WDW= 1
##$XDIM= 8192
##$YMAX_p= 0
##$YMIN_p= 0
$$ End of Bruker specific parameters
$$ ---------------------------------
##NTUPLES= NMR FID
##VAR_NAME=  TIME,          FID/REAL,        FID/IMAG
##SYMBOL=    X,             R,               I
##VAR_TYPE=  INDEPENDENT,   DEPENDENT,       DEPENDENT
##VAR_FORM=  AFFN,          ASDF,            ASDF
##VAR_DIM=   8192,          8192,            8192
##UNITS=     SECONDS,       ARBITRARY UNITS, ARBITRARY UNITS
##FACTOR=    0.0002004,     1,               1
##FIRST=     0,             0,               0
##LAST=      1.6414764,     0,               0
##MIN=       0,             -121401,         0
##MAX=       1.6414764,     156872,          0
$$ Real data points
##PAGE= N=1
##DATA TABLE= (X++(R..R)), XYDATA
0 0 0 0 0 0 0 0 0 0 0 0 -4 7 -8 8 -8 11 -14 16 -22 22 -28 30 -38 42 -49 57 -63 72 -81 93 -104 119 -134 150
34 150 -167 186 -205 231 -255 283 -314 348 -384 427 -471 524 -580 646 -722 808 -911 1032 -1179
53 -1179 1366 -1603 1925 -2385 3104 -4403 7508 -33090 -756 31387 -63489 -121401 -82815 -1625
67 -1625 -2328 -67185 -108905 -69132 -13077 -6981 -53794 -83650 -61625 -6753 9475 -24261 -65660
80 -65660 -51088 7286 40597 6826 -46212 -39801 31950 72354 29049 -34633 -23104 52371
92 52371 89860 37546 -25759 -6777 66161 88830 32137 -21197 3339 62217 73900 21331
104 21331 -21319 -4627 42583 55013 14644 -31152 -26340 15398 39299 11032 -42889 -51775
116 -51775 -4866 34922 4911 -58899 -68083 -7224 36284 -668 -66477 -63381 1642 38828
128 38828 -1262 -59775 -46613 17145 46503 8167 -40250 -28029 29095 56232 25997 -18650
140 -18650 -13325 35016 67921 46142 1242 -4727 37704 76093 58936 8363 -7112 37235
152 37235 78288 60240 1356 -14613 33473 75620 48232 -15777 -25330 25939 63138 31197
164 31197 -28537 -34225 14540 45787 17789 -33284 -40652 1266 30451 10892 -31630 -42495
176 -42495 -9263 26240 15641 -23946 -41487 -8791 35045 29805 -16546 -36355 2678 52030
188 52030 43607 -9113 -28049 17367 66880 54945 697 -15862 29417 74911 59777 9772
200 9772 -4786 36138 73071 58777 15390 -358 31095 65370 57716 17237 -3573 18251
212 18251 55265 52707 12168 -17742 2769 46617 48814 2902 -33428 -7402 42457 42228 -7612
225 -7612 -41284 -10725 40000 36108 -14559 -39541 -6822 36443 32609 -9561 -31397 -2414 38575
238 38575 34880 251 -20021 2252 39224 44729 13781 -11199 3579 43049 57247 22951
250 22951 -10718 3955 48721 62423 24088 -12223 3639 51763 62026 18129 -15356 3552
262 3552 49961 51638 10746 -19694 -538 38122 41586 4165 -22518 -7235 25474 33778 3332
275 3332 -24744 -17863 15790 31236 3268 -31454 -27174 11143 33764 4833 -34751 -27769 14818
288 14818 36682 4381 -33849 -24956 22534 41154 4351 -30600 -17032 25120 40501 8420
300 8420 -23672 -11092 24955 39046 14295 -15488 -10333 21980 40402 18096 -12615 -14452 17737
313 17737 39309 21896 -16004 -21497 16684 41805 19260 -22876 -25644 15352 40352 14527
325 14527 -27341 -24461 13986 37125 9866 -26303 -23385 11710 32389 8881 -24199 -22282 8315
338 8315 28153 11758 -19279 -22844 4546 28622 16224 -16362 -24439 4260 31840 21660 -15756
351 -15756 -28241 4661 37790 21241 -17513 -27581 7880 38212 20729 -18617 -24872 10792
363 10792 34994 17800 -16003 -21311 10004 32867 17881 -13758 -21177 4455 29955 21463 -9494
376 -9494 -22516 656 29889 25115 -8327 -25489 -1238 31865 25873 -10734 -27777 -2387 30703
389 30703 24872 -12586 -28317 -648 30253 21843 -15294 -27529 288 26761 17770 -13274 -27514
402 -27514 -3683 22321 16735 -12561 -27278 -7874 17560 17741 -8791 -28275 -13494 17325 20532
415 20532 -9322 -31153 -14138 19850 23417 -9776 -31179 -10235 25071 24722 -8538 -28775 -5489
428 -5489 28290 24780 -6903 -22186 -2219 27835 26992 -1019 -17620 -2305 24470 27684 3786
441 3786 -15326 -4942 22934 31785 5365 -17956 -8803 22511 31112 3913 -22647 -12652 21599
454 21599 30241 642 -26979 -14454 20959 26826 -4088 -27777 -13877 18404 24074 -5820 -24474
467 -24474 -12448 17135 22262 -637 -21193 -13361 14498 26813 6530 -15794 -10559 19586 34211
480 34211 14164 -12250 -8346 24264 40497 19513 -10555 -4076 29802 43977 19677 -7014
492 -7014 -1567 31840 43496 20287 -7579 -16 28941 39497 18620 -7231 -3659 21406 33454
505 33454 14556 -9792 -10492 12582 29707 13876 -13513 -18420 8345 26242 10700 -18012 -22187
518 -22187 7230 26190 8551 -20847 -22598 9200 28658 9818 -18983 -16660 12558 30373
530 30373 13319 -13115 -9475 16425 32761 20218 -2918 -5544 18321 36871 28342 2438 -4073
543 -4073 19876 40991 31777 4972 -4890 18591 39732 32261 527 -8671 15396 38620 25707
556 25707 -5587 -13430 9860 31498 17875 -10898 -18988 5380 23059 11477 -14137 -20693 -502
569 -502 18422 9927 -13931 -22111 -5008 15444 12169 -10995 -23245 -4597 20408 18748 -6969
582 -6969 -19002 199 27776 25202 -2566 -13248 9009 34383 29296 4476 -7222 15455 38307
595 38307 32706 9609 -864 16939 38010 35448 8967 -927 12887 34475 32751 8485 -6902
608 -6902 5166 27963 27514 3228 -14495 -2585 21727 23155 -3975 -20770 -7418 17306 17568
621 17568 -7568 -25313 -10816 13766 13621 -10718 -24887 -10671 11946 13765 -6881 -19841 -7053
634 -7053 14958 16576 -783 -15916 -4707 17863 25461 6746 -9788 -773 24381 31153 12649
647 12649 -6429 1656 26479 33198 13089 -7285 1992 27405 32635 10593 -8230 -1269 23226
660 23226 27461 4008 -13142 -6955 12646 17804 -2295 -20772 -13093 5923 10270 -5145 -24757
673 -24757 -22281 -192 9642 -9592 -29218 -25889 -3337 8435 -8745 -29697 -24920 1295 11507
686 11507 -4796 -25254 -19339 4396 16979 633 -20304 -14910 10496 20000 4419 -13441 -8111
699 -8111 12246 22945 9756 -8458 -7660 11551 23551 10992 -7321 -8329 9706 23418 10861
712 10861 -12080 -14157 5542 19805 5820 -16218 -20314 148 14485 446 -22245 -25529 -4103
725 -4103 8314 -5013 -23508 -25730 -5059 5400 -6107 -24823 -27366 -7894 5745 -2745 -22614
738 -22614 -23804 -6686 9018 2238 -16773 -21197 -2718 15578 7673 -12917 -17939 847 19279
751 19279 13551 -9987 -15453 5964 22745 12095 -8093 -13308 5254 21651 13401 -9010 -13190
764 -13190 4232 15093 10520 -9502 -16535 -1860 11677 5148 -13522 -22385 -7362 8382 1757
777 1757 -17646 -28696 -15538 3980 1149 -19517 -29729 -16260 2775 -2115 -20864 -29532 -13965
790 -13965 3882 1507 -18917 -25696 -11337 6195 2639 -14335 -22455 -8013 9374 7175 -8083
803 -8083 -18282 -7232 9508 10365 -5319 -16431 -5584 11283 13829 -4131 -16799 -6003 10904
816 10904 12853 -7256 -18191 -7635 9773 9314 -8479 -22300 -10851 6020 5212 -13454 -23969
829 -23969 -13986 1516 1656 -12337 -24059 -15637 127 2307 -12436 -23374 -17818 -165 4356
842 4356 -8929 -23709 -16892 1917 7895 -7160 -22204 -13381 5451 10511 -5100 -17848 -10714
855 -10714 9338 13421 -1334 -14841 -6387 9818 15008 568 -13465 -6771 9999 15055 2234
868 2234 -9886 -7030 7358 12947 2314 -12555 -9693 7144 12739 1612 -16335 -13097 4854
881 4854 12479 -122 -16435 -14446 3068 11551 -2886 -17333 -15216 1997 9018 -2533 -15831
894 -15831 -13859 3374 8401 -538 -17137 -13823 3000 10979 1666 -13815 -11923 3557 11932 4388
908 4388 -12539 -10881 4155 14206 4991 -10696 -12128 4168 14388 4764 -10689 -11517 4672
921 4672 13514 4840 -10802 -11311 3374 13580 2732 -11570 -11554 3873 11331 2339 -11554 -13426
935 -13426 -501 10085 2335 -11968 -16900 -2311 10667 3435 -12214 -16544 -2223 9043 3982
948 3982 -11976 -15610 -488 10851 4246 -10447 -15281 -1147 10751 5853 -10496 -13783 -94
961 -94 9794 5570 -8563 -12650 -687 10859 7621 -6536 -11336 -1727 11008 7223 -6938 -11176
975 -11176 -2107 11982 11098 -6520 -12665 -971 12307 9293 -5661 -10911 -1126 12230 8460 -6190
989 -6190 -11664 -1312 12335 8240 -4405 -10239 -1465 10792 10076 -4936 -10661 -1896 8435 10786
1003 10786 -4431 -11381 -4121 12197 10332 -3935 -12366 -5382 9874 9426 -4196 -12298 -4935 9247
1017 9247 9400 -4366 -14223 -5022 9110 10132 -4371 -13490 -3919 8936 8233 -3216 -11131 -3480
1031 -3480 8219 8862 -2988 -12048 -5404 7899 10504 -397 -11031 -5121 6717 8913 -1144
1044 -1144 -10920 -6348 7008 9953 -363 -10945 -6419 7489 10570 -2147 -12698 -5520 6730
1057 6730 9224 -3215 -13775 -7908 4014 7884 -2259 -13479 -9105 3375 7464 -3394 -14522
1070 -14522 -10324 1208 6652 -3002 -15621 -11233 1317 6976 -4117 -16842 -12130 816 9009
1083 9009 -3411 -13909 -12163 2191 7206 -815 -12400 -8202 4126 7597 -529 -10424 -8366 3924
1097 3924 9721 3084 -8874 -7165 5087 10210 2465 -9131 -8435 2986 9988 3032 -8865 -9278
1111 -9278 2088 10233 2257 -8741 -9412 1516 7890 1382 -12026 -11612 1636 6873 -563 -12344
1125 -12344 -12888 -1750 4596 -806 -10888 -13276 -2584 5956 -167 -10485 -11440 -1887 6039 3887
1139 3887 -9395 -10977 717 9707 3576 -6954 -9842 1145 12402 7246 -5202 -8190 2809
1152 2809 11996 7482 -5614 -7584 3536 11256 6435 -4845 -9703 1687 9462 5934 -5514 -9098
1166 -9098 -2411 7473 3580 -8374 -12316 -3111 4351 3236 -9615 -13710 -5703 2836 2394 -10292
1180 -10292 -16181 -6236 4048 86 -10562 -15453 -6594 3444 1274 -9049 -13987 -5424 4747
1193 4747 3152 -6415 -10981 -2427 7223 5970 -4089 -7557 -1944 7989 7972 -2241 -8550 -539 8273
1208 8273 9110 -1852 -7889 -1254 8963 10057 -3050 -10078 -1382 7552 7303 -3976 -11168 -4434
1222 -4434 5791 5374 -5362 -12183 -5769 3213 4785 -5282 -13457 -6475 2111 4088 -4741 -12401
1236 -12401 -6967 2717 5755 -4227 -12731 -7003 3422 7505 -2996 -10148 -5641 6691 9196 1128
1250 1128 -6522 -1514 7851 11672 948 -4128 63 8974 11256 4913 -3648 989 9639 12450 5443
1265 5443 -3525 -1684 8231 10966 3083 -4786 -1623 7117 10439 1773 -6854 -4877 4623 7344 643
1280 643 -9034 -6677 2087 7107 -585 -9257 -7719 2945 5138 -2015 -8294 -7351 2729 6238 420
1295 420 -8066 -5070 2530 7669 3125 -6343 -5177 5133 10393 4906 -5300 -3202 5930 12618 6167
1310 6167 -3529 -2548 7412 12889 5993 -3361 -2944 7044 13083 5590 -2821 -4222 5381 10805 5810
1325 5810 -4047 -6196 2702 8277 2986 -4819 -6514 455 7119 3008 -6815 -8256 -183 5830 1492
1340 1492 -6514 -9041 -1890 4975 752 -7694 -8829 639 7473 2853 -5400 -7780 2238 8051 5303
1355 5303 -3350 -5717 2843 9307 6911 -1188 -2896 4214 11447 7385 288 -3132 4248 12115 8655
1370 8655 -1384 -3178 3629 11389 8545 60 -4406 2086 10713 5918 -2222 -5975 1976 8656 5971
1385 5971 -2784 -5556 -221 6108 5045 -1722 -7366 -242 5201 4755 -3342 -6995 -875 6519 5299
1400 5299 -1069 -6195 -798 6883 7141 -972 -5192 166 8040 7348 1011 -4572 1107 8954 7808
1415 7808 -688 -4366 1166 9238 8446 1921 -2423 2059 7796 7499 760 -2937 925 7288 7372 -355
1431 -355 -4568 -1331 5352 6307 -482 -5190 -2465 4698 4759 -1627 -6055 -2774 5071 5314 -1704 -8380
1447 -8380 -3730 2952 4511 -3103 -8030 -3142 3818 5442 -1902 -6780 -3638 4769 5510 -678 -6124
1462 -6124 -4118 4969 6368 500 -5878 -3548 4178 7691 1693 -6017 -2874 4219 7750 1124 -4967
1477 -4967 -1268 5032 8313 1355 -5540 -3812 4227 6214 -74 -5297 -3366 3625 6690 825 -4152
1492 -4152 -4233 2821 6481 831 -5229 -4106 2023 5866 1596 -6522 -6103 1422 5830 1138 -6231 -4486
1508 -4486 2161 7289 2308 -4340 -4420 2887 6293 2080 -4091 -3708 2557 6030 3018 -3976 -3557 3683
1524 3683 7253 3138 -3159 -3508 2250 7046 3570 -2949 -3702 2772 6565 2616 -3208 -4285 1665
1539 1665 5505 3684 -2082 -4886 2478 7009 3398 -3583 -4221 1673 6272 3101 -3727 -4516 743
1554 743 5429 2988 -3007 -4865 127 5893 2563 -3209 -5066 253 5672 1319 -3768 -5860 -272
1569 -272 4808 3941 -3853 -5740 -4 4933 3841 -3646 -6057 -1826 3877 2163 -3766 -6393 -552
1584 -552 5271 3022 -2966 -5215 -1630 3946 2730 -2198 -4406 -836 4662 4322 -2315 -5236 -215
1599 -215 5272 5300 -710 -5652 -289 5358 3489 -1492 -3972 302 5929 5174 -923 -4324 -493 5166
1615 5166 4269 -2458 -4617 -775 3678 4033 -870 -4943 -1920 2300 4470 -2563 -3929 -1523 2427
1630 2427 3433 -995 -4590 -1152 4097 4596 16 -4754 -2283 3867 5455 212 -3293 -1091 4574
1645 4574 6604 1527 -2424 -1032 5151 7330 2259 -2103 434 4834 7399 2696 -206 -849 5722
1660 5722 6699 3023 -581 -618 4428 5550 3455 -2017 -296 4530 5413 899 -2483 -837 3419 4310
1676 4310 420 -5098 -3337 2354 4266 1048 -5244 -3504 1814 3151 284 -3951 -3713 1143 3344
1691 3344 -202 -3858 -3591 2610 3782 2054 -2371 -2075 2063 5645 2477 -2635 -336 4757 7007
1706 7007 2731 -1143 -793 4300 7389 2814 -1207 81 3297 5825 3661 -1069 -1415 3373 4919
1721 4919 2036 -1920 -3837 624 3689 1460 -2878 -4377 -254 3055 -405 -3718 -4617 -1199 2385
1736 2385 917 -4707 -5785 -1356 2139 203 -4664 -4480 -1682 2720 1026 -1898 -4547 848 5491
1751 5491 2094 -1701 -1764 2231 6181 4694 -287 294 1334 6266 5138 1181 -246 2596 6610 5240
1767 5240 -182 -901 3112 6298 4944 575 -2241 1927 4926 3213 -617 -2892 -348 4400 3061
1782 3061 -2061 -3358 540 2528 1538 -3508 -3629 -1272 2661 714 -2330 -5189 -2140 1953 1844 -2450
1798 -2450 -4136 -1173 1886 3083 -1936 -4286 -464 3171 4720 61 -1670 953 5424 4961 853
1813 853 -1250 1730 4600 5295 1629 -2180 98 4458 4642 1582 -1694 -15 4199 4210 -890 -3524
1829 -3524 -2019 2408 3020 -1585 -3567 -2519 344 513 -3207 -6807 -5088 427 245 -3944 -5474 -3841
1845 -3841 -89 397 -3750 -6342 -3723 2 1014 -2148 -5551 -2961 795 2101 -526 -4033 -2084
1860 -2084 1749 2813 -848 -2982 -796 2221 4245 1266 -2963 -992 3470 4586 571 -971 -668
1875 -668 2723 3855 880 -2486 -1400 2528 3731 495 -2923 -3071 1527 2009 -1261 -4791 -2907 242
1891 242 763 -1862 -4167 -4926 -1269 886 -1177 -4184 -4367 -1451 1597 -438 -3962 -3353 -248 2354
1907 2354 -865 -3737 -2073 648 4058 661 -1761 -1709 1653 4411 2191 -668 -1252 2605 4591 2661
1923 2661 -1245 -752 2130 4430 2267 -265 -1489 2313 2735 1923 -828 -1664 398 2612 745 -2083
1939 -2083 -3646 -578 1643 -82 -4014 -3895 -887 2057 -48 -3843 -4892 -2262 725 -450 -4175
1954 -4175 -4142 -2116 356 -601 -2806 -3559 -2410 1248 806 -1973 -4039 -1211 1982 1455 -2388 -2603 -499
1971 -499 2951 2161 -1330 -1923 228 2975 2515 -701 -2006 -205 2244 993 -417 -2191 177 2019
1987 2019 1150 -2100 -2223 -930 1197 1036 -1908 -2938 -2013 45 1168 -2094 -3017 -3467 73 621 -2614
2004 -2614 -4406 -1928 1240 511 -1845 -3115 -1626 1045 1353 -981 -3712 -401 1430 2073 -1030 -2146
2020 -2146 -460 2130 2633 -126 -1627 238 2198 2968 858 -2196 154 2519 3856 891 -749
2035 -749 -1265 3817 2761 1165 -2141 608 1245 3058 962 -1583 -1099 2571 1902 -518 -3104 -1008
2051 -1008 1495 2117 -429 -2880 -459 749 1315 -518 -1845 -3013 1224 3604 199 -2636 -1555
2066 -1555 1142 2158 -113 -1652 -1720 1413 1946 255 -1691 -856 2042 1539 13 -1426 -1547 1954
2082 1954 1958 104 -2103 -1132 118 2047 252 -1571 -1768 1364 2214 118 -1695 -2162 1284 2494 -46
2099 -46 -1091 -2247 845 2333 190 -1785 -1592 -60 2183 256 -2543 -1868 -223 1056 516 -2510
2115 -2510 -2274 456 2753 856 -1606 -2837 -8 1803 131 -2686 -2631 -255 861 203 -2217 -2187
2131 -2187 -1136 1235 -106 -2124 -2938 -1326 842 657 -1869 -2148 289 1468 689 -1789 -2257 -257
2147 -257 1902 1317 -261 -1334 562 2112 1505 884 -387 1228 3090 1833 -1168 -1601 1110 2080
2163 2080 1670 -353 -782 1290 1864 1607 -893 -1101 -712 1581 1639 -1192 -1120 -628 1121 900 -2411 -2064
2181 -2064 -800 1067 -748 -1599 -2222 -486 -346 974 -1153 -1837 -207 -77 -35 -1812 -1643 -1974 770
2198 770 1602 -1593 -1474 150 1685 2834 -595 -213 320 2627 1347 10 -358 556 1560 2237 609
2215 609 147 577 2563 2093 -975 -1402 -381 412 1863 -634 -2320 -1503 337 -301 -1551 -3595 -2721
2232 -2721 -793 -117 -1910 -3863 -2749 -396 -929 -1783 -3638 -2794 -1125 -776 -2433 -4592 -2020 -1276
2248 -1276 458 -1404 -2890 -3035 264 959 496 -1432 -954 2338 1799 40 -920 572 1101 2507 1347
2265 1347 -34 -313 2321 2208 980 -328 119 668 2249 -183 -878 -314 1390 1368 -1180 -1793 -1532
2282 -1532 965 -3 -433 -1397 -2121 -141 177 -840 -2577 -2044 -1548 582 -942 -2741 -1985 -182 84
2299 84 -835 -1104 -694 121 856 -128 -1772 -1223 372 1277 1313 42 271 202 1749 1792 1260 -395 1777
2318 1777 2199 2630 407 387 1683 2609 1678 388 132 1411 3168 1194 418 -1189 358 1554 246
2335 246 -972 -2035 -1020 -571 -602 -2776 -3569 -1135 -1359 -1452 -3607 -3535 -2026 -965 -1003 -2621 -3366 -1311
2353 -1311 -571 -521 -1884 -1729 -74 467 196 -619 -1303 325 1801 1532 -89 -342 954 1978 1612 854
2371 854 -91 775 2241 2414 1949 -24 214 2069 2806 923 -520 548 897 567 -386 -1428 -718 111
2389 111 -496 -2050 -1966 -1239 -505 -797 -1998 -3424 -2183 -1140 -21 -3287 -3101 -908 -1281 77 -1029
2406 -1029 -1261 -1261 55 874 -323 -1524 -308 702 1688 1667 1147 558 1670 2741 1215 763 1222 2328
2424 2328 2810 1599 785 137 1890 2889 1897 220 2022 3226 1577 927 362 574 2042 239 433
2441 433 -678 -159 751 154 -426 -1384 -1226 -28 -436 -427 -2217 -1793 -326 -418 -1297 -1750 -636 664 213
2460 213 -561 -1840 -463 -263 259 396 441 -254 685 1550 420 114 224 1218 2196 1554 589 1400 2409
2479 2409 1156 1713 629 918 1055 944 910 -124 744 846 1316 316 -1077 -874 1103 175 49 -1916
2497 -1916 -1048 -141 893 412 -2033 -1511 -897 -50 -89 -1632 -2132 -248 230 -1009 -933 -1526 -644 813
2515 813 -499 -1312 -537 490 1121 1511 563 194 606 1822 1163 1270 918 170 1583 1261 1333 218 1079
2534 1079 2383 2084 1249 360 1896 3890 1360 -4 -272 987 457 1258 1073 237 -658 -52 855 214
2552 214 329 202 267 230 -74 -290 270 1035 -1146 -1155 -543 -788 926 1326 -666 -1381 499 927 -729 -1006
2572 -1006 -1217 338 1571 853 -433 728 1356 1064 1968 -319 -592 1672 1064 343 1302 591 1343 1149
2590 1149 1566 -308 -30 -615 477 1118 9 153 539 33 682 -107 -500 449 -81 -229 -588 -1143 -641
2609 -641 -441 235 -1169 -958 -1188 817 -107 -528 -897 -727 979 23 -340 -1160 420 798 487 492 1289
2628 1289 -569 737 898 -337 479 -169 169 1023 -295 -433 -555 -101 2156 -796 106 508 857 885
2646 885 -102 -859 -165 1014 311 -189 -1439 -725 -38 1132 304 -1243 238 227 1526 -24 24 -1952
2664 -1952 812 515 157 -626 -766 901 1425 499 -654 -613 177 -522 404 279 308 623 403 -27 -171
2683 -171 -1014 733 554 127 785 -40 33 909 -151 573 376 147 728 1180 -126 -677 1350 953 761
2702 761 720 155 -7 857 64 -750 -457 -55 203 231 -1090 -265 770 1683 1231 190 -20 1709 154
2721 154 900 -42 -268 -72 1082 -135 -469 -441 108 1732 791 103 -375 -293 1508 -232 -60 239 -32
2740 -32 58 574 -56 -1283 -769 -38 -1070 -443 -1077 -308 332 -500 -2375 -1893 -37 -691 -1574 -107 465
2759 465 -346 -116 777 708 -1068 -1165 1954 -448 -116 1171 895 227 1111 -708 -957 1103 2 1052
2777 1052 905 -339 -679 -69 874 -1239 -814 -1095 -840 -583 1089 1095 -402 448 -213 -177 -539 454 91
2796 91 173 -222 -976 295 1547 1110 187 -1400 -1198 1296 1134 580 168 456 1161 1611 861 619 245
2815 245 514 -476 -125 1723 1749 851 1737 2161 1893 324 493 1028 1574 428 647 1536 479 1020 -1621
2834 -1621 188 -583 -307 311 -321 -971 -54 379 -350 -999 -969 -44 1316 16 -1416 -1433 987 -462
2852 -462 508 -719 -97 135 63 -563 -379 -684 -162 145 -84 1221 -1062 732 496 1645 -332 120
2870 120 -401 213 449 -449 537 2196 -102 1154 -1339 -78 -506 450 647 906 -390 -124 -391 -2121
2888 -2121 -1132 66 -154 -229 -95 -75 -435 -883 37 -1288 -1342 30 -1156 -1215 -402 -910 -55 -863 -197 -262
2908 -262 -712 -985 -93 -1107 -955 -1160 366 166 1419 78 721 -201 72 -406 252 -964 1474 201
2926 201 -72 1639 1600 1113 1460 822 275 1224 1034 499 316 554 682 311 297 1344 -105 1294 -906
2945 -906 -429 1193 409 -1135 340 -1914 1097 -1414 -335 -786 -293 -159 -532 1256 -744 -680 -468
2962 -468 -338 146 641 -198 622 -236 -288 1284 190 601 -489 226 1392 917 903 1337 1046 596 407
2981 407 668 467 203 1494 1297 -11 690 803 -1081 385 530 1096 482 870 215 -1317 -418 198
2999 198 -239 446 -826 206 -599 -1047 -1891 -330 -278 -897 -586 -533 -885 -1112 -203 284 591 -898 457
3018 457 -108 -590 -642 57 18 22 -1040 1649 323 1181 963 1323 511 804 854 1744 1299 1394 659 -91 429
3039 429 1154 273 46 -83 -681 -553 -690 421 -876 696 9 -705 -581 289 681 -1157 -341 -551 -1048
3058 -1048 -969 -599 -774 -772 968 -879 -837 -322 -136 450 458 -540 1155 151 858 -100 310 478 528 1184 352
3079 352 1754 388 915 112 1191 1936 705 1303 -1273 -124 1835 14 5 768 1134 -460 1486
3096 1486 1462 -595 -211 -429 -1250 848 153 -743 -225 -1203 620 43 -352 -753 -764 1378 1226 -204 -830
3115 -830 -751 -923 500 554 -20 -894 -285 -519 -277 -134 -989 -704 47 356 -465 202 895 1013 517 665
3135 665 -150 1358 -304 1158 -689 -203 612 437 5 -260 470 -198 -232 -837 169 1458 -441 -197
3153 -197 913 -53 -17 273 123 61 -1349 122 -369 -1172 943 490 -814 196 -54 -74 -380 877 157
3172 157 429 -232 630 -419 -527 99 -1129 -140 -223 975 -212 198 36 707 1305 572 808 774 -250
3191 -250 591 1758 -273 326 -36 192 322 617 1182 2079 398 -1002 1074 583 -953 753 737 -825
3209 -825 -205 154 321 630 923 860 -1631 -866 -840 -960 -489 456 1389 589 1379 671 -755 421 -149 -1030
3229 -1030 86 -571 579 1160 1357 -983 517 -1594 -646 302 -1105 173 1184 -340 1892 1715
3245 1715 621 208 795 382 -610 -121 -833 -949 238 -258 -1145 -140 -539 787 -176 -326 -525 -552 868
3264 868 999 373 -1751 107 1 612 857 -2033 531 875 11 -720 179 -81 -240 891 547 -339
3282 -339 -555 -1073 450 174 -908 -754 -1483 -170 171 366 -742 1269 155 62 -244 -76 -1008 -981 -751
3301 -751 -33 453 1242 -454 -275 893 -1870 -1168 1996 -844 352 457 1045 -972 1558 -4 1604
3318 1604 428 -652 400 291 -440 277 6 178 811 1440 -536 -523 422 319 -207 -409 624 -700
3336 -700 1379 -71 126 -190 883 1757 900 908 882 249 -132 -141 369 -2381 10 -183 748 439 353 -535
3356 -535 -49 -57 -1113 -923 572 1218 156 -284 -313 930 -522 -405 -254 -243 225 62 -440 1237 402
3375 402 844 361 -82 -361 1291 825 560 -860 1157 424 1000 106 -56 -142 554 855 -77 61 143 -1159
3395 -1159 309 -1042 384 -1771 -192 -1227 -320 -596 254 -462 -174 136 763 -1526 97 -1049 -1424
3412 -1424 -1659 -244 -483 116 -1303 241 -248 576 -573 -380 -226 657 319 -298 -377 679 1647 640
3430 640 183 -722 -296 -170 655 577 341 580 524 464 -572 345 211 866 1287 -1010 291 705 1545 319
3450 319 420 961 489 -53 -726 -9 589 758 143 685 -360 1303 1259 -204 -914 -1619 -184 2 365
3469 365 1388 -790 627 -38 -22 359 475 805 101 -102 -687 -537 393 -149 -191 688 111 -96 -744 225
3489 225 -498 150 85 919 399 438 61 126 -97 330 -293 -22 580 -640 -761 -1172 -307 676 -905 -891 -710
3510 -710 -775 1008 -421 -54 -38 -46 -281 -178 -482 -1476 -947 -1140 210 -835 229 -205 981 21 -451
3529 -451 808 638 -647 -153 -15 -518 432 992 780 -355 -1088 96 456 -400 -746 833 -871 -659
3547 -659 528 -283 300 562 1596 418 93 176 554 309 302 -512 -860 -339 504 -1321 -183 -431 727
3566 727 104 -1835 -114 1274 155 419 121 167 3 -210 538 -413 -197 212 35 499 53 867 693
3585 693 1193 271 141 -649 -143 135 -232 -291 -783 784 94 -506 500 -649 606 68 859 -197 -133
3604 -133 -198 -628 -1266 107 1615 -681 -267 902 -578 983 -537 665 -235 85 143 -618 227 653
3622 653 552 189 400 330 72 -1456 203 -663 -696 -394 -564 1214 326 -433 973 314 -18 -243 1425
3641 1425 164 -90 -475 310 -491 182 824 424 169 108 -549 -290 -224 -353 -990 -532 545 -163 -196 -440
3661 -440 -883 -664 -159 -1497 -453 -927 318 -727 51 162 686 -1006 694 37 -385 -273 -243 -1368
3679 -1368 234 841 -265 -153 565 -656 356 697 -1359 150 329 33 -114 -538 -543 222 249 1193 -388
3698 -388 33 498 692 182 347 -256 356 -1123 558 587 -211 458 259 177 -171 660 443 1053 438 -214
3718 -214 -376 666 -334 139 1051 68 222 264 -669 42 -902 1385 1147 248 221 31 -1211 772 -540
3737 -540 1147 -405 -151 -1313 -640 437 -426 206 1709 1841 105 864 -1089 -602 1122 252 445
3754 445 2003 805 -739 -42 455 159 188 282 154 1287 1000 -1040 377 -1284 -1512 -446 -625 -501
3772 -501 -416 1222 -285 178 840 649 143 -419 107 1 -1024 300 -1271 473 -1066 -1289 90 559
3790 559 -791 432 236 554 -977 0 113 -850 609 1921 63 -633 -387 -491 -763 -1284 -253 -81
3808 -81 1222 -110 -1278 197 -323 588 -113 239 153 -357 -796 -155 233 -468 468 -39 557 -819 1337
3827 1337 93 573 -181 -637 816 632 -420 -514 -417 1170 -26 -1553 1447 -527 2 694 405 -753
3845 -753 -1027 -685 865 423 -11 517 937 -2 -159 587 1422 -101 -662 176 562 -610 341 889 921
3864 921 -178 -38 243 -54 -862 35 -323 -438 329 449 461 320 523 297 1497 -1478 2 889 811
3883 811 247 -738 92 441 49 905 -440 568 59 -521 875 -547 -697 138 -179 83 408 -497 646
3902 646 -892 -760 -479 -286 -459 -618 -7 -656 -484 1166 171 796 129 849 -728 -733 754 -360 -442
3921 -442 249 -544 701 556 -2 -621 -191 -10 381 1006 -870 551 -1080 1156 439 -1029 -689 462
3939 462 -773 -744 94 -286 -1052 -958 -588 515 105 339 14 467 -734 -122 48 225 2087 -164 863
3958 863 -97 -338 -601 -120 -577 -691 -1276 321 508 96 -1047 910 -346 472 357 711 -474 170
3976 170 -628 833 -797 -13 647 -866 974 -521 133 552 720 1104 -811 1125 -545 -125 -886
3993 -886 401 1103 311 1778 -306 -420 -1497 1467 1245 232 967 450 -817 296 36 -248 -579
4010 -579 -231 -1420 -417 -139 -1130 -918 86 282 760 -995 -378 185 -12 -630 -962 -52 -344 -1073 -568
4029 -568 497 386 -1110 -174 -512 1213 79 585 1064 -41 798 6 375 1889 749 290 812 -134
4047 -134 79 276 290 59 -411 -109 245 333 770 -272 19 363 839 -165 559 -318 -192 -397 -745 -111
4067 -111 -875 390 301 8 -376 -316 -202 -563 65 -527 -770 688 -276 -366 -479 658 188 1175 1134 372
4087 372 373 -14 1230 262 -537 512 576 -565 -670 -431 381 -127 280 119 -296 649 406 188 -426 460
4107 460 793 535 211 -236 497 -42 392 -305 -24 274 -690 -73 -76 554 862 1038 1065 -227 -460 -328 177
4128 177 37 -633 557 166 139 1273 -189 -350 69 145 -405 -237 216 1042 -271 1397 535 -50 161
4147 161 548 -1217 880 79 270 364 281 -536 -435 -95 625 -21 -414 -1006 968 72 -171 167 46 -718
4167 -718 126 -588 -336 685 104 429 331 -435 128 -764 -41 -269 230 -204 -3 293 295 -218 221 189 -113
4188 -113 132 -230 223 61 -38 747 -161 -339 -739 -738 372 -343 109 47 -459 654 -145 -24 -266 -43 542
4209 542 297 -266 201 278 514 -13 698 -201 -1313 858 411 89 185 495 -234 -639 437 204 298 400
4229 400 -389 207 -838 471 -579 149 1220 123 129 280 -501 401 -258 -1 -557 217 195 -204 263
4248 263 286 -267 488 -202 -391 -242 572 407 960 1257 -187 224 -191 331 1239 16 80 422 -605 -234
4268 -234 927 -311 -1121 889 -32 185 844 165 179 -593 402 227 -84 215 -244 347 -289 659 -957
4287 -957 -776 155 43 -527 -567 -157 -16 -186 556 -129 492 406 -2 -247 211 186 -584 945 37 -180 -478
4308 -478 -565 120 -583 -443 370 -1115 -503 -783 197 709 649 330 447 190 -35 -727 215 -584 317 -354
4328 -354 -502 560 371 -84 -32 -987 33 -508 69 -324 -319 -301 589 918 -332 -249 323 370 -691 690
4348 690 -714 494 -224 475 -565 30 606 -289 -395 852 600 404 -483 33 537 -402 -678 73 629
4367 629 441 -319 422 -282 -67 -217 -117 235 -580 88 1485 -517 121 773 498 994 100 -536 330
4386 330 149 937 -771 -393 -1330 360 82 -1151 260 69 543 -713 282 287 262 -294 -7 -434 382
4405 382 -366 -370 -386 487 110 -19 -751 31 325 686 728 -1024 229 -374 -290 -186 -40 -322 -780 -163 1058
4426 1058 216 -543 397 -14 -246 612 -275 -137 -1027 -7 377 -437 319 424 -778 418 -134 994
4444 994 -235 -999 551 224 197 -502 620 -169 1117 189 -40 -213 -417 -428 -344 612 -319 10 522 347
4464 347 659 -214 12 -242 -818 650 -678 253 -179 497 -160 -1080 456 151 642 50 93 106 -82 -1013
4484 -1013 289 855 930 751 659 -706 -746 -696 319 14 -301 -154 -175 142 -730 137 896 180 -209 613
4504 613 404 -1026 402 -664 72 175 -812 -455 -1 -585 768 6 -40 171 1103 -126 45 99 93 -29
4524 -29 370 843 -312 618 1349 733 -770 -158 -363 -358 299 370 -450 324 -255 -456 90 723 241 -21 1466
4545 1466 696 -844 294 323 123 284 -230 -303 -969 -609 544 242 826 45 -735 -525 -636 163 213 -395
4565 -395 781 -639 -890 -873 -220 -468 -251 -86 286 975 -292 -790 -696 -335 498 343 405 71 1103 407
4585 407 238 -754 -195 -177 11 525 207 5 540 -432 -472 369 -193 127 634 977 433 -326 781 -198
4605 -198 209 -82 186 598 -632 426 1161 -134 -284 -140 -1098 118 -569 -142 309 -438 445 -415 -200
4624 -200 21 935 -517 -539 494 707 164 116 516 -903 -464 282 -378 4 250 -269 -234 389 -1091 240
4644 240 210 229 382 -345 244 733 207 46 -436 175 359 -497 953 -326 82 256 -979 -829 -75 615
4664 615 -174 479 289 -265 467 -232 -629 250 23 -532 -136 -924 -201 171 -91 -47 527 -758 -159 1251
4684 1251 -895 -294 -837 394 -313 -71 40 -579 -269 -279 147 572 -291 -504 -665 359 -10 147 -492
4703 -492 -229 -242 353 252 33 -481 -394 360 50 -132 303 72 -918 651 -124 187 -121 -315 2 -116
4723 -116 -733 -74 -906 192 -168 -232 380 -137 70 -124 237 -192 -735 170 1579 -667 236 -467 -409 -540
4743 -540 -204 673 488 372 149 404 -407 537 7 462 -598 685 -464 -535 409 1094 107 49 -23 372
4763 372 -43 312 316 242 -470 339 1564 1398 201 -664 394 110 -276 -120 -349 648 812 -269 -225 -180
4783 -180 -543 1211 640 -282 557 410 -686 -468 -249 77 731 487 686 65 448 -73 1147 -208 629
4802 629 406 -608 662 -530 -518 205 35 480 518 -5 691 315 -185 -810 -208 150 -267 -297 -71 -150
4822 -150 454 160 -1226 -383 -161 -499 21 -241 -39 160 11 -32 157 1084 -385 -1041 147 473 -989
4841 -989 433 -193 -35 132 -75 559 -438 -636 391 248 -344 125 -552 8 332 386 1050 -1118 125
4860 125 -430 -354 370 -655 -709 57 283 416 344 380 752 132 34 -880 -215 41 412 408 -448 -58 -328 349
4882 349 686 535 -31 226 -164 -357 835 -368 439 278 195 -312 442 119 546 193 104 599 -87 -208
4902 -208 235 -63 88 48 1045 578 90 -291 -523 -162 290 93 671 544 753 -526 -249 294 -175 -36
4922 -36 -633 -330 -332 -293 324 316 -96 355 449 -162 -576 17 909 575 -722 -358 -187 -176 675 230 13 -1019
4944 -1019 -35 -153 -491 267 -1019 27 -131 -109 -395 -641 -422 -556 53 689 178 625 -58 461 171
4963 171 -108 -1046 339 640 -766 -13 17 -319 397 -245 -650 -229 -76 -229 20 -410 285 -784 96
4982 96 213 -474 10 -515 220 102 -41 -665 -303 38 466 487 -268 319 267 19 287 -380 -988 86 -680
5003 -680 211 383 260 641 -447 -96 272 53 -606 95 -445 340 15 93 399 174 673 -124 167 246
5023 246 11 -111 -275 270 -181 -239 75 -83 442 -213 86 -1047 201 -147 -45 -98 521 -616 425
5042 425 458 350 -96 605 154 -358 -758 -660 592 76 185 -671 487 682 6 -987 -209 -592 -366 -234
5062 -234 233 -52 496 -727 -97 -287 -373 129 539 111 -703 319 488 -341 -161 355 415 -4 -639 -192
5082 -192 -451 -478 -1263 -27 232 376 -206 194 1138 706 -661 -782 -530 82 -308 388 489 -978 34
5101 34 365 578 351 -60 620 106 156 -332 -96 -8 418 251 -216 -439 -30 10 198 -773 -284 -456 19
5122 19 167 263 -601 247 -434 -51 -193 119 287 209 -439 199 -94 933 -1043 -95 -229 -23 92 -57
5142 -57 -306 812 -265 618 63 -1062 92 -111 188 -321 470 -308 250 247 117 270 667 -988 -859
5161 -859 148 80 1206 -64 -337 -20 -91 947 690 396 -778 -85 -132 215 -425 -277 111 -117 -631
5180 -631 140 1033 657 525 -15 -613 332 -425 80 500 -364 160 -224 430 -295 -310 -162 404 -139 171
5200 171 28 570 283 -275 192 487 31 -319 15 -171 886 -52 -240 34 404 -303 246 241 -345 703
5220 703 -119 -247 261 -320 390 -121 -791 -60 132 -521 -573 -73 309 320 -346 -284 -226 210 -662 228 279 -570
5242 -570 -543 804 -12 -120 144 -793 283 30 -518 225 -782 -490 221 75 1093 -525 422 889 349
5261 349 -497 -707 -10 -244 583 367 -174 258 -824 -742 -469 999 174 102 -1372 322 693 -174 101
5280 101 96 174 298 -314 -799 742 840 154 -793 -141 618 362 -199 549 54 560 -30 -60 -286 355 760
5301 760 -18 517 -166 -179 502 800 -11 -916 -1362 -1241 -193 89 184 252 -683 787 -849 -873 -323 -76
5321 -76 -271 -122 -422 -179 -356 -245 -337 590 -14 -764 -203 757 -419 863 -87 976 383 649 -396
5340 -396 -795 -253 572 281 -250 -133 -710 1034 -375 164 194 -21 -148 340 625 -440 -546 435 241
5359 241 109 853 -34 514 -349 -747 830 -56 304 -704 -440 -147 -251 -17 -245 -564 -405 -366 -627 -123
5379 -123 -947 137 178 -288 481 115 529 -242 -978 244 194 157 -997 1378 1018 -421 61 -301 1137
5398 1137 522 -246 13 512 498 -570 40 282 916 -470 -204 -319 74 -534 -232 301 386 -648 -963
5417 -963 -393 613 -564 125 -166 323 -487 183 -217 -120 197 -537 504 346 282 -887 705 775 -452
5436 -452 -244 -495 -123 144 -380 -452 -615 -67 -518 -245 27 311 241 -793 157 103 281 -64 311 36 48
5457 48 -556 -651 -281 344 -189 485 119 -226 -585 -731 -901 -491 -54 -526 2 171 -289 -160 -1388 141
5477 141 901 -215 -492 123 570 301 -56 -351 1589 -539 -236 217 -13 563 -1748 -374 116 -703
5495 -703 743 997 203 -1304 -571 -676 274 -148 59 498 245 278 -750 1061 -232 185 252 539 -325
5514 -325 -559 262 -774 -335 10 234 748 42 412 -12 -410 -60 506 -282 197 -111 581 -319 741
5533 741 86 52 -361 28 -553 -600 -123 -476 168 -42 -262 316 -28 -151 850 -16 563 -269 623 -249
5553 -249 -132 104 37 -480 826 149 -243 585 -358 -314 -498 -303 -690 -26 519 393 122 45 -1332 -769
5573 -769 450 1223 -218 595 -1083 -331 -89 673 -600 400 173 -799 -217 -368 647 809 70 -46
5591 -46 485 170 277 266 110 -29 -218 -35 -18 -744 91 -314 -13 1377 26 -349 257 -473 45 475
5611 475 -288 191 -402 1201 -176 295 -442 144 1607 237 -421 249 534 577 270 41 285 12 -289
5630 -289 296 132 201 418 -20 -1048 -40 626 -583 183 -611 601 -1169 450 146 -615 44 -1576
5648 -1576 -1131 643 1658 -61 138 590 575 -824 -543 150 -171 -548 -510 -23 794 505 104 315 112
5667 112 232 136 6 -679 -478 -135 736 -333 111 -1130 -287 291 -373 118 -99 12 -322 -53 -434 41
5687 41 -121 178 1033 113 -74 580 -17 397 -332 -468 959 389 250 -379 219 -748 677 -658 -375
5706 -375 668 -742 286 -286 275 222 661 549 -473 389 -75 338 -490 -303 861 601 368 78 -883
5725 -883 -625 829 398 25 -663 164 552 -177 108 -160 -421 509 510 -239 -608 415 68 602 -217 -432
5745 -432 816 64 561 -229 297 -152 -556 -216 16 85 392 593 372 326 782 451 501 17 -294 -523 110
5766 110 518 954 -314 -229 -441 -47 653 358 399 1116 152 724 -3 -187 -33 -665 -879 -545 623 1120
5786 1120 1386 290 -324 -660 240 223 717 504 -157 291 -585 -72 517 -719 753 -570 366 -152 -938
5805 -938 224 579 544 128 540 -108 589 -210 -663 158 -441 -351 -43 -176 -308 -400 -142 509 355 578 -254
5826 -254 -89 34 -658 -35 -653 58 -23 -558 -542 526 -777 84 93 -891 85 -464 930 -177 462 -893
5846 -893 74 21 -104 -434 123 -576 14 307 382 -135 -293 149 456 1189 78 -355 -640 715 -304 -53
5866 -53 -501 -823 -658 -1155 82 425 641 766 -213 708 -1455 359 -959 557 17 230 -118 -593 -248
5885 -248 -453 933 506 -278 -249 20 63 145 1122 217 104 331 -412 665 234 -751 -238 217 -650 -269
5905 -269 271 1065 187 -1125 454 272 -339 -1014 -355 -509 557 -820 349 287 -404 -427 -978 445 -698
5924 -698 275 715 -286 774 -159 681 -755 270 -1294 -118 -500 3 -95 -630 1103 825 97 468
5942 468 539 -340 -48 -826 -254 303 -698 378 292 526 -188 -253 22 12 -173 -840 -311 -473 385 -316 312
5963 312 -1220 -12 348 281 -394 410 716 -285 -347 -1088 -984 681 -758 414 -183 -883 -799 1000 59
5982 59 -203 -160 271 -158 -394 698 -148 -34 -19 277 -154 1748 -228 165 602 889 -210 -464 897
6001 897 -527 281 -1030 -216 -151 -219 -86 675 -352 -587 -400 -465 -94 -900 -1196 873 -493 -351 434
6020 434 -1171 -5 -668 -365 -860 -1173 542 -824 -453 307 441 882 -880 -497 322 -685 -319 86
6038 86 968 437 61 213 -671 674 -427 -301 -517 -37 -604 -280 -332 729 -613 -365 746 229 291
6057 291 388 -499 -992 300 -92 8 262 -789 170 141 526 -357 29 -359 372 -621 25 418 415 1120 -82
6078 -82 199 319 688 349 -111 -882 57 -134 250 172 288 -219 -1255 632 123 687 584 -154 93 -339
6098 -339 -97 -87 530 -133 -199 0 227 -172 1212 386 -166 89 118 80 308 -578 586 -7 3 396 120
6119 120 -880 90 -350 -330 4 -724 -582 133 -424 -66 641 -124 156 -629 -356 -165 -77 -114 424 144 407
6140 407 -179 318 393 513 -333 -208 23 634 -461 -753 24 -307 36 217 115 27 412 -514 -182 540
6160 540 449 245 -435 193 -147 -67 -577 322 -444 387 186 245 94 -813 553 317 -239 -141 1020 -150
6180 -150 755 683 508 57 985 506 -225 -633 -60 523 170 -93 -251 422 -26 190 -42 166 -334 425
6200 425 61 125 876 -549 229 -280 -84 -51 577 -126 -306 -380 106 -170 -314 -385 331 -488 261 -55 12
6221 12 141 420 34 1091 -265 158 230 -130 807 487 86 -269 -120 -863 -1246 -305 214 -476 286 -129
6241 -129 164 41 203 203 -405 -139 -164 354 304 -170 -835 228 -468 -344 94 -326 61 594 -291 209 142
6262 142 248 110 318 78 -35 1149 58 528 -340 -135 -614 -556 307 784 675 191 210 670 241 156
6282 156 113 149 -1230 -47 1003 -215 -65 -455 -546 -411 -807 108 -554 -292 -745 98 -9 314 113 -78
6302 -78 12 -36 588 499 -20 338 109 302 458 331 165 14 318 76 -474 -284 -88 211 -804 -390 -48
6323 -48 -681 263 -230 -81 -139 573 -506 889 196 529 639 -20 382 85 -102 -938 -52 -212 495 13
6343 13 -244 -168 -369 69 -134 206 -112 52 250 -35 694 -288 278 -558 101 -175 -362 -694 -132 482 -576
6364 -576 -361 422 331 1621 465 83 -175 -585 416 -17 313 328 -35 -176 444 -10 -47 7 -412 165
6384 165 311 736 -254 185 -361 -773 -109 -378 -187 334 91 85 -484 -60 -206 -467 101 304 338 31 -260
6405 -260 169 530 179 -188 256 638 417 -154 -29 -237 -10 -22 -484 541 130 -562 1307 -115 -416
6424 -416 514 576 -875 133 -642 85 -128 -75 -20 661 377 -81 -148 -207 852 306 363 -205 573 479 -595
6445 -595 -40 -621 -95 312 -75 218 -486 15 72 116 200 169 -647 128 446 576 -15 -421 -414 -165 691 -44
6467 -44 -368 -72 -74 -462 -256 -95 -42 -190 -4 365 -61 -253 268 15 -479 193 -184 171 -483 172 -137
6488 -137 -120 23 -55 -12 -171 554 4 -583 -69 555 -250 -106 -188 402 1216 434 404 79 -3 403 -336 553
6510 553 632 -75 -379 361 301 -533 88 -181 -364 248 873 30 5 555 61 230 -95 614 -433 783
6530 783 102 696 -48 70 -126 135 -148 599 -244 611 678 617 -229 71 -133 170 396 468 1325 737 94
6551 94 -463 -508 38 381 -312 -154 696 407 47 -346 -391 126 218 264 615 1040 185 -180 399 575 -258 640
6573 640 257 -760 -646 995 48 101 -500 -400 -462 -455 -249 108 -806 63 350 -41 112 455 -90 -179 51
6594 51 154 131 247 756 195 199 -690 281 -170 233 -322 -792 -174 95 695 -78 665 396 259 111 -49
6615 -49 808 -68 -945 624 -51 -131 97 1239 196 305 291 -691 -511 702 2101 -18 271 113 -334
6634 -334 112 -538 -649 -137 -578 207 749 610 -193 -146 -708 143 67 85 256 -435 568 234 -312 -1095 -81
6655 -81 -997 467 954 -188 165 670 612 370 -156 49 328 -939 -207 267 -18 -385 -746 580 -661
6674 -661 72 -213 -122 684 -612 417 -519 -329 475 -32 184 -705 -519 -813 1433 -329 -1 -24 682
6693 682 -96 232 136 1001 -1298 357 460 412 50 -38 -379 895 291 593 198 26 26 43 283 722 155
6714 155 -211 -150 -276 -150 -316 892 792 -443 -796 -566 165 223 29 460 466 236 -422 -536 223 232 -920
6735 -920 -49 191 -180 428 20 119 -202 -550 433 277 -234 -206 -591 447 -612 -32 336 780 436 20
6755 20 -343 137 99 -40 -194 -72 185 -391 -317 -221 -53 -26 105 534 210 -171 53 156 -672 95 353 309
6777 309 765 3 189 490 527 -33 97 227 -299 -161 225 205 512 -272 -353 404 -81 -351 221 -51 -377
6798 -377 -25 -336 -419 -414 543 -60 -367 553 -483 -422 92 -553 95 109 264 -554 529 181 149 245 -60 -312
6820 -312 -45 28 164 -652 75 -220 -344 139 -318 63 -345 286 -805 68 -200 293 -97 82 -475 55
6840 55 91 -124 -575 60 -320 530 -236 503 460 -89 -508 -233 652 -526 683 648 -130 164 -276 -69 135
6861 135 143 30 -57 -64 -393 33 -159 -278 -314 -217 529 -211 -64 -323 522 -447 -134 -248 550 835 396 433 -16
6884 -16 -355 -125 171 -29 -73 626 -332 -115 -415 -329 537 -84 -77 131 -319 -12 -245 -203 211 360 -587 150
6906 150 63 -562 -260 -390 -246 -477 558 -425 -530 -68 -71 -298 -225 203 71 333 368 -179 10 -243 -444
6927 -444 -814 93 11 -68 -50 -154 156 208 -53 367 -172 251 468 -114 -257 121 458 -305 656 -646 -989
6948 -989 -42 -116 -239 111 -71 -295 251 215 -99 -159 24 238 -335 -378 -420 -39 322 318 327 -274 -23 -124 -408
6971 -408 31 23 368 -263 244 -569 448 -595 347 -348 167 142 -36 -201 -359 87 -733 -274 278 85
6991 85 -165 -781 234 611 459 91 -20 133 -755 -226 -128 75 176 3 -344 150 -564 16 -145 -132 -213
7012 -213 518 307 -1052 -218 -39 46 -10 -597 371 -386 65 377 667 124 -308 -12 272 -323 46 -62
7032 -62 117 -227 157 76 -163 372 29 -259 -789 -660 -28 160 -103 -450 -114 258 -537 -618 -77 907 49
7053 49 -442 221 354 274 -186 178 14 161 -245 11 733 -35 -263 -303 168 -428 -50 755 463 -356 -44
7074 -44 33 -134 -681 332 -344 676 -360 -615 37 -828 -494 170 388 -9 -86 112 -538 992 -245
7093 -245 -198 332 -77 238 246 292 -510 -48 -292 168 113 -861 514 -374 -922 -332 201 -61 -80 -943 -205 -342
7115 -342 131 -607 162 309 46 572 116 337 642 -101 -227 -215 -211 -16 -282 472 -343 -539 -65 472 356
7136 356 -290 -47 -191 -435 241 44 -11 -124 -155 -292 -481 -219 -792 264 360 -173 -42 -495 389 791 43
7157 43 29 27 292 78 -15 -2 448 -432 -321 -434 96 327 106 242 553 63 -347 -417 -441 100 490 9 269
7180 269 -328 -71 -238 228 366 -85 544 715 562 663 249 403 -526 -305 69 246 71 -168 19 -559
7200 -559 -306 208 885 -161 548 993 -309 -634 -8 85 118 331 -373 56 -418 717 447 -37 -414 480
7220 480 -280 -149 -728 190 337 87 -291 -48 -36 209 279 184 182 278 97 -331 284 -672 -636 -202 219 -89
7242 -89 216 -748 85 -525 865 -461 238 44 -510 224 -610 662 -71 706 122 155 -66 674 142 790
7262 790 379 546 -655 -94 16 -178 569 208 177 -176 -225 553 302 179 94 65 -20 -188 -153 -209 -49 71
7284 71 -254 -447 52 33 266 -190 2 245 534 354 72 280 223 -198 151 -330 274 -62 339 -154 -38
7305 -38 -8 -323 -196 234 -321 -585 -350 -281 -265 -849 -7 -348 501 -63 668 155 258 111 421 7 -124
7326 -124 -320 -188 83 843 -535 197 348 -660 56 -113 712 270 -50 536 77 528 354 293 56 -722
7346 -722 -337 -192 -429 206 -121 -364 0 157 340 79 -421 -315 534 472 -782 -195 153 -87 469 -398
7366 -398 -235 250 724 89 249 -73 81 -93 -65 -135 171 -75 -243 1099 -45 -512 -160 231 110 -56
7386 -56 -182 125 473 260 -86 226 -491 49 46 -91 -154 724 212 -285 472 377 -112 -186 -220 -25 450 -187
7408 -187 -127 331 -105 421 -533 -206 160 197 -402 489 -616 -385 986 43 -307 -754 -34 143 203 -425
7428 -425 29 373 139 323 675 1 78 -38 253 107 -77 -442 75 -192 123 92 184 252 -167 -748 -443
7449 -443 -374 84 -275 -153 96 -140 -121 174 741 -368 -16 -130 -268 291 144 -250 -326 95 -424 37 118
7470 118 -348 -208 237 249 360 90 -110 -295 733 -584 -338 -66 -86 14 -462 588 -413 400 410 455
7490 455 -345 846 482 -175 -637 -618 -4 -172 69 -808 -110 233 225 -136 869 368 75 220 -489 -887
7510 -887 307 600 261 -467 26 -472 448 720 574 -61 -834 658 12 -23 -97 -161 8 -122 -502 -128
7530 -128 57 51 1216 383 628 -162 -206 434 -653 516 534 -145 -420 -234 98 516 35 20 26 551 -512
7551 -512 256 299 -582 -121 300 -320 23 -206 472 439 161 109 -46 146 75 154 -145 461 65 -912 293
7572 293 55 -428 -631 153 -346 -294 -80 -253 26 385 404 618 88 137 445 48 606 38 122 -80 -880
7593 -880 -232 257 208 -394 -648 -60 -91 599 -111 -374 531 382 430 -656 -121 -65 -756 -102 290 444 -49
7614 -49 -291 907 -689 169 -423 -370 -560 -497 -99 300 199 96 -45 -180 -316 312 -23 395 -737 -175
7634 -175 396 218 268 487 8 689 -502 131 375 120 -159 -508 821 217 39 651 268 352 816 534
7654 534 279 215 34 26 185 -698 118 450 -811 679 293 -188 236 -94 244 8 184 -64 20 28 -22 -1041
7676 -1041 67 -55 -593 -916 -708 45 -123 -693 269 -190 -470 -113 162 326 269 -33 -609 161 -766 765
7696 765 681 421 -92 793 109 -187 186 -546 -456 30 685 112 -252 -219 -228 413 23 287 130 -229 605 -86
7718 -86 533 454 200 74 -616 -146 -746 -711 293 205 709 -542 -12 25 665 738 -768 58 -128 22 396
7739 396 470 639 922 337 1045 -58 179 -228 -192 -285 520 -641 608 -415 -867 -392 -110 -410 -681 406
7759 406 -31 287 -81 256 -538 -341 327 575 -483 -41 300 389 -208 309 -747 195 -366 -353 667 624
7779 624 329 -200 174 137 95 -58 -136 662 345 -507 -366 469 240 272 1016 197 632 -55 -243 -83 -1450
7800 -1450 505 -363 -429 311 298 972 323 202 -29 -632 -102 -39 546 68 93 613 354 425 358 -769 -950
7821 -950 490 -132 -628 -1446 -78 315 322 478 238 297 -793 853 792 525 -221 871 -697 67 1153
7840 1153 -564 219 -196 268 792 125 248 716 -449 68 456 -119 198 422 -460 -403 -273 -321 -204 266
7860 266 -22 729 81 8 -134 -260 1213 748 1081 -258 158 -284 -635 -1610 -101 -321 110 -149 -838
7879 -838 624 418 -448 -530 581 -210 -686 885 -255 361 -549 539 513 -871 -907 -271 87 -405 369
7898 369 752 290 -757 198 -150 -329 491 -244 157 -333 795 -159 -140 880 -138 1028 198 35 -557
7917 -557 279 395 5 150 670 626 38 -139 231 -538 -241 -24 -135 -1233 -191 812 -71 -50 51 267
7937 267 -463 4 523 125 51 -409 -318 -511 641 150 -397 1309 -439 446 -68 400 -332 355 650 329
7957 329 -789 -1087 1255 -1219 171 237 1104 651 -703 722 -55 22 -369 259 -672 871 -345 -524
7975 -524 -434 -176 146 886 160 -115 -492 -609 15 -223 -283 -111 -465 -88 447 604 -375 -866 -46 -124 -167
7996 -167 545 -128 -486 196 336 -494 -113 -565 971 256 -1109 172 -692 -695 -5 -203 -699 -832 -233 -63
8016 -63 -510 513 -1718 1668 -224 67 -316 -835 264 -1418 454 36 10 -106 -190 -178 43 -238 -183
8035 -183 711 -825 177 -287 -5 -780 1645 553 7 548 333 142 -780 703 1412 -393 1281 -401
8053 -401 280 364 -1829 -79 -786 248 -46 -1108 -548 333 -756 -331 278 944 -364 -396 -705 308
8071 308 1792 200 -76 -151 181 894 871 1038 -7 -4 91 -377 -1365 -866 647 -393 1136 422 649 1327
8091 1327 438 -1296 -1010 -135 -1080 711 104 995 -567 -1157 540 -273 -821 -810 627 -1044 -1192 167
8109 167 324 473 119 -385 -69 -307 -844 -729 -621 729 874 -894 518 928 -1577 366 378 95 -82
8128 -82 -82 276 112 -708 1267 1086 357 -387 -1013 -643 -85 146 497 -5 821 631 393 818 114 -135 498
8149 498 254 113 -15 -249 148 -294 399 487 835 -137 -492 743 447 -361 648 1226 -729 46 -185
8168 -185 417 -1705 -37 299 -1733 -273 -3 5 436 -1201 -1034 320 -837 297 299 1037 216 -672 556
8187 556 -641 -142 -141 -343
8191c43
$$ Imaginary data points
##PAGE= N=2
##DATA TABLE= (X++(I..I)), XYDATA
0 0 0 0 0 0 0 0 0 -1 7 -8 8 -8 12 -15 16 -22 24 -31 36 -41 49 -57 67 -77 87 -99 115 -130 147 -166 187 -210
32 -210 236 -265 296 -329 365 -405 450 -498 553 -610 676 -748 830 -919 1022 -1138 1272 -1428
50 -1428 1613 -1836 2109 -2456 2910 -3535 4457 -5952 8797 -16190 78058 156872 32545 -733
64 -733 50740 127106 95806 22812 -10627 42525 84796 66243 4161 -17639 13262 54735 47415
77 47415 -1652 -36762 -10459 37626 47137 -3822 -47610 -25626 41145 59096 1109 -52231
89 -52231 -19450 57054 73078 9226 -38723 2134 75690 81218 18328 -16424 27704 90290
101 90290 89583 32136 6023 43812 94893 94576 49569 18926 43742 88422 99206 60492 16133
114 16133 23276 77547 99060 53913 -2844 4268 65387 89698 33422 -27802 -10880 54266
126 54266 69305 7186 -44107 -19627 41019 47122 -8097 -50529 -24731 29584 37885 -7826
138 -7826 -45131 -25269 23727 39864 5040 -34128 -21718 26311 52862 24306 -20759 -15612
150 -15612 37725 70391 39622 -9614 -4971 54454 86479 49081 -4133 6140 66538 91873
162 91873 47693 -1950 12254 66269 86002 43601 -1244 7718 52538 69626 33215 -5645
174 -5645 -2455 32964 52875 28087 -14202 -22422 14650 42363 20695 -28601 -38217 4177 40040
187 40040 15618 -39931 -45264 5043 42138 13487 -38763 -41860 12817 45176 15265 -31565
199 -31565 -29365 18932 48486 23339 -16074 -16654 27157 53874 35663 -2772 -7807 27467 58096
212 58096 46345 4613 -9553 24743 63053 49830 2985 -18592 17805 62118 46697 -8742
224 -8742 -29310 13676 54369 34311 -21857 -34044 5823 40881 17001 -29856 -40384 -4146
236 -4146 25731 8723 -30040 -44076 -13565 16423 7454 -26793 -46060 -20238 13735 14254 -24082
249 -24082 -46397 -20016 22783 24018 -18602 -45287 -14125 32248 30944 -16297 -39824 -5686
261 -5686 39572 31067 -13883 -32250 2040 40438 30737 -9803 -24882 764 34279 30504 -5126
274 -5126 -25743 -6669 26927 29368 -3647 -32000 -15217 22566 28775 -7617 -41381 -24218 20619
287 20619 27311 -15407 -48420 -25333 20575 23197 -21535 -48889 -22499 18836 19410 -20773 -46076
300 -46076 -19909 17054 19358 -13928 -35832 -17791 15736 23202 -4243 -29878 -19154 17040
312 17040 28510 3449 -27212 -19416 20462 37202 5215 -29535 -17655 25463 39263 3730
324 3730 -28454 -15446 25213 38452 442 -29007 -14016 23081 32530 786 -27560 -16261
336 -16261 17470 26894 1870 -25289 -19108 11449 25583 4221 -25699 -25290 9241 28208 5531
349 5531 -28854 -26553 8800 30266 5520 -32270 -28585 11002 32477 5259 -32845 -26511 13657
362 13657 29453 3199 -28622 -22353 13058 27470 4103 -25068 -21926 8191 25600 6888
374 6888 -21733 -24614 6238 26024 12278 -20949 -26096 3714 29447 14674 -22027 -27588 6431
387 6431 31816 14314 -23022 -25713 7794 33222 13332 -20915 -22352 9487 31343 13421 -16752
400 -16752 -20390 8656 29172 13471 -14431 -18688 4830 26172 16033 -13196 -22222 -840 25486
413 25486 17668 -14190 -27305 -2538 26923 18600 -14975 -29531 -1692 26814 17608 -18159 -29126
426 -29126 1009 28356 14992 -17281 -25029 2781 25204 17097 -12833 -22118 1456 26840 22703
439 22703 -4957 -19308 2595 29083 26888 -333 -16350 1584 33385 33090 1963 -17436 3811
452 3811 34988 32490 1177 -18893 5481 34841 31631 -2238 -18444 3288 32957 28236 -5091
465 -5091 -20638 290 24865 22052 -6732 -21815 -6385 18879 18443 -6557 -25358 -12877 15278
478 15278 19599 -6831 -28976 -15636 15694 22719 -5741 -29832 -14986 18940 23891 -5358 -27701
491 -27701 -9441 24451 27560 -1896 -20422 -4965 25005 29374 3516 -15361 -1382 24799
503 24799 31243 6347 -12417 -2577 23500 29599 8791 -12847 -7094 19940 30166 8899 -19711
516 -19711 -15017 14204 26568 1280 -27848 -20926 9580 19805 -6129 -33620 -24928 5814 13357
529 13357 -11563 -34616 -25130 1849 9101 -9902 -31726 -24705 -1 11814 -6378 -26910 -24484
542 -24484 1532 18715 2181 -22325 -21734 7455 24258 7862 -17538 -16797 11970 31174 12927
555 12927 -14107 -11314 16672 32633 12816 -13956 -11050 15644 29687 10265 -13769 -12622 10759
568 10759 23374 5807 -18220 -19252 2050 15581 2693 -22094 -27041 -6672 11628 -533
580 -533 -28025 -35490 -11218 9479 -2421 -31685 -36369 -9960 9615 -3723 -29336 -33873 -6702
593 -6702 12020 -1128 -26370 -27285 -2561 15357 4443 -17939 -21452 601 19913 11439 -10535
606 -10535 -16638 2459 22225 17500 -7515 -15301 2834 23032 16931 -7838 -20629 -935 21684
619 21684 13021 -13939 -24869 -6128 15473 7399 -22150 -31358 -11639 6310 -2610 -27769 -35803
632 -35803 -17416 334 -6305 -28389 -39253 -23306 -4116 -7474 -28153 -39804 -24567 -3594
644 -3594 -1443 -24335 -37011 -21600 1469 3477 -18896 -34135 -15502 8753 8911 -14432 -26566
657 -26566 -9237 13662 13608 -9321 -20764 -5604 16083 14749 -6256 -19248 -6861 13373 13299
670 13299 -6169 -18706 -11093 8556 10747 -7516 -26250 -18367 4436 7191 -12999 -31952 -23371
683 -23371 -541 2903 -18713 -37261 -27024 -2598 429 -22775 -38653 -26038 -3424 -488 -21281
696 -21281 -34250 -23188 -1230 2148 -15764 -29883 -20373 2350 9517 -6756 -22868 -15334 6115
709 6115 14820 -365 -16659 -11856 11655 20068 5545 -14935 -8091 13300 22346 4147 -16532
722 -16532 -9272 12916 20033 -1317 -18945 -11746 8415 12988 -3371 -20676 -16351 434 8549
735 8549 -7899 -24346 -21996 -4094 5516 -9033 -29008 -25939 -6551 3645 -9461 -28265 -28221
748 -28221 -7362 5735 -7719 -27499 -24606 -2422 9564 -5344 -22741 -20203 1501 14388
760 14388 -66 -17496 -13498 5528 15810 4251 -11594 -13538 6641 18347 8638 -10378 -10460
773 -10460 4006 18061 9898 -11002 -13861 3505 16860 5920 -14088 -17989 -55 13873 1859
786 1859 -18981 -19992 -3179 9992 -792 -22420 -22010 -6799 6267 -3341 -21415 -22106 -7217
799 -7217 6671 -236 -18799 -21771 -7322 7251 3490 -15439 -19648 -4254 12338 6612 -11108
812 -11108 -15318 -979 17430 12519 -6656 -12265 4155 20244 14959 -3502 -10567 6386 21080
825 21080 15954 -3383 -9284 6394 19185 15405 -3272 -10315 1651 17245 13999 -3598 -12039
838 -12039 -2268 14566 11230 -6388 -16379 -6603 12881 10977 -8853 -17545 -7569 10451 11040 -8520
852 -8520 -19251 -5333 11662 9699 -7584 -16865 -5140 11578 12814 -4025 -14300 -2900 12625
865 12625 12625 -1587 -10242 193 14772 15186 1477 -8552 -1219 15328 17800 3235 -7507 -1222
879 -1222 16144 18318 2450 -10757 -2962 16044 17636 -636 -12729 -3997 12813 14326 -2543
892 -2543 -13463 -4058 9844 11538 -2507 -15338 -6715 8059 10575 -3267 -14903 -9902 7038
905 7038 9610 -1356 -15054 -10425 6995 12084 -646 -15496 -10213 7199 13963 -43 -13719
918 -13719 -8798 9483 14990 509 -12115 -6902 10014 15302 1276 -10874 -6155 10418 14321
931 14321 2953 -9061 -5580 9246 15341 5651 -8415 -5764 7408 14384 5429 -11340 -8858
944 -8858 5642 14787 5585 -11345 -9893 6679 14916 4705 -10459 -8926 6935 12895 2421
957 2421 -11691 -10811 5579 12459 3853 -8601 -9198 4961 13003 4658 -7479 -10061 5564 12902
971 12902 5973 -9429 -9326 3870 13538 6668 -7678 -10339 3512 15289 6417 -7847 -10151 4777
985 4777 13181 6019 -8618 -10079 4486 12507 6995 -7839 -9355 3115 11459 6289 -7751 -9602
999 -9602 1013 10997 7315 -7113 -10164 586 12664 7950 -5725 -10913 -1237 12698 7253 -6948
1013 -6948 -11616 -1649 11246 6326 -9199 -13023 -589 10053 6236 -7881 -14866 -2010 9294
1026 9294 4399 -7192 -13390 -3238 7842 4613 -8743 -12760 -4203 6575 5722 -7622 -15947 -6115
1040 -6115 7035 6414 -6903 -14798 -4233 8050 6853 -6706 -12140 -2851 8769 7577 -4223
1053 -4223 -12629 -3282 10129 9583 -3570 -11344 -1149 9789 8822 -3883 -10688 -3510 8731 10350
1067 10350 -3435 -10766 -3126 9503 9409 -2340 -11198 -5826 6668 9728 -2796 -12493 -6176 7334
1081 7334 8949 -4423 -12100 -7088 6973 8111 -3717 -13413 -6516 6798 7566 -3937 -12544 -5601
1095 -5601 5840 9177 -1190 -9393 -3117 6388 10978 1948 -8816 -3469 8704 13539 3203 -7880
1109 -7880 -3154 10497 13773 4018 -7272 -1903 11614 13114 3945 -7017 -3024 9925 13011 3810
1123 3810 -6473 -2844 7062 10437 1250 -8086 -6152 5563 10387 -68 -8691 -7886 3370 8135
1137 8135 271 -11163 -10612 2050 7657 461 -11077 -10233 2810 9216 254 -11571 -8385 3128
1151 3128 10322 2271 -9605 -6881 4517 12534 4021 -7144 -4379 7157 13632 5778 -4343 -3490
1165 -3490 6171 12957 7160 -2760 -3587 5784 14648 7419 -3993 -5355 5510 12929 6339 -4529
1179 -4529 -6662 3978 10882 5678 -6391 -7746 1869 7765 4037 -7719 -10635 -281 7435 2520
1193 2520 -7565 -9931 123 7699 3650 -7205 -8606 -272 8446 4861 -6799 -8098 1885 9433
1207 9433 7658 -2965 -5691 4741 12559 10947 -285 -2587 6335 15013 11737 861 -2604 7043
1221 7043 15978 12544 867 -1654 6137 14384 10550 1877 -3914 4798 14120 9484 -666 -5796
1235 -5796 1254 10328 10058 -2861 -6997 -814 9227 7735 -5006 -9022 -2130 8425 7320 -4048
1249 -4048 -8215 -37 8261 5964 -3057 -7491 -598 8066 8324 -2499 -7372 -119 10169 9958 1695
1264 1695 -4687 1109 11130 12448 3053 -2104 2701 13153 11680 2955 -3854 2798 11165 12560
1278 12560 4823 -4406 1857 10020 11939 1603 -5984 -724 7437 8533 -2270 -7960 -2364 5910
1292 5910 6318 -2171 -8811 -5702 4511 5994 -1644 -10063 -6189 3465 6263 -3346 -11503 -6104 3210
1307 3210 7570 -2076 -8534 -5565 4966 7775 1553 -7156 -3776 7028 8731 1967 -4998 -909
1321 -909 7952 10240 4160 -3229 -688 7571 11809 4574 -1777 -1883 7242 11006 4814 -3426 -1543
1336 -1543 5996 10811 4500 -5929 -3800 3810 8707 1938 -6220 -5162 3527 7448 956 -6561 -6423
1351 -6423 2957 5847 -655 -8134 -6475 1818 5513 502 -6597 -6132 2501 6591 2057 -4926 -5125
1366 -5125 3392 8354 3499 -4526 -4611 2446 10474 6268 -2363 -3980 5317 10964 4661 -3271 -3026 4635
1382 4635 10180 6303 -2481 -3313 3857 9908 5152 -3212 -6040 2516 8738 4375 -5193 -6047 1325
1397 1325 6755 1855 -6886 -6872 -1710 3579 534 -6294 -8559 -2371 5102 805 -7159 -9546 -2708
1412 -2708 3610 1903 -6370 -8421 -1812 5571 2758 -6799 -6982 -609 5623 3079 -3952 -5896 912
1427 912 6861 3410 -2831 -6147 -946 6464 4133 -2032 -7215 -166 6606 4689 -2243 -6059 -1506
1442 -1506 6394 3769 -3567 -6479 -2589 6800 4088 -3439 -8050 -1249 3553 3265 -3886 -8093 -2935
1457 -2935 3585 2693 -4412 -8461 -3028 3048 2519 -3049 -7805 -3618 3474 4303 -2545 -6592 -3844 4513
1473 4513 5330 -1871 -7776 -2672 4875 5847 -64 -6609 -2166 5541 5773 -787 -5164 -1038 5712 6713
1489 6713 840 -4295 -729 5702 6835 850 -5092 -2376 4289 5719 542 -5304 -2552 4131 5091
1504 5091 39 -5986 -3406 4736 6099 -657 -5488 -3268 4256 5902 -854 -5181 -2521 3809 5101
1519 5101 -876 -7347 -4198 2750 4486 -788 -6713 -3447 3218 4864 1085 -5546 -4324 2050 5194
1534 5194 1238 -5875 -3944 3394 4915 -139 -6235 -3723 3308 5397 1188 -6024 -5050 2859 4883
1549 4883 811 -5254 -4214 2027 5392 2470 -5230 -4253 2082 5489 1099 -3790 -4612 2342 5731
1564 5731 2360 -4120 -3643 2492 5823 2411 -4859 -5331 1625 5382 1688 -4252 -4636 900 5296 1497
1580 1497 -4289 -3986 1023 4910 1079 -4283 -5093 1135 4000 1277 -4078 -5085 1681 4242 1332
1595 1332 -3236 -4564 570 4768 3078 -3930 -5653 409 6496 3288 -2952 -3844 1813 6632 4146
1610 4146 -1960 -4279 1764 6533 4177 -1734 -2989 2617 7689 4441 -1662 -2209 2744 4307 4336 -430
1626 -430 -2182 382 4574 4321 -1917 -4348 -9 5320 3953 -1891 -4441 -2659 4477 1709 -2744
1641 -2744 -4933 -1742 4263 2303 -3788 -5803 -688 3834 2260 -2966 -4439 -1395 2409 3773 -967
1656 -967 -4578 -1019 4283 4451 -1573 -3710 -2240 3843 4001 -260 -3130 -275 5723 5979 616 -4068
1672 -4068 -1646 4322 5252 -825 -4286 -1424 4699 4263 -963 -5132 -1269 3184 2731 -2055 -5327 -3712
1688 -3712 1312 1869 -3560 -6234 -4759 722 1036 -3238 -7234 -4009 333 1401 -2330 -7121 -4426
1703 -4426 -895 975 -2248 -5220 -4557 1416 3707 -661 -4689 -2961 2128 4005 -160 -4846 -1036
1718 -1036 4143 4792 2087 -2159 -791 3398 4710 1581 -3542 -1147 3134 5912 2060 -2234 -2075
1733 -2075 1984 4532 689 -3672 -2272 1088 2440 -544 -4287 -4268 59 2251 -1943 -5798 -4591
1748 -4591 -1430 1119 -1513 -6086 -4994 -1074 1467 -814 -5723 -5047 -664 3040 -549 -3436 -3764
1763 -3764 385 3937 1584 -3114 -3262 2687 3697 1777 -2257 -1986 1536 6127 2528 -2377 -2373 1959
1779 1959 5477 2812 -682 -1021 1233 4737 2658 -3170 -3498 -114 2261 -179 -4091 -5166 -1719
1794 -1719 1166 -945 -4797 -7120 -2287 695 -2315 -5771 -6700 -3333 332 -2183 -7192 -7292 -2782
1809 -2782 -130 -2132 -5345 -5471 -2218 891 -884 -3057 -5168 -824 1930 1596 -2082 -3890 1008
1824 1008 3308 2006 -1138 -2543 146 3806 4126 -137 -3283 1406 3050 2285 -1244 -2975 698
1839 698 2176 2750 -2502 -4582 -1934 1794 551 -2853 -5357 -2685 1048 435 -3518 -6361 -4242 59
1855 59 -383 -4595 -6716 -4146 236 -189 -2879 -5415 -3208 1499 1382 -3118 -3965 -2147 1921 3242
1871 3242 -867 -1803 -863 3375 3362 -536 -839 450 4484 3390 253 -1349 786 4606 4610 818 -1598
1888 -1598 459 2013 4159 538 -1765 -754 1625 2198 -124 -3506 -2456 2305 1249 -789 -4452
1903 -4452 -2842 1252 1091 -1414 -5622 -4306 -509 487 -2280 -4379 -4115 -90 1093 -2097 -4741 -2866
1919 -2866 -665 1313 -614 -4049 -2459 35 1986 -172 -2262 -2016 2316 1953 -185 -2687 -1751 1641
1935 1641 3336 790 -966 -1369 2842 3710 933 -1207 -863 848 3103 -294 -2438 -1367 91 2228
1951 2228 264 -2418 -3521 12 1852 79 -3851 -4866 -1379 845 -1525 -4341 -2906 -403 -177
1966 -177 -1044 -2977 -3895 39 1602 -335 -2600 -3606 -139 2583 759 -1958 -3062 1158 3244 1242
1982 1242 -1502 -957 924 2691 3223 -749 -1046 2356 3748 2098 -779 -1062 1356 3260 2473 -830
1998 -830 -1254 462 3308 1099 -1205 -1034 660 3102 1313 -1321 -1276 554 2267 425 -1685 -3294
2014 -3294 722 2371 1103 -1019 -2560 36 2434 1749 -1780 -2044 -706 2790 1745 -183 -2187
2029 -2187 -796 2315 2367 -1089 -1903 -239 3163 1949 434 -2030 -331 3260 1778 -220 -1442 916
2045 916 2367 2502 -50 -1429 -493 2183 1300 -370 -2074 -617 831 2239 -1314 -2373 -778 1866
2061 1866 1389 -1342 -3571 -1059 1266 1146 -1718 -3586 -1648 358 401 -1483 -2325 -1558 922 1727 -992
2078 -992 -2758 -1877 1786 511 -1177 -2790 -2074 1060 1622 -256 -2687 -700 1806 1062 -1686 -2238
2094 -2238 -1344 1665 1713 -165 -2129 -1603 381 1467 122 -3008 -1858 1188 1773 -665 -2314 -1091
2110 -1091 2522 1446 645 -939 107 2168 2959 1036 -1333 201 1490 2539 758 -1856 -850
2125 -850 1932 2994 460 -1841 -210 282 2267 207 -2040 -1648 289 2022 482 -2869 -2323 -289
2141 -289 2484 -80 -1821 -1582 149 1016 475 -1414 -1721 -219 1738 352 -1951 -978 445 1384 -348
2158 -348 -824 -621 975 2036 442 -1486 -1423 1510 2096 1577 -1093 -675 1226 2496 1147 -1222 -585
2175 -585 1595 1942 2068 -168 -2099 307 1055 400 -1878 -2928 620 1603 475 -1669 -1616 -1686 1053
2192 1053 -426 -2065 -2420 -119 320 -68 -2516 -3235 -1861 -569 -239 -3283 -2171 -1370 846 -38 -2235
2209 -2235 -2932 -575 1373 -636 -2137 -2281 -415 818 826 -209 -1698 -369 2583 1449 -385 -429 793
2226 793 1713 1964 454 -72 -383 1784 1924 390 -778 -81 1250 1173 -1091 -1459 531 1621 872 -1784
2244 -1784 -876 10 495 279 -2285 -3228 -1300 -38 266 -2292 -2392 -1008 -687 1292 -1144 -2494 -1462
2261 -1462 320 782 -690 -1709 -775 1718 700 -322 -667 -318 2329 3126 517 -212 559 2552 2897
2278 2897 1482 787 1827 2934 3191 1544 373 1186 1770 2537 1335 -1136 290 1064 1618 98 -1332
2295 -1332 -1846 316 983 -565 -1451 -2980 276 602 -1115 -2928 -2109 -1083 264 -1642 -2288 -2351 -1045
2312 -1045 4 -68 -2261 -1705 -318 -295 -588 -414 -1046 1433 1404 1303 -4 506 2006 2136 1863 -166
2330 -166 1311 2138 3392 2534 42 501 1364 3353 2362 -980 861 622 1668 1282 7 -935 265
2347 265 1577 479 -1611 -1733 -999 305 -900 -1876 -2509 -2088 -543 -2120 -2170 -2409 -1307 343 -957
2364 -957 -1239 -1650 -914 81 13 -880 -1086 -155 1276 656 564 -32 1923 3006 1861 947 170 1247 3433
2383 3433 2598 2199 1574 2315 3747 2972 1167 1141 1813 2217 2931 1202 1112 1211 2205 1757 556 -759 243
2402 243 736 878 -1017 -1851 -1132 485 63 -911 -2224 -834 272 -407 -1505 -2340 -1367 -65 -395 -195
2420 -195 -917 299 786 492 86 -1102 113 528 1866 219 542 1482 3271 1176 1373 974 1119 1854
2438 1854 2068 1143 -86 1157 2999 1847 1310 -526 108 2368 2258 -574 -731 -686 1298 460 -20
2455 -20 -2220 -1909 -458 189 -1527 -2588 -1605 -1188 -933 -2372 -2099 -1948 -179 -356 -763 -2737 -2040 -704
2473 -704 -280 -650 -1934 -1115 -588 392 -580 -844 43 603 1423 1125 -307 -818 782 2439 1147 -146
2491 -146 332 1855 1897 809 733 1679 1535 1761 1001 644 320 1500 1606 930 -293 -1073 -267 499 348
2510 348 -1684 -356 -111 424 -408 -1416 -1534 -209 136 -147 -669 -1106 -860 16 -692 -1519 -826 -283 228
2529 228 528 -181 -448 1129 1045 1952 24 770 1664 2972 1607 339 67 1698 1861 2170 483 978
2547 978 327 1589 1927 222 935 174 1509 2052 -30 1259 506 -76 1241 -181 -1589 23 621
2564 621 -143 -585 -1415 -639 547 -644 -1631 -612 -802 -980 -200 -1972 -2101 -1290 241 -1005 -1163 -1276
2582 -1276 -1350 470 89 -603 -440 -850 46 -286 -666 -1389 -966 389 928 -581 -157 836 501 394 211
2601 211 -195 352 670 1423 155 -156 262 861 -146 36 419 -114 137 26 -299 -1127 -528 -559 -277 -851
2621 -851 -1758 -1246 -294 798 -686 -1084 -345 276 -126 -50 336 -545 302 1019 514 152 -1014 584 -897
2640 -897 751 -774 -220 1878 305 -818 447 179 965 1246 -412 -1003 812 479 1811 -674 -324
2657 -324 292 1026 1162 255 -379 -569 -15 774 -575 -969 549 693 -105 598 -697 -474 279 -839 -900
2676 -900 -1234 -294 318 520 104 31 266 -417 575 383 -206 185 -14 -48 -426 577 -711 -1334 763 -756
2696 -756 -537 834 868 801 -395 -1819 195 826 891 487 140 -1236 86 -304 668 -1018 224 726
2714 726 772 264 -840 -1048 926 1058 -159 -1013 -1688 45 -243 -404 -552 -278 -179 1004 -593 -118 491
2733 491 213 -439 296 -139 -8 -784 35 -616 -868 622 157 431 -1507 -527 -492 -1327 286 -100 217
2752 217 -1014 -443 -24 -767 672 -517 -118 207 -596 -361 -864 2 675 325 -222 580 -1467 -444
2770 -444 -385 114 403 621 1232 343 -137 1461 979 902 129 -67 915 644 1253 709 1316 -1006 1559 1120
2790 1120 1173 600 -1336 443 804 141 -1404 -199 -838 108 1278 1240 -939 -239 -1234 -910 -277 -583
2808 -583 347 85 305 -1435 -823 -1114 486 -674 81 -53 -793 -115 -790 -591 -101 -1133 1298 1452
2826 1452 616 1788 244 348 2143 519 1140 -33 98 -13 111 -1114 671 720 622 1861 -264
2843 -264 -349 -671 -758 -413 -1217 -405 -152 -259 -1441 -1415 -12 -13 1025 -435 -1096 -1281 -1462 -1911 504 -1793
2863 -1793 131 401 -466 -1616 -1555 -968 -1326 -1197 167 -21 -1112 373 364 -1927 -884 -843 -810 478 1384
2882 1384 -477 -548 979 1167 273 -584 1212 713 813 657 958 707 1126 1016 1016 -158 868 -57 756
2901 756 1232 374 -915 898 652 -1308 -349 106 -379 1303 -1304 -1685 -416 -418 28 -1263 -359 -951
2919 -951 203 68 -1154 -547 -1099 136 1186 158 -554 -33 349 -96 34 -1 -399 262 800 1395 1284
2938 1284 2391 2082 143 365 -42 1334 1347 571 560 245 2386 188 827 -332 -362 -871 378 -644
2956 -644 88 1564 -337 73 -957 47 -2710 -1277 -1568 -1178 -1814 -895 -1863 -511 -288 -1857 -325
2973 -325 -1319 -1672 -1706 -1373 -461 -328 -1855 13 -638 -917 -630 -904 -411 103 687 -244 58 258 713 -837
2993 -837 395 -62 673 453 996 -570 1282 222 492 1062 -693 611 -160 -380 -88 1420 -848
3010 -848 185 -189 159 -179 -992 -361 -1093 -780 -601 -780 -580 -593 -714 -826 -452 -1020 -250 -896 565 436
3030 436 -1385 748 -598 220 -349 540 -450 377 124 -10 681 -621 148 1223 309 -120 994 -1137
3048 -1137 1189 298 648 2458 25 1117 1082 1166 39 855 -399 1543 93 -171 1449 -372 270
3065 270 302 -234 583 -438 -244 509 -562 -589 -93 166 -975 -107 -1270 -636 -1784 -1802 1338 1463 -1070
3084 -1070 -524 362 -1234 627 34 805 -435 566 600 -420 153 686 -243 986 78 797 1865 334
3102 334 -210 364 62 791 539 8 -800 -190 -118 -553 1069 -768 -129 -929 -620 227 -1517 -984 -540
3121 -540 -2 -234 -1514 -718 739 156 -811 -806 -373 -506 -804 268 469 -1092 115 622 -36 82 556
3140 556 1180 593 -746 -177 -976 -19 -95 27 -508 324 162 216 -412 733 -1005 1076 365 457 -1026
3159 -1026 1177 -307 1222 863 323 529 343 782 -356 1058 457 1914 -234 -457 -673 -737 442
3176 442 -647 -779 -480 -1144 -493 -1578 449 -718 -317 -463 796 352 -206 -560 -2268 -507 -483 97
3194 97 -333 196 210 -513 -223 170 -438 -566 1713 802 22 -235 1046 -708 -113 203 73 852 1603 1446
3214 1446 -627 1280 1263 410 -784 891 -1002 -1059 -1080 -714 304 -868 221 -439 -1936 -226 80
3231 80 -432 -230 -1804 -935 -533 -548 -986 -207 -504 -758 -696 -590 -685 1119 -1662 -1492 -1244 611 -696 468
3251 468 -953 -798 -651 -729 17 -46 -817 -330 -349 -1254 769 -876 -1562 55 700 108 329 934 -814
3270 -814 48 -230 -986 -317 -1009 -205 763 1008 -235 -469 828 -798 50 217 -681 780 -556 -217
3288 -217 2 209 43 -1196 -69 6 -510 1102 -221 635 260 -802 279 494 692 -194 890 721
3306 721 866 -281 233 659 997 -266 -448 638 -702 1640 240 64 -482 664 -822 -311 -937
3323 -937 283 -376 1145 607 1132 174 -1194 1085 150 565 93 59 430 -1057 -337 572 -1010 27
3341 27 1382 142 -405 -382 847 338 -181 -1068 -1 86 -591 -464 509 97 -1321 -697 -541 -1750 -2121
3360 -2121 377 -1526 -699 -151 999 823 556 8 -796 -207 264 -1710 1317 125 -193 -1057 -556 623
3378 623 -264 -922 -146 1342 304 1387 571 -90 -1 79 -303 716 -1117 588 -1227 -426 1159 1465
3396 1465 -1315 -48 211 1547 -79 1123 -650 94 820 -223 1243 -803 272 -236 -761 -1414
3412 -1414 -714 -215 -127 -629 -718 568 -365 -379 -1110 -806 -309 -414 -357 -301 51 -186 1348 1141 328 -129 -500
3433 -500 258 122 -409 1153 520 476 699 -440 675 49 729 292 640 66 514 -94 -1098 31 927
3452 927 -141 1782 291 1042 -1569 298 63 -74 111 -433 249 -1248 323 -1075 365 -833 851
3469 851 -1168 -846 -1400 509 -920 157 -227 -684 -1429 -347 -582 170 -773 337 -1507 -562 636
3486 636 -119 70 200 85 538 -950 532 337 668 -359 1322 193 -488 302 1540 52 -672 -724
3504 -724 -516 141 -733 -710 250 -1239 632 65 -814 867 354 -80 6 240 -1132 755 163 1023 545
3523 545 -1252 -197 126 -180 -986 -1179 681 1023 272 269 -176 -1322 223 -663 909 -339 -93 -139 -1082
3542 -1082 1373 785 -404 -595 569 -434 356 -15 778 651 1116 1085 -296 660 540 1724 1213 436
3560 436 -661 188 278 -355 940 267 212 -197 293 1045 -109 224 -363 -153 415 -593 -101 489 99
3579 99 498 1377 -150 -664 -1089 -1037 -554 -951 -669 55 297 -233 1047 -332 410 346 -285 -284 549 552 2063
3600 2063 337 370 479 -329 -1004 -563 -201 -236 -715 1396 -268 -551 -795 -159 868 -656 -535 873
3618 873 801 -592 1750 301 113 -671 262 -747 -805 -356 -881 433 -140 609 -1447 -730 -1319 -649 69
3637 69 569 -716 -694 216 474 -68 288 -517 -131 -745 -328 -572 367 121 -367 232 -147 38 -271 666
3657 666 -509 815 36 64 -414 -172 553 -449 489 993 -574 -1241 844 406 -450 -74 129 -1120
3675 -1120 620 -65 1106 484 1327 338 -668 -380 -81 -288 -637 45 -545 8 16 888 -39 446 -154
3694 -154 823 503 1216 86 91 -772 631 373 -118 -586 -480 -140 -240 871 794 497 181 7 362 -449
3714 -449 1039 1202 5 140 216 767 -241 498 -314 312 -744 1226 562 -218 -476 789 634 184
3732 184 -912 -1143 -1192 550 -210 -214 -1854 -1040 -154 599 -1049 -638 911 1526 -804 262 -614 642
3750 642 338 258 334 -1075 608 -803 -19 -272 -282 -558 307 -321 -128 722 639 939 578 805 535 97
3770 97 -1238 491 599 -538 -8 78 -1154 -1051 -320 378 -405 -1140 -379 -230 -268 45 149 912 176 -366
3790 -366 -666 -410 -496 271 624 1140 965 681 -1282 -618 421 144 -704 -1281 -189 313 624 -532 297
3809 297 141 289 -74 325 564 -50 -469 -472 -203 824 307 853 112 1156 -532 630 -149 522 1132
3828 1132 -620 623 254 1130 34 871 -42 403 -102 178 -629 -349 -1607 -331 1620 -440 94
3845 94 754 -979 228 -536 -672 305 237 42 -68 886 137 449 -452 20 602 -63 -200 436 1174 67
3865 67 -828 -526 -5 122 -567 192 387 -724 214 -214 216 -68 733 -82 36 -125 -701 -922 -1344 379
3885 379 -325 1126 598 -1040 803 -172 325 -132 234 180 39 405 535 448 -760 -448 758 21 -1176
3904 -1176 -205 -197 222 -1505 1058 214 15 116 -73 282 444 -558 588 -380 -349 -741 4 -754 -441
3923 -441 -289 -84 -243 -581 482 -794 514 1051 382 172 -12 -172 264 1170 1067 214 95 -317 -333
3942 -333 232 -372 1500 -268 -731 -877 -69 -21 89 -366 -323 306 553 405 423 -53 -401 -616 106 781
3962 781 404 244 112 -122 57 -165 -1135 330 -234 -646 -1377 905 176 -127 187 573 482 151 -476 -42
3982 -42 -553 -114 886 -341 157 -1243 -445 -843 109 54 -28 659 -382 240 108 -415 617 -108 402
4001 402 750 -813 -153 -407 -1091 1077 -67 64 820 1465 -306 -1143 -2164 496 121 -833 -180 395
4019 395 184 -466 -5 -830 435 -843 491 -433 235 294 -872 114 538 -154 -198 -541 -884 -43 -1553
4038 -1553 947 232 -463 -340 -382 -215 191 401 -201 -650 -101 18 -105 -860 1078 189 20 -166 813
4057 813 -31 36 535 -495 562 -660 1362 522 279 873 345 39 -762 172 -1335 -203 -257 -372 87
4076 87 -679 11 300 305 25 148 -81 3 66 109 -577 276 -421 -123 558 -151 418 -255 -92 334 412 -391
4098 -391 -907 -200 429 -577 -261 477 -553 430 -230 -952 -1078 767 157 438 -624 -771 -25 -258 225
4117 225 -501 -257 499 -697 -784 -33 -712 500 867 -484 -546 -65 -597 -426 78 -1003 -408 -112 130
4136 130 -211 393 -395 -24 -874 448 -496 -681 -293 -622 -482 -97 105 -776 -235 -84 -176 -724 -7 -702
4156 -702 -653 -390 -132 456 758 -371 362 -677 -108 787 -103 168 -336 -660 -61 311 238 -878 -276 95
4176 95 171 25 715 -76 205 599 -842 -386 -481 -184 -97 -200 -342 -601 1246 -307 -545 664 -799 -899
4196 -899 537 475 415 -54 1391 125 -274 362 -315 -342 -61 125 149 -225 928 -335 260 415 392 758
4216 758 -65 751 198 -244 151 94 -433 1283 378 416 -397 87 100 381 -417 265 -328 12 167 -261 -708
4237 -708 -379 -995 110 -422 67 -41 860 -325 -47 1193 -222 447 947 377 -328 -448 -30 112 -597
4256 -597 173 592 -58 -97 430 147 131 -651 1327 -731 -112 -312 211 425 -828 141 -484 -392 641 -431
4276 -431 -722 -784 565 223 -541 159 -8 -148 -648 -326 -410 -293 -377 -550 -397 71 -508 -213 252 144 264
4297 264 36 244 430 497 29 -133 199 133 111 -291 -309 -307 845 -51 -395 247 -2 70 -360 334 78 192
4319 192 311 68 58 573 -179 -112 -428 92 122 -1222 286 -797 275 392 506 312 -220 -301 159 -13
4339 -13 -55 -218 180 -120 38 658 -461 235 84 -370 -61 -273 -623 -890 -545 281 378 301 18 -189 -261
4360 -261 -540 -872 -144 -83 104 -104 -437 -417 611 -273 244 -134 -836 573 -742 -359 547 -346 318 166
4380 166 -443 -291 769 258 123 816 -281 -38 -238 137 45 290 438 380 111 -564 424 -965 -342 -484
4400 -484 394 -182 29 1208 -654 -112 424 101 -283 -439 27 -963 -130 -42 -1495 314 -1275 -394 -375
4419 -375 175 -41 -190 789 365 338 -381 594 432 -439 -317 -2 578 -279 -987 -496 -358 -185 344 -347
4439 -347 -142 164 -973 293 -377 242 259 -236 82 823 339 297 625 299 -100 216 -18 16 -194 837
4459 837 878 846 522 -338 87 1084 185 -90 -102 13 -183 94 -327 713 -457 329 -531 -928 353 -201
4479 -201 737 -18 263 371 448 -456 384 173 555 211 510 -1417 194 -57 -136 205 239 -323 -186 -94 -784
4500 -784 -225 -6 503 463 330 734 547 -82 -579 -306 286 393 -749 806 111 264 69 -774 329
4519 329 69 -176 239 1233 1004 149 -638 -901 -921 -146 -400 -868 385 1273 -264 -601 -221 -639 -494 -1341
4539 -1341 -232 7 -530 -269 283 -910 -1080 112 -834 -552 -388 -766 705 14 485 301 -892 -273
4557 -273 142 520 -60 37 920 109 774 -114 346 -492 -1483 686 -399 -194 86 -515 550 291 636
4576 636 130 -165 -50 -4 57 -220 -396 476 -65 -827 -42 -600 -217 13 -178 -524 -522 87 -147 746 1502
4597 1502 710 693 1273 283 -322 -426 -291 -643 -297 -247 467 657 -317 959 -492 -411 699 -747 801
4616 801 -237 -494 -202 318 852 432 -406 133 260 747 -69 -566 -705 -376 -107 -448 -38 -153 -589 122
4636 122 15 -945 -138 -469 -788 18 1150 225 -408 -271 -3 616 -369 -244 -742 61 337 73 -299 -251
4656 -251 80 -68 188 917 -1280 -665 69 165 718 407 -132 352 -180 446 -164 -641 -165 -36 -189 155
4676 155 177 856 112 1096 310 -86 88 -477 1096 -463 -103 512 289 -262 -65 -675 205 -409 -138 190
4696 190 -16 272 341 -796 138 234 765 82 608 -417 164 485 -434 -642 -712 804 355 1348 394 -49
4716 -49 -35 -1197 977 1321 734 899 -458 -1274 28 -848 -159 174 415 785 -235 -16 376 -779 -687
4735 -687 441 -459 870 -617 290 25 -52 927 254 140 -386 -266 -355 -741 -184 -142 76 -289 -88 560
4755 560 -1035 -236 0 1258 -121 -534 977 -652 792 -252 -86 -1028 148 186 45 -26 1181 -658
4773 -658 477 408 -112 -572 -7 -324 419 -204 153 -800 -198 -149 131 -331 -529 454 -114 326 -301 44
4793 44 -206 -130 -533 -555 858 579 -435 -730 -175 469 -54 987 -462 244 -1048 -423 -210 975 -275
4812 -275 -700 76 -759 440 -786 -594 396 385 830 505 665 -43 187 571 179 491 273 450 86 -334
4832 -334 429 247 -541 9 646 -47 -490 167 59 -223 -249 -109 -288 872 -716 -159 129 577 -516
4851 -516 120 -716 -496 832 413 463 893 -428 -523 542 274 336 354 377 25 -103 8 -134 739 -713
4871 -713 52 102 26 -460 751 315 -694 -732 -780 -12 -349 176 -220 -816 -554 -908 -364 623 141 -59 141
4892 141 403 -133 -258 760 -185 -198 110 324 -619 -790 -11 -274 269 -344 -247 -360 44 -70 811 -123
4912 -123 -85 1383 46 -566 -506 -411 344 -245 -184 -797 -244 282 -740 523 -282 -301 405 -483 -75 -732
4932 -732 -248 77 368 931 88 96 -513 -141 16 -590 144 -943 -189 512 550 389 -409 -542 -157 283 181
4953 181 -328 -226 944 293 -88 -98 421 838 -516 391 -208 -217 -328 283 -600 214 368 1066 454 400 -136
4974 -136 475 143 -260 1173 1146 -177 -295 -1120 -11 234 207 335 667 -261 429 93 -134 -116 848 -85
4994 -85 -454 92 55 98 -386 -206 228 106 -258 62 -425 489 392 721 366 -29 -301 95 -203 -512 -416 820
5016 820 -93 81 -376 218 588 -813 120 462 476 -14 453 19 -35 148 654 34 -54 -331 662 -276 -87
5037 -87 538 -130 494 57 -168 370 -516 92 -147 -745 275 -17 -458 -258 5 449 -210 -472 -254 404
5057 404 494 250 -550 334 -593 -302 -131 -326 173 697 756 -46 563 611 -250 -43 -476 936 174 396 608
5078 608 316 443 18 -132 143 455 -608 9 186 443 -772 -252 -477 -470 -22 -307 508 272 352 446 -439
5099 -439 -583 702 -387 -542 -22 121 378 105 755 -532 -867 184 782 764 26 148 838 338 252
5118 252 66 625 308 -31 -354 244 351 770 705 624 -430 613 380 481 350 -12 390 -834 88 -126
5138 -126 813 42 -33 64 140 511 424 340 311 151 -310 -981 456 662 -336 267 -182 333 -96 585 114 1270
5160 1270 -46 -26 -443 445 224 253 -497 -113 -435 472 -730 -597 -210 -273 -47 -118 567 -787 -704 -445
5180 -445 387 235 -461 524 407 497 178 -414 58 176 109 -107 -355 111 -282 126 -768 371 -400 130
5200 130 368 28 -568 114 178 44 575 189 -220 -409 959 -111 519 117 -441 715 12 387 400 2
5220 2 154 -841 -307 -605 820 -98 407 376 -307 -119 199 750 435 62 -385 35 294 154 588 732 830
5241 830 1190 333 -583 -210 1093 418 -329 -22 -128 -138 437 13 -461 402 605 243 -546 946 -271
5260 -271 7 309 -185 -284 52 -91 828 -72 501 -164 -284 288 639 479 1117 -369 39 -1257 -127
5279 -127 219 876 824 -191 1021 178 1003 -832 -374 435 191 1210 541 -188 32 -71 70 198 -132
5298 -132 199 -866 -806 1186 1104 305 -88 -407 -452 414 839 -167 1476 264 -95 -43 -224 398 -11 32
5318 32 -607 614 185 778 349 -260 158 -27 1352 362 78 724 370 -863 806 -362 -86 265 -2
5337 -2 -103 -132 -88 -264 -402 -143 105 -163 -1091 -103 -243 -845 781 -265 -57 -805 -4 -243 -184 -446 407
5358 407 962 381 -897 231 146 -461 -337 -89 -231 -858 262 -715 149 595 -126 -114 383 -14 -125 -364
5378 -364 398 181 91 -382 -352 -262 -610 -166 -289 164 171 184 318 -442 279 157 483 -284 107 7 -200 -333
5400 -333 383 85 703 -158 -736 -1065 659 -385 -939 -565 150 -36 -886 887 -12 467 -690 3 -73
5419 -73 -200 702 1053 674 452 267 941 -3 -122 -28 446 -42 446 -7 -326 -379 -432 492 -365 -422 391 33
5441 33 -81 38 -72 35 603 362 -108 -662 -1045 1277 -464 -791 -219 -476 64 -519 26 722 -177 204
5461 204 -625 227 -678 517 70 291 -104 -588 99 170 -297 -376 1015 88 -1011 -246 386 145 342 -496
5481 -496 918 -386 -147 -396 -459 -234 821 -1011 255 834 383 271 -221 539 325 603 507 290 -154
5500 -154 -156 264 -1250 1 31 -832 383 109 1000 216 312 125 -994 357 -26 -421 707 0 1001
5519 1001 -494 517 37 -606 271 -843 1204 284 7 831 -25 30 -1102 -156 -787 200 -133 15
5537 15 264 -1478 -49 -280 79 664 -11 332 758 88 -258 -305 -28 -810 -181 347 941 361 -331 -721
5557 -721 -395 825 26 305 -179 -774 222 265 136 -124 247 385 475 10 199 434 -27 1016 722 902
5577 902 -46 470 169 4 13 -911 -12 -143 250 35 438 -98 -193 387 54 -84 353 284 -416 557 -804
5598 -804 565 -401 817 -89 -47 233 369 488 -829 1035 1250 2145 161 -59 -33 621 -595 -47 -16
5617 -16 158 401 1086 -851 82 -1646 -723 592 226 259 -732 -1027 -53 -361 568 -122 -349 -284 635 -139
5637 -139 978 354 -183 -524 531 -221 180 281 980 1501 -894 165 120 -16 400 252 616 251 -75
5656 -75 -286 -565 81 -1148 628 400 -580 -624 58 90 -947 238 -309 559 -417 272 -627 -321 221 491
5676 491 -90 183 728 -645 -158 572 605 -464 -16 -169 733 130 324 211 167 57 686 -475 -130 -811
5696 -811 -65 -66 198 756 -1155 -525 112 160 772 -588 -126 323 -783 32 92 -379 -390 822 782 -215 -387
5717 -387 -498 513 257 -205 -326 -112 701 1 143 592 -508 343 59 618 29 -524 -344 44 -259
5736 -259 199 1016 755 587 -197 929 -533 182 -7 72 982 116 121 241 939 -418 790 -199 -709 1026
5756 1026 839 1000 -457 289 556 235 -864 -155 746 -4 -538 166 1468 -312 560 654 1010 -925
5774 -925 341 212 -529 -58 446 511 32 925 44 -549 102 1228 289 804 -882 674 339 -798 1032
5793 1032 -274 -529 -85 11 -926 -161 -325 422 -198 443 79 -67 213 -159 808 -85 534 888 296 1010
5813 1010 532 480 622 633 -966 -144 194 -603 -1278 267 -756 -922 460 319 -403 1380 -40 -375
5831 -375 248 -34 -566 273 739 -580 -593 -396 375 -185 -26 449 -229 556 123 -458 94 -367 162 512
5851 512 -838 -369 -1104 -335 423 790 -227 -231 772 -377 159 -232 -141 -223 -52 -524 -188 449 -100 411
5871 411 865 112 1607 -273 156 -1130 -288 1091 323 -242 -1194 -420 736 66 208 -147 455 790
5889 790 114 196 265 34 -661 -1024 -645 -93 356 912 -284 -1113 117 849 -897 399 1568 536 559
5908 559 751 454 -240 217 -119 440 766 1069 -798 -1013 825 492 331 161 -375 823 220 -447 91
5927 91 1020 4 -652 -384 -39 -1475 -371 -106 695 376 469 1119 -232 346 -455 487 42 -191 73
5946 73 624 -736 -1068 828 -36 131 132 -285 -1677 398 570 -850 902 314 407 -1185 -554 -552 -402 -125
5966 -125 1 444 -73 -103 410 197 -353 -91 25 -185 -1079 759 -601 -311 810 411 -515 2 -381
5985 -381 -380 -201 524 361 1087 751 743 -733 340 -225 467 -7 1253 -33 -295 606 575 316 146 22
6005 22 536 -431 -355 -722 441 -215 -170 -22 -73 550 93 -3 -170 -716 -1137 -1016 -286 197 -410 -157 -71 -832
6027 -832 -552 -186 457 -250 -119 -1009 80 -6 341 8 22 743 280 -730 -134 -805 -805 -230 -12 131 -218
6048 -218 1090 430 215 -230 -338 -114 64 302 22 -634 -63 68 956 44 -1018 100 136 12 -12 -290
6068 -290 966 528 -190 226 6 -428 -258 -570 -514 426 798 -541 -538 446 -280 129 -243 177 -276 -17
6088 -17 121 -186 230 597 390 144 971 416 26 9 132 286 324 672 38 210 -456 997 -71 -203
6108 -203 140 -1118 87 489 1179 967 184 -180 17 66 345 344 -89 -106 654 124 -253 -320 993 452 1019
6129 1019 114 499 -248 333 -343 -288 -779 -142 -181 -127 -149 563 890 904 396 -311 258 -511 -425 481 835 -458
6151 -458 36 -497 -121 844 288 407 1077 506 710 -221 -627 60 627 1039 148 366 418 -13 391 386 -129
6172 -129 -305 -498 126 -317 757 -539 572 607 -522 -247 334 -33 -347 -623 32 -334 -376 -159 391
6191 391 -390 396 81 125 -209 480 848 305 561 300 -415 -226 -619 336 -368 123 473 -505 541 637
6211 637 156 -3 -238 610 -421 269 248 -1344 162 80 208 -693 -50 -1055 499 850 -158 277 -164
6230 -164 407 458 593 464 -280 -357 -479 -67 505 135 179 984 -81 28 359 371 -518 813 782 294 526
6251 526 -474 -105 848 275 -420 752 -18 -1151 195 581 -947 933 -29 733 -593 433 -754
6268 -754 491 -131 247 393 539 -44 110 338 367 -51 590 533 278 615 394 -836 -616 -87 -385 479
6288 479 21 -82 -62 246 27 114 270 -146 51 -357 281 -524 -128 -455 42 204 109 311 1014 -142 73
6309 73 624 102 -534 -395 424 41 403 298 615 -462 144 -197 161 674 351 241 368 -684 -277 -342
6329 -342 -109 -144 -459 -27 -267 389 -857 -400 -486 674 126 -433 576 182 377 -445 370 -64 -89 -216
6349 -216 616 1049 60 164 318 -395 -150 -648 60 -105 503 -535 128 87 -124 -401 371 305 -1108 -358
6369 -358 380 -347 179 -221 -250 -668 17 836 291 255 -307 822 -640 -318 416 518 -33 66 96 209 573
6390 573 -89 195 7 -345 -209 405 -264 792 787 -364 -336 422 413 26 1078 218 -83 6 339 -778 -34
6411 -34 -113 109 192 -6 -598 -429 384 -252 659 -91 -595 234 152 232 -432 -41 -641 529 -273 -263 -366 573
6433 573 -355 -131 -75 -327 412 254 128 370 307 412 1066 513 600 918 -333 -495 -167 -97 284 -40 -383
6454 -383 -388 -510 255 256 227 618 588 607 -594 -597 303 973 745 434 926 929 -624 705 165 -409 -15 254 -188
6477 -188 -48 -333 -1119 366 53 133 -216 80 215 -1043 78 1319 -34 150 -336 -472 -268 -167 -644
6496 -644 -30 681 -439 691 -255 362 -467 420 -640 1168 891 -173 123 -225 83 353 -488 80
6514 80 -7 525 -385 144 110 39 -279 -666 113 -681 351 289 -414 -767 239 40 197 -956 82 -723
6534 -723 5 129 -170 -168 -767 28 351 -587 -434 169 -514 61 -5 154 -88 365 737 -197 -623 353 223
6555 223 590 -251 -245 -768 -729 -424 787 255 858 341 112 3 -192 54 -545 -425 -224 -560 515 359
6575 359 1338 -409 -794 697 -685 169 -172 24 -276 504 -390 -186 577 275 -228 780 544 -89 -524
6594 -524 -346 112 -241 278 338 141 -398 959 37 64 -119 134 -16 -130 -374 495 -351 -895 21 649
6614 649 1039 532 -192 -132 18 -70 -134 -625 -369 -86 -255 -329 -518 -663 -225 445 -631 259 1467 -215
6634 -215 365 420 -136 39 -49 161 -54 542 34 636 -100 -136 356 245 -273 -82 103 319 627 664 29
6655 29 -66 394 -60 -351 304 423 570 -418 136 359 499 681 379 -45 929 -957 264 -404 46 719
6675 719 837 83 21 86 -819 -188 48 6 -6 -49 -537 720 -472 468 209 191 438 80 390 -535 213
6696 213 223 -319 -238 -108 -343 -1023 -1330 -908 356 509 418 -529 22 419 -181 -186 392 129 592 -357 -490
6717 -490 -125 -337 271 4 230 352 -120 -90 -572 439 880 533 76 140 216 601 387 352 176 30 361
6738 361 542 766 202 249 -174 411 -338 600 -452 685 201 565 -29 400 217 -114 0 -63 526 -405
6758 -405 35 -405 251 -744 -539 580 -365 333 16 61 -16 -3 -342 284 -38 411 -75 -55 5 -273 208
6779 208 -67 51 -319 339 528 -75 -177 186 -360 113 -497 -230 148 56 114 629 -323 -659 -668 -28 404
6800 404 -631 -39 107 361 -124 370 -193 -5 566 -150 -253 622 -341 156 688 724 75 -407 81 369
6820 369 -281 -431 -324 230 -100 -376 89 -74 -102 -356 56 403 -296 -113 -77 -717 -79 334 -29 439 301
6841 301 643 -339 -105 416 -165 244 -68 64 266 -125 165 403 2 42 -231 -244 -434 241 -295 157 273
6862 273 934 227 -313 187 19 -130 -133 -279 173 353 -220 361 400 43 -391 -698 -44 -222 6 627 314
6883 314 -96 -33 581 -281 -115 520 -1054 -53 11 170 -186 406 -353 -237 217 306 -218 49 -93 -124 -317
6904 -317 -287 484 -237 515 -275 234 149 1 -674 220 -234 137 377 280 -184 390 -168 293 811 140 65
6925 65 62 -114 -774 616 -114 -20 -307 158 23 -149 18 -182 206 294 57 -650 -196 -626 429 501 -105
6946 -105 -351 235 159 22 -511 104 -286 188 523 3 -117 -367 -113 -357 -81 -628 480 52 597 332
6966 332 21 35 -209 758 -3 20 97 -312 -11 -214 -151 -22 299 483 -24 189 -6 478 -25 229 -121
6987 -121 -586 -317 484 108 74 -261 988 -227 172 -270 -39 499 33 466 -304 -344 163 42 -365 440
7007 440 -529 566 270 -2 114 61 570 -6 -4 -20 439 -541 -738 -384 -449 349 -185 -121 276 323 516 102
7029 102 -116 31 33 480 -277 452 -33 526 601 391 367 343 -68 -50 -333 274 306 -223 415 242 866 402
7051 402 -2 694 376 -525 99 606 -277 -259 -138 379 258 855 304 -294 461 -224 407 -369 592 -376
7071 -376 -499 395 170 594 684 -218 208 -83 84 -227 -80 -140 -162 232 -118 251 268 -332 -479 -162 -177 619
7093 619 -170 438 -280 -253 755 582 220 207 447 -217 251 826 26 315 -760 -259 -64 85 148 -60
7113 -60 285 -23 254 434 -557 -202 -830 124 -713 350 183 -532 290 380 -4 469 -65 180 49 469
7133 469 -615 -11 138 981 -292 -718 1043 340 558 -662 641 -120 184 -56 -91 -266 798 -194
7151 -194 -94 -4 328 -30 -531 283 -273 -318 -449 -46 574 -219 -168 -270 -529 -135 211 -260 -728 -228 118
7172 118 179 -540 119 547 81 188 -126 -211 157 -38 342 768 -261 872 -16 -100 -117 -162 331 -553 -90
7193 -90 -37 -731 251 311 179 -62 -754 -269 100 185 -184 -375 485 267 405 262 1 -232 25 -72 258 -216
7215 -216 194 89 -18 -49 769 -499 -45 38 -445 -207 118 1064 197 -101 -49 98 362 795 110 643 391
7236 391 194 -436 237 -231 652 618 -629 462 -157 319 60 -142 480 -154 137 402 -513 307 850 -153
7256 -153 -18 27 -113 -195 -81 401 146 727 4 -350 277 2 -360 -612 -599 223 -163 47 -314 -113 634
7277 634 380 249 -504 236 517 -29 28 -67 -102 563 55 5 230 738 155 -294 278 120 337 186 263 154
7299 154 259 -262 288 -36 -95 -112 434 -308 -171 459 528 -174 460 406 -53 574 265 406 -170 -482 184
7320 184 -29 -268 -682 -326 242 -194 76 -58 564 -390 254 66 -771 89 743 -238 76 183 733 342
7340 342 -10 236 -62 -4 512 -496 10 -223 64 -443 446 -19 -275 730 477 688 -334 57 -89
7359 -89 461 -255 -570 431 402 521 -162 -345 -286 15 -131 384 -372 183 438 242 260 1095 -115 137 -63
7380 -63 -404 340 -61 401 393 498 463 276 601 -11 -186 254 -862 33 -138 313 -363 651 -254 -640 481
7401 481 -641 -197 236 217 355 -516 -907 -448 -276 197 766 436 -355 133 -95 -364 -658 430 -164 756
7421 756 904 494 -39 -298 -500 197 -56 544 -579 125 385 596 429 -109 -379 -561 375 -310 125 -90
7441 -90 284 36 -435 325 -360 -449 -159 153 50 -514 -809 -73 789 51 -404 683 350 -102 291 309 -325
7462 -325 42 -97 176 -257 119 452 -16 167 847 -192 33 -254 236 41 199 417 572 322 421 -367
7482 -367 166 290 -36 -53 -43 190 28 87 -236 309 -227 68 -528 25 811 -288 179 -29 -167 94 -228
7503 -228 -635 -366 -135 -78 -315 700 -126 471 -61 -306 -548 -773 -448 421 392 654 99 399 -113 125
7523 125 -510 -395 81 597 34 -58 688 237 88 -238 599 740 -348 -92 208 455 227 268 440 59
7543 59 578 -147 -329 147 -121 -513 -316 -264 176 -124 268 360 -153 -396 -27 -80 -892 -98 -464 -856 -227
7564 -227 366 -283 -130 134 149 -592 351 286 -494 15 50 402 24 -561 -6 293 469 595 -141 -96 676
7585 676 -201 -71 505 -474 188 408 246 169 -251 -285 475 302 -117 -24 476 410 -553 438 632 151 -447
7606 -447 100 512 -384 235 -62 -501 20 -152 252 -638 450 -212 -505 410 -162 247 -220 -161 -269 -545
7626 -545 -214 1 127 -104 -227 -375 403 -219 -54 -858 -258 152 -216 232 86 -466 -42 -204 -173 -2
7646 -2 317 -365 263 -181 337 556 145 -375 102 -91 -149 -236 141 315 -451 351 -196 935 220 -107 302
7667 302 301 -759 53 -461 530 72 -100 -805 163 -291 -269 -33 -445 99 93 585 837 87 -307 565 -392
7688 -392 -709 -225 609 208 -361 -323 144 207 388 -98 -557 371 -910 61 -76 -577 8 -367 -649 205
7708 205 631 179 -355 -119 461 -724 -1 87 -109 102 -190 252 396 -167 -791 -61 -487 -526 -334 131
7728 131 17 255 208 -35 -59 -926 -519 -224 154 -85 234 411 -193 -163 514 -982 425 327 -561 -87 199
7749 199 -183 -281 87 257 369 897 -55 -1303 549 -181 709 -691 383 782 795 -784 -118 -85 -75 213
7769 213 14 112 -33 -748 552 687 400 1073 360 -419 918 1072 -302 513 23 690 250 -856 -930
7788 -930 -312 -65 94 -41 -173 403 948 24 1457 599 72 -360 697 -256 -359 -146 550 -39 535
7807 535 -420 505 477 -554 -451 469 221 421 219 -81 691 -104 -84 -122 575 223 -69 33 -337 -902 -351
7828 -351 -157 644 109 -439 244 -38 309 -239 -701 1203 -49 575 711 -403 -111 428 1497 -199
7846 -199 -167 -271 -666 632 981 -738 256 542 -924 181 -205 -210 879 -187 -79 -600 -131 -123 563 278
7866 278 369 385 -583 416 -129 -283 -140 -497 466 725 -450 -524 152 -124 -207 -237 -457 1112 152 -718 -727 -702
7888 -702 -658 -5 661 72 475 -468 -342 -432 -1020 139 402 642 183 -256 663 -494 -163 449 -69 247
7908 247 956 252 338 352 414 -110 -481 -76 -582 335 391 -878 294 -122 371 -71 -843 -61 785 1071 112
7929 112 452 -468 932 -892 -63 218 -197 989 544 142 79 -192 91 355 229 108 889 1092 -109
7948 -109 -409 -712 -1 162 -1356 -480 295 -653 511 -991 -153 22 197 -470 -107 609 915 100 -303
7967 -303 -92 -219 -611 439 -857 991 330 -191 129 -231 668 -1157 190 -311 217 114 -2 533
7985 533 631 -784 -253 221 351 -75 -709 245 -541 -483 905 180 1154 567 -428 465 -1514 -571 -667 -440
8005 -440 -79 174 -1106 1017 296 -334 161 -693 470 -316 -93 12 -1221 -425 908 -898 -467 91
8023 91 -1126 443 397 -137 967 -237 154 -121 1261 -1097 -838 -959 353 -646 223 308 -650 -290 456
8042 456 723 -211 421 408 -311 487 444 -1481 -399 -431 491 -21 695 679 -723 -811 1074 423 -540 -453 -120
8063 -120 514 -798 -434 218 -322 -377 -77 -357 -81 -744 648 -322 -855 -539 -236 -1265 56 -1461 540
8082 540 548 754 133 316 59 -785 589 407 -196 -119 -1074 1291 486 1393 456 152 -872 -2 639 -1038
8102 -1038 1002 -632 331 -865 616 664 253 56 -817 332 -318 -544 -1040 -192 102 236 49 87 -60
8121 -60 -811 -131 1339 -219 867 1072 -418 -1138 -888 -439 316 93 -405 733 -932 217 1537 -1146
8139 -1146 -60 1073 -224 389 -258 200 443 -71 -9 1255 204 440 535 -645 -1266 10 -274 518
8157 518 -586 512 197 -60 23 -1059 -204 361 175 -368 829 -229 -263 486 165 41 -647 -160 -354
8176 -354 1172 526 -339 1440 111 1044 367 -202 -168 611 -746 467 -461 132 -126
8191a26
##END NTUPLES=NMR FID
##END=
