##TITLE=1H_Tparten2-Re-f11-f8-f2-osad
 CDCl3, 8 sc, 
 9.07.2021
##JCAMPDX= 6.0         $$ Bruker NMR JCAMP-DX V2.0
##DATA TYPE= NMR FID
##DATA CLASS= NTUPLES
##ORIGIN= UXNMR, Bruker Analytische Messtechnik GmbH
##OWNER= root
$$ XWIN-NMR		Version 3.5
$$ Fri Jul  9 08:49:08 2021 Russian Standard Time (UT+4h)  she@DPX200
##.OBSERVE FREQUENCY= 200.131506
##.OBSERVE NUCLEUS= ^1H
##.DELAY= (6, 6)
##.ACQUISITION MODE= SIMULTANEOUS
##.ACQUISITION SCHEME= undefined
##.AVERAGES= 8
##.DIGITISER RES= 18
##SPECTROMETER/DATA SYSTEM= spect
##.PULSE SEQUENCE= zg30
##.SOLVENT NAME= CDCl3
##.SHIFT REFERENCE= (INTERNAL, CDCl3, 0, 15.7039)
##AUDIT TRAIL= $$ (NUMBER, WHEN, WHO, WHERE, WHAT)
$$ ##TITLE= Audit trail, XWIN-NMR		Version 3.5
$$ ##JCAMPDX= 5.01
$$ ##ORIGIN= Bruker BioSpin GmbH
$$ ##OWNER= she
$$ F:/spectra/data/she/nmr/H-F/1/audita.txt
$$ ##AUDIT TRAIL=  $$ (NUMBER, WHEN, WHO, WHERE, WHAT)
(   1,<2021-07-09 08:47:10.96 +0400>,<she>,<DPX200>,
      <created by zg, POWCHK disabled, PULCHK disabled
       configuration hash MD5:
       00 E9 B6 7A A2 85 ED C7 34 08 36 98 17 FE 4E 26
       data hash MD5: 16K
       14 9E 31 24 BF DD 42 76 18 E3 34 6E 3A 61 84 8F>)
$$ ##END=
$$ 
$$ hash MD5
$$ BE 0E 9E DF 41 2C 24 21 E2 1C 16 03 00 28 0A 9A
##$RELAX= 
##$RELAX= 
##$RELAX= 
##$RELAX= 
##$RELAX= 
##$RELAX= 
$$ Bruker specific parameters
$$ --------------------------
##$DU= <F:/spectra>
##$EXPNO= 1
##$NAME= <H-F>
##$PROCNO= 1
##$TYPE= <nmr>
##$USER= <she>
##$AMP= (0..31)
100 100 100 100 100 100 100 100 100 100 100 100 100 100 100 100 100 100 
100 100 100 100 100 100 100 100 100 100 100 100 100 100 
##$AQSEQ= 0
##$AQ_mod= 1
##$AUNM= <au_zg>
##$AUTOPOS= <>
##$BF1= 200.13
##$BF2= 200.13
##$BF3= 200.13
##$BF4= 200.13
##$BF5= 200.13
##$BF6= 200.13
##$BF7= 200.13
##$BF8= 200.13
##$BYTORDA= 1
##$CFDGTYP= 0
##$CFRGTYP= 5
##$CHEMSTR= <none>
##$CNST= (0..31)
1 1 145 1 1 1 1 1 1 1 1 1 1 1 1 1 1 1 1 1 1 1 1 1 1 1 1 1 1 1 1 1 
##$CPDPRG= <>
##$CPDPRG1= <>
##$CPDPRG2= <>
##$CPDPRG3= <>
##$CPDPRG4= <mlev>
##$CPDPRG5= <mlev>
##$CPDPRG6= <mlev>
##$CPDPRG7= <mlev>
##$CPDPRG8= <mlev>
##$CPDPRGB= <>
##$CPDPRGT= <>
##$D= (0..31)
0 1.2 0 0 0 0 0 0 0 0.06 0 0.03 0 0 0 0 0.0002 0 0 0 0 0 0 0 0 0 0 0 0 
0 0 0 
##$DATE= 1625806030
##$DBL= (0..7)
120 120 120 120 120 120 120 120 
##$DBP= (0..7)
150 150 150 150 150 150 150 150 
##$DBP07= 0
##$DBPNAM0= <>
##$DBPNAM1= <>
##$DBPNAM2= <>
##$DBPNAM3= <>
##$DBPNAM4= <>
##$DBPNAM5= <>
##$DBPNAM6= <>
##$DBPNAM7= <>
##$DBPOAL= (0..7)
0.5 0.5 0.5 0.5 0.5 0.5 0.5 0.5 
##$DBPOFFS= (0..7)
0 0 0 0 0 0 0 0 
##$DE= 6
##$DECBNUC= <off>
##$DECIM= 32
##$DECNUC= <off>
##$DECSTAT= 4
##$DIGMOD= 1
##$DIGTYP= 9
##$DL= (0..7)
0 120 120 120 120 120 120 120 
##$DP= (0..7)
150 150 150 150 150 150 150 150 
##$DP07= 0
##$DPNAME0= <>
##$DPNAME1= <>
##$DPNAME2= <>
##$DPNAME3= <>
##$DPNAME4= <>
##$DPNAME5= <>
##$DPNAME6= <>
##$DPNAME7= <>
##$DPOAL= (0..7)
0.5 0.5 0.5 0.5 0.5 0.5 0.5 0.5 
##$DPOFFS= (0..7)
0 0 0 0 0 0 0 0 
##$DQDMODE= 0
##$DR= 18
##$DS= 0
$$ [...]
##$SUBNAM2= <"">
##$SUBNAM3= <"">
##$SUBNAM4= <"">
##$SUBNAM5= <"">
##$SUBNAM6= <"">
##$SUBNAM7= <"">
##$SUBNAM8= <"">
##$SUBNAM9= <"">
##$SW= 20.0188882624521
##$SWIBOX= (0..15)
0 0 2 0 0 0 0 0 0 0 0 0 0 0 0 0 
##$SW_h= 4006.41025641026
##$TD= 16384
##$TD0= 1
##$TE= 0
##$TE2= 300
##$TE3= 300
##$TEG= 300
##$TL= (0..7)
0 120 120 120 120 120 120 120 
##$TP= (0..7)
150 150 150 150 150 150 150 150 
##$TP07= 0
##$TPNAME0= <>
##$TPNAME1= <>
##$TPNAME2= <>
##$TPNAME3= <>
##$TPNAME4= <>
##$TPNAME5= <>
##$TPNAME6= <>
##$TPNAME7= <>
##$TPOAL= (0..7)
0.5 0.5 0.5 0.5 0.5 0.5 0.5 0.5 
##$TPOFFS= (0..7)
0 0 0 0 0 0 0 0 
##$TUNHIN= 0
##$TUNHOUT= 0
##$TUNXOUT= 0
##$USERA1= <user>
##$USERA2= <user>
##$USERA3= <user>
##$USERA4= <user>
##$USERA5= <user>
##$V9= 5
##$VALIST= <valist>
##$VCLIST= <CCCCCCCCCCCCCCC>
##$VD= 0
##$VDLIST= <DDDDDDDDDDDDDDD>
##$VPLIST= <PPPPPPPPPPPPPPP>
##$VTLIST= <TTTTTTTTTTTTTTT>
##$WBST= 1024
##$WBSW= 4
##$XGAIN= (0..3)
0 0 0 0 
##$XL= 0
##$YL= 0
##$YMAX_a= 98213
##$YMIN_a= -146483
##$ZGOPTNS= <>
##$ZL1= 120
##$ZL2= 120
##$ZL3= 120
##$ZL4= 120
##$ABSF1= 10
##$ABSF2= 0
##$ABSG= 5
##$ABSL= 3
##$ALPHA= 0
##$AQORDER= 0
##$ASSFAC= 0
##$ASSFACI= 0
##$ASSFACX= 0
##$ASSWID= 0
##$AUNMP= <proc_1d>
##$AZFE= 0.1
##$AZFW= 0.1
##$BCFW= 1
##$BC_mod= 2
##$BYTORDP= 1
##$COROFFS= 0
##$CY= 11.3945322036743
##$DATMOD= 1
##$DC= 2
##$DFILT= <>
##$DTYPP= 0
##$F1P= 17.5019972093344
##$F2P= -2.517084195857
##$FCOR= 0.5
##$FTSIZE= 0
##$FT_mod= 4
##$GAMMA= 1
##$GB= 0.15
##$INTBC= 1
##$INTSCL= 1
##$ISEN= 128
##$LB= 0.24
##$LEV0= 0
##$LPBIN= 0
##$MAXI= 10000
##$MC2= 0
##$MEAN= 0
##$ME_mod= 0
##$MI= 1.114404
##$NCOEF= 0
##$NC_proc= 0
##$NLEV= 6
##$NOISF1= 3.799351
##$NOISF2= 2.8
##$NSP= 1
##$NTH_PI= 0
##$NZP= 0
##$OFFSET= 15.70392
##$PC= 1
##$PHC0= -12282.43
##$PHC1= 23.00101
##$PH_mod= 1
##$PKNL= yes
##$PPARMOD= 0
##$PSCAL= 0
##$PSIGN= 0
##$REVERSE= no
##$SF= 200.130013532006
##$SI= 16384
##$SIGF1= 3
##$SIGF2= 2
##$SINO= 400
##$SIOLD= 16384
##$SREGLST= <1H.CDCl3>
##$SSB= 0
##$STSI= 0
##$STSR= 0
##$SW_p= 3612.71676300578
##$SYMM= 0
##$S_DEV= 0
##$TDeff= 0
##$TDoff= 0
##$TI= <>
##$TILT= no
##$TM1= 0
##$TM2= 0
##$TOPLEV= 0
##$USERP1= <user>
##$USERP2= <user>
##$USERP3= <user>
##$USERP4= <user>
##$USERP5= <user>
##$WDW= 1
##$XDIM= 8192
##$YMAX_p= 0
##$YMIN_p= 0
$$ End of Bruker specific parameters
$$ ---------------------------------
##NTUPLES= NMR FID
##VAR_NAME=  TIME,          FID/REAL,        FID/IMAG
##SYMBOL=    X,             R,               I
##VAR_TYPE=  INDEPENDENT,   DEPENDENT,       DEPENDENT
##VAR_FORM=  AFFN,          ASDF,            ASDF
##VAR_DIM=   8192,          8192,            8192
##UNITS=     SECONDS,       ARBITRARY UNITS, ARBITRARY UNITS
##FACTOR=    0.0002496,     1,               1
##FIRST=     0,             0,               0
##LAST=      2.0444736,     0,               0
##MIN=       0,             -146483,         0
##MAX=       2.0444736,     98213,           0
$$ Real data points
##PAGE= N=1
##DATA TABLE= (X++(R..R)), XYDATA
$$ [...]
$$ plain form
1838 -567 172 -233 -208 484 411 -72 -97 26 178 454 -104 -346 150 -87 90 808 -12 -323 572 444 253
1859 253 589 651 -502 -92 859 -230 -233 599 91 -876 730 732 -154 359 748 -379 22 1234 72 -800
1879 -800 266 498 -624 567 841 -466 28 858 357 -297 282 136 -482 -279 14 -396 -262 -334 -472
1898 -472 158 187 -262 95 140 -272 106 83 -588 -399 145 -621 -104 330 -604 -967 442 81 -691 259 594
1919 594 -845 -59 816 -488 -633 354 -328 -1007 490 384 -715 -93 834 -174 9 977 -178 -836
1937 -836 474 260 -579 109 323 -486 -44 461 170 -15 558 599 290 497 509 246 111 46 243 247 19
1958 19 -9 470 111 152 796 270 -236 480 623 -362 525 739 -479 -371 878 -19 -681 628 600 -468
1978 -468 269 797 -263 -365 598 -436 -521 524 139 -894 53 507 -530 -223 495 57 -632 246 252
$$ packed form
1838e67P39m05K5O92p3m83k5J23J52K76n58k42M96k37J77P18q20l11Q95j28j91
1859B53L36O2j153M10R51j089lQ32n08r67J606Kq86N13L89j127M01J212j162q72
1879h00J066K32j122J191K74j307M94Q30n01o54N79j46o18K03K93m10J34p2j38
1898d72O30K9m49L57M5m12L78k3o71J89N44p66N17M34r34l63J409l61p72R50L35
1919E94j439P86Q75j304j45R87o82o79J497j06j099O22R27j008J83R68j155o58
1937h36J310k14q39O88K14q09M42N05k91j85N73M1l09K07J2k63j35o5J97Mk28
1958A9k8M79l59M1O44n26n06P16J43r85Q87K14j218J08J249q97o62J309k8j068
1978d68P37N28j060j02R63j034q5J045l85j033R47M54j037L07P18m38o89Q78O
$$ plain form
1997 252 -654 146 -228 -437 -289 -94 -417 -113 -6 -274 -41 -9 -206 181 -445 -501 -141 -40 -639 -111 136
2018 136 -553 -217 570 -65 -539 356 729 -539 71 694 -773 -514 884 -32 -740 743 594 -185 817
2037 817 773 -228 104 768 -108 -232 710 138 -447 204 356 -292 17 669 165 125 311 486 259 165 -114
2058 -114 -84 -322 -388 80 -102 -34 343 409 -80 -159 462 -11 -429 196 228 -462 -305 591 -472 -281 316 -322
2080 -322 -840 592 91 -680 232 829 -438 -617 532 -667 -783 71 -217 -890 5 405 -515 -359 512
2099 512 -273 -617 -55 -52 -686 -42 108 -302 -251 -36 64 -46 293 96 460 75 -5 139 245 -189 -74
2120 -74 156 -258 304 714 -266 -212 737 90 -132 499 416 -408 -66 605 -327 -198 676 -343 -535 414 144
2141 144 -197 559 767 -219 218 499 -135 -533 316 -102 -420 87 413 68 167 448 141 226 439 -16 -323
$$ packed form
1997B52r06Q00l74k09J48J95l23L04J07k68K33L2j97L87o26n6L60J01n99N28K47
2018A36o89L36P87o35m74Q95L73j268O10O23j467K59J398r16p08J483j49p79J002
2037H17m4j001L32O64q76j24R42n72n85O51J52o48L09O52n04m0J86J75k27r4k79
2058a14L0k38o6M68j82O8L77O6m89p9O21m73m18O25L2o90J57Q96j063J91N97o38
2080c22n18J432n01p71R12N97j267j79J149j199j16Q54k88o73Q95M00r20J56Q71
2099E12p85l44N62Lo34O44J50m10N1K15J00j10L39j97L64l85q0J44J06m34J15
2120g4K30m14N62M10r80N4R49o47k22O31q3q24L42O71r32J29Q74j019j92R49k70
2141A44l41P56K08r86M37K81o34l98Q49m18l18N07L26l45R9K81l07Q5K13m55l07
$$ plain form
2162 -323 -112 -194 9 157 -511 -487 25 -185 228 1 -276 47 497 -284 -254 65 -305 -762 -146 357 -524
2183 -524 -518 324 -249 -433 148 142 -914 -22 368 -529 -43 123 -482 -657 189 -313 -94 343 258 -179 7
2204 7 534 -171 -221 134 -148 -189 -14 13 -149 304 24 1 287 -186 -45 401 374 208 374 140 -349 -66
2226 -66 60 -445 251 468 151 96 667 206 -219 318 408 -432 432 397 191 -256 286 -401 -230 590 68
2247 68 -468 127 693 -214 269 530 -460 -435 14 -128 -706 -221 -56 -133 361 150 -68 -70 -241 -433 -28 101
2269 101 -370 -217 -21 -94 -229 -8 -329 -35 155 18 51 343 -237 -539 -199 -393 -443 -282 175 -447 54
2290 54 294 169 -81 457 -55 -531 401 371 -406 -369 238 -106 -569 263 -199 -228 497 560 173 397 477 -134
2312 -134 62 92 -175 -376 138 177 -182 403 338 -13 44 97 3 176 31 362 393 63 -107 125 150 -111 -138
$$ packed form
2162c23K11q2K03J48o68K4N12k10M13k27k77L23M50p81L0L19l70m57O16N03q81
2183e24OQ42n73j84N81oj056Q92L90q97M86J66o05j75Q46n02K19M37q5m37J86
2204GN27p05n0L55k82m1J75K7j62M53k80k3K86m73J41M46k7j66J66k34m89K83
2226f6J26n05O96K17l17n5N71m61m25N37R0q40Q64l5k06m47N42o87J71Q20n22
2247F8n36N95N66r07M83K61r90K5M49j42n78M85J65p7M94k11k18kj71j92M05J29
2269A01m71J53J96p3j35K21l21K94J90j37L3K92n80l02L40j94n0J61M57o22N01
2290E4K40j25k50N38n12m76R32l0p77L7O07l44m63Q32m62k9P25O3l87K24Q0o11
2312a34J96L0k67k01N14L9l59N85o5l51N7N3r4J73j45L31L1l30j70K32K5k61k7
$$ plain form
2335 -138 136 -18 268 429 4 -114 356 108 -344 -250 -11 -455 -180 342 -356 -292 317 175 -664 102 149
2356 149 -209 97 138 -245 -203 -303 -256 -790 -65 -41 -364 10 277 -27 -299 40 -15 -329 97 -183 -118 -3
2378 -3 -261 2 5 -208 -143 240 -129 -118 457 105 -158 93 -170 -325 296 319 -328 -44 455 28 111 391 125
2401 125 -386 237 208 -393 55 389 -59 62 537 189 -44 334 311 -218 343 495 -15 190 395 -211 -585
2422 -585 -157 -266 202 92 22 156 115 240 -8 -302 -157 12 304 -302 -297 -87 -204 -244 -235 -200 -295 -102 446
2445 446 -130 -219 361 -18 -517 -239 39 -539 -142 449 -334 -252 427 -138 -519 -61 215 -415 159 338 -382
2466 -382 -202 -79 -163 -409 -82 357 -182 291 266 -43 83 25 -34 -209 119 256 -222 186 276 96 353 53
2488 53 202 43 -5 260 17 182 -212 297 179 -507 202 315 -85 6 550 129 188 696 477 165 169 49
$$ packed form
2335a38K74j54K86J61m25j18M70k48m52R4K39m44K75N22o98O4O09j42q39P66M7
2356A49l58L06M1l83M2j00M7n34P25K4l23L74K67l04k72L39n5l14M26k80O5J15
2378ck58K63Lk13O5L83l69J1N75l52k63K51k63j55O21K3o47K84M99m27Q3K80k66
2401A25n11O23k9o01M48L34m48J21M75l48k33L78k3n29N61J52n10K05K05o06l74
2422e85M28j09M68j10p0J34m1J25k48k94J45J69K92o06NK10j17m0RL5r5J93N48
2445D46n76q9N80l79m99K78K78n78L97N91p83Q2O79n65l81M58K76o30N74J79p20
2466c82J80J23q4k46L27M39n39M73k5l09J26n8n9j75L28J37m78M08R0j80K57l00
2488E3J49j59m8K65k43J65l94N09j18o86P09J13m00R1N44m21N9N08k19l12Mj20
$$ plain form
2510 49 -450 21 251 219 20 12 326 -225 5 -186 -165 74 138 -275 75 119 -209 -416 -236 -172 62 63 -12 39
2534 39 -10 -127 -199 -210 -429 -317 69 -286 -358 -132 372 -7 -332 233 -350 -145 203 -121 -187 256 -69 -90
2556 -90 148 -72 -192 -263 -7 37 16 481 -132 -127 -42 139 75 203 248 -90 215 126 -183 -116 308 31 -55 38
2580 38 150 231 52 -34 -44 153 23 -33 -25 -129 74 -9 538 305 450 103 -211 -108 201 53 -183 193 459
2603 459 32 189 -147 -400 207 383 -95 -293 126 -27 -192 179 16 -349 -163 356 27 -93 173 -25
2623 -25 85 188 5 -50 151 80 -268 139 157 -40 109 -113 -131 32 78 -170 16 204 111 112 152 -12 -105 -114
2647 -114 -224 -203 274 -169 -116 45 48 -239 91 212 -121 -96 266 308 -266 262 89 -350 -153 75 -359 -213
2669 -213 272 107 -41 77 -96 37 -105 207 281 5 432 -104 10 252 331 -144 -13 211 -257 140 283
$$ packed form
2510D9m99M71K30l2j99qL14n51K30j91K1K39O4m13L50M4l28k07J80O4K34Jp5N1
2534C9m9j17p2j1k19J12L86l55p2K26N04l79l25N65n83K05L48l24o6M43l25k1
2556i0K38k20j20p1K56M4k1M65o13NQ5J81o4J28M5l38L05q9l09O7M24k77q6R3
2580C8J12Q1j79q6j0J97j30n6Qj04K03q3N47k33J45l47l14J03L09j48k36L76K66
2603D59m27J57l36k53O07J76m78j98M19j53j65L71j63l65J86N19l29j20K66j98
2623b5J10J03j83n5K01p1l48M07J8j97J49k22j8J63M6k48J86J88r3JM0j64r3r
2647a14j10K1M77m43N3J61Lk87L30J21l33K5L62M2n74N28j73m39J97K28m34J46
2669b13M85j65j48J18j73J33j42L12P4k76M27n36J14K42P9m75J31K24m68L97J43
$$ plain form
2690 283 279 89 58 115 157 -43 -186 73 16 92 -28 163 15 -206 -192 48 173 214 -109 -253 411 -111 -69
2713 -69 37 6 -188 -19 64 -160 -232 -43 -18 -100 -188 -1 -123 -272 -59 61 -167 101 -57 -458 50 -221
2735 -221 5 -338 76 78 -17 111 137 -14 -117 182 -248 -233 -78 -41 212 200 -173 209 -78 -287 -29 215
2757 215 -81 126 61 -320 198 64 249 -172 125 250 -98 352 295 -221 85 -2 30 12 234 25 -59 276
2779 276 -40 -30 150 -28 -104 201 238 41 -176 62 154 10 -8 -144 -229 67 96 66 107 105 -80 99 50 -226
2803 -226 50 -151 -130 89 246 -101 -255 101 -236 -75 121 -70 -210 148 128 -340 -46 158 -50 -149 -234
2824 -234 -77 -218 159 211 -238 -45 -34 -372 -109 120 -159 -59 492 14 85 0 -136 31 -100 -86 149 42
2846 42 181 -375 -25 -52 -239 -104 296 238 201 313 74 106 113 192 -30 -235 182 -35 34 -41 -192 22 -115
$$ packed form
2690B83mj90l1N7M2k00j43K59n7P6j20J91j48k21J4K40J25M1l23j44O64n22M2
2713f9J06l1j94J69Q3k24p2J89K5q2q8J87j22j49K13J20k28K68j58m01N08k71
2735b21K26l43M14Kr5J28K6j51j03K99m30J5J55L7K53j2l73L82k87k09K58K44
2757B15k96K07o5l81N18j34J85m21K97J25l48M50n7n16L06q7L2j8K22k09q4L35
2779B76l16J0J80j78p6L05L7j97k17K38R2j44j8j36q5K96K9l0M1kj85J79m9k76
2803b26K76k01K1K19J57l47j54L56l37J61J96j91j40L58k0m68K94K04k08r9q5
2824b34J57j41L77N2m49J93J1l38K63K29k79J00N51m78P1q5j36J67j31J4K35j07
2846D2J39n56L50k7j87J35M00n8l7J12k39L2PP9k22k05M17k17O9p5j51K14j37
$$ plain form
2869 -115 -71 -101 128 64 272 1 349 -117 -152 191 -171 -182 448 174 -51 222 210 87 115 54 -298 -103 -217
2892 -217 -158 -15 189 -9 -99 12 -244 -236 172 -59 297 -154 59 -3 -42 45 -120 41 -68 -85 -7 -114 -35
2915 -35 -157 -14 -48 -71 263 -60 33 138 65 169 -197 68 -37 -51 -185 -27 -35 119 157 -111 260 146 119
2938 119 277 43 -14 -165 123 100 -84 -74 66 37 3 -8 58 -18 63 218 249 115 -68 57 -74 -11 -1 -23
2962 -23 194 39 355 206 -140 372 -18 -69 -32 -36 -397 104 346 122 -283 25 -36 -102 6 11 -152 -72 47
2985 47 -77 -38 -76 139 -353 90 -89 -250 174 388 -51 -10 316 -167 -245 330 -24 -388 58 -101 -312 39
3007 39 -94 136 -144 205 130 144 -205 90 33 252 67 -126 -98 -49 28 -38 -326 66 196 283 -151 -133 -154 -54
3031 -54 -322 158 26 106 178 194 -33 315 68 -286 296 185 48 -200 168 125 2 -85 -66 25 282 -94 -106
$$ packed form
2869a15M4l0K29o4K08k71L48m66l5L43l62j1O30k74k25K73j2j23K8o1l52J95j14
2892b17N9J43K04j98r0J11k56QM08k31L56m51K13o2l9Q7j65J61j09j7P8j07P9
2915c5j22J43l4k3L34l23R3J05p3J04l66K65j05j4j34J58qJ54L8k68L71j14k7
2938A19J58k34n7j51K88k3j84J0J40k9l4j1O6p6Q1J55L1j34j83J25j31O3J0k2
2962b3K17j55L16j49l46N12l90n1L7ml61N01K42k24m05L08o1o6J08Nj63Q0J19
2985D7j24L9l8K15m92M43j79j61M24K14m39M1L26m83p8N75l54l64M46j59k11L51
3007C9j33K30k80L49p5J4l49K95n7K19j85j93K8M9P7o6k88L92J30Q7m34J8k1J00
3031e4k68M80j32Q0P2J6k27L48k47l54N82j11j37k48L68m3j23q7J9R1K57l76j2
$$ plain form
3054 -106 47 -33 34 48 300 -131 82 11 67 -139 -95 -61 -240 145 -155 -53 1 -1 -56 43 89 -210 48 -149
3078 -149 -81 -146 113 -34 58 36 -238 -477 140 46 -115 33 -352 -181 184 43 -416 77 -183 -55 -167 -22
3100 -22 18 -313 -71 84 -198 -337 -136 -72 -118 179 -8 -141 -34 -56 -65 6 148 -75 -167 136 25 -173 -45
3123 -45 -149 -33 176 -339 -134 121 -107 135 -308 166 -191 101 229 -99 -136 251 -147 -282 74 151 -109
3144 -109 14 -276 90 236 -4 -34 183 257 62 52 61 7 174 284 -21 258 7 330 -29 -118 90 -213
3166 -213 -126 25 26 -173 144 53 -56 87 -23 -106 275 230 -28 66 -184 -19 107 20 -354 -32 189 11 20
3189 20 -157 -22 156 -126 167 -67 -89 33 -118 9 276 170 -198 111 185 -110 55 -26 95 -64 221
3210 221 -75 -192 39 84 -141 -103 50 -216 260 168 -118 203 -250 33 69 15 -60 89 147 220 -212 120 -210
$$ packed form
3054a06J53q0O7J4K52m31K13p1N6k06M4L4j79L85l00J02N4kn5R9M6k99K58j97
3078a49O8o5K59j47R2k2k74k39O17r4j61J48l85J71L65j41m59M93k60J28j12J45
3100b2M0l31K42J55k82j39K01O4m6K97j87j33J07k2rP1J42k23r2L03j11j98J28
3123d5j04J16K09n15K05K55k28K42m43M74l57K92J28l28l7L87l98j35L56P7k60
3144a09J23k90L66J46k40l0K17P4j95j0Rn4J67J10l05K79k51L23l59q9K08l03
3166b13Q7J51Jj99L17r1j09J43j10q3L81m5k58R4k50J65J26q7l74L22K21j78R
3189B0j77J35J78k82K93k34k2J22j51J27K67j06l68L09P4k95J65q1J21j59K85
3210B21k96j17K31M5k25L8J53k66M76r2k86L21m53K83L6n4p5J49N8P3m32L32l30
$$ plain form
3233 -210 9 299 455 -40 94 379 -191 -13 381 154 225 -210 61 -12 -84 306 -106 51 27 4 88 -175
3255 -175 -124 -99 -86 -171 -25 131 127 149 172 118 -158 9 -198 -179 -177 99 -147 -8 -141 -67 -78 197 -62 240 -119
3280 -119 144 -76 -20 -228 -243 11 -200 165 156 -162 -248 -238 98 -54 250 118 -210 36 122 130 -69 -64 -99 123
3304 123 -150 -61 63 16 97 43 61 368 -129 -43 -203 36 172 -170 16 127 18 146 -10 31 301 57
3326 57 201 41 20 -33 21 268 -116 -207 -155 2 118 286 -191 67 94 -55 331 -5 166 63 -142 20
3348 20 -163 -70 77 -124 51 126 -144 -33 212 -275 -17 143 -2 -27 -209 -178 215 -199 60 72 -234 -158
3370 -158 203 -279 -182 -114 -8 -138 24 -164 -75 88 -181 103 58 -148 34 -46 91 277 37 98 -29 39
3392 39 -366 35 -34 85 111 135 -37 57 271 106 222 -106 57 -133 -223 -62 230 190 -39 117 -43 27 120
$$ packed form
3233b10K19K90J56m95J34K85n70J78L94k27P1m35K71p3p2L90m12J57k4k3Q4k63
3255a75N1K5J3q5J46J56mK2K3n4k76J67k07J9KK76k46J39j33P4j1K75k59L02l59
3280a19K63k20N6k08j5K54k11L65rl18q6J0L36j52L04j32l28K46Q6Qj99Nl5K22
3304A23k73Q9J24m7Q1n4J8L07m97Q6j60K39J36l42J86J11j09J28j56M1K70k44
3326E7J44j60k1n3N4K47l84r1N2J57J16J68m77K58K7j49L86l36J71j03k05J62
3348B0j83R3J47k01J75P5k70J11K45m87K58J60j45k5j82L1L93m14K59J2l06P6
3370a58L61m82R7O8J06j30J62j88Q9J63k69K84m5k06J82q0J37J86k40O1j27O8
3392C9m05M01o9J19K6K4j72R4K14j65J16l28J63j90r0J61K92m0k29J56j60P0R3
$$ plain form
3415 120 100 40 68 232 -140 -126 276 -75 35 260 146 9 134 -64 -179 496 -64 -53 81 -48 50 100
3437 100 -52 -180 -79 -102 -295 -27 18 -153 74 6 -60 34 36 -110 -167 -14 -356 -79 138 -142 5 26 150
3460 150 112 -100 19 -46 67 76 -256 -369 -54 -65 -137 -175 -34 -17 -251 -34 -102 -57 -133 -127 -160 136 -88 -106 271
3485 271 -171 55 -75 -146 -107 307 41 87 199 101 285 243 69 -104 -64 134 -109 27 351 110 250 93
3507 93 386 -140 40 201 69 -156 -108 127 84 101 -229 -269 4 44 17 -126 290 273 -31 -82 201 -109 -196
3530 -196 132 91 -102 -70 -87 119 -119 112 152 182 37 63 -22 -187 -135 -158 -133 -269 -27 -146 75 -101 78
3553 78 -135 -82 100 -193 -87 -77 180 75 31 54 49 -144 -187 -210 -15 236 109 -22 121 94 -62 87 -121
3576 -121 144 83 -107 188 99 176 109 195 -30 91 -223 -353 40 -9 82 13 -31 -11 108 278 206 15 -119 -126
$$ packed form
3415A20k0o0K8J64l72J4M02l51J10K25j14j37J25j98j15O75n60J1J34j29R8N0
3437A00j52j28J01k3j93K68M5j71K27o8o6R4Kj46n7J53l42K77K17k80J47K1J24
3460A50l8k12J19o5J13Rl32j13L15j1p2l8J41J7k34K17o8M5p6Ol3K96k24j8L77
3485B71m42K26j30p1L9M14k66M6J12r8J84m2j74j73M0J98k43J36L24k41J40j57
3507I3K93n26J80J61j32k25M8K35m3J7l30m0K73M0k7j43M16j7l04n1K83l10q7
3530a96L28m1j93L2j7K06k38K31M0L0j45K6q5j65N2k3K5j36K42j19K21j76J79
3553G8k13N3J82k93J06J0K57j05m4K3nj93m3k3J95K51j27j31J43k7j56J49k08
3576a21K65o1j90K95q9P7o7Q6k25J21l14j30L93m9R1o9m4K0J19J70p2j91j34p
$$ plain form
3600 -126 0 -63 226 -103 -117 -171 24 -183 -192 131 164 -82 156 46 123 76 -122 -21 -226 -208 -87 7 24 115
3624 115 -47 -350 110 55 -230 -86 -59 -412 -57 -143 -258 -189 41 91 -377 80 -53 -85 -101 -64 -35 -141 -65
3647 -65 -95 6 -65 -81 -171 -19 -44 111 -39 -171 -11 -100 -246 64 -34 -3 -259 -153 193 -183 103 111 -76 -214
3671 -214 225 -22 -121 275 208 -294 2 19 -116 202 -119 76 201 -10 25 107 -78 175 244 -4 -178 187
3693 187 81 364 -132 48 65 -116 -64 213 11 -36 -86 120 -39 80 -102 -127 257 -128 -39 13 253 201 -65
3716 -65 135 68 -6 21 21 22 -85 -175 -30 193 216 -114 -192 -197 -155 -232 64 -33 -46 5 229 -164 133 -58 -301 -90
3742 -90 -200 -28 -141 -155 -11 335 -73 123 -40 31 161 -241 -158 107 -171 286 -124 7 104 -18 -221 86
3764 86 -96 274 48 246 -21 51 126 27 133 -28 210 -294 -55 98 -65 219 78 -218 46 199 76
$$ packed form
3600a26J26o3K89l29j4n4J95k07rL23L3k46K38j10P7m7j98J01k05J8J21R4J7R1
3624A15j62l03M60n5k85J44K7l53L55q6j15O9K30N0m68M57j33l2j6L7K9j06P6
3647f5l0J01p1j6r0J52k5J55j50j32J60q9j46L10r8L1k56J06L46l76K86Qj87j38
3671b14M39k47r9L96o7n02K96J7j35L18l21J95J25k11L5Q2j85K53O9k48j74L65
3693A87j06K83m96J80J7j81N2K77k02m7n0K06j59J19j82k5L84l85Q9N2K40n2k66
3716f5K00o7p4K7%Jj07r0J45K23K3l30p8nM2p7K96r7j3N1K24l93K97j91k43K11
3742i0j10J72j13j4J44L46m08J96j63P1J30m02Q3K65k78M57m10J31R7j22k03L07
3764H6j82L70k26J98k67P2P5r9J06j61K38n04K39J53j63K84j41k96K64J53j23
$$ plain form
3785 76 -1 159 94 -82 1 -182 116 -19 77 48 -166 132 270 -67 87 -65 -248 -307 38 -63 -134 139 -96
3808 -96 -8 -107 29 -15 16 27 -204 140 -212 -148 84 134 -46 -205 89 254 49 23 46 113 36 -16 -49 -91 -24
3833 -24 -112 73 238 -41 -20 52 -8 -91 -57 -71 -99 -14 -186 154 -35 170 -187 -199 -46 -2 204 16 198 130
3857 130 -60 -50 210 164 128 94 311 161 28 129 231 -35 22 -68 71 -131 -138 86 -142 140 286 -283 213
3880 213 158 -53 -13 132 129 205 -39 178 -92 95 104 -223 102 38 -11 -235 83 81 -1 145 -12 75 94 -244 5
3905 5 127 118 -201 -291 -93 -76 -265 43 -54 -64 -103 -39 -154 -24 -319 -239 -84 10 -89 147 -30 -127 -45 230 -116
3930 -116 -168 -173 -149 97 107 118 -98 -34 147 36 27 244 -184 208 -28 50 -144 0 131 203 -135 -27 -176 -129
3954 -129 29 -157 12 89 -43 -85 47 13 -136 397 250 -47 93 -55 -46 114 221 -59 -4 206 -14 -68
$$ packed form
3785G6p7J60o5j76Q3j83K98j35R6k9k14K98J38l37J54j52j83n9L45j01p1K73k35
3808i6Q8r9J36m4L1J1k31L44l52O4K32N0j80j59K94J65k05k6K3O7p7n2l3m2O7
3833b4q8J85J65k79K1P2o0q3L4j4k8Q5j72L40j89K05l57j2J53M4K06j88J82o8
3857A30j90J0K60m6l6l4K17j50j33J01J02k66N7r0J39k02pK24k28K82J46n69M96
3880B13n5k11M0J45lP6k44K17k70J87Rl27L25o4m9k24L18kq2J46j57Q7J9l38K49
3905EJ22rl19r0J98J7j89L08r7j0l9O4j15J30k95Q0J55R4r9K36j77r7Q2K75l46
3930a16n2nK4K46J0J1k16O4J81j11rK17m28L92k36P8j94J44J31P2l38J08j49M7
3954a29J58j86J69P7j32m2J32l4j49N33j47k97J40j48RJ60J07k80N5K10k20n4
$$ plain form
3976 -68 -56 -149 -122 -146 131 -85 -182 62 -474 -114 80 -156 53 1 -7 -333 96 -28 -154 8 151 29 -153
3999 -153 -157 86 -194 105 -221 93 128 5 -85 -173 92 -125 -236 -44 17 213 86 -136 62 218 63 -98
4021 -98 180 -301 101 3 124 48 -159 -153 1 -49 311 11 53 -102 -61 -12 154 137 -42 232 138 176 43 33
4045 33 -184 -222 -237 -48 -50 -34 86 167 -185 121 -35 175 103 196 187 203 -212 57 153 -228 -140 36 -102 -113 197
4070 197 92 298 199 -76 -203 15 93 177 -264 -25 -105 64 287 -185 -228 134 9 24 59 130 124 3 -41 -136
4094 -136 -39 201 77 64 -80 -149 180 -209 -2 -92 -65 -235 -113 -313 176 -6 51 -43 -71 -29 -14 161 60
4117 60 80 275 -146 239 -248 -1 24 -15 -78 -179 235 70 72 92 -119 94 -2 -38 -263 308 212 93 67 40
4141 40 60 28 318 81 210 -23 65 53 -114 248 40 40 -362 187 -37 -29 -66 -35 119 108 99 186 -157 73 67 91
$$ packed form
3976f8J2r3K7k4K77k16r7K44n36L60J94k36K09n2ql26M29j24j26J62J43j22j82
3999a53mK43k80K99l26L14L5j23r0q8K65k17j11J92O1J96j27k22J98J56j55j61
4021i8K78m81M02r8J21p6k07OJ54n0L60l00M2j55M1M9J66j7j79K74r4L8j33j0
4045C3k17l8j5J89kJ6J20Q1l52L06j56K10p2R3rJ6m15K69R6l81Q8J76j38j1L10
4070A97j05K06r9k75j27K18P8Q4m41K39q0J69K23m72m3L62j25J5L5P1oj21m4r5
4094a36R7K40j24j3j44o9L29l89K07r0K7j70J22k00M89j82N7r4k8M2J5J75j01
4117F0K0J95m21L85m87K47K5l9o3j01M14j65KK0k11K13r6l6k25N71r6j19k6k7
4141D0K0l2K90k37J29k33Q8j2j67L62k08%m02N49k24Ql7L1J54j1rQ7l43K30oK4
$$ plain form
4167 91 -76 -43 -236 -115 49 -160 -442 -228 61 -71 19 -102 -194 100 4 -65 127 119 109 42 -158 144 64 -372
4191 -372 70 -124 213 -66 218 -351 -182 -133 219 -108 -313 -261 -291 1 -79 -108 -40 48 -245 139 -49 128
4213 128 33 4 109 -161 88 196 117 86 -179 163 191 49 -68 -25 -41 -122 -25 -22 -52 181 277 -44 -124 59 -93
4238 -93 -76 124 125 123 86 131 122 211 112 -6 150 7 24 -132 28 -147 -102 -175 -41 239 -257 -123 -114 -94 126 -196
4264 -196 -261 76 -48 178 -8 -9 -128 149 23 127 -95 83 -26 -139 -135 14 77 -98 -115 -115 -159 -344 97
4287 97 -102 8 112 131 -123 147 52 -229 -57 200 252 6 33 -34 28 21 80 98 36 22 -115 -83 60 248 46
4312 46 -25 16 -147 -67 221 89 -212 -49 54 -60 153 111 -49 226 64 -62 90 76 -18 -45 14 -10 253
4335 253 14 38 76 -85 -126 318 -285 79 90 -63 -111 -122 -6 173 -71 77 43 -129 -118 -99 -3 23 -24 -47
$$ packed form
4167I1j67L3j93J21J64k09k82K14K89j32R0j21r2K94r6o9J92qj0o7k00L02q0m36
4191c72M42j94L37k79K84n69J69M9L52l27k05N2l0K92q0k9O8Q8k93L84j88J77
4213A28r5k9J05k70K49J08p9l1k65L42K8j42j17M3j6q1R7Ll0K33R6l21q0J83j52
4238i3J7K00Jkl7M5rQ9r9j18J56j43J7j56J60j75M5p3J34K80m96J34RK0K20l22
4264a96o5L37j24K26j86jj19K77j26J04k22J78j09j13MJ49O3j75j7%m4j85M41
4287I7j99J10J04J9k54K70r5k81J72K57N2k46K7o7O2pN9J8o2j4j37L2J43J88k02
4312D6p1M1j63Q0K88j32l01J63J03j14K13m2j60K75j62j26J52j4r4k7N9k4K63
4335B53k39K4L8j61m1M44o03L64J1j53m8j1J16J79k44J48l4j72J1J9R6K6m7k3
$$ plain form
4359 -47 -100 116 -21 239 122 -225 -92 -111 248 -65 168 -94 107 -39 -58 -22 -213 -80 -190 -25 9 219
4381 219 -354 0 -53 111 39 -184 -229 -47 -6 -87 -245 -85 -67 153 111 -85 -197 256 150 181 130 -13 98
4404 98 -52 12 59 50 -147 24 -60 377 -68 238 -54 3 -12 293 -133 254 20 -205 277 -3 128 -57 -160
4427 -160 21 243 87 -13 -27 168 -127 -20 -92 136 -122 146 28 42 -83 -34 90 172 -1 109 108 137 88
4450 88 -296 156 -30 -49 65 170 -116 13 123 -154 72 -140 138 105 85 -151 159 38 11 -52 56 133
4472 133 -196 -195 77 0 223 283 -155 -152 124 87 -104 -30 -245 116 -122 -31 -88 319 174 68 167 -146 91 137
4496 137 132 -124 -266 63 26 -146 -14 -89 -242 -116 134 -137 21 265 51 -109 -164 -135 -255 -32 172 -77
4518 -77 -38 194 4 108 52 -53 -43 -419 157 5 -8 138 -115 -97 -4 -42 -27 329 -103 -204 -5 -102 -2
$$ packed form
4359d7n3K16j37K60j17l47J33j9L59l13K33k62K01j46j9L6j91J33j10J65L4K10
4381B19n73L54n3J64p2k23m5J82M1q1j58J60J8K20m2j96j12M53j06L1n1j43J11
4404I8j50O4M7rj97J71q4M37m45L06k92N7j5L05m26L87k34k25M82k80J31j85j03
4427a60J81K22j56j00j4J95k95J07p2K28k58K68j18J4j25M9J24Q2j73J10jK9m9
4450H8l84M52j86j9J14J05k86J29J10k77K26k12K78l3k0k36L10j21k7o3J08P7
4472A33l29JK72p7K23O0m38LK76l7j91P4k15L61k38R1n7M07j45j06R9l13K37M6
4496A37nk56j42L29l7j72J32p5j53J26K50k71J58K44k14j60n5K9j20K23K04k49
4518g7L9K32j90J04n6j05J0l76N76j52j3J46k53J8R3l8J5L56m32j01J99r7J00
$$ plain form
4541 -2 -202 133 442 -208 -230 73 -48 -146 -156 -184 -127 221 124 -54 50 -52 107 -79 -266 58 200 154 -49
4564 -49 226 -176 -50 172 333 45 -28 -114 -35 187 70 -62 144 -32 -164 67 255 -124 391 -6 -157
4585 -157 -86 -166 150 43 -31 134 25 67 183 94 -25 302 -115 178 83 -33 -30 88 -40 -218 -119 -151 98
4608 98 -189 168 -115 337 203 -80 -43 9 -25 -229 -154 34 78 19 36 -187 212 84 -36 -70 147 -159 45
4631 45 -121 -180 -73 -47 -167 -153 107 263 -19 -114 230 163 -54 -52 -82 2 41 -96 77 17 -52 81 -26 171
4655 171 192 191 151 211 34 176 4 -37 -130 -21 -64 94 39 -125 -33 82 -76 -92 25 59 -53 2 249 -168
4679 -168 61 -128 -114 60 -247 -85 69 -35 -146 197 98 -269 -209 -32 -232 71 22 -304 45 16 95 -208
4701 -208 126 69 -106 -191 -10 25 -109 -169 86 -33 29 -117 203 161 234 4 -178 -97 -12 -215 158 -70 -10
$$ packed form
4541bk00L35L09o50k2L03j21r8j0k8N7L48r7j78J04j02J59j86j87L24J42m6k03
4564d9K75m02J26K22J61k88p3q6P9K22j17j32K06j76j32K31J88l79N15l97j51
4585a57P1q0L16j07p4J65j09M2J16q9j19L27m17K93r5j16LJ18j28j78R9l2K49
4608I8k87L57k83M52j34k83L7N2l4k04P5J88M4n9J7k23L99j28j20l4K17l06K04
4631D5j66n9J07K6j20J4K60J56k82r5L44o7k17Kl0Q4L9j37J73o0o9J33j07J97
4655A71K1jm0O0j77J42j72m1r3J09m3J58n5j64R2J15j58j6J17L4j12N5K47m17
4679a68K29j89J4J74l07J62J54j04j11L43r9l67O0J77k00L03m9l26L49k9P9l03
4701b08L34n7j75q5J81L5j34o0K55j19O2j46L20m2P3k30j82Q1Q5k03L73k28O0
$$ plain form
4724 -10 -24 33 5 -35 83 236 -199 -201 97 37 380 -86 62 84 -162 275 225 8 216 -192 -73 -40 85 194
4748 194 392 155 -203 33 25 -127 80 -97 -10 41 37 239 49 -132 4 175 -217 14 -174 -144 69 160 -150
4771 -150 -345 161 106 -85 308 9 -108 283 68 19 71 279 -31 -76 -20 80 -50 33 -245 -69 -31 101
4793 101 -177 -5 232 -235 254 49 128 76 9 -395 192 133 121 -7 26 -127 -236 357 -183 -76 -147 -172 -218
4816 -218 -19 -14 210 28 -227 -263 -117 9 -194 109 -61 138 -138 -51 -88 -30 -34 98 29 -212 314 -87 -170
4839 -170 59 149 95 146 -236 -145 -4 -48 -47 -146 -89 137 -70 -97 2 402 44 -123 -50 77 356 142 39 68
4863 68 55 191 318 21 -137 37 -69 -36 -137 -7 -118 142 -27 28 194 82 88 44 -286 65 32 -56 42
4886 42 -145 80 80 -18 164 -149 -38 176 111 28 89 6 124 -5 39 72 -163 29 -186 -377 -136 24 -212
$$ packed form
4724a0j4N7k8m0J18J53m35kK98o0L43m66J48K2k46M37n0k17K08m08J19L3J25J09
4748A94J98k37l58K36qj52K07j77Q7N1mK02j90j81J36J71l92K31j88L0K13R1l10
4771a50j95N06n5j91L93k99j17L91k15m9N2K08l10m5N6J00j30Q3k78J76L8J32
4793A01k78J72K37m67M89k05P9n2o7m04N87n9j2j28L3j53j09N93n40J07p1k5m6
4816b18J99NK24j82k55l6J46J26k03L03j70J99k76Q7l7N8mJ32o9k41N26m01q3
4839a70K29R0n4N1l82R1J41m4Jr9N7K26k07k7R9M00l58j67P3J27K79k14j03K9
4863F8j3J36J27k97j58J74j06L3j01J30j11K60j69N5J66j12Om4l30L51l3q8R8
4886D2j87K25%r8J82l13J11K14o5q3O1q3J18j29M4L3k35J92k15j91K41J60k36
$$ plain form
4909 -212 212 60 346 -90 -30 150 -246 -102 51 176 -130 -167 47 -30 29 -4 91 297 -196 -193 71 41 7
4932 7 -32 67 -205 -53 76 -152 6 200 123 77 256 4 -47 69 20 397 158 122 109 28 45 -65 -10 -66 -101
4957 -101 77 -20 -144 -1 155 93 -4 170 -139 -92 -87 167 -13 -44 -91 320 279 -1 152 -101 209 116 -19
4980 -19 144 23 39 -6 147 -44 8 -42 -147 243 -103 32 42 301 -93 -166 11 -28 170 16 19 48 20 -10
5004 -10 -51 -246 -31 -197 84 -35 150 99 -80 -98 -167 10 -86 18 57 -172 198 101 -266 94 -136 -103 5
5027 5 11 130 -43 79 -108 28 -267 -158 2 89 -32 -230 38 16 106 -7 -209 154 22 143 83 44 142
5050 142 -275 -33 -138 10 189 230 107 -75 -8 133 -141 65 106 54 174 57 342 5 -89 48 294 -1
5072 -1 72 62 -22 -82 43 -147 -299 -15 -182 103 13 -69 113 -264 123 17 -86 39 -18 -240 17 110 50 190
$$ packed form
4909b12M24j52K86m36O0J80l96J44J53J25l06l7K14p7N9l3R5K06m93LK64l0l4
4932Gl9R9k72J52J29k28J58J94p7m6J79k52n1J16m9L77k39l6j3q1J7j10N5n6l5
4957a01J78r7j24J43J56o2r7J74l09M7NK54j80l1m7M11m1k80J53k53L10r3j35
4980a9J63j21J6m5J53j91N2n0j05L90l46J35J0K59l94p3J77l9J98j54LK9k8l0
5004a0m1j95K15j66K81j19J85n1j79j8o9J77r6J04L9k29L70r7l67L60k30L3J08
5027EOJ19j73J22j87J36k95J09J60Q7j21j98K68k2R0j13k02L63j32J21o0l9R8
5050A42m17K42j05J48J79M1j23j82O7J41k74K06M1n2J20j17K85l37r4J37K46k95
5072aP3j0q4o0J25j90j52K84j67K85r0q2J82l77L87j06j03J25n7k22K57R3o0J40
$$ plain form
5096 190 96 33 -40 -162 83 -234 -120 -30 -141 144 -248 48 134 229 80 75 -41 -211 32 3 -10 -161 236
5119 236 -145 17 -151 -149 142 278 -71 -79 70 -89 35 178 99 -101 -19 -110 76 132 30 249 37 164 142
5142 142 208 -43 -190 124 8 -65 -16 -155 5 105 -156 250 -13 -16 -279 167 -84 -165 -222 -7 15 109 128
5165 128 -5 -358 160 -69 13 -308 -348 115 170 -220 -62 13 -30 200 -6 58 -124 -64 67 -160 -19 -136
5187 -136 -51 178 -230 51 10 26 54 43 -44 19 -51 237 216 -7 -17 27 73 -49 -278 205 33 29 -92 64 144
5212 144 -251 -214 63 83 152 -80 116 277 133 31 -60 234 -208 23 53 187 31 26 375 -279 10 -13 -172
5235 -172 -93 52 41 69 0 -60 -140 -18 -176 172 -77 -12 -137 -34 22 321 433 132 29 87 -50 -351 12
5258 12 -191 28 23 45 -94 303 305 -73 7 97 172 19 -39 175 -42 117 -186 101 341 -97 37 -118 -249
$$ packed form
5096A90r4o3p3j22K45l17J14R0j11K85l92K96Q6R5j49nj16j70K43k9j3j51L97
5119B36l81J62j68KK91J36l49qJ49j59J24J43p9k00Q2r1J86N6j02K19k12J27k2
5142A42O6k51j47L14j16p3M9j39J60J00k61M06k63lk63M46k51q1n7K15K2R4J9
5165A28j33l53N18k29Q2l21m0M63N5l90J58P5m3K30k06O4j82O0J31k27J41j17
5187a36Q5K29m08K81m1J6K8j1q7O3p0K88k1k23j0M4M6j22k29M83j72mj21J56Q0
5212A44l95L7K77K0O9k32J96J61j44j02r1K94m42K31L0J34j56nL49o54K89k3j59
5235a72P9J45j1K8o9o0q0J22j58L48k49O5j25J03N6K99J12l01j03N8j37l01L63
5258A2k03K19nK2j39L97Kl78Q0R0P5j53n8K14k17J59l03K87K40m38J34j55j31
$$ plain form
5281 -249 -102 91 -112 -225 158 -29 -217 -102 -42 128 -199 97 -51 -48 -177 -106 75 47 37 19 103 187 363
5304 363 -130 -135 -35 -40 1 55 -20 -115 19 192 -110 100 -100 43 140 73 10 -115 -288 -7 129 -53 70 -84
5328 -84 98 21 20 318 53 -279 154 27 -21 -59 -141 184 -25 81 -172 267 187 -330 -26 -3 -11 -182 -147 1
5352 1 73 -40 25 -155 29 235 -193 99 153 -247 213 -90 -352 -23 74 81 -114 -245 -182 -13 22 51 -235 20
5376 20 -56 -118 5 -128 166 -50 -10 63 -184 44 108 81 -66 -78 158 -77 -44 -377 -125 -19 -27 -110 86 -4
5400 -4 22 138 155 -125 -227 -4 159 81 237 125 343 56 171 167 -348 334 -65 191 53 34 5 28 184
5423 184 1 -122 321 112 124 176 110 -248 -173 165 -31 144 -54 77 -75 -198 112 152 41 42 253 227 -50
5446 -50 4 -57 29 184 125 160 -117 186 -12 64 -16 -278 153 -288 -183 -171 50 -119 228 168 -125 15 -37 -186
$$ packed form
5281b49J47J93k03j13L83j87j88J15O0J70l27K96j48Lj29P1J81k8j0j8Q4Q4J76
5304C63m93nJ00nM1N4p5r5J34J73l02K10k00J43R7o7o3j25j73K81J36j82J23j54
5328h4J82p7jK98k65l32M33j27m8l8q2L25k09J06k53M39q0n17L04K3qj71L5J48
5352AP2j13O5j80J84K06m28K92N4m00M60l03k62L29R7Pj95j31O3J69L5K9k86K55
5376B0p6o2J23j33K94k16M0P3k47K28O4k7j47j2K36k35L3l33K52J06qq3J96r0
5400dK6J16J7k80j02K23J63p8J56j12K18k87J15mn15O82l99K56j38j9k9K3J56
5423A84j83j23M43k09J2N2o6l58P5L38j96J75j98J31j52j23L10M0j11JK11k6k77
5446e0N4o1Q6J55n9L5k77L03j98P6q0k62M31m41J05J2K21j69L47o0k93J40n2j49
$$ plain form
5470 -186 8 -55 45 -131 47 -51 168 -7 165 381 355 14 -161 -118 62 126 116 325 121 234 -123 386
5492 386 -94 -33 3 -138 140 214 -67 170 -354 150 -93 -88 212 32 55 -123 74 -101 141 -25 -198 -49
5514 -49 -49 70 180 -28 -134 -177 -201 -36 -162 86 47 -124 157 -16 138 175 136 -108 -162 -195 106 117 137 -82
5538 -82 -95 1 -119 221 114 59 -149 -116 183 91 -193 100 -362 46 211 124 -159 -195 -12 -61 -72 -115 76 -108
5562 -108 -81 -162 -28 -81 153 -219 145 -150 55 -187 21 -165 94 -43 -209 -56 -128 68 163 235 -28 25
5584 25 -98 92 38 8 -65 142 89 63 213 -111 -96 206 90 -171 64 -250 -119 -1 51 -118 -10 13 -198
5607 -198 -198 -3 -101 -139 -181 119 -3 -185 -151 76 -99 -152 -81 18 -293 49 37 16 -116 -32 -231 9 182 -102
5631 -102 -55 1 -275 -289 -44 179 -149 104 234 -81 -252 134 138 -63 -150 162 116 148 0 -47 333 -61 -67 -113
$$ packed form
5470a86J94o3J00j76J78r8K19j75J72K16k6l41j75M3J80O4j0K09k04J13l57N09
5492C86m80O1L6j41K78P4k81K37n24N04k43NL00j80K3j78J97j75K42j66j73J49
5514d9%J19J10k08j06m3k4J65j26K48l9j71K81j73J54L7l9k44n4l3L01J1K0k19
5538h2j3R6j20L40j07n5k08L3K99r2k84K93m62M08J65q7k83l6J83m9j1m3J91j84
5562a08K7q1J34n3K34l72L64k95K05k42K08j86K59j37j66J53p2J96R5P2k63N3
5584B5j23J90n4l0p3K07n3k6J50l24J5L02j16k61K35l14J31J18N2j69J08K3k11
5607a98%J95r8l8m2L00j22j82L4K27j75n3P1R9l11L42j2k1j32Q4j99K40J73k84
5631a02M7N6k76j4K45K23l28K53J30l15j71L86Mk01q7L12m6L2j48m7L80l94om6
$$ plain form
5655 -113 53 -205 43 -216 -34 -213 9 -219 39 -96 -95 -9 142 -69 203 -45 -68 6 168 99 63 146 150
5678 150 141 -161 74 -192 17 55 -16 -7 -13 1 43 368 33 -74 0 -135 -31 69 -52 -136 -31 -119 -124 -16 -87
5703 -87 13 -17 451 -10 -198 -217 -324 -122 -39 150 -80 71 119 15 -133 -53 -165 -119 90 88 -123 169 267
5726 267 68 117 -72 -300 122 -188 -151 149 -58 84 -140 -29 27 -13 -121 155 -37 -114 69 -156 58 -95
5748 -95 125 -118 4 71 -29 -34 50 124 -84 -48 -52 218 11 -60 31 120 164 -51 114 386 -125 19 61 62 -15 -208
5774 -208 -82 139 184 -116 -4 -143 -31 108 175 26 18 -114 -120 263 -40 182 232 -331 17 204 55 121 -63
5797 -63 -19 185 -25 0 66 -116 -100 -82 -189 88 185 -55 270 -155 -143 10 -322 -9 -64 -88 28 -235 -94
5820 -94 -32 35 -6 -121 -153 133 16 63 -154 78 289 -209 -10 158 -86 -244 -119 -209 227 144 -122 -112 78
$$ packed form
5655a13J66k58K48k59J82j79K22k28K58j35JQ6J51k11K72k48k3P4J62o9l6Q3M
5678A50rl02K35k66K09L8p1RoJ4M2L25l35j07P4j35J04J00j21q4J05q8nJ08p1
5703h7J00l0M68m61j88j9j07K02Q3J89k30J51M8j04j48Q0j12M6K09kk11K92R8
5726B67j99M9j89k28M22l10L7L00k07J42k24J11N6m0j08K76j92p7J83k25K14j53
5748i5K20k43J22O7j00nQ4P4k08L6mK70k07p1R1Q9M4k15J65K72n11J44M2Jp7j93
5774b08J26K21M5l00J12j39J12J39O7j49qj32oL83l03K22N0n63L48J87j49O6j84
5797f3M4K04k10K5O6j82J6J8j07K77R7k40L25m25J2J53l32L13n5k4J16k63J41
5820i4O2O7m1j15l2K86j17M7k17K32K11m98J99J68k44j58J25r0M36q3k66J0J90
$$ plain form
5843 78 90 13 -81 4 -162 -35 -32 -47 131 50 -150 116 205 15 65 57 -182 -28 1 -143 117 -63 -114 183 -19
5868 -19 -153 -214 -145 86 53 164 119 -240 -82 260 -27 -17 -255 48 -144 -59 45 -90 -233 -192 93 114 -13
5891 -13 -182 159 163 -211 49 177 -44 -243 -254 -97 145 41 60 -305 90 93 -151 -10 -88 -72 -47 -231 80
5914 80 32 -121 151 -358 89 -139 -22 -83 -183 52 -35 84 -267 -167 18 -88 -92 112 162 -204 -168 -30 -345
5937 -345 -121 -96 220 112 156 -213 -6 -174 -272 -31 -237 1 124 98 153 -118 74 270 -12 74 19 -77 -12
5960 -12 237 72 198 55 -164 16 -10 133 110 80 -162 -33 30 61 244 260 -128 -43 94 -27 128 109 -155
5983 -155 -70 -78 -210 200 2 -18 -142 184 -4 53 54 -138 -86 47 -16 89 -16 -103 -84 -157 -115 -13 105 -240
6007 -240 -232 35 14 -46 -93 -43 45 -39 19 63 137 -17 -16 62 2 -18 93 -122 196 -26 109 -118 117 60 67 41 23
$$ packed form
5843G8J2p7r4Q5j66J27Lj5J78q1k00K66Q9j90N0qk39J54K9j44K60j80n1K97k02
5868a9j34o1O9K31l3J11m5l59J58L42k87J0k38L03j92Q5J04j35j43M1K85K1j27
5891a3j69L41Ml74K60J28k21j99j1J57K42j04J9l65L95Lk44J41p8J6K5j84L11
5914H0m8j53K72n09M47k28J17o1j00K35q7J19l51J00J85j06mK04N0l66L6J38l15
5937c45K24K5L16j08M4l69K07j68r8K41k06K38J23k6N5k71J92J96k82Q6n5r6O5
5960a2K49j65J26j43k19J80k6J43k3l0k42J29O3L1J83J6l88Q5J37j21J55j9k64
5983a55Q5qj32M10j98k0j24L26j88N7Jj92N2J33o3J05j05q7J9p3M2J02J18l45
6007b40QK67k1o0m7N0Q8q4N8M4P4j54JP8o0k0J11k15L18k22J35k27K35n7Pk6j8
$$ plain form
6034 23 133 17 -87 83 -124 16 -121 -60 30 -330 -69 53 -146 33 -97 12 356 -74 -52 41 -25 -109
6056 -109 -301 -39 168 -260 52 -123 100 -128 73 19 146 -58 4 -49 182 -135 57 -72 -30 54 11 -67
6078 -67 -117 -142 -65 -111 0 -32 17 15 17 162 188 -64 144 -33 -43 -260 189 -32 -38 -87 37 -111 14 40 112 -32
6104 -32 -13 12 79 4 238 127 -8 298 -12 -113 26 -98 -193 -91 -41 -53 317 172 -25 -225 202 34 -80
6127 -80 -331 168 -49 18 105 196 66 -164 106 41 139 -105 64 -83 -225 164 8 60 -18 -17 -130 -239 110
6150 110 -211 49 70 185 -101 176 -117 -133 75 -153 -185 -185 -229 -65 -145 -171 -94 33 -125 42 -96 71 -54
6173 -54 -26 161 182 -31 74 -273 119 74 -40 215 -79 -24 82 64 35 98 -75 20 35 89 166 148 18 -240
6197 -240 -31 120 132 -1 -65 -64 -110 124 -84 -94 134 182 -173 -76 -269 173 -130 -183 19 -107 -34 88 52 -250
$$ packed form
6034B3J10j16j04J70k07J40j37O1R0l60K61J22j99J79j30J09L44m30K2R3o6q4
6056a09j92K62K07m28L12j75K23k28K01n4J27k04O2n3K31l17J92j29M2Q4m3p8
6078f7n0k5P7m6J11l2M9kKJ45K6k52K08j77j0k17M49k21om9J24j48J25K6P2j44
6104c2J9K5O7p5K34j11j35L06l10j01J39j24r5J02N0j2L70j45j97k00M27j68j14
6127h0k51M99k17O7Q7R1j30k30K70o5R8k44J69j47j42L89j56N2p8Jj13j09L49
6150A10l21K60K1J15k86K77k93j6K08k28l2%m4J64q0k6P7J27j58J67j38J67j25
6173e4K8J87K1k13J05l47L92m5j14K55k94N5J06j8k9O3j73R5J5N4P7j8j30k58
6197b40K09J51J2j33o4Jm6K34k08j0K28M8l55R7j93M42l03n3K02j26P3J22l6l02
$$ plain form
6221 -250 198 -156 -30 -157 -146 3 -267 -217 22 64 270 -16 -49 -94 30 -2 -186 121 135 75 148 263 -35
6244 -35 -57 80 -120 -239 -92 -85 23 -47 89 181 93 183 -64 21 162 -77 -42 -70 134 104 4 -62 -63 285 10
6269 10 -74 233 112 -97 76 11 33 38 -30 168 150 -9 -72 117 -55 -5 97 183 4 47 275 115 -345 -106
6293 -106 221 -37 280 129 70 109 308 125 -151 -131 -3 296 184 -40 -199 -68 -20 151 53 -24 -190 163
6315 163 -78 -8 9 166 90 -120 275 -81 -10 83 -35 -125 -45 -236 97 149 -65 215 -168 83 5 187 48
6338 48 41 -124 -187 -10 7 -28 -4 55 -79 47 9 -108 -373 12 -58 -179 113 -195 -188 -28 51 22 -192 -290 120
6363 120 -141 -1 -139 222 73 -108 -44 88 102 -2 187 -180 5 140 318 -110 -114 -164 9 -114 36 -85
6385 -85 -37 215 -44 -59 91 -225 172 33 57 97 366 21 -121 -37 359 17 -29 7 -15 192 163 -28 86
$$ packed form
6221b50M48l54J26j27J1J49k70N0K39M2K06k86l3m5J24l2j84L07J4o0P3J15k98
6244c5k2J37k00j19J47PJ08p0J36R2q8R0k47Q5J41k39L5k8K04l0j00o6jL48k75
6269A0q4L07j21k09J73o5K2No8J98j8j59o3J89j72N0J02Q6j79M3K28j60m60K39
6293a06L27k58L17j51n9L9J99j83k76K0J28K99j12k24j59J31M8J71r8p7j66L53
6315A63k41P0J7J57p6k10L95l56P1R3j18r0Q0j91L33N2k14K80l83K51p8J82j39
6338D8pj65o3J77J7l5K4N9j34J26l8j17k65L85p0j21K92l08PJ60P9k9k14r8M10
6363A20k61J40j38L61j49j81O4J32J4j04J89l67J85J35J78m28mn0J73j23J50j21
6385h5M8K52k59j5J50l16L97j39K4M0K69l45j42Q4L96l42m6L6k2K07k9j91J14
$$ plain form
6408 86 -48 46 -16 17 227 -29 350 169 198 -33 -44 -22 -217 -174 -87 -17 87 -31 -22 -120 -44 141 64 -96 -40
6433 -40 378 51 23 112 16 -131 -102 -104 17 345 -89 -117 -30 -117 -113 216 99 76 12 34 219 20 149 -101 57
6458 57 131 -87 -335 33 -2 314 83 -105 -231 -191 -153 26 21 -159 66 -126 -17 200 -63 42 -149 -181 225
6481 225 44 45 -19 -192 12 283 -22 -54 5 -219 101 -216 91 202 -133 236 77 -207 -233 229 -39 -82
6503 -82 118 -1 -40 55 62 -79 0 0 51 64 241 -55 -244 -121 215 -169 196 32 -169 261 159 -46 -116 -20
6527 -20 -200 154 64 163 45 185 -22 -117 187 55 53 -88 -127 108 31 64 194 -31 -134 -101 -37 -125 -100 193
6551 193 8 125 -36 26 15 3 64 -200 -230 235 -14 0 -54 5 152 91 -81 -37 37 108 361 74 -13 -52 151
6576 151 45 -104 273 110 13 15 55 5 -73 30 12 -54 216 26 22 -192 -263 -218 141 134 -86 84 263 61 64
$$ packed form
6408H6j34R4o2L3K10k56L79j81K9k31j1K2j95M3Q7P0J04j18Rr8P6J85p7j60N6
6433d0M18l27k8Q9r6j47K9kJ21L28m34k8Q7q7ML29j17k3o4K2J85j99J29k50J58
6458E7P4k18k48L68l5L16k31j88j26M0L8J79nj80K25j92J09K17k63J05j91l2M06
6481B25j81Jo4j73K04K71l05l2N9k24L20l17L07J11l35L69j59k84k6M62k68m3
6503h2K00j19l9R5Pj41P9%N1J3J77k96j89J23L36l84L65j64k01M30j02k05p0R6
6527b0j80L54r0R9j18J40k07r5L04j32kj41l9K35p7L3J30k25j03L3O4q8K5K93
6551A93j85J17j61O2j1j2O1k64l0M65k49J4n4N9J47o1j72M4P4P1K53k87q7l9K03
6576A51j06j49L77j63r7KM0n0p8J03j8o6K70j90mk14p1M5L59pk20J70J79k02L
$$ plain form
6601 64 -194 -73 -76 -90 13 133 128 -75 216 -101 173 -57 -204 150 42 118 16 -185 66 -195 -45 298
6623 298 -152 143 146 -278 -294 -210 90 -30 -197 110 -86 53 21 6 -101 151 112 103 93 109 -115 100 -82 15
6647 15 -49 50 82 -127 -1 48 187 15 -67 118 -127 -174 26 123 101 -228 -232 56 34 33 101 -86 35 -150 95
6672 95 109 -159 -14 106 168 -346 180 -39 -187 30 -60 -99 52 -273 63 51 -122 -28 -50 -104 -283 -82 60
6695 60 200 -46 -267 -41 85 -205 -38 -19 -91 -114 -65 0 -106 20 -117 61 82 -130 -46 203 -16 -75 -99
6718 -99 22 20 4 23 -101 -4 34 -93 166 13 -21 -140 259 36 -75 -55 -156 261 29 -236 199 139 253
6741 253 18 218 277 47 -118 -63 -82 46 52 -197 272 17 -86 119 -142 -76 133 106 -134 -224 14 24 192
6764 192 74 -176 18 -105 155 168 131 230 -110 -107 -31 80 40 115 -23 -43 8 -37 184 276 -70 -7 -44 -151 -236
$$ packed form
6601F4k58J21lj4J03J20nk03K91l17K74k30j47L54j08P6j02k01K51k61J50L43
6623B98m50K95Lm24j6Q4L00j20j67L07j96J39l2j5j07K52l9rj0J6k24K15j82R7
6647A5o4R9L2k09J26M9J39j72q2J85k45m7K00R7k2l29mK88k2jO8j87J21j85K45
6672I5J4k68J45J20O2n14N26k19j48K17r0l9J51l25L36j2j73R4k2n4j79K01J42
6695F0J40k46k21K26J26k90J67J9p2k3M9O5j06J26j37J78K1k12Q4K49k19n9k4
6718i9J21kj6J9j24R7L8j27K59j53l4j19L99k23j11K0j01M17k32k65M35o0J14
6741B53k35K00N9k30j65N5j9J28Ok49M69k55j03K05k61O6K09k7k40r0K38J0J68
6764A92j18k50J94j23K60J3l7R9l40LP6J11m0P5j38k0N1m5K21R2l46O3l7j07q5
$$ plain form
6789 -236 -19 1 -2 -137 -77 44 -149 -32 -103 239 -69 -112 -156 -84 51 -93 46 -202 -80 158 -170 96 169
6812 169 -24 101 -129 49 178 -224 -118 -223 -76 19 -136 118 231 76 -11 -92 -7 187 -253 87 156 108
6834 108 54 197 230 92 71 19 8 -60 -12 113 136 124 -59 94 353 -222 -46 -113 -219 154 -149 -215 4 -29
6858 -29 -134 150 62 117 -70 -97 72 119 253 -60 182 -160 242 -101 -47 -47 -2 285 63 67 74 -108 -30 -1 78
6883 78 -82 -67 116 64 -199 -197 -119 -56 12 148 -40 114 -134 142 52 34 -126 -67 266 -325 62 -126 80 78
6907 78 -42 -79 120 -49 108 -109 222 -209 7 -100 73 117 -272 -69 7 36 -66 174 -82 13 -21 15 -52
6930 -52 176 15 -90 199 50 -42 207 89 107 47 32 240 -143 65 -63 124 -159 -48 83 -220 19 -106
6952 -106 371 72 -157 -13 -164 0 -24 141 52 -147 102 -78 -198 191 -152 74 -139 -48 -224 38 96
$$ packed form
6789b36K17K0lj35O0J21j93J17p1L42l08m3m4P2J35j44J39k48J22K38l28K66P3
6812A69j93J25k30J78J29m02J06j05J47R5j55K54J13j55q7q1Q5J94m40L40O9m8
6834A08n4J43L3j38k1n2j1o8M8J25K3j2j83J53K59n75J76o7j06L73l03o6K19l3
6858b9j05K84q8N5j87k7J69M7J34l13K42l42M02l43N4%M5K87k22MPj82P8K9P9
6883G8j60J5J83n2k63KP8O3O8J36j88J54k48K76r0j8j60N9L33n91L87j88K06k
6907G8j20l7J99j69J57k17L31m31K16j07J73M4l89K03P6K9j02K40k56R5l4L6o7
6930e2K28j61j05K89j49r2K49j18J8o0j5K08l83K08j28J87k83J11J31l03K39j25
6952a06M77k99k29J44j51J64k4J65q9j99K49j80j20L89l43K26k13R1j76K62N8
$$ plain form
6973 96 4 -34 -50 -55 -115 77 -115 2 204 -210 -85 -141 -123 250 -100 86 -247 -104 -49 4 19 53 -44 88 -50
6998 -50 93 -28 -89 -89 234 245 177 108 -109 -5 65 118 -148 -233 191 142 239 128 16 168 70 287 -150 -387
7022 -387 311 -92 -39 90 330 233 -130 13 177 250 241 -20 199 23 156 -74 290 -121 -118 -131 -307 -21 -178
7045 -178 -22 148 -29 115 -51 59 68 -37 108 80 -98 -221 151 -55 -163 51 26 157 320 -165 -194 93
7067 93 29 89 -19 32 -106 261 -73 77 136 -220 -48 -145 -130 -213 58 -115 60 -150 260 135 79 -46 14
7090 14 82 -15 115 -63 347 -73 79 8 -218 -399 20 -119 77 -13 -56 -31 106 106 1 -131 -156 112 172 252
7114 252 160 -103 -107 224 0 -153 51 187 93 52 107 4 259 41 -67 -43 9 35 -229 280 -17 -223 129
7137 129 -215 84 -151 -187 -227 1 -174 171 -106 157 144 -41 63 261 -166 203 110 42 322 122 174 -126
$$ packed form
6973I6r2l8j6no0J92j92J17K02m14J25n6J8L73l50J86l33J43N5N3J5L4r7J32j38
6998e0J43j21o1%L23J1o8o9k17J04P0N3k66q5M24m9R7j11j12J52r8K17m37k37
7022c87O98m03N3J29K40r7l63J43J64P3rk61K19j76J33k30L64m11Lj3j76K86j57
7045a78J56J70j77J44j66J10Rj05J45k8j78j23L72k06j08K14k5J31J63m85k9K87
7067I3o4O0j08N1j38L67l34J50N9l56J72r7J5q3K71j73J75k10M10j25n6j25O0
7090A4O8r7J30j78M10m20J52p1k26j81M19j39J96r0m3K5J37%j05j32k5K68O0Q0
7114B52r2k63mL31k24j53K04J36r4m1N5j03K55k18j08K4N2K6k64N09k97k06L52
7137A29l44K99k35l6m0K28j75L45k77K63j3j85J04J98m27L69r3o8K80k00N2l00
$$ plain form
7159 -126 111 -43 217 56 31 52 251 202 -259 94 27 165 -48 30 -147 -133 195 -190 -377 -169 295 -129
7181 -129 -50 -88 -67 -22 -134 211 77 -80 39 -143 -118 -152 -73 124 -238 -34 144 -62 48 209 254 67 -10
7204 -10 256 -84 58 -260 -2 -104 -197 -101 -50 -118 -150 115 -34 -176 -13 -22 71 -75 -53 94 -122 53 -80
7227 -80 -46 -150 200 209 20 32 -94 127 -48 -146 42 156 21 71 -171 29 -4 -36 -175 255 -176 -203 158
7250 158 48 -194 74 -341 -257 -29 -1 -48 -220 178 -7 213 70 -7 -324 -44 -24 -234 -61 75 419 -267
7272 -267 -271 -41 -42 -25 138 -192 -14 -86 52 -114 -46 58 1 -89 26 -118 -117 -34 92 44 -117 -129 96 7 -38
7297 -38 -15 -113 74 59 -35 96 -104 -84 -86 187 28 -40 97 -234 -88 -204 10 -248 -194 -157 -68 -224 -134 43
7321 43 -91 188 135 -132 -132 127 6 120 177 -160 276 -9 50 30 -69 37 -64 75 -44 55 -142 68 56
$$ packed form
7159a26K37j54K60j61k5K1J99m9m61L53o7J38k13P8j77J4L28l85j87K08M64m24
7181a29P9l8K1M5j12L45j34j57J19j82K5l4P9J97l62K04J78k06J10J61M5j87p7
7204a0K66l40J42l18K58j02r3R6N1o8l2K65j49j42J63rR3j46K2J47k16J75j33
7227h0L4j04L50Rj89J2j26K21j75r8J88J14j35N0k42K00l3l2j39M30m31k7L61
7250A58j10k42K68m15Q4K28K8m7j72L98j85K20j43p7l17K80K0k10J73J36L44o86
7272b67mK30jJ7J63l30J78p2J38j66O8J04n7r0J15j44JQ3J26m8j61j2K25q9m5
7297c8K3r8J87j5r4J31k00K0kK73j59o8J37l31J46j16K14k58N4L7Q9j56R0J77
7321D3j34K79n3k67%K59j21J14N7l37M36k85N9k0r9J06j01J39j19R9j97K10j2
$$ plain form
7344 56 22 -7 -17 10 -22 -144 -69 -80 26 277 -33 178 280 123 -93 7 -277 -46 -225 -221 103 -144 19
7367 19 -164 137 -96 127 40 -65 21 -71 169 79 -33 183 -180 -16 93 17 180 3 138 -59 39 31 -98
7390 -98 -33 -80 -32 152 -51 -93 -49 122 -29 -89 -131 -204 -15 136 37 -68 -27 217 -56 -67 -32 -278 108 185 48
7415 48 -99 -92 96 279 83 -52 -89 -257 204 120 -207 -34 -26 69 -63 -378 41 82 67 250 71 253 -91
7438 -91 132 -234 -37 -107 105 67 -359 278 -229 -145 222 45 -8 14 203 44 31 105 39 20 26 81 -42 -112 -84
7463 -84 -120 -64 145 -50 -88 58 74 51 23 -188 156 -29 -65 13 349 -61 -190 134 -65 215 35 -102 -30
7486 -30 18 2 -87 159 -66 -247 -28 -65 -158 -89 52 -31 -33 -50 4 15 143 59 166 17 57 58 -16 -10 81 304 82
7513 82 -89 -224 -179 -334 -58 -103 92 328 172 128 245 -52 106 -2 -92 233 37 246 -317 200 226 -94
$$ packed form
7344E6l4k9j0K7l2j22P5j1J06K51l10K11J02j57k16J00k84K31j79ML24k47J63
7367A9j83L01k33K23q7j05Q6r2K40r0j12K16l63J64J09p6J63j77J35j97R8qj29
7390i8O5m7M8J84k03m2M4J71j51o0m2p3J89J51r9j05M1K44k73j1L5k46L86P7j37
7415D8j47PJ88J83j96j35l7j68M61q4l27J73QR5j32l15M19M1j5J83j79J82l44
7438i1K23l66J97p0K12l8m26O37n07Q4L67j77n3K2J89j59j3P4o6j9ON5j23p0K8
7463h4l6N6K09j95l8J46J6k3k8k11L44j85l6P8L36m10j29L24j99K80j80j37P2
7486c0M8j6q9K46k25j81K19l7r3O9J41q3kj7N4J1J28q4J07j49M0Jp4OR1K23k22
7513H2j71j35M5j55K76m5J95K36j56m4J17k97J58j08r0L25j96K09n63N17K6l20
$$ plain form
7535 -94 -135 163 -157 -22 96 304 48 -86 -3 208 -136 110 -128 -135 296 202 -193 -91 -16 127 308 9
7557 9 156 -289 62 120 -44 35 -69 -19 -91 -141 76 64 266 10 4 -83 147 -15 106 248 26 -83 195 157
7581 157 -244 -113 -123 29 93 -213 -41 66 241 -65 -266 245 -8 73 -150 66 -34 192 -67 220 -1
7602 -1 51 240 23 -59 -187 -208 175 78 -46 -294 -156 128 200 -15 -71 -95 -163 -359 190 110 69 -276 -33 231
7626 231 85 22 52 -91 -318 -85 26 -31 -208 -63 286 124 274 -98 -260 -99 91 -212 -177 -151 -122 247
7648 247 -152 -281 9 -165 -353 -51 101 51 -11 -35 -20 -84 -89 180 37 -35 -51 -75 -100 -128 161 -41 180 7
7672 7 62 39 -150 -215 25 2 33 181 -173 -13 -101 -49 21 284 125 105 -141 24 142 -56 -54 287 153 22
7696 22 -35 -23 -110 42 188 136 139 232 -161 -3 245 -179 -109 143 52 -189 -90 -163 -91 -8 127 51 -110 -259 58
$$ packed form
7535i4m1K98l20J35J18K08k56j34Q3K11l44K46k38pM31r4l95J02P5J43J81k99
7557IJ47m45L51N8j64P9j04N0p2n0K17j2K02k56oq7K30j62J21J42k22j09K78l8
7581A57m01J31j0J52O4l06J72J07J75l06k01N11k53Q1k23K16j00K26k59K87k21
7602aN2J89k17q2j28k1L83r7j24k48J38K84P2k15n6k4o8j96N49q0m1l45K43K64
7626B31j46o3L0j43k27K33J11n7j77J45L49j62J50l72j62J61J90l03L5K6K9L69
7648B47l99j29K90j74j88L02J52n0o2k4J5o4nK69j43p2j6k4k5k8K89k02K21j73
7672GN5k3j89o5K40k3L1J48l54J60q8N2P0K63j59k0k46J65J18j98KL41j34j31
7696B2n7J2q7J52J46n2LR3l93J58K48m24P0K52r1k41R9p3P2Q3J35p6j61j49L17
$$ plain form
7721 58 -268 72 131 44 127 74 -153 -51 -184 -17 -51 -57 24 -3 248 120 -5 -92 -77 -60 204 -94 -225 -86
7745 -86 263 113 59 85 -199 15 32 -236 -248 -25 477 116 37 109 -152 236 -46 29 -73 32 -150 -60 134
7768 134 -8 -117 -123 270 -38 -205 -30 -116 23 -76 -14 193 42 -24 -127 123 84 -38 15 180 -67 12 -52
7791 -52 -100 56 -223 73 102 47 150 90 277 171 351 153 -57 135 150 -92 -16 -44 -60 40 92 86 -8 -197
7815 -197 188 -112 -273 -268 -99 -40 70 190 71 -17 30 78 -162 99 94 139 335 15 67 -1 -128 62 -29 13
7839 13 -202 184 -167 165 31 -210 207 -59 196 33 282 -72 77 259 -27 106 115 191 164 26 -140 224
7861 224 -113 232 -66 -38 93 -9 -64 -134 7 146 -49 124 -335 -199 -65 -116 -67 -84 20 -15 -108 -99 178
7884 178 -123 109 -1 168 126 211 -7 317 55 35 -339 187 7 -29 149 34 86 149 46 -156 118 62
$$ packed form
7721E8l26L40N9q7Q3n3k27J02j33J67l4oQ1k7K51j28j25q7J5J7K64k98j31J39
7745h6L49j50n4K6k84K14J7k68j2K23N02l61p9P2k61L88k82P5j02J05j82R0J94
7768A34j42j09oL93l08j67J75q6J39r9O2K07j51o6j03K50l9j22N3J65k47P9o4
7791e2m8J56k79K96K9n5J03o0J87j06J80j98k10J92J5k42P6k8j6J00N2or4j89
7815a97L85l00j61NJ69N9J10J20j19q8M7M8k40K61nM5J96l20N2o8j27J90r1M2
7839A3k15L86l51L32j34k41M17k66K55j63K49l54J49J82k86J33RP6k7j38j66L64
7861B24l37L45k98K8J31j02n5p0J41J39j95J73m59J36J34n1M9j7J04l5r3RK77
7884A78l01K32j10J69m2Q5k18L24k62k0l74N26j80l6J78j15N2O3j03k02K74n6
$$ plain form
7906 62 182 158 -47 123 167 -25 -166 202 -146 -40 -53 -59 196 114 269 96 58 -259 -18 40 189 -90 104
7929 104 185 -55 158 -16 -2 149 -135 -83 -49 6 104 25 363 -10 -93 60 278 148 -113 -69 -229 342 -281
7952 -281 -89 141 -102 162 145 -136 -67 160 117 35 -263 50 264 -183 259 152 36 -36 -6 -306 -282 102
7974 102 -85 238 -48 58 -165 142 -76 -267 -10 -119 142 -45 -121 390 -75 -320 -62 -99 181 92 119
7995 119 -155 -3 -69 230 99 112 159 -187 89 -35 -56 242 47 15 -32 -58 -27 228 -47 177 -217 194 202
8018 202 -371 23 8 141 65 -216 2 -34 -201 158 135 208 -27 0 68 110 93 -68 36 219 142 -112 -48 53
8042 53 103 52 -57 1 57 -181 -123 12 -176 219 52 -176 -279 144 203 -145 79 -32 185 72 -260 255
8064 255 275 -247 -221 -175 -12 -113 -126 -118 9 104 222 -8 -37 -88 263 -75 129 138 105 47 -230 119 -63 87
$$ packed form
7906F2J20k4k05J70M4j92j41L68l48J06j3oK55q2J55j73l8l17K41N8J49k79J94
7929A04Q1k40K13j74J4J51k84N2L4N5R8p9L38l73q3J53K18j30k61M4j60N71o23
7952b81J92K30k43K64j7k81O9K27m3q2k98L13K14m47M42j07j16p2L0l00K4L84
7974A02j87L23k86J06k23L07k18j91K57j09K61j87p6N11m65k45K58l7K80q9K7
7995A19k74J52o6K99j31J3M7l46K76j24k1K98j95l2m7k6L1K55k75K24l94M11Q
8018B02n73L94j5J33p6k81K18l6j67L59k3P3k35K7O8M2j7j61J04J83p7k54O4J01
8042E3N0n1j09N8N6k38N8J35j88L95j67k28j03M23N9l48K24j11K17j13l32N15
8064B55K0n22K6M6J63j01j3QJ27R5J18k30k9n1L51l38K04Rl3n8k77L49j82J50
$$ plain form
8088 87 35 168 213 -105 111 25 -230 -362 -23 190 -57 121 43 311 30 -147 92 105 231 -178 156 -2
8110 -2 4 112 16 68 -152 1 95 -75 -116 144 -63 -47 -261 -56 -111 54 78 -32 161 77 -235 17 -98 -19
8134 -19 -32 -143 158 164 189 -63 -274 252 -81 202 6 -78 -218 -17 -226 214 -10 145 -10 39 45 196 10
8157 10 -46 22 24 -100 128 43 -6 14 158 46 113 59 -142 50 57 31 75 -181 40 141 -61 328 -254 -129 -190
8182 -190 -25 176 9 -234 -210 49 127 88 126
$$ packed form
8088H7n2J33M5l18K16q6k55j32L39K13k47J78p8K68k81j77K39J3J26m09L34j58
8110bOJ08r6N2k20J53R4j70m1K60k07J6k14K05n5J65K4j10J93q4l12K52j15P9
8134a9j3j11L01OK5k52k11N26l33K83j96q4j40K01k09M40k24J55j55M9OJ51j86
8157A0n6O8Kj24K28q5m9K0J44j12O7n4k01J92Pk6M4k56K21J01k02L89n82J25o1
8182a90J65K01j67k43K4K59P8l9L8
8191A26
$$ Imaginary data points
##PAGE= N=2
##DATA TABLE= (X++(I..I)), XYDATA
$$ plain form
0 0 0 0 0 0 0 0 0 0 0 0 0 0 0 0 0 0 8 -8 8 -8 8 -9 16 -16 16 -24 24 -31 32 -40 44 -48 56 -64 71 -79 90 -100
38 -100 110 -125 138 -153 169 -186 206 -227 251 -277 303 -335 369 -407 449 -496 549 -609 677 -758
58 -758 852 -965 1102 -1275 1496 -1797 2219 -2862 3949 -6101 11934 -57690 -146483 72776
72 72776 54378 -101545 -3868 80478 -53631 -38209 81937 7342 -71363 16762 27034 -36260
84 -36260 1730 25582 -33860 -15576 27597 -25205 -45612 22347 23836 -30980 -8683 37960
96 37960 10578 -17833 5993 6363 -35638 -26126 25756 8478 -38168 -1047 38989 -6752 -19046
109 -19046 30953 4263 -39841 17530 41342 -24337 -13219 36679 -14565 -41185 26122 20769
121 20769 -37617 -640 39645 2229 2777 32294 -2497 -25114 10789 11513 -17455 -5641 10329
$$ packed form
0@%%%%%%%%%%%%%%%%Qj6J6j6J6j7K5l2L2m0M8n5O3p2Q4r2J04j20J35j50J69j90
38a00K10k35K63k91L22l55L92m33M78n28N80o38P04p76Q56r45J045j158J286j435
58g58J610j817K067k377K771l293M016n081O811j0050J8035o9624q8793K19259
72G2776j8398j55923R7677Q4346j34109J5422J20146p4595p8705Q8125J0272o3294
84c6260L7990K3852n9442J8284M3173n2802k0407O7959J489n4816K2297M6643
96C7960k7382k8411K3826L70m2001R512N1882j7278m6646L7121M0036m5741j2294
109a9046M9999k6690m4104N7371K3812o5679J1118M9898n1244k6620O7307n353
121B0769n8386L6977M0285l7416N48K9517l4791k2617L5903P24k8968J1814J5970
$$ plain form
134 10329 1261 3599 11678 3822 -2622 1916 8894 6964 -5158 3752 25170 1363 -29140 335
148 335 16535 -19658 -13477 18519 -6046 -9209 38846 17243 -32436 131 18990 -21703 -9535
161 -9535 15280 -24552 -17097 35727 209 -38824 13662 20167 -30784 -2061 30795 -14199 -15164
174 -15164 26969 -4728 -35199 3974 6257 -27414 -7576 12749 -5746 3949 19149 -7274
186 -7274 -13295 9769 995 -15367 -3408 346 -5055 2933 1450 -7499 -1112 1617 -3666 2951
200 2951 5252 1849 11021 8611 -7598 -2348 4560 -9014 -8091 2290 -4345 3584 21472 3549
214 3549 -9188 14922 11371 -12252 1970 10078 -10723 1507 20065 -7548 -13867 14864 4518
227 4518 -15310 7613 12901 -5341 11489 19061 -9488 -6911 13455 -5392 -17356 2248 1002
$$ packed form
134A0329r068K338Q079p856o444M538O978j930j2122Q910K1418k3807l0503K9475
148C35J6200l6193O181L1996k4565l163M8055k1603m9679L2567J8859m0693J2168
161i535K4815l9832P455N2824l5518l9033N2486O505n0951K8723L2856m4994r65
174a5164M2133l1697l0471L9173K283l3671J9838K0325j8495R695J5200k6423
186g274o021K3064q774j6362J1959L754n401P988j483q949O387K729n283O617
200B951K301l403R172k410j6209N250O908j3574R23J0381o635P929J7888j7923
214C549j2737K4110l551k3623J4222Q108k0801J2230J8558k7613o319K8731j0346
227D518j9828K2923N288j8242J6830P572k8549K577K0366j8847j1964J9604j246
$$ plain form
240 1002 -5088 11345 7121 -8400 5452 10332 -7855 -5126 3510 -5152 592 7887 -9185 -10574
254 -10574 5159 -3488 -12366 894 15 -3612 11977 6878 -11400 706 6979 -13669 -11533 716
268 716 -10903 -5707 12170 -3600 -12101 11386 6020 -14960 420 6887 -10464 897 12804
281 12804 -10981 -11490 11506 -2628 -17034 2542 4363 -5575 10342 11559 -7995 2285 13645
294 13645 -6957 -11222 4458 -2354 -5119 9593 2968 -7515 7537 10779 -5195 -1671 7853
307 7853 1680 3542 8048 -554 -2138 4490 -660 -5621 -2099 87 5489 9238 629 1271 12566
322 12566 3243 -7416 2707 -443 -10576 5802 10560 -12460 -4647 16830 -2071 -12434 9204
335 9204 2554 -11796 10405 11476 -14977 -1593 14603 -12098 -16287 8848 -1921 -14178 9044
$$ packed form
240A002o090J6433m224j5521J3852M880j8187K729Q636q662N744P295j7072j389
254a0574J5733q647q878J3260q79l627J5589n099j8278J2106O273k0648K136J2249
268G16j1619N196J7877j5770q501K3487n366k0980J5380O467j7351J1361J1907
281A2804k3785n09K2996j4134j4406J9576J821r938J5917J217j9554J0280J1360
294A3645k0602m265J5680o812k765J4712o625j0483J5052L242j5974L524R524
307G853o173J862M506q602j584O628n150m961L522K186N402L749q609O42J1295
322A2566r323j0659J0123l150j0133J6378M758k3020P813K1477j8901j0363K1638
335I204o650j4350K2201J071k6453J3384J6196k6701m189K5135j0769j2257K3222
$$ plain form
348 9044 7979 -12851 3615 15690 -10057 -14455 5176 154 -9532 271 735 -7827 -1551 4342
362 4342 -2862 -7174 -2911 3933 3659 -3416 -354 6799 -3574 -9682 2190 -1650 -12611 3484
376 3484 9003 -12184 -1801 21553 -713 -15542 10310 5349 -15480 7723 14587 -17673 -6456
389 -6456 23086 -2778 -16916 12558 6050 -15334 10372 19378 -11102 -2516 20855 -4092 -16655
402 -16655 11305 8679 -14826 -948 13444 -750 -1307 11975 2497 -9471 1513 10419 889
415 889 -5685 414 4697 -363 -432 2960 -4030 -7951 6014 6960 -7106 1856 13327 -6329 -10506
430 -10506 11073 911 -17909 3200 8683 -16578 -2923 21622 -5064 -19033 9372 6611
442 6611 -13870 3797 8253 -16751 -4201 17261 -6542 -16149 7052 1138 -14534 4019 10730
$$ packed form
348I044j065k0830J6466J2075k5747m398J9631n022r686R803M64q562O276N893
362D342p204m312M263O844k74p075L062P153j0373o108J1872l840j0961J6095
376C484N519k1187J0383K3354k2266j4829K5852m961k0829K3203O864l2260J1217
389f456K9542k5864j4138K9474o508k1384K5706R006l0480Q586K3371k4947j2563
402a6655K7960k626k3505J3878J4392j4194n57J3282r478j1968J0984Q906r530
415H89o574O099M283n060o9L392o990l921J3965R46j4066Q962J1471j9656m177
430a0506K1579j0162j8820K1109N483k5261J3655K4545k6686j3969K8405k761
442F611k0481J7667M456k5004J2550K1462k3803r607K3201n914j5672J8553O711
$$ plain form
455 10730 -8961 -3556 10556 -2619 -9840 3309 3033 -7591 -5801 1820 3716 1467 -1454 -1612
469 -1612 -1163 -978 4873 4856 -6328 -4069 9452 2960 -6190 3939 1638 -10613 3546 12465 -6461
484 -6461 -4307 15353 1694 -10113 9972 8197 -11929 717 10056 -8080 -785 17056 -2620
497 -2620 -13515 10480 9549 -9632 1989 10656 -7109 -3634 14014 2410 -11271 507 6061
510 6061 -3527 -3038 3334 2359 -440 155 1700 1218 -1207 -854 -411 -4568 -2381 5793 19 -7407 933
527 933 1348 -6734 2088 6061 -10723 -6372 13023 611 -13372 3965 4604 -13127 -1585 9268
541 9268 -9259 -7256 11537 -1155 -12066 6561 5953 -11465 -1457 7125 -7257 -2949 9886
554 9886 -3016 -10088 5003 5073 -6189 -607 3066 -3250 1461 5998 -1664 -3275 2298 1776 -1178
$$ packed form
455A0730j9691N405J4112j3175p221J3149k76j0624J790P621J896k249k921j58
469a612M49J85N851j7j1184K259J3521o492r150J0129k301j2251J4159Q919j8926
484f461K154J9660j3659j1807K0085j775k0126J2646R339j8136P295J7841j9676
497b620j0895K3995r31j9181J1621Q667j7765L475J7648j1604j3681J1778N554
510F061r588M89O372r75k799N95J545m82k425L53M43m157K187Q174n774p426Q340
527I33M15q082Q822L973j6784M351J9395j2412j3983J7337O39j7731J1542J0853
541I268j8527K003J8793j2692j0911J8627o08j7418J0008Q582j4382M308J2835
554I886j2902p072J5091P0j1262N582L673o316M711M537p662j611N573n22k954
$$ plain form
569 -1178 -669 610 2324 1205 -988 2849 3380 -2099 1109 5521 -3047 -3143 8730 3390 -7066 2390
585 2390 7707 -3534 -796 5971 -2899 -1981 8479 1031 -5976 5148 3695 -5538 2494 4603 -6629
600 -6629 350 9200 -3937 -6714 7145 2206 -7246 1781 3430 -5743 64 5159 -4187 -3717 4115
615 4115 31 -4810 -463 -428 -1393 648 -1830 -2927 447 -461 -2429 145 -2184 -4272 2895 1966
631 1966 -6346 -1605 3679 -3284 -2967 2696 -3611 -4039 4963 -315 -6668 2663 3165 -5316 541 3981
647 3981 -5379 -475 7315 -4311 -5820 7931 2036 -7845 3520 5307 -6694 974 9624 -4020
661 -4020 -6199 7446 4444 -5773 654 4508 -1158 73 2825 109 693 2488 786 1161 1641
676 1641 -410 1835 3694 -1163 -2078 2678 2511 -489 -340 -575 1781 3677 -1236 -2634 3832 1416
$$ packed form
569a178N09J279J714j119k193L837N31n479L208M412q568r6J1873n340j0456R456
585B390N317j1241K738O767q870R18J0460p448p007J1124j453r233Q032K109j1232
600f629O979Q850j3137k777J3859m939r452R027J649r173N807N095r346M70P832
615D115m084m841M347L5r65K041k478j097L374r08j968K574k329k088P167r29
631A966q312M741N284o963L17N663o307m28R002n278o353R331N02q481N857L440
647C981r360M904P790j1626j509J3751n895r881J1365J787j2001P668Q650j3644
661d020k179J3645l002j0217O427L854n666J231K752k716N84J795j702L75M80
676A641k051K245J859m857r15M756j67l000J49k35K356J896m913j398O466k416
$$ plain form
692 1416 -3691 2954 2960 -6602 -243 6852 -4467 -5579 5830 924 -6571 3462 3356 -7351 750
707 750 6524 -7025 -5569 7044 -1112 -8448 2621 2455 -6113 820 4036 -5972 -2449 5149 -1876
722 -1876 -4909 2357 -193 -4429 1627 641 -5954 -1041 3851 -1148 -3241 958 1587 -98 -647 -831
738 -831 -24 -417 -1454 583 155 -2103 1234 3428 -2194 -1569 4722 95 -2457 4393 1728 -4960
754 -4960 4470 6138 -7114 -3173 9211 -480 -6521 6880 4858 -5854 3250 8270 -4473 -3010
768 -3010 6807 -162 -4670 4458 2237 -4263 2604 3636 -4156 83 5947 -1022 -3609 3434 3392 -1986
784 -1986 -875 580 -1765 -2020 312 1289 -1341 -2688 2197 3583 -2622 -2628 2711 -1502 -4857 2151
800 2151 1199 -6200 186 4360 -6372 -4124 7336 -1050 -8222 4075 4073 -6659 599 5844 -7333
$$ packed form
692A416n107O645Or562O359P095j1319j112J1409m906p495J0033j06j0707Q101
707G50N774j3549J456J2613q156p336J1069j66q568O933L216j0008L523P598p025
722a876l033P266k550m236O056r86o595M913M892m999k093M199O29j685n49j84
738h31Q07l93j037K037m28k258L337K194n622O25O291m627k552O850k665o688
754d960R430J668j3252L941J2384r691o041J3401k022j0712R104N020j2743J463
768c010R817o969m508R128k221o500O867J032p792M239N864o969k587P043m2n378
784a986J111J455k345k55K332R77k630j347M885J386o205oN339m213l355P008
800B151r52p399O386M174j0732K248J1460q386p172J2297kj0732P258N245j3177
$$ plain form
815 -7333 -6532 6548 -544 -7821 1974 2936 -4795 1625 5490 -3869 -3406 4502 -154 -4284 2200 2437
831 2437 -3054 -1096 1990 263 -1039 369 1152 538 453 2953 3876 -1443 -2766 2785 1544 -3051
847 -3051 992 2206 -2830 1513 6721 -766 -2600 5230 1711 -4314 3841 5041 -4331 -214 5816
862 5816 -2940 -3412 5818 593 -6224 2765 5987 -1851 875 4189 -2553 -2695 3570 -527 -5026 -446
878 -446 1478 -1469 659 1334 -1322 -1015 1050 102 -1096 -236 -30 -244 -1635 -2312 428 -525 -3897
895 -3897 -1316 791 -1415 762 3524 -2279 -2993 3097 -15 -5117 -293 239 -4949 248 4239 -4280
911 -4280 -3002 5317 -390 -4741 3669 3005 -4691 1165 4364 -4326 -2946 4190 -2342 -5187 3332
926 3332 2860 -2192 2713 3809 -2389 753 4496 -2019 -3093 2461 717 -1736 1831 2147 -1126 827
$$ packed form
815g333Q01J3080p092p277R795R62p731O420L865r359M63P908m656m130O484K37
831B437n491J958L086j727j302J408P83o14q5K500R23n319j323N551j241m595
847c051M043J214n036M343N208p487j834P830l519o025Q155J200r372M117O030
862E816q756m72R230n225o817Q989L222p838K726L314o742j42O265m097m499M580
878d46J924k947K128O75k656L07K065r48j198Q60K06k14j391o77K740r53l372
895c897K581K107k206K177K762n803p14O090l112n102M824N32n188N197L991q519
911d280J278Q319n707m351Q410o64p696N856L199q690J380P136o532k845Q519
926C332m72n052M905J096o198L142L743o515j074N554j744k453L567L16l273J953
$$ plain form
942 827 2436 263 245 1870 2093 1663 164 187 1827 -687 -2584 366 732 -1611 2047 4136 -1349
959 -1349 -167 4797 -139 -4214 2100 1023 -4532 534 3406 -3839 -2089 4561 -1484 -4609 2991
974 2991 2126 -3360 1748 3291 -3615 -1785 2678 -3082 -5009 1025 205 -3213 541 2543 -843 -841
990 -841 1586 -985 -2644 -513 753 -1255 -2047 -1015 1114 -1336 -2410 534 131 -1667 1747 3458
1006 3458 -1763 -1298 3638 -354 -4587 569 600 -4165 571 4156 -1524 -381 4932 -335 -2873 3929
1022 3929 1788 -3950 1334 3466 -2950 -616 4453 -1971 -4083 3263 2822 -1387 2716 3439 -417
1037 -417 896 2509 -1373 -1976 796 -710 -1131 1475 1267 390 1172 958 -279 663 291 315 784 -745
1055 -745 -714 1515 -549 -3798 -774 871 -1797 160 2344 -693 -456 3013 -465 -3310 -10 -855
$$ packed form
942H27J609k173j8J625K23m30j499K3J640k514j897K950L66k343L658K089n485
959a349J182M964m936m075O314j077n555N066K872p245J750O650o045l125P600
974B991q65n486N108J543o906J830M463n760j927O034q20l418L754K002l386K
990h41K427k571j659K131J266k008p92J032K129k450j074K944m03j798L414J711
1006C458n221M65M936l992m233N156L1m765M736L585n680J143N313n267k538O802
1022C929k141n738N284K132o416K334N069o424k112P346m41m209M103P23l856
1037d17J313J613l882o03K772j506m21K606k08q77P82k14j237R42l72K4M69j529
1055g45L1K229k064l249L024J645k668J957K184l037K37L469l478k845L300q45
$$ plain form
1071 -855 -4141 250 1477 -3093 -402 2953 -1961 -2611 2558 625 -2724 1004 1261 -2363 708 1482
1087 1482 -4001 -3192 1364 -1352 -2083 2015 1476 -1159 1792 2437 -1259 -1669 -65 -391 -776 -82 332
1104 332 691 440 -752 414 1526 -287 -120 1842 1046 551 1761 -267 -1835 560 -832 -2078
1120 -2078 2112 1750 -1728 2408 5250 -838 -1719 3676 714 -4031 1155 2277 -2515 356 3303
1135 3303 -1855 -1330 2976 -205 -1896 3056 1903 -1953 1747 2296 -3275 -2647 1378 -1083 -3121 393
1151 393 1336 41 966 889 -14 -412 -572 -777 -985 -1196 -975 94 -1109 -1641 -67 -1117 -2063 987
1169 987 1212 -1888 817 2835 -1649 -3049 1459 -813 -4605 -459 1195 -2371 215 2875 -1089
1184 -1089 -932 3002 -805 -2699 1768 640 -2779 1065 2723 -3060 -2062 2559 2 -2763 1750
$$ packed form
1071h55l286M391J227m570K691L355m914o50N169j933l349L728K57l624L071P74
1087A482n483Q09M556k716p31M098n39k635K951O45l696m10J604l26l85O94M14
1104C32L59k51j192J166J112j813J67J962p96m95J210k028j568K395j392j246
1120b078M190l62l478M136K842o088q81N395k962m745N186J122m792K871K947
1135C303n158N25M306l181j691M952j153l856L700N49n571O28M025k461k038L514
1151C93R43j295R25p7r03l98j60k05k08k11K21J069j203n32J574j050r46L050
1169I87K25l100K705K018m484j400M508k272l792M146J654l566K586K660l964
1184a089J57L934l807j894M467j128l419L844J658n783R98M621k557k765M513
$$ plain form
1199 1750 2790 31 1135 2118 428 -819 -132 -838 -507 -31 380 1501 1285 409 1011 1037 265 821
1217 821 763 -1060 1069 2637 -884 -1602 1496 -341 -2488 1428 2171 -1912 916 4017 -197 -1072
1233 -1072 2114 -1103 -3605 863 710 -2780 653 2468 -2000 -1144 3028 -552 -3162 1567 1376 -2240
1249 -2240 -130 1873 -1860 -2479 35 -1297 -2318 -68 460 -338 425 1071 593 -480 -1440 -1041 -1004
1266 -1004 -1338 -467 525 -1350 -1355 1335 503 -1619 0 781 -1047 921 2189 -1430 -1120 1975 -1176
1283 -1176 -2969 1210 590 -2454 1622 3856 -1343 -435 4109 136 -3489 1207 1397 -2143 382 2081
1299 2081 -1018 -478 2420 234 -1384 1348 1351 -79 1541 1625 -844 -309 595 -592 -1299 -646 465
1316 465 502 782 996 1403 370 -779 505 739 -1623 -142 1688 -1044 -996 1657 -529 -2537 514
$$ packed form
1199A750J040k759J104R83j690j247O87p06L31M76M11J121k16q76O02K6p72N56
1217H21n8j823K129J568l521p18L098j837k147L916P43m083K828L101m214q75
1233a072L186l217k502M468j53l490L433J815m468Q56M172l580k610M729j91l616
1249b240K110K003l733o19K514j332j021K250N28p98P63O46m78j073r60L99L7
1266a004l34Q71R92j875nK690q32k122J619P81j828J968J268l619L10L095l151
1283a176j793M179o20l044M076K234n199R08M544l973l625M696J90l540K525J699
1299B081l099N40K898k186j618K732Lj430J620Q4k469N35R04j187p07O53J111
1316D65L7K80K14M07j033j149J284K34k362J481J830k732M8K653k186k008L051
$$ plain form
1333 514 851 -2076 527 2677 -1234 -963 2232 -1308 -3737 671 -263 -3503 17 2015 -1653 -819
1349 -819 2633 -554 -2587 750 255 -2243 -342 1035 -1283 -907 573 -1214 -1395 126 230 -334
1365 -334 671 1009 755 325 -185 -743 -683 -981 98 826 -589 -150 2015 507 -818 1502 804 -1717
1383 -1717 864 2238 -673 -653 2238 -64 -2214 1283 1075 -1899 815 2637 -271 618 2935 -259
1399 -259 -1999 1218 483 -2002 353 1550 -1012 62 2154 -21 -962 391 431 -508 555 857 -380
1416 -380 -132 -187 -492 -461 -909 -419 35 -51 410 1146 329 -903 -220 -216 -1393 -818 456 -1538 -1113 1563
1436 1563 251 -1655 697 168 -2061 403 1520 -1221 -860 1196 -705 -1961 759 -346 -2541
1451 -2541 186 1567 -776 615 1948 -814 -1216 1394 318 -1501 -2 431 -562 449 1332 -394
$$ packed form
1333E14L37k927K603K150l911K71L195l540k429M408r34l240L520J998l668Q34
1349h19L452l187k033L337m95k498J901J377k318L76J480j787j81J521J04n64
1365c34J005L38k54m30n10n58O0k98J079P28j415M39K165j508j325K320o98k521
1383a717K581J374k911K0K891k302k150L497k08k974K714J822k908Q89K317l194
1399b59j740L217p35k485K355J197k562J074K092k175r41J353M0r39J063L02j237
1416c80K48n5l05L1m48M90M54q6M61P36q17j232O83Mj177N75J274j994M25K676
1436A563j312j906K352n29k229K464J117k741L61K056j901j256K720j105k195
1451b541K727J381k343J391J333k762m02K610j076j819J499M33r93J011Q83j726
$$ plain form
1467 -394 -420 450 -282 21 1104 312 323 570 436 88 120 -477 -866 315 103 416 1715 1012 -330 1067
1487 1067 993 -838 252 876 -1029 -404 1910 139 -1245 916 152 -1322 818 1438 -1130 168
1503 168 1787 -585 -1154 1269 -268 -2325 273 913 -1366 105 1292 -646 -975 1160 -117 -1150
1519 -1150 -365 -293 -650 175 512 -898 -683 -495 -514 -712 -237 -57 91 28 -175 373 -380 -1413 -339 26
1539 26 -1410 -284 1318 -357 -1066 1124 463 -1649 358 765 -1241 -174 1796 -529 -1097 1515
1555 1515 103 -1632 1018 1360 -1228 426 2424 -235 -618 1497 301 -1474 428 707 -768 449
1571 449 1244 -217 170 942 532 -355 384 677 258 473 580 465 -45 -396 287 536 -710 165 1221
1590 1221 128 -603 1329 329 -1193 311 223 -1234 -237 1370 -502 -863 1463 -51 -1865 640
$$ packed form
1467c94k6Q70p32L03J083p92J1K47j34l48L2n97l89J181k12L13J299p03j342J397
1487A067p4j831J090O24j905O25K314j771j384K161p64j474K140O20k568J298
1503A68J619k372n69K423j537k057K598O40k279J471J187j938l29K135j277j033
1519a150P85P2l57Q25L37j410K15J88j9j98M75J80J48o3k03N48p53j033J074L65
1539B6j436J126J602j675p09K190o61k112K007M07k006J067J970k325n68K612
1555A515j412j735K650L42k588J654J998k659l83K115j196j775J902K79j475J217
1571D49P95j461L87P72m10q87P39K93m19K15J07j15n10l51O83K49j246Q75J056
1590A221j093p31J932j000j522J504q8j457R97J607j872l61K326j514j814K505
$$ plain form
1606 640 678 -1641 -186 1504 -1168 -1279 941 -471 -1674 199 -32 -1881 -67 1128 -863 -815 974
1623 974 -484 -1225 257 -205 -996 -34 567 -316 -496 19 -390 -228 -279 46 240 70 27 582 150 -646
1643 -646 -60 196 -940 -161 1181 -154 -132 1407 369 -940 693 750 -1371 -104 1502 -469 -421
1660 -421 1739 371 -1229 943 777 -980 492 1801 -288 -36 1444 -92 -914 851 417 -660
1676 -660 278 1026 -448 -166 1032 -310 -585 104 197 39 -100 21 358 -289 -397 54 -95 -796 -272
1695 -272 654 -578 -693 749 -262 -1139 278 624 -1498 -249 511 -1015 -976 976 -193 -1521 355
1712 355 379 -1392 8 1046 -1201 -862 1415 26 -1531 703 552 -1348 3 792 -295 -460 474
1729 474 -117 -526 40 209 -392 203 283 -16 125 142 44 28 0 387 466 83 -236 984 397 -350 702
$$ packed form
1606F40L8k319J455J690k672j11K220j412j203J873k31j849J814J195j991M8J789
1623I74j458p41J482m62p91R62O01q83j80N15m09J62n1L25J94j70m3N55m32p96
1643f46N86K56j136P79J342j335K2J539j038j309J633N7k121J267J606j971M8
1660d21K160j368j600K172j66j757J472J309k089K52J480j536q22J765m34j077
1676f60R38P48j474K82J198j342k75O89R3j58j39J21L37o47j08M51j49p01N24
1695b72R26j232j15J442j011q77J417L46k122J249P60j526L9J952j169j328J876
1712C55K4j771J400J038k247L39K277j389j557K234j51j900J351P89j087j65R34
1729D74n91m09N66J69o01N95Q0k99J41J7r8j6k8L87P9l83l19J220n87p47J052
$$ plain form
1750 702 605 -584 9 1426 -192 -229 1104 228 -770 992 892 -1147 337 1477 -353 -430 1521 14
1768 14 -1076 448 1095 -1113 -49 442 -733 -206 725 -85 -463 261 -374 -767 192 390 -671 -298
1786 -298 374 -353 -192 17 -163 -355 -561 -17 271 -28 -993 22 326 -691 -522 219 -710 -1079 556
1805 556 333 -808 66 224 -899 66 879 -641 -757 721 -449 -675 905 324 -1367 75 815
1822 815 -473 -186 1086 -281 -741 918 224 -521 393 297 -626 89 1143 105 -489 972 440 -14
1840 -14 641 703 -22 299 337 277 166 267 -354 -135 417 414 414 484 -242 344 686 -247 21 318 -701 -257 953
1863 953 3 -587 353 311 -747 393 758 -579 -592 712 -366 -744 651 -280 -1038 274 183 -786 -136
1882 -136 626 -699 -389 892 40 -928 -201 81 -431 -299 175 -366 -227 -191 -135 287 28 -151 -247 201
$$ packed form
1750G02r7j189N93J417j618l7J333q76r98J762j00k039J484J140j830p7J951j507
1768A4j090J524O47k208J064M91j175N27R31q10l78P24o35l93R59J98j061L73
1786b98O72p27J61K09j80j92k06N44K88k99r65J015L04j017J69P41r29l69J635
1805E56k23j141Q74J58j123R65Q13j520j16J478j170k26J580n81j691J442P40
1822H15j288K87J272j367m60J659o94p45R14r6r23P15J054j038n94J461n32m54
1840a4O55O2p25L21L8o0j11J01o21K19N52l%P0p26N86L42r33K68K97j019M44J210
1863I53r50n90R40m2j058J140L65j337j3J304j078l78J395r31p58J312r1r69O50
1882a36P62j325L10J281q52r68P27K82n12J32M74n41J39L6N6M22k59j79r6M48
$$ plain form
1902 201 -170 -25 -123 -571 -422 131 -280 -335 588 -139 -795 585 820 -384 232 586 -754 -207 845
1921 845 -249 -551 617 305 -818 599 985 -428 -56 1061 58 -248 929 177 -804 418 594
1938 594 -424 14 564 8 93 755 386 99 116 404 -86 -201 69 -188 -257 -294 22 -179 130 101 130 -107
1960 -107 -466 360 -77 -775 -164 183 -616 -157 363 -435 -1002 442 -126 -936 162 717 -864 -23 758
1979 758 -860 -842 325 -179 -787 237 174 -638 -364 739 -633 -338 348 -97 -672 -94 62 -559 -298
1998 -298 168 -178 -229 166 -73 129 164 -1 350 348 -50 -103 81 -150 -54 275 -9 99 846 134 -187 630
2020 630 600 -398 469 740 -350 -207 620 -515 -395 608 263 -361 610 944 -405 335 1194 -200 -449
2039 -449 779 13 -575 230 560 -628 262 428 -196 -128 641 84 -208 81 98 -51 -84 -49 -232 -441 -257
$$ packed form
1902B01l71J45r8m48J49N53m11n5R23p27o56J380K35j204O16L54j340N47J052
1921H45j094l02J168l12j123J417L86j413L72J117j003l06J177p52r81J222J76
1938E94j018M38N50n56Q5O62l69k87J7K88m90j15K70k57o9l7L16k01L09k9K9k37
1960a07l59Q26m37o98O11L47p99M59N20p98n67J444n68q10J098N55j581Q41P81
1979G58j618J8J167n04o08J024o3q12K74J103j372K95O86m45n75N78J56o21K61
1998b98M66l46n1L95k39K02L5j65L51kl98n3J84k31R6L29k84J08P47p12l21Q17
2020F30l0r98Q67K71j090J43Q27j135J20J003l45o24R71L34j349P40Q59j394k49
2039d49J228p66n88Q05L30j188Q90J66o24O8P69n57k92K89J7j49l3L5j83k09J84
$$ plain form
2060 -257 -143 188 -24 -298 217 -313 -592 -9 -233 -712 -213 392 -959 -187 529 -454 -365 288 182 -667
2080 -667 143 572 -433 -32 609 -630 -731 336 84 -424 514 609 -107 282 1025 161 -236 501 -46
2099 -46 -492 180 365 -234 96 262 -35 170 236 13 405 295 441 344 218 -27 -187 -93 -602 126 8
2120 8 -81 222 939 192 13 694 -220 -463 514 578 -667 -159 385 -205 -547 614 62 -742 517 583 -204
2141 -204 202 380 -545 -317 11 -503 -831 -103 -353 -443 511 294 -573 -401 93 -201 -281 -70 -300 -350 -67
2162 -67 -144 -426 -663 -374 -82 18 64 149 397 -65 -246 191 -88 -505 -380 223 -455 -32 609 -9 -383
2183 -383 595 203 -374 388 351 -353 166 571 -98 -485 149 -124 -408 620 336 81 599 486 -92 61
2203 61 329 -246 -494 4 -268 -81 289 198 -78 62 -62 323 204 213 111 -8 -39 -301 116 -189 -452 74
$$ packed form
2060b57J14L31k12k74N15n30k79N83k24m79M99O05j351P72P16r83Q9O53j06q49
2080f67Q10M29j005M01O41j239j01J067k52n08R38R5p16L89P43q64l97P37n47
2099d6m46O72J85n99L30J66k97K05O6k23L92j10J46r7j26k45j60R4n09P28j18
2120Hq9L03P17p47j79O81r14k43R77O4j245N08N44n90l42J161n52q04J259O6p87
2141b04M06J78r25K28L28n14l28P28k50r0R54k17q67J72M94k94q0K11k30n0K83
2162f7p7k82k37K89K92J00M6Q5K48m62j81M37k79m17J25O03o78M23O41o18l74
2183c83R78l92n77P62l7p04N19M05o69l87O34k73k84J028k84k55N18j13n78J53
2203F1K68n75k48M98k72J87L70r1k76J40j24L85j19Rj02j19l1k62M17l05k63N26
$$ plain form
2225 74 172 -192 164 342 23 -146 437 277 -746 -184 -261 -211 -163 53 -225 -216 212 -230 -229 367 39 -623 293
2248 293 380 22 -392 282 -578 -530 279 193 -251 -131 285 -100 151 243 -240 -562 66 -6 -174 279 -214 -219
2270 -219 -19 101 -37 28 116 161 220 -44 282 487 -90 -511 -14 31 -224 166 507 -193 69 900 254 10
2292 10 169 94 -274 127 575 -340 -2 636 -103 6 315 173 -198 621 733 -141 -78 192 -439 74 -5
2313 -5 -232 -546 214 335 250 136 182 -71 -355 210 65 229 -206 -174 -252 -175 -285 -30 158 -512 -162 22
2335 22 -81 -233 130 -133 -789 222 7 -514 -91 219 -270 -335 364 -111 -218 133 230 -289 62 27 -109
2356 -109 -256 142 28 -499 231 38 -452 132 256 58 -38 157 -6 -429 24 -130 -247 127 144 27 184
2377 184 232 140 201 -213 195 264 338 -54 129 288 -59 -7 170 2 226 288 -237 154 441 149 -135 302
$$ packed form
2225G4R8l64L56J78l19j69N83j60j023N62p7N0M8K16k78RM28m42JN96l28o62R16
2248B93Q7l58m14O74q60M8Q09q6m44J20M16l85K51R2m83l22O28p2j68M53m93n
2270b19K00J20j38O5Q8M5N9k64L26K05n77m21M97M5k55L90L41p00K62Q31o46k44
2292A0J59p5l68M01M48r15L38O38p39J09L09j42l71Q19J12q74O3K70o31N13p9
2313ek27l14P60J21q5j14M6k53k84N65j45J64m35L2p8P7j10K55J88o70L50J84
2335B2j03j52L63k63o56J011k15n21M23L10m89o5O99m75j07L51R7n19L51l5j36
2356a09j47L98j14n27P30j93m90N84J24j98r6J95j63m23M53j54j17L74J7j17J57
2377A84M8r2O1m14M08O9P4l92J83J59l47N2J77j68K24O2n25L91K87k92k84M37
$$ plain form
2399 302 161 -472 72 78 -209 -188 193 52 -333 118 -249 -268 -180 187 -115 -110 -56 -178 -357 -39 -223 -475 76
2422 76 6 -93 513 58 -124 -7 -273 -103 -287 -335 -26 16 -283 -306 57 131 -283 -102 161 -28 50 322 -181
2445 -181 -268 3 -102 -436 -438 97 -149 382 529 177 -260 71 -144 -607 109 254 -444 -317 344 -46 -84
2466 -84 211 -109 -233 85 322 -6 178 425 19 -148 155 -254 -34 -88 266 210 67 206 -15 257 204
2487 204 3 81 -24 -50 266 56 -406 258 37 -114 22 332 -72 115 260 -61 -27 264 86 -546 -194
2508 -194 168 -387 -160 285 -185 -305 -18 -189 -184 129 258 -319 -151 61 -285 -543 96 -384 -205 -41 -191
2529 -191 -122 27 118 -248 -29 29 -175 -165 -124 -126 -95 20 141 38 305 -248 -334 68 38 -177 266 -113 40
2552 40 28 45 -312 181 509 63 -184 522 180 204 396 24 -344 249 108 34 63 228 151 -6 506 -70
$$ packed form
2399C02j41o33N44Ok87K1L81j41l85M51l67j9Q8L67l02NN4j22j79L18j84k52N51
2422G6p0r9O06m55j82J17k66J70j84m8L09M2k99k3L63P4m14J81K63j89P8K72n03
2445a81q7K71j05l34kN35k46N31J47l52m37L31k15m63P16J45o98J27O61l90l8
2466h4K95l20j24L18K37l28J84K47m06j67L03m09K20n4L54n6j43J39k21K72n3
2487B04k01P8j05k6L16k10m62O64k21j51J36L10m04J87J45l21L4K91j78o32L52
2508a94L62n55K27M45m70j20K87j71NL13J29n77J68K12l46k58O39m80J79J64j50
2529a91O9J49R1l66K19N8k04J0M1kL1J15J21j03K67n53q6M02l0k15M43l79J53
2552D0j2J7l57M93L28m46k47P06l42K4J92l72l68N93j41p4K9J65p7j57N12n76
$$ plain form
2574 -70 115 183 132 4 128 211 -102 -143 41 86 74 -15 163 -69 141 -49 33 177 -5 60 -5 -64 -139 -39
2598 -39 -142 -272 -54 114 92 196 -74 -127 -55 198 -71 -240 91 62 -273 78 -82 -287 -295 393 -125 -145 95
2621 95 103 -493 -76 32 -324 -202 -83 -95 -228 167 -61 -205 -4 -20 -183 448 111 293 89 -125 99 -210
2643 -210 -14 -217 212 -28 -52 92 73 -203 169 104 133 21 18 308 135 422 184 -297 -120 -7 -242 69
2665 69 93 -64 90 222 173 -18 376 -65 -304 141 328 -42 -176 276 -92 -235 170 91 -103 -158 -176 -20
2687 -20 -125 34 25 -134 -395 -80 -297 37 -193 -42 -83 105 -82 -51 53 -134 -35 170 -162 133 -14 -213
2709 -213 -131 -3 -233 80 -11 6 -105 218 49 -46 -56 192 -415 -98 360 -32 -125 480 31 -230 109 3
2731 3 19 75 467 -139 -25 177 236 -78 -153 -156 -212 130 -99 109 344 98 61 -53 106 59 151 169 -87 49
$$ packed form
2574g0J85O8n1j28J24Q3l13m1J84M5j2q9J78k32K10j90Q2J44j82O5o5n9p5J00
2598c9j03j30K18J68k2J04k70n3P2K53k69j69L31k9l35L51j60k05qO88n18k0K40
2621I5Qn96M17J08l56J22J19j2j33L95k28j44K01j6j63O31l37J82k04k14K24l09
2643b10J96k03M29k40k4J44j9k76L72o5K9j12lK90j73K87k38m81J77J13k35L11
2665F9K4j57J54J32m9j91L94m41k39M45J87l70j34M52l68j43M05p9j94n5j8J56
2687b0j05J59rj59k61L15k17L34k30J51m1J88j87L1J04j87R9K05l32K95j47j99
2709b13Q2J28k30L13r1J7j11L23j69r5j0K48o07L17M58l92r3O05m49k61L39j06
2731CJ6N6L92o06J14K02N9l14p5ln6L42k29K08K35k46l7j14J59m7R2J8k56J36
$$ plain form
2755 49 76 65 366 277 303 -105 246 -175 -90 175 -15 -291 69 203 11 -275 8 -99 36 36 -89 -117 274
2778 274 -342 14 48 111 -411 72 283 -98 -168 38 36 -258 -59 -237 -86 -170 125 37 -60 -4 -47 -296 -233 -159
2802 -159 -46 70 -65 -199 -58 -211 -181 15 -414 -220 -29 -97 -62 108 82 -152 -28 187 26 243 43
2823 43 -48 -184 -167 65 -21 -221 -51 -148 -105 55 -71 -3 164 155 -259 -77 4 -195 217 84 200 -27 86
2846 86 99 58 128 149 -287 -20 92 15 22 -59 -182 91 -59 -211 89 17 23 101 140 -336 7 -108 -87 -183 199
2871 199 64 -106 -217 -39 -222 56 190 -248 -154 87 217 -440 -84 241 -99 138 -72 -206 -152 136 -44
2892 -44 -183 -76 -154 20 -211 13 -352 -165 414 -22 117 -54 115 110 113 -274 -63 -122 -160 -59 13 -13 -239
2915 -239 21 47 -1 61 264 73 43 235 -267 212 302 90 -321 -41 340 107 -185 136 -208 -266 320 -237
$$ packed form
2755D9K7j1L01q9K6m08L51m21Q5K65j90k76L60J34j92k86K83j07J35%j25k8L91
2778B74o16L56L4O3n22M83K11l81p0K06kk94J99j78J51q4K95q8r7N6m3k49O3P4
2802a59J13J16j35j34J41j53L0J96m29J94J91o8L5J70k6k34J24K15j61K17k00
2823D3r1j36J7K32q6k00J70r7M3J60j26O8J67rm14J82Q1j99M12j33J16k27J13
2846H6J3m1P0K1m36K67J12p7Pq1j23K73j50j52L00p2OP8L9m76L43j15K1r6L82
2871A99j35j70j11J78j83K78J34m38R4K41J30o57L56L25l40K37k10j34N4K88j80
2892d4j39J07p8J74k31K24l65J87N79m36J39j71J69nLl87K11n9l8J01P2k6k26
2915b39K60K6m8O2K03j91l0J92n02M79R0k12m11K80L81k33k92L21l44n8N86n57
$$ plain form
2937 -237 97 103 268 -68 220 -120 -133 -17 158 -21 -221 155 50 -17 198 -19 -34 46 -70 18 -47 80 -354
2960 -354 207 19 -60 97 246 -8 -170 -207 -126 -37 30 -159 -86 264 -143 -316 -45 4 -161 149 4 34 -198
2983 -198 156 -263 -28 -106 -188 -351 248 -25 -138 12 -76 -98 -304 99 -243 -76 -110 -55 -24 -25 -125 80 48
3006 48 -47 -151 -11 152 -79 115 107 -403 -105 244 48 325 96 183 172 187 8 131 -16 90 -23 -303
3028 -303 -268 155 -35 -71 288 -143 256 305 -14 91 44 -9 121 -123 158 -242 32 -47 -159 173 89 -99
3050 -99 112 156 -325 -312 -120 -117 -368 -133 -187 -49 45 -168 -121 -196 -126 108 210 226 139 -57 -44 -93 -99 -42 -23 -65
3076 -65 -76 41 -66 173 -179 -257 32 1 -50 88 82 -129 83 7 -232 244 267 175 -105 -3 -48 36 -127 -74
3100 -74 -152 26 147 142 -238 -112 63 156 156 76 -24 159 -98 -222 282 38 -119 20 302 121 138 -101 -116
$$ packed form
2937b37L34OJ65l36K88l40j3J16J75j79k00L76j05o7K15k17j5Q0j16Q8o5J27m34
2960c54N61j88p9J57J49k54j62l7Q1Q9O7j89P3L50m07j73K71M9j65L10j45L0k32
2983a98L54m19K35p8q2j63N99k73j13J50q8k2k06M03l42J67l4N5L1jj00K05l2
3006D8r5j04J40J63k31J94qn10K98L49j96K77k29Q7j1J5j79J23j47J06j13k80
3028c03L5M23j90l6L59m31L99M9l19J05m7n3J30k44K81m00K74p9j12L32q4j88
3050i9K11M4m81J3J92Lk51K35n4J38R4k13M7p5P0K34J02J6q7j96J3m9oN7J9m2
3076f5j1J17j07K39l52p8K89l1n1J38ok11K12p6k39M76K3r2k80J02m5Q4j63N3
3100g4p8J78J21nl80J26J75R3%q0j00J83k57j24N04k44j57J39K82j81J7k39j5
$$ plain form
3123 -116 -86 127 -56 111 -54 -307 -211 369 21 9 -66 112 242 -112 207 100 77 254 215 -114 -35 -92 -124
3146 -124 -293 -184 26 -113 22 115 -232 -141 83 -200 45 -271 -249 -22 -87 -36 -292 -161 1 -282 -214 33
3168 33 -98 -243 -64 118 239 75 -66 -234 -81 -179 102 -98 25 213 171 102 161 138 110 -344 210 -116
3190 -116 -120 188 -14 126 -21 -96 -86 38 103 -2 -107 228 -69 26 -119 0 94 71 198 -78 -78 68 136 -130
3214 -130 -177 168 120 260 -177 -26 84 167 308 -106 -23 -50 -37 23 85 -179 175 -114 122 -95 -208 -188 -94
3237 -94 -39 58 -184 115 -76 10 -77 -281 161 139 -182 -470 146 -308 -314 60 -8 66 -286 135 -153 -88 -71 20
3261 20 -95 8 -54 -83 266 159 -28 -89 -256 -162 -58 -136 -275 174 141 -104 69 74 -255 -47 -96 -140 -309 -2
3285 -2 191 -9 98 221 -113 -22 -32 -93 -312 452 145 -225 228 -128 -67 113 130 106 -142 342 325 430 289
$$ packed form
3123a16L0K13j83J67j65k53R6N80l48j2p5J78J30l54L19j07k3J77l9l29P9n7l2
3146a24j69J09K10j39J35R3l47R1K24k83K45l16K2K27o5N1k56J31J62k83O8K47
3168C3j31j45J79J82J21j64j41j68J53r8K81k00J23J88m2o9N9k3k8m54N54l26
3190a16mL08k02J40j47p5J0J24O5j05j05L35k97R5j45J19R4k3J27k76%J46O8k66
3214a30m7L45m8J40m37J51J10Q3J41m14Q3k7J3O0O2k64L54k89K36k17j13K0R4
3237i4N5R7k42K99j91Q6q7k04M42k2l21k88O16m54oL74o8P4l52M21k88O5J7R1
3261B0j15J03o2k9L49j07j87o1j67R4J04p8j39M49l3k45J73Nl29K08m9m4j69L07
3285bJ93k00J07J23l34R1j0o1k19P64l07l70M53l56O1J80J7k4k48M84j7J05j41
$$ plain form
3308 289 -42 12 -51 -164 -87 -64 180 24 -219 178 167 69 101 -15 18 61 -62 -41 -160 51 -273 -4 37 -141
3332 -141 -13 -78 -66 -37 -59 -108 -1 -76 -45 -237 164 -201 1 156 271 106 33 3 -239 -97 49 89 -203
3355 -203 111 45 -23 180 225 39 74 179 -181 -66 -52 6 -118 -48 287 8 29 -239 44 126 88 12 -88 -14
3379 -14 94 -122 124 45 271 6 141 267 -270 -274 -50 -66 107 47 153 10 4 280 -83 214 197 109 -64
3402 -64 -127 109 2 31 -120 -137 -19 -90 -128 164 -84 150 158 14 139 119 -185 -363 45 -201 82 -73 -97
3425 -97 -152 -84 -174 -310 -42 -36 -309 -30 -10 117 141 -18 -100 -243 -170 97 80 -113 26 49 45 -192 -193 -244 235 -135
3451 -135 -251 -22 195 -233 298 -141 207 335 -231 -79 154 -103 -5 270 57 -42 -100 41 236 84 240
3472 240 384 107 -2 268 32 -24 -240 -232 -20 -45 -76 69 -155 225 175 -177 192 21 173 -29 113 -18
$$ packed form
3308B89l31N4o3j13P7K3K44j56k43L97j1r8L2j16L3M3j23K1j19K11l24K69M1j78
3332a41J28o5J2K9k2m9J07p5L1j92M01l65K02J55J15j65p3l0k42J42J46M0k92
3355b03L14o6o8K03M5j86L5J05l60J15J4N8j24P0L35k79K1k68K83Q2l8p6j00P4
3379a4J08k16K46p9K26k65J35J26n37mK24j6J73o0J06j43oK76l63K97j7q8j73
3402f4o3K36j07K9j51j7J18p1l8K92k48K34Qj44J25k0l04j78M08k46K83j55k4
3425i7n5O8r0j36K68Ok73K79K0J27K4j59q2j43P3K67j7j93J39K3mk37jn1M79l70
3451a35j16K29K17m28N31m39L48J28n66J52K33k57R8K75k13r9n8J41J95j52J56
3472B40J44k77j09K70k36n6k16QK12k5l1J45k24L80n0l52L69j71J52k02J42j31
$$ plain form
3494 -18 174 -125 19 61 28 -80 -60 167 100 90 -34 56 -10 59 -6 277 -22 -336 -201 -9 53 -85 90 -175
3518 -175 -109 84 121 -85 -46 -166 138 -279 -41 -8 48 141 -83 130 118 -14 -58 -261 249 -107 -25 -12 113
3541 113 -64 287 131 -251 7 -46 46 204 -217 -200 114 -36 -77 -176 -18 -69 23 211 57 233 118 202 -55
3564 -55 277 -66 106 -276 105 106 -173 8 42 -86 -13 -74 -144 158 67 207 211 -28 55 40 21 -147 -32 -76 79
3589 79 -119 -44 -55 150 307 73 -287 -251 -60 194 -111 229 -188 -142 -44 -260 136 -192 216 2 -22 211
3611 211 -10 352 27 -120 -253 -102 -113 -122 136 -31 -140 183 -14 -59 242 -237 -45 104 -29 -122 5 -86
3633 -86 -203 -84 269 -89 -128 116 6 51 86 37 -239 -186 228 -111 252 83 -73 11 73 -188 67 18 -84
3656 -84 49 -189 405 127 113 -6 -14 76 -160 59 -119 0 92 -57 -115 272 -35 -233 0 -81 51 49 28 184
$$ packed form
3494a8J92k99J44M2l3j08K0K27o7j0j24R0o6O9o5K83k99l14J35J92O2j38J75k65
3518a75O6J93L7k06L9j20L04m17K38L3N6R3k24K13j2j32m4k03N10l56Q2J3J25
3541A13j77L51j56l82K58n3R2J58m21J7L14j50m1r9J58n1R2J88j54J76j15Q4k57
3564e5L32l43J72l82L81Jk79J81L4j28P3o1p0L02r1J40Mk39Q3j5j9j68J15m4J55
3589G9j98P5j1K05J57k34l60L6J91K54l05L40m17M6R8k16L96l28M08k14k4K33
3611B11k21L62l25j47j33J51j1rK58j67j09L23j97m5L01m79J92J49j33r3J27r1
3633h6j17J19L53l58l9K44j10M5L5m9k76N3M14l39L63j69j56Q4O2k61K55m9j02
3656h4J33k38N94k78j4j19qR0k36K19j78J19R2j49n8L87l07j98K33q1J32kk1J56
$$ plain form
3680 184 69 -279 -326 204 0 -22 -40 -30 -62 -5 -51 -187 120 -43 57 85 112 33 -308 -287 -181 -26 -8 43
3704 43 226 113 131 -145 67 -38 -215 139 -414 -323 117 -57 -225 89 65 -145 -296 -13 -3 -44 54 198
3726 198 266 99 160 -98 -32 -42 -41 97 -247 -46 2 241 218 25 225 60 98 -143 241 -35 112 88 -15
3749 -15 41 244 22 -135 70 136 137 19 29 167 -22 -74 17 -219 23 80 50 382 254 87 -133 -213 -199 -149
3773 -149 102 212 54 -127 -97 -209 -91 106 12 193 164 -1 29 -86 -209 -72 -174 166 91 67 0 84 -172
3796 -172 190 -231 -209 -90 -182 -57 -166 -110 -108 -25 -252 285 -336 -86 -178 368 217 -173 90 35 223 -368 -53
3819 -53 -215 77 -167 140 -44 -179 59 -157 85 -80 -177 195 111 -250 231 37 -158 -16 -172 -119 39
3840 39 127 10 184 153 309 222 -279 110 46 103 110 68 29 -2 41 -52 43 64 -118 409 198 129 231 61 42 -175
$$ packed form
3680A84j15l48m7N30k04k2j8J0l2N7m6j36L07j63J00K8K7p9l41K1J06J55J8N1
3704D3J83j13J8k76K12j05j77L54n53R1M40j74j68L14k4k10j51K83J0m1R8J44
3726A98O8j67O1k58O6j0JJ38l44K01M8K39k3j93K00j65L8k41L84k76J47k4j03
3749a5N6K03k22j57K05O6Jj18J0J38j89n2R1k36K42N7l0L32j28j67k20q0J4N0
3773a49K51J10j58j81L0j12J18J97r4J81k9j65L0j15j23J37j02L40p5k4o7Q4k56
3796a72L62m21K2J19r2J25j09N6KQ3k27N37o21K50r2N46j51l90K63n5J88n91L15
3819e3j62K92k44L07j84j35K38k16K42j65r7L72q4l61M81j94j95J42j56N3J58
3840C9Q8j17J74l1J56q7n01L89o4N7Pm2l9l1M3r3R5K1j82N27k11o9J02j70j9k17
$$ plain form
3866 -175 280 66 31 -238 -81 164 88 -116 -215 -65 271 -40 -255 179 -94 -73 -108 -243 -63 111 -109 -70
3888 -70 62 -54 10 36 -195 -57 -19 -154 -299 -65 -81 160 70 -21 -332 357 171 -74 -231 14 -183 25
3910 25 -242 16 129 78 -102 31 -116 65 -222 -355 150 -175 -70 4 57 -35 -108 -205 74 243 250 53 -58
3933 -58 -227 133 -25 -276 363 -132 -86 40 -251 -297 291 54 65 265 127 -118 112 91 -161 227 -35 -124
3955 -124 72 80 73 28 4 -3 -126 -135 27 -147 300 29 -162 212 160 38 -117 14 -199 55 -195 150 25 55
3979 55 187 226 -152 -40 -59 59 197 -82 -99 80 -140 14 58 250 -67 -48 -141 -177 364 142 -73 158 -75
4002 -75 -30 -68 24 118 -209 -45 76 -124 -59 77 -288 -93 -99 38 129 77 78 -174 142 -75 128 84 -31 -94 1
4027 1 56 95 276 -22 43 156 110 -75 -12 -67 327 193 -26 48 143 -70 71 154 -116 -69 57 144 54 18 63
$$ packed form
3866a75M55k14l5k69J57K45p6k04r9J50L36l11k15M34k73K1l5j35J80J74k20L9
3888g0J32j16O4K6k31J38L8j35j45K34j6K41r0r1l11O89j86k45j57K45j97K08
3910B5k67K58J13n1j80J33j47J81k87j33N05l25J05P4N3r2p3r7K79J69Pj97j11
3933e8j69L60j58k51O39m95M6J26k91m6N88k37J1K00j38k45K30k1k52L88k62q9
3955a24J96Qpm5k4pj23rJ62j74M47k71j91L74n2j22j55J31k13K54k50L45j25L0
3979E5J32L9l78J12j9J18J38k79j7J79k20J54M4J92l17J9r3l6N41k22k15K31k33
4002g5M5l8R2R4l27J64J21k00O5J36l65J95oJ37R1n2Jk52L16k17K03m4j15o3R5
4027AN5L9J81k98O5J13m6j85O3n5L94j34k19P4R5k13J41Q3k70M7J26Q7r0l6M5
$$ plain form
4052 63 -34 -9 -21 7 120 116 -8 -148 -218 -329 -12 69 -120 93 -101 -7 136 -68 316 -73 18 -40 -95 -86 -71
4077 -71 46 -102 105 -189 -16 -223 180 59 -289 -53 -84 -1 -270 22 90 -159 165 146 8 37 269 21
4099 21 105 -198 -109 -147 40 31 -56 -12 -192 217 19 -26 -135 39 -54 223 379 36 -84 -167 -84 -85 141 42 148
4124 148 218 -160 220 -76 -29 71 61 -103 -113 17 -94 264 169 173 45 51 88 -61 265 58 -55 -133 43 -173
4148 -173 71 13 -110 -91 -156 -47 -227 160 68 -15 -68 -98 111 -76 6 -92 -178 -168 -176 41 107 -112 -305 154 -148
4173 -148 -88 -65 -183 263 -144 11 39 -97 129 -250 -127 318 -38 -178 14 -81 -125 -92 94 5 58 30 159
4196 159 -13 99 112 67 332 -112 196 -24 227 -5 -18 18 -284 12 54 145 -15 327 10 -89 133 -12
4218 -12 -240 80 60 30 97 30 209 207 -22 -17 188 92 -119 -24 193 27 39 -243 -8 -107 194 -17 4 -248 -138
$$ packed form
4052F3r7K5j2K8J13mj24j40p0j11L17Q1j89K13j94R4J43k04L84l89R1n8n5RJ5
4077g1J17j48K07k94J73k07M03j21l48K36l1Q3k69K92O8k49L24j9j38K9K32k48
4099B1Q4l03Q9l8J87rq7M4j80M09j98m5j09J74r3K77J56l43j20q3Q3jK26r9J06
4124A48P0l78L80k96M7J00j0j64j0J30j11L58r5Mj28OL7j49L26k07j13p8J76k16
4148a73K44n8j23J9o5J09j80L87r2q3n3l0K09j87Q2r8q6J0qK17O6k19j93M59l02
4173a48O0K3j18M46m07J55K8j36K26l79J23M45l56j40J92r5m4L3J86q9N3k8J29
4196A59j72J12J3m5K65m44L08k20K51k32j3L6l02K96M2R1j60L42l17r9K22j45
4218a2k28L20k0l0O7o7J79kk29NK05r6k11R5K17j66J2k82K35r9L01k11K1k52J10
$$ plain form
4243 -138 -38 227 -46 62 -41 141 -93 -95 152 -150 -2 -53 -20 -158 -63 -140 -306 -81 81 -106 -45 168
4265 168 -139 -26 161 -42 167 -55 70 -88 93 81 91 161 160 -147 69 55 22 210 18 -37 45 113 14 93
4289 93 -86 -17 34 103 6 38 -126 -4 164 6 192 42 -376 -111 282 179 399 75 -297 29 50 -30 212
4312 212 -72 83 16 283 164 -197 87 5 3 -15 42 -159 34 125 -16 -100 113 -88 -11 22 -129 30 -228
4335 -228 -50 -214 8 264 -199 39 -48 83 16 -252 5 24 -161 -191 81 -85 -318 -110 -88 151 386 154
4357 154 39 307 -175 -3 -169 50 111 55 -268 -122 81 -72 32 62 -154 -61 160 83 90 -181 -150 151 56
4380 56 33 -74 -232 -30 167 51 -15 -78 218 37 161 79 -104 349 10 199 222 130 171 9 292 -229 -3
4403 -3 162 -386 28 -366 -117 191 212 0 75 98 166 -290 -26 -9 -172 10 8 -167 69 191 -106 -91 0 -37
$$ packed form
4243a38J00K65k73J08j03J82k34kK47l02J48n1L3j38R5p7j66K25J62j87O1K13
4265A68l07J13J87k03K09k22J25j58J81j2J0P0jl07K16j4l3J88j92n5Q2O8r9P9
4289I3j79O9N1O9r7L2j64J22J68j58J86j50m18K65L93j03K20l24l72L26K1q0K42
4312B12k84J55o7K67j19l61K84q2kj8N7k01J93R1j41q4K13k01P7L3j51J59k58
4335b28J78j64K22K56m63K38q7J31o7k68K57J9j85l0K72j66k33K08K2K39K35k32
4357A54j15K68m82J72j66K19O1n6l23J46K03j53J04L0k16R3K21p7Pk71L1L01r5
4380E6k3j07j58K02J97j16o6o3K96j81J24q2j83M53l39J89K3r2M1j62K83n21K26
4403cJ65n48M14l94K49L08K1k12P5K3O8m56K64J7j63J82kj75K36J22k97J5R1l7
$$ plain form
4427 -37 -9 3 -188 -118 19 -247 56 226 -57 -277 -80 -176 -242 -65 -85 74 -77 -62 25 -162 -515 -41 17
4450 17 -78 -46 85 101 -263 -61 202 165 -34 30 185 -40 -217 166 39 -38 -10 -20 69 154 240 -260 5 -263
4474 -263 176 157 158 63 180 -28 -4 -204 25 288 22 24 14 43 195 132 -3 248 69 111 114 16 23 28 -34 45 156
4501 156 187 140 -241 -87 -305 141 -82 135 59 -68 150 -166 -123 -212 -110 62 146 -42 -81 -56 -113 -9 106
4524 106 70 -285 94 -99 0 -8 66 239 -68 -195 -34 -2 -150 27 -6 56 48 -66 -125 -97 233 -52 -97 -7 60
4549 60 -69 49 27 -85 3 191 57 -148 58 -111 -122 -54 -10 373 -132 54 89 156 200 140 -32 31 -1 -72
4573 -72 159 137 -71 216 7 43 242 -45 -70 177 -46 164 206 -5 37 -81 18 -152 78 -12 60 -86 -109
4596 -109 187 28 -14 124 -50 -50 -3 36 -52 -307 255 -267 -155 151 -92 42 -57 -165 -277 -106 161 -85
$$ packed form
4427c7K8J2j91P0J37k66L03J70k83k20J97r6o6J77k0J59j51J5Q7j87l53M74N8
4450A7r5L2J31J6l64K02K63l7j99O4J55k25j77L83j27p7K8j0Q9Q5Q6n00K65k68
4474b63M39j9Jr5J17k08K4k00K29K63k66Kj0K9J52o3j35K51j79M2Lr8PNo2P9J11
4501A56L1m7l81J54k18M46k23K17p6j27K18l16M3q9J02J72Q4j88l9K5n7J04J15
4524A06l6l55L79j93R9qP4J73l07j27J61L2j48J77l3O2qj14n9K8L30k85m5R0O7
4549F0j29J18k2j12Q8J88j34k05K06j69j1O8M4L83n05J86L5O7M4o0j72O3l2p1
4573g2K31k2k08K87k09L6J99k87k5K47k23K10M2k11M2j18R9j70K30r0P2j46k3
4596a09K96j59m2J38j74%M7L9q8k55N62n22J12L06k43J34r9j08j12J71K67k46
$$ plain form
4618 -85 164 -153 131 -210 -33 -129 112 29 -156 347 -18 68 48 47 -16 -5 145 -79 61 -50 127 94 -232
4641 -232 -139 14 -109 -204 68 -90 109 -116 181 29 186 336 136 214 100 72 -64 114 -103 -121 57 4
4663 4 115 -96 40 177 -468 -62 17 -92 -222 131 208 67 59 -13 141 12 -124 145 14 143 83 254 -90
4686 -90 -48 27 -79 -125 174 -100 -277 -65 -75 -4 10 -57 124 174 107 -198 79 -31 -413 79 11 4 -221 56
4710 56 -9 132 15 192 204 0 158 -18 -1 -44 231 -23 -107 225 -4 71 -53 73 37 -16 -37 83 43 62
4734 62 87 -37 92 203 42 -295 273 -124 69 -144 52 337 189 72 -24 66 10 -42 160 -100 201 -11
4756 -11 -171 -18 180 225 139 147 -37 216 -91 138 157 -73 -72 158 -93 -233 313 19 -61 -110 -156 73 44 -57
4780 -57 -72 200 -115 67 -397 99 19 14 -256 -27 -60 -117 31 -68 277 14 60 -160 -151 -120 133 212 305 181 152
$$ packed form
4618h5K49l17K84l41J77r6K41q3j85N03l65Q6k0jo3J1J50k24J40j11J77l3l26
4641b32R3J53j23r5K72j58J99k25K97j52J57J50k00P8j14k8j36J78k17j8J78n3
4663DJ11k11J36J37o45M06P9j09j30L53P7j41qp2J54j29j36K69j31J29o0J71l44
4686i0M2P5j06m6K99k74j77K12j0P1J4o7J81N0o7l05K77j10l82M92o8pk25K77
4710E6o5J41j17J77J2k04J58j76J7m3K75k54q4L32k29P5j24J26l6n3k1J20m0J9
4734F2K5j24J29J11j61l37N68l97J93k13J96K85j48j17r6R0n6n2K02k60L01k12
4756a1j60J53J98M5q6Qj84K53l07K29J9k30JK30k51j40N46k94q0m9m6K29k9j01
4780e7j5K72l15J82m64M96q0nk70K29l3n7J48r9L45k63M6k20RL1K53P9R3j24k9
$$ plain form
4805 152 -28 247 -140 -239 69 -369 156 -79 33 -109 -166 105 176 6 73 78 -23 21 186 165 42 154 172
4828 172 -240 212 -141 -181 -177 200 252 -95 115 27 -103 142 74 65 -8 -89 -240 28 -105 -153 49 -145 256 -168
4852 -168 291 -169 -122 -157 11 -139 107 -66 -118 -78 113 52 -360 -74 -1 -5 -204 -99 108 50 -131 -387 16
4875 16 87 -54 -260 -100 12 -135 93 -81 -302 -62 -86 -206 -27 21 -64 278 -179 -57 -196 -5 -239 -99
4897 -99 -61 -130 265 55 -272 -89 75 135 175 -220 2 -89 -90 45 -298 -56 -51 42 -42 197 256 -25 72 -22 375
4922 375 -225 113 -9 216 -80 -31 40 104 -64 -79 -32 184 -76 117 -39 -52 146 280 -1 -136 112 -80
4944 -80 145 18 -19 7 106 41 -183 58 31 -120 20 185 -175 99 378 -32 -320 -25 -96 -213 -195 -98 284
4967 284 195 216 -275 365 -123 -136 309 8 181 -95 159 358 75 -44 158 165 156 -85 102 -329 36 -340
$$ packed form
4805A52j80K75l87r9L08m38N25k35J12j42n7K71P1j70O7Nj01M4J65k1j23J12J8
4828A72m12M52l53m0ML77N2l47K10q8j30K45o8rp3q1j51K68j33m8K02j94M01m24
4852a68M59m60M7l5J68j50K46j73n2M0J91o1m12K86P3mj99J05K07n8j81k56M03
4875A6P1j41k06J60J12j47K28j74k21K40k4j20J79M8q5L42m57J22j39J91k34J40
4897i9L8o9L95k10l27J83J64O0M0l95K22r1jJ35l43K42NR3q4K39N9k81R7r4L97
4922C75o00L38j22K25k96M9P1O4j68j5M7K16k60J93j56j3J98J34k81j35K48j92
4944h0K25j27l7K6R9o5k24K41k7j51J40J65l60K74K79m10k88K95p1j17J8R7L82
4967B84q9K1m91O40m88j3M45l01J73k76K54J99k83j19K02Prk41J87m31L65l76
$$ plain form
4989 -340 280 107 -116 -64 40 105 -52 76 -60 -26 -76 0 -109 -135 -71 -6 -231 -59 -42 122 -49 241 -137
5012 -137 2 -127 118 123 170 465 53 3 -138 187 106 -165 -140 57 167 34 157 -55 99 137 -9 168
5034 168 57 -193 169 220 107 -125 -79 59 7 154 24 -280 42 -18 58 -197 -194 -137 -24 -16 -114 -222 -55 -132
5058 -132 -80 185 -78 136 -77 91 70 199 243 7 10 -89 209 -184 -47 -135 -42 -50 -79 258 -148 -242 -140 15
5082 15 17 -53 -39 38 -108 -89 -22 -135 66 12 -144 26 114 76 157 385 -46 88 20 44 -36 -151 73 -252 292
5107 292 -5 103 -129 185 136 52 113 40 -102 3 174 20 257 -155 -140 65 82 187 314 3 -120 130
5129 130 -35 123 201 72 -152 -79 -131 355 -142 -44 -85 -138 -72 127 202 96 40 -152 16 248 -191 -30 -160
5152 -160 93 -107 211 44 25 -103 84 -14 104 119 -108 -292 -49 -237 -54 160 -191 45 153 176 -81
$$ packed form
4989c40O20j73k23N2J04O5j57J28j36L4n0P6j09k6O4O5k25J72J7J64j71K90l78
5012a37J39j29K45NM7K95m12n0j41L25q1k71K5J97J10j33J23k12J54L8j46J77
5034A68j11k50L62N1j13k32M6J38n2J47j30l04L22o0P6k55LN7J13Qr8j08J67p7
5058a32N2K65k63K14k13J68k1J29M4k36Lr9K98l93J37q8R3qk9L37m06r4J02J55
5082A5Kp0J4P7j46J9O7j13K01n4j56J70Q8l8Q1K28m31J34o8K4q0j15K24l25N44
5107B92k97J08k32L14m9q4O1p3j42J05J71j54K37m12J5K05J7J05J27l11j23K50
5129A30j65J58P8j29k24P3n2M86m97R8m1n3O6J99P5j06n6j92J68K32m39J61j30
5152a60K53k00L18j67j9j28J87r8J18J5k27j84K43j88J83K14l51K36J08K3k57
$$ plain form
5173 -81 19 -340 176 36 -185 125 156 156 -10 87 98 165 118 124 -92 -170 112 145 28 -44 -57 239 93 179 -147
5198 -147 -30 18 -38 102 166 -38 105 125 147 -35 43 -24 -225 30 152 -209 93 269 85 23 79 -15 -37 242
5222 242 -158 -214 13 -28 162 146 38 45 -304 159 -102 -94 -164 -22 -274 57 -126 -200 202 30 -41 237 37
5245 37 128 306 -89 217 -83 254 79 75 -123 9 -189 -159 -146 -132 -217 -164 234 50 135 206 143 -14 203 -107
5269 -107 17 -217 -226 372 -58 -107 55 5 216 -94 -49 -263 -135 7 -245 -186 -229 119 -162 114 85 273 35
5292 35 220 -139 131 -153 69 119 128 127 -114 -56 43 178 163 183 -53 52 306 -159 63 -80 -40 26 -19 -246
5316 -246 115 117 -177 -17 51 -70 95 56 101 152 -61 -161 216 45 -40 52 -106 -111 -172 -63 -264 11 -65 75
5340 75 -244 -155 130 -92 291 -134 90 21 53 -79 195 47 -363 57 -172 81 27 108 -59 -70 134 191 -282
$$ packed form
5173h1J00l59N16j40k21L10L1%j66R7J1O7m7Ok16p8K82L3j17p2j3K96j46Q6l26
5198a47J17M8n6J40O4k04J43K0K2j82P8o7k01K55J22l61L02J76j84o2N6r4k2K79
5222B42m00n6K27m1J90j6j08Pl49M63k61Qp0J42k52L31j83p4M02j72p1K78k00
5245C7R1J78l95L06l00L37j75mj98J32j98L0J3J4q5N3L98j84Q5P1o3j57K17l10
5269a07J24k34rN98m30m9J62n0K11l10M5k14J28J42k52N9m3L48k81K76k9J88k38
5292C5J85l59K70k84K22N0Rjk41N8R9J35j5K0k36J05K54m65K22j43M0O6m5k27
5316b46L61Kk94J60O8j21J65l9M5N1k13j00L77j71q5R2j58no1J09k01K75p6J40
5340G5l19Q9K85k22L83m25K24o9L2j32K74j48m10M20k29K53n4Q1j67j1K04N7m73
$$ plain form
5363 -282 -17 -39 29 2 -18 30 -135 45 -93 135 -32 129 179 -119 -45 184 107 -98 -65 -61 -155 -264 129 104
5387 104 -140 -88 -9 -38 3 -30 101 -14 -109 74 106 -148 -116 53 52 119 88 -117 12 -125 -217 56 58 -147 -99
5412 -99 -57 -203 87 98 -7 27 -33 -189 188 -62 -304 -3 160 -194 -61 260 67 131 -151 22 63 -21 -77
5435 -77 -18 -15 -335 -145 -84 250 98 225 64 -16 -85 122 -30 -69 -8 226 84 -27 123 41 -198 -56 -53 -93
5459 -93 243 60 89 19 25 -52 -132 -50 141 -93 -31 -190 243 -129 204 -47 -161 63 218 -238 -232 63 189 46
5483 46 75 -6 252 208 69 104 76 -60 -5 -32 205 -76 13 -51 -242 -153 -80 241 307 -137 10 39 -73 287 -17
5508 -17 -181 -18 192 3 -176 -15 69 143 -112 101 -86 -274 209 27 -379 -20 -20 40 169 -126 -24 -82
5530 -82 -8 -102 26 -154 32 -166 153 -48 192 127 -184 -174 37 284 -38 -46 59 15 -8 -41 74 26 234 -41
$$ packed form
5363b82K65k2O8k7k0M8j65J80j38K28j67J61N0k98P4K29p7k05L3Mr4j09L93k5
5387A04k44N2P9k9M1l3J31j15r5J83L2k54L2J69jO7l1k05J29j37r2K73Kk05M8
5412i9M2j46K90J1j05L4o0j56L77k50k42L01J63l54J33L21j93O4k82J73M1q4n6
5435g7N9Ll20J90O1L34j52J27j61q0o9K07j52l9O1K34j42j11J50q2k39J42Lm0
5459i3L36j83K9p0Op7q0Q2J91k34O2j59M33l72L33k51j14K24J55m56OK95J26j43
5483D6K9q1K58m4j39L5k8j36N5k7K37k81Q9o4j91Q9P3L21O6m44J47K9j12L60l04
5508a7j64J63K10j89j79J61Q4P4k55K13j87j88M83j82m06L59%O0J29k95J02n8
5530h2P4r4J28j80J86j98L19k01K40o5l11J0K11K47l22qJ05m4k3l3J15m8K08k75
$$ plain form
5554 -41 139 211 -311 151 168 127 66 143 221 196 -222 103 -279 198 -8 53 -82 16 -85 36 190 114 -143 -14
5578 -14 326 -11 -170 -53 242 106 66 82 -142 91 -106 43 -53 -101 167 63 -162 238 141 -79 -166 -141 -157
5601 -157 -152 85 157 20 148 62 -172 -157 78 -215 53 94 124 22 197 6 -173 -50 -28 105 135 90 -154
5624 -154 47 217 -12 -13 -103 90 51 123 44 77 -86 119 -37 74 -59 -90 -148 -187 -196 -139 19 -69 92 50 29
5649 29 27 96 283 20 -45 342 169 164 156 -171 -255 188 230 -38 -146 61 -44 -92 -103 -256 -76 69 -198 -25
5673 -25 9 68 123 -358 -82 197 221 -102 87 146 70 -117 -49 140 111 77 125 92 -326 316 106 -10 29 136
5697 136 103 28 -42 223 -89 -46 31 -62 123 -215 -43 -19 -156 7 90 -148 182 -233 -37 142 139 116 -98 261
5721 261 145 -224 -32 96 115 123 29 116 69 -67 13 236 -25 464 125 50 -29 -4 -165 198 -115 88 100 143
$$ packed form
5554d1J80P2n22M62J7m1o1P7P8k5m18L25l82M77k06O1j35R8j01J21J54p6k57J29
5578a4L40l37j59J17K95j36m0J6k24K33j97J49r6m8K68j04k25M00r7k20q7K5j6
5601a57NK37P2j37J28q6k34J5K35k93K68M1L0j02J75j91j79J23K2J33L0m5k44
5624a54K01J70k29jr0J93l9P2p9L3j63K05j56J11j33l1n8l9rN7J58q8J61m2k1
5649B9kO9J87k63o5L87j73nql27q4M43M2k68j08K07j05m8j1j53J80J45k67J73
5673b5L4N9N5m81K76K79K4l23J89N9p6j87O8J89k9l4M8l3m18O42k10j16L9J07
5697A36l3p5p0K65l12M3P7r3J85l38J72K4j37J63Q3k38L30m15J96J79lk3k14L59
5721B61j16l69J92J28J9Qr4Q7m7j36Q0K23k61M89l39p5p9K5j61L63l13K03J2M3
$$ plain form
5745 143 86 143 -58 -76 61 -45 -233 -342 28 46 28 11 174 52 -259 35 82 432 198 79 17 177 -132
$$ packed form
5745A43n7N7k01j8J37j06j88j09L70J8j8j7J63j22l11K94M7L50k34j19o2J60l09
$$ [...]
8191h5
##END NTUPLES=NMR FID
##END=
