##TITLE=1H_Tparten2-Re-f11-f5-orange
 CDCl3, 8 sc, 
 9.07.2021
##JCAMPDX= 6.0         $$ Bruker NMR JCAMP-DX V2.0
##DATA TYPE= NMR FID
##DATA CLASS= NTUPLES
##ORIGIN= UXNMR, Bruker Analytische Messtechnik GmbH
##OWNER= root
$$ XWIN-NMR		Version 3.5
$$ Fri Jul  9 08:54:35 2021 Russian Standard Time (UT+4h)  she@DPX200
##.OBSERVE FREQUENCY= 200.131506
##.OBSERVE NUCLEUS= ^1H
##.DELAY= (6, 6)
##.ACQUISITION MODE= SIMULTANEOUS
##.ACQUISITION SCHEME= undefined
##.AVERAGES= 8
##.DIGITISER RES= 18
##SPECTROMETER/DATA SYSTEM= spect
##.PULSE SEQUENCE= zg30
##.SOLVENT NAME= CDCl3
##.SHIFT REFERENCE= (INTERNAL, CDCl3, 0, 15.7039)
##AUDIT TRAIL= $$ (NUMBER, WHEN, WHO, WHERE, WHAT)
$$ ##TITLE= Audit trail, XWIN-NMR		Version 3.5
$$ ##JCAMPDX= 5.01
$$ ##ORIGIN= Bruker BioSpin GmbH
$$ ##OWNER= she
$$ F:/spectra/data/she/nmr/H-F/1/audita.txt
$$ ##AUDIT TRAIL=  $$ (NUMBER, WHEN, WHO, WHERE, WHAT)
(   1,<2021-07-09 08:53:13.00 +0400>,<she>,<DPX200>,
      <created by zg, POWCHK disabled, PULCHK disabled
       configuration hash MD5:
       00 E9 B6 7A A2 85 ED C7 34 08 36 98 17 FE 4E 26
       data hash MD5: 16K
       98 3C 4E 90 91 86 1E C7 5D 06 C1 AB 9F D1 42 DA>)
$$ ##END=
$$ 
$$ hash MD5
$$ 9E ED C9 BB 24 9D BB F6 D6 69 64 D8 B3 E4 72 9C
##$RELAX= 
##$RELAX= 
##$RELAX= 
##$RELAX= 
##$RELAX= 
##$RELAX= 
$$ Bruker specific parameters
$$ --------------------------
##$DU= <F:/spectra>
##$EXPNO= 1
##$NAME= <H-F>
##$PROCNO= 1
##$TYPE= <nmr>
##$USER= <she>
##$AMP= (0..31)
100 100 100 100 100 100 100 100 100 100 100 100 100 100 100 100 100 100 
100 100 100 100 100 100 100 100 100 100 100 100 100 100 
##$AQSEQ= 0
##$AQ_mod= 1
##$AUNM= <au_zg>
##$AUTOPOS= <>
##$BF1= 200.13
##$BF2= 200.13
##$BF3= 200.13
##$BF4= 200.13
##$BF5= 200.13
##$BF6= 200.13
##$BF7= 200.13
##$BF8= 200.13
##$BYTORDA= 1
##$CFDGTYP= 0
##$CFRGTYP= 5
##$CHEMSTR= <none>
##$CNST= (0..31)
1 1 145 1 1 1 1 1 1 1 1 1 1 1 1 1 1 1 1 1 1 1 1 1 1 1 1 1 1 1 1 1 
##$CPDPRG= <>
##$CPDPRG1= <>
##$CPDPRG2= <>
##$CPDPRG3= <>
##$CPDPRG4= <mlev>
##$CPDPRG5= <mlev>
##$CPDPRG6= <mlev>
##$CPDPRG7= <mlev>
##$CPDPRG8= <mlev>
##$CPDPRGB= <>
##$CPDPRGT= <>
##$D= (0..31)
0 1.2 0 0 0 0 0 0 0 0.06 0 0.03 0 0 0 0 0.0002 0 0 0 0 0 0 0 0 0 0 0 0 
0 0 0 
##$DATE= 1625806392
##$DBL= (0..7)
120 120 120 120 120 120 120 120 
##$DBP= (0..7)
150 150 150 150 150 150 150 150 
##$DBP07= 0
##$DBPNAM0= <>
##$DBPNAM1= <>
##$DBPNAM2= <>
##$DBPNAM3= <>
##$DBPNAM4= <>
##$DBPNAM5= <>
##$DBPNAM6= <>
##$DBPNAM7= <>
##$DBPOAL= (0..7)
0.5 0.5 0.5 0.5 0.5 0.5 0.5 0.5 
##$DBPOFFS= (0..7)
0 0 0 0 0 0 0 0 
##$DE= 6
##$DECBNUC= <off>
##$DECIM= 32
##$DECNUC= <off>
##$DECSTAT= 4
##$DIGMOD= 1
##$DIGTYP= 9
##$DL= (0..7)
0 120 120 120 120 120 120 120 
##$DP= (0..7)
150 150 150 150 150 150 150 150 
##$DP07= 0
##$DPNAME0= <>
##$DPNAME1= <>
##$DPNAME2= <>
##$DPNAME3= <>
##$DPNAME4= <>
##$DPNAME5= <>
##$DPNAME6= <>
##$DPNAME7= <>
##$DPOAL= (0..7)
0.5 0.5 0.5 0.5 0.5 0.5 0.5 0.5 
##$DPOFFS= (0..7)
0 0 0 0 0 0 0 0 
##$DQDMODE= 0
##$DR= 18
##$DS= 0
$$ [...]
##$SUBNAM2= <"">
##$SUBNAM3= <"">
##$SUBNAM4= <"">
##$SUBNAM5= <"">
##$SUBNAM6= <"">
##$SUBNAM7= <"">
##$SUBNAM8= <"">
##$SUBNAM9= <"">
##$SW= 20.0188882624521
##$SWIBOX= (0..15)
0 0 2 0 0 0 0 0 0 0 0 0 0 0 0 0 
##$SW_h= 4006.41025641026
##$TD= 16384
##$TD0= 1
##$TE= 0
##$TE2= 300
##$TE3= 300
##$TEG= 300
##$TL= (0..7)
0 120 120 120 120 120 120 120 
##$TP= (0..7)
150 150 150 150 150 150 150 150 
##$TP07= 0
##$TPNAME0= <>
##$TPNAME1= <>
##$TPNAME2= <>
##$TPNAME3= <>
##$TPNAME4= <>
##$TPNAME5= <>
##$TPNAME6= <>
##$TPNAME7= <>
##$TPOAL= (0..7)
0.5 0.5 0.5 0.5 0.5 0.5 0.5 0.5 
##$TPOFFS= (0..7)
0 0 0 0 0 0 0 0 
##$TUNHIN= 0
##$TUNHOUT= 0
##$TUNXOUT= 0
##$USERA1= <user>
##$USERA2= <user>
##$USERA3= <user>
##$USERA4= <user>
##$USERA5= <user>
##$V9= 5
##$VALIST= <valist>
##$VCLIST= <CCCCCCCCCCCCCCC>
##$VD= 0
##$VDLIST= <DDDDDDDDDDDDDDD>
##$VPLIST= <PPPPPPPPPPPPPPP>
##$VTLIST= <TTTTTTTTTTTTTTT>
##$WBST= 1024
##$WBSW= 4
##$XGAIN= (0..3)
0 0 0 0 
##$XL= 0
##$YL= 0
##$YMAX_a= 538568
##$YMIN_a= -747488
##$ZGOPTNS= <>
##$ZL1= 120
##$ZL2= 120
##$ZL3= 120
##$ZL4= 120
##$ABSF1= 10
##$ABSF2= 0
##$ABSG= 5
##$ABSL= 3
##$ALPHA= 0
##$AQORDER= 0
##$ASSFAC= 0
##$ASSFACI= 0
##$ASSFACX= 0
##$ASSWID= 0
##$AUNMP= <proc_1d>
##$AZFE= 0.1
##$AZFW= 0.1
##$BCFW= 1
##$BC_mod= 2
##$BYTORDP= 1
##$COROFFS= 0
##$CY= 11.3945322036743
##$DATMOD= 1
##$DC= 2
##$DFILT= <>
##$DTYPP= 0
##$F1P= 17.5019972093344
##$F2P= -2.517084195857
##$FCOR= 0.5
##$FTSIZE= 0
##$FT_mod= 4
##$GAMMA= 1
##$GB= 0.15
##$INTBC= 1
##$INTSCL= 1
##$ISEN= 128
##$LB= 0.24
##$LEV0= 0
##$LPBIN= 0
##$MAXI= 10000
##$MC2= 0
##$MEAN= 0
##$ME_mod= 0
##$MI= 1.114404
##$NCOEF= 0
##$NC_proc= 0
##$NLEV= 6
##$NOISF1= 3.799351
##$NOISF2= 2.8
##$NSP= 1
##$NTH_PI= 0
##$NZP= 0
##$OFFSET= 15.70392
##$PC= 1
##$PHC0= -12282.34
##$PHC1= 22.00101
##$PH_mod= 1
##$PKNL= yes
##$PPARMOD= 0
##$PSCAL= 0
##$PSIGN= 0
##$REVERSE= no
##$SF= 200.130013532006
##$SI= 16384
##$SIGF1= 3
##$SIGF2= 2
##$SINO= 400
##$SIOLD= 16384
##$SREGLST= <1H.CDCl3>
##$SSB= 0
##$STSI= 0
##$STSR= 0
##$SW_p= 3612.71676300578
##$SYMM= 0
##$S_DEV= 0
##$TDeff= 0
##$TDoff= 0
##$TI= <>
##$TILT= no
##$TM1= 0
##$TM2= 0
##$TOPLEV= 0
##$USERP1= <user>
##$USERP2= <user>
##$USERP3= <user>
##$USERP4= <user>
##$USERP5= <user>
##$WDW= 1
##$XDIM= 8192
##$YMAX_p= 0
##$YMIN_p= 0
$$ End of Bruker specific parameters
$$ ---------------------------------
##NTUPLES= NMR FID
##VAR_NAME=  TIME,          FID/REAL,        FID/IMAG
##SYMBOL=    X,             R,               I
##VAR_TYPE=  INDEPENDENT,   DEPENDENT,       DEPENDENT
##VAR_FORM=  AFFN,          ASDF,            ASDF
##VAR_DIM=   8192,          8192,            8192
##UNITS=     SECONDS,       ARBITRARY UNITS, ARBITRARY UNITS
##FACTOR=    0.0002496,     1,               1
##FIRST=     0,             0,               0
##LAST=      2.0444736,     0,               0
##MIN=       0,             -747488,         0
##MAX=       2.0444736,     538568,          0
$$ Real data points
##PAGE= N=1
##DATA TABLE= (X++(R..R)), XYDATA
$$ plain form
0 0 0 0 0 0 0 0 0 8 -8 8 -8 16 -16 24 -32 37 -48 56 -68 80 -100 120 -142 168 -196 230 -266 308 -356 409
30 409 -468 535 -607 688 -776 875 -985 1102 -1233 1375 -1531 1703 -1890 2094 -2317 2558
46 2558 -2824 3114 -3432 3779 -4165 4588 -5057 5577 -6161 6818 -7563 8414 -9400 10564
60 10564 -11948 13637 -15747 18471 -22139 27361 -35431 49634 -81846 307067 -296992 -595129
72 -595129 538568 51453 -448623 188984 327856 -242038 -88458 105886 26571 -37896
82 -37896 -104636 7241 263860 -38381 -238537 75771 60828 -145068 124537 132936 -144879
93 -144879 -44220 40273 -74494 61944 38862 -119736 98355 129322 -199347 -66027 141292
104 141292 -73259 -14564 186637 -88759 -191314 85010 55728 -63153 60320 30116
$$ packed form
0@%%%%%%%Qj6J6j6K4l2M0n6O9q5J04j24J48j80K20k62L10l64M26m96N74o64P65
30D09q77J003j142J295j464J651j860K087k335K608k906L234l593L984m411M875
46B558n382N938o546P211p944Q753r645J0634j1738J2979j4381J5977j7814J9964
60A0564k2512K5585k9384L4218m0610M9500o2792Q5065j31480L88913o04059k98137
72e95129J133697m87115n00076O37607J38872n69894J53580J94344p9315o4467
82c7896o6740J11877K56619l02241k00156L14308j4943k05896K69605Q399k77815
93a44879J00659Q4493j14767J36438k3082j58598K18091L0967l28669J33320K07319
104A41292k14551N8695K01201k75396j02555K76324k9282j18881J23473l0204
$$ plain form
114 30116 -69124 -3109 3006 -13127 4895 -51356 55483 151583 -129483 -182186 152427 53732
126 53732 -156478 130627 131932 -232752 -67841 191085 -26832 -85656 73355 20234 -355
137 -355 2113 -111336 10127 131008 -63430 -18771 156354 -103965 -193044 153795 129258
148 129258 -114664 -1164 68732 -41767 -15512 -9809 -11241 85413 -4404 -66614 108651
159 108651 -8123 -209755 79265 202078 -104311 -53529 115693 -90348 -81597 126938
169 126938 -807 -58848 83872 -16275 -69115 58128 -40701 -72133 130301 52710 -107159
180 -107159 10838 7339 -79064 59574 75092 -54299 -1144 9416 -60488 24530 20012 -59344
192 -59344 60166 61022 -94594 -13219 37737 -85937 29668 130648 -66141 -77987 59997
$$ packed form
114C0116r9240O6015O115j6133J8022n6251J06839R6100k81066n2703L34613r8695
126E3732k10210K87105J305l64684J64911K58926k17917n8824J59011n3121k0589
137c55K468j13449J21463J20881j94438M4659J75125k60319q9079L46839k4537
148A29258k43922J13500O9896j10499K6255N703j432R6654q9817o2210J75265
159A08651j16774k01632K89020J22813l06389N0782J69222k06041Q751K08535
169A26938j27745n8041J42720j00147n2840J27243r8829l1432K02434p7591j59869
180a07159J17997l499q6403J38638J5518j29391N3155J0560o9904Q5018m518p9356
192e9344J19510Q56j55616Q1375N0956j23674J15605J00980j96789j1846J37984
$$ plain form
203 59997 -35731 -47989 80612 4944 -44370 39543 -22306 -48014 35650 -25390 -13963 112355
215 112355 -16199 -120233 44956 29602 -78750 64425 80051 -85886 -25799 44032 -38209
226 -38209 3394 36430 -26882 43648 37841 -105208 -9916 88800 -54832 -7205 125735 -49673
238 -49673 -115352 66631 34556 -50480 44790 29148 -33072 15901 -24227 -36426 66867 3744
250 3744 -48216 85397 9586 -136482 32748 99569 -63819 -155 84777 -57852 -55741
261 -55741 47512 -7052 -3275 43104 -22317 643 27754 -80378 -18938 102844 -22118
272 -22118 -51331 78572 -24474 -104673 57640 55181 -54051 20505 30055 -50733 -4502 487
284 487 -31448 51280 26522 -60635 26576 19388 -99460 15890 101912 -47803 -38080 63184
$$ packed form
203E9997r5728j2258J28601p5668m9314Q3913o1849k5708Q3664o1040J1427J26318
215A12355j28554j04034J65189j5354j08352J43175J5626j65937O0087O9831q2241
226c8209M1603L3036o3312P0530n807j43049R5292R8716j43632M7627J32940j75408
238d9673o5679J81983l2075q5036R5270j5642o2220M8973m0128j2199J03293o3123
250C744n1960J33613p5811j46068J69230O6821j63388O3664Q4932j42629K111
261e5741J03253n4564L777M6379o5421K2960K7111j08132O1440J21782j24962
272b2118k9213J29903j03046q0199J62313k459j09232P4556R550q0788M6231M989
284D87l1935Q2728k4758q7157Q7211p188j18848J15350Q6022j49715R723J01264
$$ plain form
296 63184 -36820 -58570 47366 11672 -14492 30446 -23283 -24917 28629 -42346 -19848 94073
308 94073 -6716 -76094 51909 9261 -88315 41933 71815 -47697 -5162 29809 -42023
319 -42023 -3937 24641 -17175 38725 27391 -70057 6851 49992 -64495 2554 101998 -35764
331 -35764 -60208 56936 -11638 -54071 52113 27488 -23313 23071 -18126 -35675 42337 -3720
343 -3720 -29070 71718 6459 -87042 31612 42129 -64448 21172 69133 -42929 -24133
354 -24133 25249 -30874 3097 35684 -23449 19272 31435 -75226 -11483 75390 -43833 -31964
366 -31964 90754 -21394 -88011 46648 24281 -53481 32082 33602 -36895 -673 -9330 -30427
378 -30427 41879 9361 -45633 47110 18070 -94321 12756 74590 -52575 -18669 72687
$$ packed form
296F3184j00004k1750J05936l5694k6164M4938n3729j634N3546p0975K2498J13921
308I4073j00789o9378J28003m2648r7576J30248K9882j19512M2535L4971p1832
319d2023L8086K8578m1816N5900j1334r7448P6908M3141j14487O7049R9444j37762
331c5764k4444J17144o8574m2433J06184k4625n0801M6384m1197j7549P8012m6057
343c720k5350J00788o5259r3501J18654J0517j06577Q5620M7961j12062J8796
354b4133M9382n6123L3971L2587n9133M2721J2163j06661O3743Q6873j19223J1869
366c1964J22718j12148o6617J34659k2367p7762Q5563J520p0497L6222q657k1097
378c0427P2306l2518n4994R2743k9040j12391J07077O1834j27165L3906R1356
$$ plain form
389 72687 -27949 -59334 28491 10847 -10911 17410 -6890 -106 10007 -47777 -5430 65761
401 65761 -21276 -36451 58539 -7053 -70325 31065 37253 -28274 15623 15500 -28547 8142
413 8142 -4502 -25506 51446 21396 -59907 25388 38128 -72688 -543 82861 -27031 -33825
425 -33825 50115 -16198 -43228 32228 11067 -7734 27839 -15059 -21578 28280 -21694 -21685 64091
438 64091 2277 -56116 35953 14157 -63523 26151 53750 -38447 -7996 30942 -28171 -14186
450 -14186 18676 -6289 19284 12931 -41830 9251 24045 -54561 9288 73649 -43125 -46284
462 -46284 58149 -13498 -55531 46740 21880 -40031 18313 4158 -38729 19213 6861 -29950
474 -29950 40615 18208 -66395 5172 42471 -39310 -6673 48503 -16777 -26688 13435 -8360
$$ packed form
389G2687j00636l1385Q7825j7644k1758K8321k4300O784J0113n7784M2347P1191
401F5761q7037j5175R4990o5592o3272J01390O188o5527M3897j23m4047L6689
413H142j2644k1004P6952l0050q1303Q5295J2740j10816P2145Q3404j09892o794
425c3825Q3940o6313k7030P5456k1161j8801L5573m2898o519M9858m9974RQ5776
438F4091o1814n8393R2069k1796p7680Q9674K7599r2197L0451L8938n9113J3985
450a4186L2862k4965K5573o353n4761N1081J4794p8606O3849O4361j16774l159
462d6284J04433p1647m2033J02271k4860o1911N8344j4155m2887N7942j2352l6811
474b9950P0565k2407q4603P1567L7299q1781L2637N5176o5280r911M0123k1795
$$ plain form
486 -8360 -437 12685 -17594 17384 28446 -53275 -21122 58950 -13097 -36917 51386 9921
498 9921 -57999 9699 33074 -15670 -3274 12176 4827 7711 -22327 -15708 37261 91 -27661
511 -27661 41432 10302 -63647 16291 50325 -33092 -2367 40523 -30046 -17050 36025 -18370
523 -18370 -15432 40523 -8001 -19541 30806 -20071 -34392 46520 16966 -36341 18139 9972
535 9972 -38505 13702 27825 -22262 46 15831 -13285 1716 -2223 -23239 23879 22024 -31609
548 -31609 6566 18742 -45913 -530 56754 -21480 -36480 31701 842 -28096 12692 1854
560 1854 -9364 17234 -9186 -12371 20124 -27766 -27222 61912 14270 -69231 12454 42752 -44169
573 -44169 -13939 50416 -8221 -35725 14217 19962 -10032 -26337 -2638 45090 7656 -52027
$$ packed form
486h360P923J3122l0279L4978J1062q1721L2153Q0072p2047k3820Q8303m1465
498I921o7920O7698K3375m8744J2396J5450p349K884l0038O619N2969l7170k7752
511b7661O9093l1130p3949P9938L4034q3417L0725M2890p0569J2996N3075n4395
523a8370K938N5955m8524j1540N0347n0877j4321Q0912k9554n3307N4480q167
535I972m8477N2207J4123n0087K2308J5785k9116J5001l939k1016M7118j855n3633
548c1609L8175J2176o4655M5383N7284p8234j5000O8181l0859k8938M0788j0838
560A854j1218K6598k6420l185L2495m7890N44Q9134m7642q3501Q1685L0298q6921
573d4169L0230O4355n8637k7504M9942N745k9994j6305K3699M7728l7434n9683
$$ plain form
585 -52027 9740 36992 -43011 -7767 67389 -17595 -57239 34770 26463 -33080 1866 15760
597 15760 -6218 12972 549 -20155 10370 3184 -13355 30845 14166 -44100 -2608 33747
609 33747 -8046 -6640 13484 -8122 789 10496 -11874 2140 6393 -15972 22831 26973 -46883
622 -46883 -17389 49054 -11336 -25560 43824 -5938 -53158 32403 35614 -43460 -10147 34296
634 34296 -4655 -12246 2707 -8478 -1009 2783 1755 20963 -11435 -45021 20351 39920 -31849
647 -31849 -16069 30785 -12760 -17799 21921 -6941 -17797 13497 -718 2508 14755 -36069
659 -36069 -20688 54125 3921 -49476 21828 22296 -42812 4514 40511 -23006 -25461 23859 15540
672 15540 -10293 -19220 -6454 25836 8365 -23570 10889 10318 -35776 8967 45920 -23245 -29905
$$ packed form
585e2027O1767K7252q0003L5244P5156q4984l9644R2009q307n9543L4946J3894
597A5760k1978J9190j2423k0704L0525p186j6539M4200j6679n8266M1492L6355
609C3747m1793J406K0124k1606Q911R707k2370J4014M253k2365L8803M142p3856
622d6883K9494O6443o0390j4224O9384m9762m7220Q5561L211p9074L3313M4443
634C4296l8951p591J4953j1185P469L792j028J9208l2398l3586O5372J9569p1769
647c1849J5780M6854m3545n039L9720k8862j0856L1294j4215L226J2247n0824
659c6069J5381P4813n0204n3397P1304M68o5108M7326L5997o3517k455M9320q319
672A5540k5833q927J2766L2290j7471l1935L4459n71m6094M4743L6953o9165o660
$$ plain form
685 -29905 29958 6151 -17484 12507 -3302 -12973 23348 7577 -17327 6092 -4936 -11809
697 -11809 30795 12183 -34007 1302 20857 -11329 1490 13105 -13702 -1798 16128 -2104
709 -2104 -4569 -5201 -9012 22850 16799 -31138 -5534 23732 -17095 -4380 34528 -16569 -33270
722 -33270 28011 16453 -26992 -1483 9912 -5044 8643 644 -16495 2576 -56 -7297 22562
735 22562 2571 -38876 4681 31790 -17225 -14997 18312 -4901 -11768 12789 -871 -13263
747 -13263 -777 1052 12412 9147 -27623 -11095 29564 -3235 -20535 19936 2043 -27775
759 -27775 14142 20908 -22215 -9513 15562 3655 1270 -5616 -13562 11640 10224 -13761 9863
772 9863 10666 -29362 1338 36298 -12545 -24896 20965 9379 -14136 5684 3058 -7715 5059
$$ packed form
685b9905N9863k3807k3635K9991j5809r671L6321j5771k4904K3419j1028o873
697a1809M2604j8612m6190L5309J9555l2186J2819J1615k6807J1904J7926j8232
709b104k465o32l811L1862o051m7937K5604K9266m0827J2715L8908n1097j6701
722c3270O1281j1558m3445K5509J1395j4956J3687p999j7139J9071k632p241K9859
735B2562j9991m1447M3557K7109m9015K228L3309k3213o867K4557j3660j2392
747a3263J2486J829J1360l265l6770J6528M0659l2799j7300M0471j7893k9818
759b7775M1917O766m3123J2702K5075j1907k385o886p946K5202j416k3985K3624
772I863Q03m0028L0700L4960m8843j2351M5861j1586k3515J9820k626j0773J2774
$$ plain form
785 5059 4771 3356 4484 -16850 -6652 29676 2280 -25166 10955 12926 -17422 3967 16685
798 16685 -11945 -7574 12368 5177 -1926 -9976 -8119 18023 9442 -19951 3215 13589 -20280
811 -20280 -1739 27493 -11415 -21743 17173 7470 -13623 1625 -752 -4169 10740 -2975 -9634
824 -9634 8263 -7916 -12988 23580 5353 -30825 6725 20913 -20076 -6438 19765 -10602
836 -10602 -12046 16298 400 -14425 102 1946 4424 5814 -11720 -4263 11901 -6738 -7027
849 -7027 15728 -3397 -16624 11621 9151 -13295 -2235 5818 1052 5333 -4616 -7755 11105
862 11105 -229 -13116 16498 9937 -26815 1633 27432 -12184 -16332 18618 5792 -12223
874 -12223 3889 5703 -2466 -669 -1331 8376 9032 -16976 -6230 23989 -1780 -20144 15408 11216
$$ packed form
785E059k88j415J128k1334J0198L6328k7396k7446L6121J971l0348K1389J2718
798A6685k8630M371J9942p191p103q050J857K6142q581k9393K3166J0374l3869
811b0280J8541K9232l8908j0328L8916r703k1093J5248k377l417J4909j3715o659
824i634J7897j6179n072L6568j8227l6178L7550J4188m0989J3638K6203l0367
836a0602j444K8344j5898j4825J4527J844K478J390j7534P457J6164j8639k89
849g027K2755j9125j3227K8245k470k2446J1060Q053m766M281r949l139J8860
862A1105j1334j2887K9614o561l6752K8448K5799l9616m148L4950j2826j8015
874a2223J6112J814q169J797o62R707O56k6008J0746L0219k5769j8364L5552m192
$$ plain form
888 11216 -19967 1873 16952 -9401 -7988 9758 3810 -1063 -4185 -5273 8810 3667 -12034
901 -12034 6652 9720 -17154 -2009 18323 -8891 -11982 13627 579 -9361 4209 -1920 -4439
914 -4439 7016 -4281 -4530 11112 -8827 -13314 18537 3431 -22818 8962 15590 -19245 -5003
927 -5003 17246 -6293 -10682 8257 2651 -4911 -3746 -3028 7736 3595 -14553 2601 15561 -14141
941 -14141 -10550 20972 78 -19608 10011 12486 -12976 -4650 9395 1852 -2670 -2787 2184 6818
955 6818 -7174 -6678 15204 2656 -17113 7961 14056 -14040 -4202 15363 -2176 -7522 6831
968 6831 1764 -2581 874 -2301 5385 6180 -10923 -676 14770 -7862 -11153 16712 3825 -16794
982 -16794 5904 11849 -9705 -4816 8832 2103 -3356 -3498 1244 6765 -5166 -8600 11580 5457
$$ packed form
888A1216l1183K1840J5079k6353J413J7746n948m873l122j088J4083n143j5701
901a2034J8686L068k6874J5145K0332k7214l091K5609j3048r940J3570o129k519
914d439J1455j1297k49J5642j9939m487L1851j5106k6249L1780O628l4835J4242
927e003K2249k3539m389J8939n606p562J165P18J0764m141j8148J7154J2960k9702
941a4141L591L1522k0894j9686K9619K475k5462Q326J4045p543m522j17M971M634
955F818j3992M96K1882j2548j9769K5074O095k8096R838J9565j7539n346J4353
968F831n067m345L455l175P686P95j7103J0247J5446k2632l291K7865j2887k0619
982a6794K2698N945k1554M889J3648o729n459j42M742N521j1931l434K0180o123
$$ plain form
996 5457 -16955 1202 15322 -10006 -10890 12730 3272 -10633 -435 4243 -104 -3149 -4630 5274
1010 5274 5441 -12414 -4437 15415 -4521 -15656 11128 8756 -15326 -2031 11989 -4682 -7554
1023 -7554 4741 3562 -2310 -4348 -1013 5867 -827 -8054 5794 6452 -10904 -1222 11707 -4790
1037 -4790 -7266 8883 1417 -6926 2931 1941 -2436 2621 -292 -1023 5077 -2845 -4474 9420 1868
1052 1868 -10575 5982 8760 -9813 -1909 10982 -2536 -6195 6134 4206 -3501 -3259 1210 6731
1066 6731 84 -7817 4956 8559 -10093 -3726 14004 -2327 -12432 7815 8138 -8653 -4418
1079 -4418 4953 2321 -1223 -3756 335 5988 -4977 -7652 10382 4541 -14777 -270 13660 -5152
1093 -5152 -11153 5719 5914 -6046 -4270 4234 3210 -7096 -5199 9981 4023 -14356 -920 13356
$$ packed form
996E457k2412J8157J4120k5328q84K3620r458j3905J0198M678m347l045j481R904
1010E274J67j7855P977J9852j9936j1135K6784k372k4082J3295J4020j6671k872
1023g554J2295j179n872k038L335O880o694p227J3848O58j7356R682J2929j6497
1037d790k476J6149p466q343R857r90m377N057k913p31O100p922j629J3894p552
1052A868j2443J6557K778j8573P904J2891j3518l659J2329j928p707K42M469N521
1066F731o647p901J2773L603j8652O367J7730j6331j0105K0247L23j6791M235
1079d418R371k632l544k533M091N653j0965k675J8034n841j9318J4507J3930j8812
1093e152o001J6872J95j1960J776Q504j024j0306J897J5180n958j8379J3436J4276
$$ plain form
1107 13356 -6197 -10755 9379 2817 -11153 3122 7162 -6611 -4305 3895 1811 614 -2125
1120 -2125 -3959 3242 1635 -4674 2876 3312 -7651 78 9296 -3245 -7052 5262 3984 -2618
1134 -2618 1080 860 -1065 583 343 3194 3099 -7199 -2137 11979 151 -11285 6373 8599 -9342
1149 -9342 -1017 11718 -3619 -9456 7453 8579 -5554 -6710 3553 6813 -2164 -6161 4503
1162 4503 4489 -7719 -513 11581 -3357 -11552 5987 9552 -5629 -6435 2285 3398 -693 -2947
1176 -2947 1163 3130 -6631 -4147 11444 1597 -15471 1579 13890 -5912 -9591 6847 1541
1189 1541 -7971 2550 6037 -5037 -7646 2070 7559 -535 -8440 -245 6233 -3039 -3383 5059 -2707
1204 -2707 -6819 5221 5923 -5881 -5284 1658 3834 2444 -3396 -3406 3415 502 -3062 6470 1365
$$ packed form
1107A3356j9553m558K0134o562j3970J4275M040j3773K306Q200k084j197k739
1120b125j834P201j607o309P550M36j0963P729R218j2541l807J2314j278o602
1134b618L698k20j925J648k40K851r5j0298N062J4116j1828j1436J7658K226j7941
1149i342Q325J2735j5337n837J6909J126j4133j156J0263L260q977l997J0664
1162D503j4j2208P206J2094j4938q195J7539L565j5181q06Q720J113m091k254
1176b947M110J967r761K484J5591r847j7068J7050J2311j9802l679J6438n306
1189A541r512J0521L487j1074k609R716N489q094p905Q195O478r272l44Q442p766
1204b707m112J2040P02j1804N97O942K176j390n840j0O821k913l564R532n105
$$ plain form
1219 1365 -11621 2127 13421 -5162 -9759 6641 4262 -4744 3140 3828 -5352 -2636 5165 5321
1233 5321 -1065 -7082 -13 9775 584 -7891 2974 4488 -5728 1779 8595 -5266 -8552 6736
1247 6736 8350 -3470 -5852 983 4498 174 -2108 2119 192 -5308 2462 8992 -3875 -10079
1261 -10079 3729 7977 -2411 -4907 600 731 -988 530 2976 -1778 -8189 589 10342 -2170
1275 -2170 -11479 2705 7213 -4280 -2099 3921 -4246 -5560 5390 4745 -5382 -6658 769 5992
1289 5992 1402 -6430 -1758 4385 -1790 -2099 5830 -1687 -9665 3489 10332 -3717 -9118 1707
1303 1707 5565 -560 -2919 1302 636 -4245 1041 8754 -1668 -10937 3061 10865 -3645 -6293
1317 -6293 3555 1751 -2811 3702 3502 -4291 -3429 3664 6240 487 -6612 -1218 7904 1841 -5695
$$ packed form
1219A365j2986J3748J1294j8583m597J6400k379r006P884O88r180K716P801J56
1233E321o386o017P069R788r191q475J0865J514j0216P507O816j3861l286J5288
1247F736J614j1820k382O835L515m324k282M227j927n500P770O530j2867o204
1261a0079J3808M248j0388k496N507J31j719J518K446m754o411Q778R753j2512
1275b170r309J4184M508j1493K181O020q167j314J0950o45j0127j276P427N223
1289E992m590p832M672O143o175l09P929p517p978J3154O843j4049n401J0825
1303A707L858o125k359M221o66m881N286P713j0422r269J3998P804j4510k648
1317f293R848j804m562O513k00p793Q62P093K576n753p099N394R122o063p536
$$ plain form
1332 -5695 1872 2397 -4896 1873 8669 -3569 -8860 4672 7909 -2089 -4711 1229 1582 -1558 1075
1347 1075 3433 -2384 -6378 3455 8064 -4735 -7682 3648 4248 -3081 -205 1746 -3663 -2015 4355
1362 4355 3259 -4315 -5791 1220 5906 -937 -6121 668 2814 -2681 -87 3703 -3253 -5581 3116
1377 3116 5974 -2961 -7091 116 5806 -392 -5488 1521 2799 -5169 -543 8297 -2407 -10029 4080
1392 4080 9602 -4277 -6762 3970 2641 -3288 573 3983 -2270 -4988 3155 6745 -2038 -6561
1406 -6561 2616 6117 -1669 -2788 2674 -265 -2313 3042 4096 -2983 -3807 2256 4888 511 -3563
1421 -3563 -517 3908 546 -1945 1967 526 -4284 1831 5939 -2265 -5535 2540 4603 -1600 -2167
1436 -2167 1722 127 -2124 1417 3421 -2097 -4949 1856 5284 -2350 -5275 2095 2372 -3241 -353
$$ packed form
1332e695P567N25p293O769O796j2238n291J3532L237r998k622N940L53l140K633
1347A075K358n817l994R833M609j2799k947J1330O00p329K876J951n409J648O370
1362D355j096p574j476P011M686o843n184O789K146n495K594L790o956k328Q697
1377C116K858q935m130P207N690o198n096P009J278p968M626Q840j0704p622J4109
1392D080N522j3879k485J0732j329n929L861L410o253k718Q143L590q783m523
1406f561R177L501p786j119N462k939k048N355J054p079q24O063K632m377m074
1421c563L046M425l362k491L912j441m810O115M108q204l270Q075K063o203n67
1436b167L889j595k251L541K004n518k852O805L428p634k925P370K77n613K888
$$ plain form
1451 -353 3313 -2274 -3993 2570 3974 -2775 -4752 1029 4051 -1420 -4218 1885 1974 -4110 -530 5345
1467 5345 -2013 -6903 2985 5442 -3265 -4529 2820 2422 -3030 -1360 3408 235 -4812 878 5988
1482 5988 -2238 -6229 3905 5349 -4084 -2705 4376 365 -3522 1638 3938 -1682 -3417 2042 4685
1497 4685 -1451 -4209 2353 4227 -2409 -1509 4324 149 -3553 2196 3990 -2076 -2936 1596 2850
1512 2850 -546 -2459 1334 2827 -1324 -1764 3734 1078 -5188 940 5641 -1892 -4327 2908 2875 -2736
1528 -2736 -1473 2870 349 -3152 -215 3853 -759 -4945 1441 4908 -3347 -4355 4200 1214 -5838
1543 -5838 956 4670 -3576 -3563 3689 1440 -3335 -627 1697 -181 -1995 -848 1512 153 -2729
1558 -2729 52 3037 -1611 -3576 1901 1942 -2988 -1311 2462 43 -2170 -223 1915 206 -2897
$$ packed form
1451c53L666n587j719O563J404o749j977N781L022n471k798O103Q9o084L580N875
1467E345p358m890R888K457q707j264P349l98n452J670M768l173n047N690N110
1482E988q226l991J0134J444r433J379P081m011l887N160K300n620j735N459K643
1497D685o136k758O562J874o636R00N833m175l702N749J794o066q60M532J254
1512B850l396j913L793J493m151m40N498k656o266O128M701p533k435P235l3n611
1528b736J263M343k521l501K937M068m612m186O386L467q255j008Q555k986p052
1543e838O794L714q246J3P252k249m775K708K324j878j814J147K360j359k882
1558b729K781K985m648j965N477M1m930J677L773k419k213J947K138j709l103
$$ plain form
1573 -2897 -7 4133 -948 -4517 3042 4186 -4128 -2016 5135 192 -3812 1817 3176 -1439 -2062
1588 -2062 1435 3145 -817 -3305 2118 3882 -3168 -2616 5689 1224 -4844 1976 4878 -3022 -2654
1603 -2654 3283 1404 -2053 -828 1855 1647 -1487 -1443 2937 1248 -3811 174 4533 -1970 -3572 3109
1619 3109 1439 -3329 40 2165 -1116 -1665 149 1366 238 -2308 -261 3084 -1642 -3166 3156
1634 3156 1275 -4481 704 3251 -2883 -2276 2807 -149 -2144 -11 391 -99 -485 -1755 910 1815
1650 1815 -3464 -1138 4441 -1490 -5111 3005 2936 -4499 -1370 4197 -251 -3255 1066 2994 -1072
1665 -1072 -2842 1107 3521 -1553 -3460 3538 2806 -3960 -364 4542 -1068 -3506 2693 2938 -1809
1680 -1809 -1339 1036 1985 -237 -1916 1359 2757 -2278 -1484 4317 271 -4505 2089 4217 -2592 -2078
$$ packed form
1573b897K890M140n081l569P559J144q314K112P151m943m004N629J359m615o23
1588b062L497J710l962k488N423J764p050N52Q305m465o068O820K902p900L68
1603b654N937j879l457J225K683k08l134M4M380j689n059L985M359o503j602O681
1619C109j670m768L369K125l281n49J814J217j128k546K047L345m726j524O322
1634C156j881n756N185K547o134O07N083k956j995K133M02m90l86j270K665R05
1650A815n279K326N579n931l621Q116o9p435L129N567m448l004M321J928m066
1665a072j770L949K414n074j907O998p32o766L596M906n610k438O199K45m747
1680a809M70K375R49k222j679L275J398n035P94N801m046m776O594K128o809N14
$$ plain form
1696 -2078 2893 921 -1658 53 1381 611 -1663 -915 2945 388 -4342 990 4195 -2514 -2826 3544
1712 3544 217 -3910 1302 2463 -2290 -2188 1547 1207 -1111 -1771 21 1796 -1524 -1683 2603 -378
1728 -378 -3870 1639 3318 -3148 -2324 2230 526 -1200 -274 -322 20 -437 -1218 1444 908 -3797 7
1745 7 4550 -1635 -4335 3007 1933 -3525 368 2840 -1798 -1818 1606 1892 -474 -2636 342 3530
1761 3530 -584 -3051 2045 1979 -3172 1211 3846 -2075 -2766 3038 2011 -1474 -726 370 1318 527
1777 527 -946 921 1164 -2651 302 4322 -1563 -4314 2594 3362 -2523 -870 1811 -1080 -952 1832
1793 1832 1103 -779 -1964 124 3194 -100 -3999 949 3242 -2142 -1237 2775 -1314 -2761 2570
1808 2570 2199 -2285 -2198 682 1857 129 -2682 -293 1883 -1684 -1179 3039 -929 -4816 2162 3865
$$ packed form
1696b078M971j972k579J711J328p70k274P48L860k557m730N332L205o709l12O370
1712C544l327m127N212J161m753J02L735l40k318o60J792J775l320j59M286k981
1728c78l492N509J679o466Q24M554j704j726R26m8L42m57p81K662n36m705L804
1745GM543o185k700P342j074n458L893K472m638k0L424K86k366k162K978L188
1761C530m114k467N096o6n151M383K635n921o91N804j027l485P48J096R48p91
1777E27j473J867K43l815K953M020n885k751O908P68n885J653K681k891J28K784
1793A832p29j882j185K088L070l294l899M948K293n384R05M012m089j447N331
1808B570l71m484Q7K880J175j728k811K389K176l567N05M218l968l887O978J703
$$ plain form
1824 3865 -3156 -2807 1860 583 -861 341 -226 -1153 -771 93 2188 -467 -4088 469 4166 -1346
1840 -1346 -3285 1753 470 -1896 1881 1840 -2691 -1482 1770 2018 -58 -2288 -503 2883 144 -2003
1856 -2003 2263 484 -3397 2126 4210 -3373 -3367 3525 1592 -1566 198 361 -574 613 1625 736
1872 736 -782 -1999 1445 3657 -1508 -3259 2140 1754 -1028 862 347 -2157 -164 2077 577 -495
1888 -495 -2073 -811 3390 1023 -4571 98 2915 -2105 -888 3058 -1698 -3959 2488 3275 -2670
1903 -2670 -3362 397 2215 -165 -1862 350 713 -2859 302 3958 -2394 -4740 2943 3013 -3215 -968
1919 -968 1527 -1572 -165 2235 -1089 -1990 4 617 1484 631 -3005 -737 2983 -73 -1500 567
1935 567 -663 -786 1865 1465 -1730 -1141 569 2005 1354 -2276 -1303 3197 377 -1514 2283 -66
$$ packed form
1824C865p021L49M667j277j444J202n67r27L82Q64K095k655l621M557L697n512
1840a346j939N038j283k366L777m1m531J209L252K48k076k230J785L386k739k147
1856b003M266j779l881N523K084p583OO892j933l158J764J63r35J187J012q89
1872G36j518j217L444K212n165j751N399l86k782J890n15k504J993K241j500j072
1888d95j578J262M201k367n594M669K817n020J217L946m756k261O447P87n945
1903b670o92L759J818k380j697K212L63l572L161L656o352k346P683P0o228K247
1919i68K495l099J407K400l324r01J994O13Q67q53l636K268L720l056j427K067
1935E67j230j23K651m00l195N89J710J436o51l630R73M500k820j891L797k349
$$ plain form
1951 -66 -3572 2411 4508 -2777 -2794 2906 1480 -1053 984 309 -1340 242 1469 1460 -916 -2665 1272
1968 1272 3307 -1382 -2612 1653 233 -1468 1649 808 -2727 -846 1514 776 -227 -2277 -453
1983 -453 2957 165 -3021 910 1125 -2725 878 3141 -2970 -2939 2529 1578 -1952 -1190 -289 120 395
2000 395 -905 325 474 -2178 119 3495 -1519 -4166 2254 2232 -2257 107 1074 -2077 202 1932
2016 1932 -424 -909 -731 -717 1969 849 -3066 -203 2520 -1041 -690 1661 -1326 -1766 2266 1477 -1575
2033 -1575 -749 336 924 1116 -1160 -458 2011 -696 -744 2844 -826 -3451 2703 3260 -2552 -1160 2400
2050 2400 -529 -630 1983 -270 -1494 526 676 806 176 -2069 546 2506 -1210 -1397 1772 -815
2066 -815 -1184 1872 570 -2081 121 671 178 969 -1125 -911 2394 72 -2288 1211 733 -2888 878
$$ packed form
1951f6l506N983K097p285j7N700j426k533K037o75j649J582J227rk376j749L937
1968A272K035m689j230M265j420j701L117q41l535J881K360p38j003k050J824
1983d53L410k792l186L931K15l850L603K263o111L1N468r51l530P62R01M09K75
2000C95j300J230J49k652K297L376n014k647O420k2m489K364R67l151K279J730
2016A932k356m85J78J4K686j120l915K863K723l561L51K351k987m40M032p89l052
2033a575Q26J085N88J92k276P02K469k707m8L588l670k625O154N57n812J392L560
2050B400k929j01K613k253j224K020J50J30o30k245K615J960l716j87L169k587
2066h15l69L056j302k651K202N50m93P91k094K14L305k322k360L499m78l621L766
$$ plain form
2083 878 2582 -2173 -2128 1966 612 -1185 -394 12 298 -433 -1192 861 630 -2594 -151 3263 -1755
2100 -1755 -3087 2107 1296 -2353 303 1455 -1883 -447 1412 185 -241 -451 -449 1661 367 -2171
2116 -2171 932 1716 -1196 -163 2310 -785 -1354 1678 726 -457 -447 105 613 668 -1121 408 1913
2133 1913 -1330 -747 2511 -422 -2490 2091 1815 -1942 169 1731 -823 -706 1081 82 -274 -221 -377
2150 -377 1222 328 -1966 939 1979 -1925 -854 2572 -453 -1962 1784 895 -1577 -167 735 33
2166 33 -27 -682 -414 1449 -931 -1540 1834 397 -2920 1200 1630 -2274 -954 1914 -432 -1038 439
2183 439 233 -238 -340 -845 702 570 -2032 -163 2036 -1628 -1752 1962 16 -2140 736 1418 -930
2200 -930 -254 410 -2 282 -636 -442 1559 -354 -1953 1351 1190 -2166 447 2415 -1021 -1090 1760
$$ packed form
2083H78J704m755M5M094j354j797P91M06K86p31p59K053k31l224K443L414n018
2100a755j332N194q11l649K656J152l338J436J859j227m26k10KK110j294k538
2116b171L103P84k912J033K473l095n69L032r52j183J0N52N08N5j789J529J505
2133A913l243N83L258k933k068M581k76l757K111J562k554J17J787r99l56N3j56
2150c77J599q94k294K905J040l904J071L426l025j509L746q89k472J410R02p02
2166C3o0o55K68J863k380o09L374j437l317M120M30l904J320K868k346o06J477
2183D39k06m71j02n05J547j32k602J869K199l664j24L714j946k156K876O82k348
2200i30O76O64m12K84r18J94K001j913j599L304j61l356K613J968l436o9K850
$$ plain form
2217 1760 216 -1050 622 487 -102 209 -486 551 1210 -1059 -221 2158 -366 -1481 2088 983
2233 983 -2024 502 1298 -974 -198 1126 289 -10 107 -399 856 252 -1615 749 1192 -1605 -215
2250 -215 1972 -848 -1522 1214 516 -1169 -191 397 129 -21 -709 -346 974 -1191 -1005 1832 -40
2267 -40 -2407 761 1241 -2159 -761 1566 -529 -1000 323 -18 -322 -273 -588 808 113 -1679 143
2284 143 1620 -1412 -1116 1925 -232 -1488 1074 829 -870 -174 614 56 29 -381 -212 1138 -320
2301 -320 -1063 1368 139 -1733 590 1640 -1513 -389 1764 -60 -838 778 159 -119 287 -236 248
2318 248 932 -1091 -224 1853 -532 -1377 1548 721 -1510 560 1042 -727 -162 594 113 79 -475 -586
2336 -586 1238 -24 -1298 721 983 -1747 241 1914 -1284 -1305 1498 434 -927 76 113 -249 -203
$$ packed form
2217A760j544j266J672j35n89L11o95J037O59k269Q38K379k524j115L569j105
2233I83l007K526P96k272P76J324q37k99J17n06J255o04j867K364M43k797J390
2250b15K187k820o74K736o98j685R78N88k68j50o88L63J320k165J86K837j872
2267d0k367L168M80l400J398K327k095m71J323l41l04M9l15J396o95j792J822
2284A43J477l032K96L041k157j256K562k45j699O96P88n58k7m10J69J350j458
2301c20p43K431j229j872K323J050l153J124K153j824p78J616o19k78M06n23M84
2318B48O84k023Q67K077k385q45K925q27k231K070M82j769N65P56m81l4n54j11
2336e86J824j262j274K019K62k730J988J673l198k1K803j064j361J003L7l62M6
$$ plain form
2353 -203 -513 -81 451 -1026 -274 1605 -1025 -1923 1118 694 -1602 179 632 -747 -151 561 -274 -300
2371 -300 -167 -369 871 76 -1420 94 1245 -1051 -262 1460 -835 -1156 1527 200 -857 219
2387 219 606 204 403 -513 -179 981 -171 -307 1324 -212 -1555 1216 1556 -1411 -325 1011 -171
2404 -171 -5 390 -348 -12 445 -244 454 458 -1719 89 2118 -564 -1370 1310 346 -870 554 847
2422 847 -1267 -164 946 396 -203 -617 -312 778 149 -834 636 -4 -1169 715 1358 -1300 -742
2439 -742 1160 -128 -422 205 -728 -337 899 -395 -486 507 -977 -495 1623 -330 -1870 407 952
2456 952 -1359 121 435 -890 -37 275 -12 -491 -658 -325 1426 135 -1451 188 1181 -870 286
2473 286 1366 -1331 -1214 1667 713 -1460 -8 159 -83 563 -36 -486 242 -160 -22 1199 -283 -1551
$$ packed form
2353b03l10M32N32j477P52J879k630q98L041m24k296J781M53j379N96P12q35k6
2371c00J33k02J240p95j496J514J151k296P89J722k295l21K683j327j057J076
2387B19L87m02J99r16L34J160j152j36J631j536j343K771L40k967J086J336j182
2404a71J66L95p38L36M57o89O98Mk177J808K029k682q06K680r64j216J424K93
2422H47k114J103J110n50n99m14L05J090o29r83J470o40j165J884O43k658N58
2439g42J902j288k94O27r33L91J236j294r1R93j484M82K118j953j540K277N45
2456I52k311J480L14j325Q53L12k87m79j67L33J751j291j586J639R93k051J156
2473B86J080k697J17K881r54k173J452J67k42O46n99m50P28m02J38J221j482j268
$$ plain form
2491 -1551 911 1229 -821 -283 353 -296 537 497 -450 31 -183 -230 1285 507 -1688 -143 1928 -366
2509 -366 -902 1022 -346 -1141 1377 948 -1406 -331 824 451 87 -983 -424 79 75 -309 642 -282
2527 -282 -1237 608 1253 -993 -607 298 -204 67 300 -657 -309 531 -78 -460 360 -1089 -527 1374 -132
2546 -132 -1455 419 719 -660 471 206 -1122 -157 942 211 -489 -865 -288 767 171 -980 197
2563 197 418 -1065 642 1264 -1354 -731 1377 396 -600 199 -68 -139 780 164 -257 195 -661 300 1177
2582 1177 87 -1247 630 1069 -161 37 470 -659 13 575 -95 -174 -240 -273 1383 512 -1605 346
2600 346 1122 -650 -99 748 -789 -1133 1172 633 -394 -200 279 296 125 -278 -573 324 -251 -513 941
2619 941 -614 -1412 627 718 -1040 -439 531 -134 95 65 -734 -206 101 14 213 255 -1244 -242 994
$$ packed form
2491a551K462L18k050N38O36o49Q33m0r47M81k14m7J515p78k195J545K071k294
2509c66n36J924j368p95K518m29k354J075J155l73l64j070N59N03ml84R51r24
2527b82r55J845O45k246L86R05n02K71K33r57L48Q40o09l82Q20j449N62J901j506
2546a32j323J874L00j379J131k65j328R65J099p31p00l76N77J055n96j151J177
2563A97K21j483J707O22k618O23K108r81r96P99k67p1R19o16m21M52q56R61Q77
2582A177j090j334J877M39j230J98M33j129O72N62o70p9o6l3J656q71k117J951
2600C46P76j772N51Q47j537l44K305n39j027J94M79J7j71m03k95Q97n75k62J454
2619I41j555p98K039R1j758O01R70o65K29l0p99N28L07q7J99M2j499J002J236
$$ plain form
2638 994 -193 -744 694 -86 -416 425 163 -768 -237 534 326 -99 -453 -566 467 362 -198 446 -64
2657 -64 -1009 637 867 -615 -193 901 73 -344 382 -99 -247 42 198 21 -183 -603 91 1262 -386
2676 -386 -844 569 399 -113 485 293 -603 153 484 150 -277 -525 -43 735 381 -901 443 736 -788
2695 -788 131 889 -638 -760 660 532 -495 47 -163 207 64 -246 -278 19 -542 -432 875 -7 -1104
2714 -1104 483 784 -633 -309 274 -457 19 303 -34 -69 -227 -249 571 205 -835 -114 552 -503 -219
2733 -219 868 -204 -647 541 32 -566 -120 71 97 60 -98 -140 265 -191 -424 586 -115 -834 159 698
2753 698 -608 -276 542 -311 -343 194 -43 -123 110 -19 612 408 -543 7 971 -69 -635 748 244 -461
2773 -461 331 391 -177 12 434 142 -207 -218 67 555 -66 -370 292 306 -740 -45 799 -464 -395 528 302
$$ packed form
2638I94j187n51J438p80l30Q41k62r31N31P71k08m25l54j13J033j05n60O44n10
2657f4r45J646K30j482M22J094q28m17P26m81j48K89J56j77k04m20O94J171j648
2676c86m58J413j70n12N98j92q96P56L31l34m27k48M82P78l54j282J344K93j524
2695g88R19P58j527j22J420j28j027N42k10L70j43l10l2K97n61J10J307q82j097
2714a104J587L01j417L24N83p31M76K84l37l5j58k2Q20l66j040P21O66j055K84
2733b19J087j072m43J188n09n98M46J91K6l7j58m2M05m56k33J010p01p19R93N39
2753F98j306L32Q18q53l2N37k37q0K33j29O31k04r51N50R64j040n66J383n04p05
2773d61P92O0n68J89M22k92l49j1K85M88o21l04O62J4j046O95Q44j263O9R23k26
$$ plain form
2794 302 -522 170 -38 -50 121 -296 -58 360 -424 -244 748 -161 -625 304 235 -745 -254 316 -185 -313 276
2815 276 -150 -284 -34 71 139 311 -505 330 603 -794 -114 757 -68 -403 583 -120 -785 103 144 -120
2835 -120 318 -139 -19 257 -55 -402 500 179 -412 439 512 -392 -11 776 -97 -154 169 -419 196 80 -49
2856 -49 450 329 -597 -14 620 -500 -272 666 81 -642 129 411 -472 99 253 -51 112 166 -124 379
2876 379 -102 -240 202 424 -602 412 576 -412 -143 391 191 3 -118 -56 -209 22 -134 -54 357 -495
2896 -495 -495 243 -57 -621 380 200 -689 42 447 -211 -34 357 -38 -116 -165 -355 12 -186 -475 248 290
2917 290 -791 -107 381 -355 -272 611 170 -325 -123 65 -101 351 -114 -202 539 -314 -131 740 375 -912
2937 -912 319 375 -477 -205 258 -151 -348 403 -18 -204 -254 -97 250 52 -485 219 171 -278 -2 897 -216
$$ packed form
2794C02q24O92k08j2J71m17K38M18p84J80R92r09m64R29o9r80M91N70n01j28N89
2815B76m26j34K50J05O8J72q16Q35K73j397O80Q71q25l35R86p03o65Q88M1k64
2835a20M38m57J20K76l12l47R02l21n91Q51P3r04L81P87q73n7L23n88O15j16j29
2856d9M99j21r26N83O34j120K28R38n85p23P71K82q83N71J54l04J63N4k90N03
2876C79m81j38M42K22j026J014J64r88K69N34k00j88j21O2j53K31j56Q0M11q52
2896d95%P38l00n64J001j80q89P31M05o58J77L91l95p8m9j90L67j98k89P23M2
2917B90j081O84M88p36Q3Q83m41m95K02J88j66M52m65q8P41q53J83Q71l65j287
2937i12J231N6q52K72M63m09j97P51m21j86n0J57L47j98n37P04m8m49K76Q99j113
$$ plain form
2958 -216 -145 335 150 -309 79 271 94 56 -156 -402 -52 -38 -29 306 372 -529 178 396 -759 -174 367 105
2980 105 -119 -8 -65 -89 141 -46 -189 61 -501 -348 309 -113 -610 254 110 -352 282 222 -545 -282 299
3001 299 -130 -28 -107 -247 243 -32 -278 206 110 -341 125 403 -254 -260 351 161 134 154 -268 50 68 130 161
3024 161 117 -306 -93 551 -6 -648 35 536 -232 -41 583 -43 6 386 261 -111 -69 -103 410 287 -177
3045 -177 24 388 -106 -87 354 -191 -504 531 68 -293 -83 174 98 138 128 -51 -11 -236 7 497 97
3066 97 -598 51 658 -317 -145 258 -47 -152 423 -174 -235 -43 -136 293 177 -391 52 232 -266 -289 226
3087 226 51 -339 470 245 -524 -119 103 -105 71 -132 -155 -101 146 -37 83 91 -289 -62 421 -95 -365
3108 -365 69 73 -125 43 -80 8 264 387 85 -15 -229 76 415 160 -320 150 155 -143 216 87 -343 -153
$$ packed form
2958b16P1M80j85m59L88J92j77l8k12k46L50J4RL35O6r01P07K18j155N85N41k62
2980A05k24J11n7k4K30j87j43K50n62J53O57m22m97Q64j44m62O34o0p67K63N81
3001B99m29J02p9j40M90k75k46M84r6m51M66K78o57oO11j90k7K0m22L18J8O2L1
3024A61m4m23K13O44n57o42O83N01p68J91O24o26M9L80j25l72M2l4N13j23m64
3045a77K01L64m94J9M41n45l13J035m63l61K10K57p6M0j0j79M0k25K43M90m00
3066I7o95O49O07r75J72M03l05j05N75n97o1J92r3M29j16n68M43J80m98k3N15
3087B26j75l90Q09k25p69M05K22k08J76k03k3N4K47j83J20Ql80K27M83n16k70
3108c65M34Mj98J68j23Q8K56J23l02j00k14L05L39k55m80M70Nk98L59j29m30J90
$$ plain form
3130 -153 433 113 33 -164 -260 -4 403 -468 -122 147 -132 85 450 -242 91 387 508 -77 -355 196 -78
3151 -78 418 -47 -304 88 -96 78 496 75 -565 35 57 92 -115 223 -2 -224 149 -67 -272 -226 -194 103
3173 103 -130 -397 -150 -8 -93 -296 185 -353 -218 348 104 -475 -79 72 318 212 -226 19 -103 -67 -24
3194 -24 -8 -102 -272 33 388 -347 -271 61 295 -198 516 -78 -238 -83 71 232 -20 -121 -341 363 -81
3215 -81 -346 297 12 -236 62 192 -294 -103 260 213 -80 -182 -89 243 -43 112 311 183 -416 86 395
3236 395 -181 -412 152 131 150 -45 115 -279 140 31 -24 -188 -247 -172 159 122 -426 -30 -193 -57 150 -92
3258 -92 -334 -41 265 128 -192 -281 -106 -133 243 119 247 216 -294 73 109 -117 -335 349 110 -224 -74 -74
3280 -74 95 287 222 -232 -191 -146 17 178 28 -250 70 385 -159 -320 77 -120 234 241 188 -187 -176 56 188
$$ packed form
3130a53N86l20q0j97r6K56M07q71L46K69k79K17L65o92L33K96J21n85k78N51k74
3151g8M96m65k57L92j84J74M18m21o40O00K2L5k07L38k25k22L73k16k05M6L2K97
3173A03k33k67K47J42q5k03M81n38J35N66k44n79L96J51K46j06m38K45j22L6M3
3194b4J6r4j70L05L55p35P6L32K34m93P14n94j60J55J54J61k52j01k20P04m44
3215h1k65O43k85k48K98J30m86J91L63m7k93j02R3L32k86J55J99j28n99N02L09
3236C95n76k31N64k1J9j95J60l94M19j09n5j64n9P5L31l7n48L96j63J36K07k42
3258i2k42K93L06j37l20q9J75k7L76j24J28l1n10L67L6k26k18O84k39l34J50%
3280g4J69J92o5m54M1M5J63J61j50k78L20L15n44j61L97j97L54Pn3l75J1K32J32
$$ plain form
3303 188 140 -234 -90 259 -120 -239 245 -76 8 326 255 -289 -136 299 90 89 397 -86 112 -43 -322 234
3325 234 -68 -256 -39 260 -204 -244 206 -47 3 -44 -120 -134 -127 -157 175 40 -12 -448 55 296 -226 129 48
3348 48 -187 -7 145 -319 -234 250 217 -161 34 -28 220 4 -215 -65 233 -87 -247 16 -238 -329 -139 21
3370 21 -446 -139 -30 -267 39 122 72 -5 -32 56 -79 91 -354 320 307 -234 121 332 -87 -331 66 194
3392 194 -10 -129 116 -207 67 -43 85 298 -71 -337 196 -141 8 172 302 -28 -142 470 -45 -96
3412 -96 120 -81 -104 234 -242 116 56 -172 -104 91 -2 -285 227 32 -102 97 1 -385 -180 43 211 111
3434 111 158 68 125 -263 -222 -176 232 -139 -143 203 -278 164 -14 -114 228 -86 -171 95 -284 -146 -104 424 1
3457 1 -342 166 -74 -146 -171 176 -156 122 -80 -5 84 -64 -252 89 -60 167 24 281 -254 -153 407 -334
$$ packed form
3303A88m8l74J44L49l79j19M84l21Q4L18p1n44J53M35k09jL08m83J98j55k79N56
3325B34l02j88K17K99m64m0M50k53N0m7p6j4Pl0L32j35n2m36N03K41n22L55q1
3348D8k35J80J52m64Q5M84l3l78J95o2K48k16k19J50K98l20j60K63k54r1J90J60
3370B1m67L07J09k37L06Q3n0p7k7Q8j35J70m45O74j3n41L55K11m19k44L97J28
3392A94k04j19K45l23K74j10J28K13l69k66N33l37J49J64J30l30j14O12n15n1
3412i6K16k01k3L38m76L58o0k28O8J95r3k83N12j95j34J99r6l86K05K23J68j00
3434A11M7r0N7l88M1M6M08l71mL46m81M42j78j00L42l14q5K66l79J38M2N28m23
3457Al43N08k40p2k5L47l32K78k02P5Q9j48j88L41j49K27j43K57n35J01N60p41
$$ plain form
3479 -334 247 284 61 -230 -127 38 -105 -15 139 -210 81 -19 15 77 -244 -147 77 -61 -174 27 257 -112
3501 -112 -67 149 13 358 78 -254 48 -65 -254 147 22 -102 -179 49 -366 -180 -55 160 -202 -194 191
3522 191 -84 -392 43 -53 30 -190 151 -47 -56 -130 -167 22 -104 110 -34 -96 -154 -118 -31 -18 8 42 -91 -88 3
3547 3 99 45 -101 -298 30 -193 -185 -85 28 -57 -93 216 3 -56 408 25 -38 -39 -27 60 -117 7 -23 17 7 39
3573 39 -29 48 190 52 -95 -122 -191 177 -32 37 238 95 266 -47 -82 85 25 -87 108 133 -129 -130 -133 107
3597 107 -55 145 -283 142 -188 -107 111 128 -360 102 141 38 178 -177 -215 -113 74 320 -109 -199 -142 -197
3619 -197 -1 72 12 47 -41 102 -33 -182 210 -104 414 -27 -203 -110 -208 254 -41 116 -125 74 14 272
3641 272 131 11 -208 25 107 133 87 47 -36 62 0 -29 324 57 11 207 -3 -374 -119 -100 190 162 80 152
$$ packed form
3479c34N81L7k23k91J03J65j43R0J54l49K91j00L4O2l21R7K24j38j13K01K30l69
3501a12M5K16j36L45k80l32L02j13j89M01j25j24p7K28m15J86J25K15l62QL85
3522A91k75l08M35r6Q3k20L41j98rp4l7J89j26K14j44o2n8L6Q7J3K6L4j33LR1
3547CR6n4j46j97L28k23QJ00J13q5l6L09k13n9M64l83o3jJ2Q7j77J24l0M0j0L2
3573C9o8P7J42j38j47k7o9L68k09O9K01j43J71l13l5J67o0j12J95K5k62jlK40
3597A07j62K00m28M25l30Q1K18J7m88M62L9j03J40l55l8J02J87K46m29r0N7n5
3619a97J96P3o0L5q8J43j35j49L92l14N18m41j76R3r8M62k95J57k41J99o0K58
3641B72j41j20k19K33Q2K6m6m0q3R8o2k9L53k67m6J96k10l71K55J9K90k8q2P2
$$ plain form
3665 152 34 160 -91 -43 -47 148 -125 70 -108 -326 39 -46 -59 118 -143 18 295 137 -128 -143 -139 80 -8
3688 -8 -304 -130 7 202 160 43 -45 -82 29 -64 -143 -129 371 21 -15 134 -423 -7 159 49 -26 -152 -173 -106
3712 -106 97 -109 -48 113 -384 -75 -151 35 -53 -180 177 127 -138 42 175 34 -142 51 -23 32 -102 115
3734 115 63 -317 225 124 120 -286 38 -257 -85 164 148 8 33 59 45 40 354 -162 -35 127 112 181 -51 -39
3758 -39 -42 311 -38 -393 79 30 30 147 94 113 209 242 73 51 -39 -101 328 16 -199 -44 273 -242 103 297
3782 297 -498 -39 -126 -21 135 7 -151 104 212 -106 21 -175 97 -171 171 -173 -84 -118 65 -197 -149
3803 -149 135 -143 104 -120 -252 55 18 4 250 23 -98 -168 181 -203 59 -39 -84 34 -67 57 1 -78
3825 -78 -79 18 230 170 163 -275 -14 122 -230 3 -18 224 -72 151 -171 -89 162 -8 -47 96 185 110 46 99 -171
$$ packed form
3665A52j18J26k51M8mJ95k73J95j78k18L65q5j3J77k61J61K77j58k65j5MK19q8
3688hk96J74J37J95m2j17q8l7J11r3p9J4N00l50l6J49n57M16J66j10p5j26k1O7
3712a06K03k06O1J61m97L09p6J86q8j27L57n0k65J80J33j41j76J93p4N5j34K17
3734A15n2l80N42j01mm06L24k95J72K49j6j40K5K6j4nL14n16J27J62j5O9k32J2
3758c9lL53l49l55M72m9%J17n3J9R6L3j69k2r0o2M29l12k15J55L17n15L45J94
3782B97p95M59q7J05J56j28j58K55J08l18J27j96K72k68L42l44Q9l4J83k62M8
3803a49K84k78K47k24j32L07l7j4K46k27j21p0L49l84K62r8m5J18j01J24n6p9
3825g8jR7K12o0pm38K61J36l52K33k1K42k96K23l22Q2K51j70l9J43Q9p5o4N3k70
$$ plain form
3850 -171 -118 60 219 -34 -97 -44 -21 241 -16 18 -86 48 -60 306 -24 86 -37 105 269 -188 -367 68
3872 68 197 89 -289 154 16 337 -52 179 346 -348 50 96 243 17 391 -49 -94 326 -316 -153 113
3893 113 116 2 -208 -33 -73 -129 -126 -123 108 60 50 33 -119 -4 -164 275 54 72 109 -287 -113 -113 268 -42 -144
3918 -144 -118 94 49 -3 240 85 58 106 71 -41 35 -156 289 -52 297 -56 -311 110 -12 -200 63 -17 -110
3941 -110 160 -20 125 96 0 -89 -10 16 93 81 -2 -176 127 -47 162 194 57 114 273 -14 207 -87 136
3964 136 -241 -114 163 16 151 230 123 58 81 -78 89 -34 -15 322 -44 -280 -58 -193 -196 -275 -141 11
3986 11 114 9 65 -106 -302 136 43 -141 5 -253 -127 -69 -70 -161 -51 171 38 39 132 -78 10 120 -150 86
4010 86 -5 -31 -138 -57 -39 89 -1 -55 103 121 -174 -232 -73 -15 -173 -121 -94 -93 30 6 52 -39 274 -133 123 304
$$ packed form
3850a71N3J78J59k53o3N3K3K62k57L4j04J34j08L66l30J10j23J42J64m57j79M35
3872F8J29j08l78M43j38L21l89K31J67o94L98M6J47k26L74m40m5M20o42J63K66
3893A13Lj14k10J75m0n6LLK31m8j0j7j52J15j60M39k21J8L7l96J74%L81l10j02
3918a44K6K12m5n2K43j55k7M8l5j12P6j91M45l41L49l53k55M21j22j88K63q0r3
3941a10K70j80J45k9r6q9P9K6P7j2q3j74L03j74K09L2j37N7J59k87K21k94K23
3964A36l77J27K77j47J35P9j07o5K3j59J67j23J9L37l66k36K22j35lp9J34J52
3986A1J03j05N6j71j96M38r3j84J46k58J26N8jr1J10K22j33JR3k10Q8J10k70K36
4010H6r1k6j07Q1J8J28r0n4J58J8k95n8J59N8j58N2K7JJ23k4M6r1L13m07K56J81
$$ plain form
4036 304 168 9 211 -78 76 3 -102 -43 149 30 -297 121 -39 -97 60 144 39 17 -78 129 303 55
4058 55 -281 17 76 -64 -81 34 -61 137 -56 -107 -26 -205 20 202 -69 -213 203 174 -63 -44 -125 -146 -12
4081 -12 -94 -4 100 2 64 -229 -248 -278 -114 30 195 1 161 -26 22 217 -51 31 43 91 -54 29 62 187
4105 187 143 -112 -65 -7 -65 205 -71 0 60 -105 -60 -211 125 70 -220 -16 101 -73 229 193 66 -217 380
4128 380 51 -57 -19 -13 -100 -42 26 -222 -68 168 -19 14 198 -58 -36 13 -170 -112 -21 175 -352 -30 -57 -232
4152 -232 123 14 97 -1 4 -292 160 97 13 -396 91 -248 49 217 72 208 76 -23 -156 14 105 -71 154
4175 154 -269 55 160 -113 32 82 -9 -338 -2 12 -79 -85 -182 -95 -13 143 -5 -3 -138 -63 -267 85 192 147
4199 147 82 -14 -123 -95 -54 19 39 -91 49 138 52 -42 -230 19 -126 -112 -245 285 -45 -44 200 248 -110 -399
$$ packed form
4036C04j36j59K02k89J54p3j05N9J92j19l27M18j60n8J57Q4j05k2r5K07J74k48
4058E5l36K98N9j40j7J15r5J98j93n1Q1j79K25J82k71j44M16k9k37J9q1k1J34
4081a2q2R0J04r8O2k93j9l0J64J44J65j94J60j87M8J95k68Q2J2M8j45Q3L3J25
4105A87m4k55M7N8n8K70k76P1O0j65M5j51L36n5k90K04J17j74L02l6j27k83N97
4128C80l29j08L8Oq7N8O8k48J54K36j87L3J84k56K2M9j83N8R1J96n27L22k7j75
4152b32L55j09Q3r8Nk96M52o3q4m09M87l39K97J68j45J36j32r9j33J70R1j76K25
4175A54m23L24J05k73J45N0r1l29L36J4r1or7Q7Q2J56j48Kj35P5k04L52J07m5
4199A47o5r6j09K8M1P3K0j30J40Q9q6r4j88K49j45J4j33N30l30JK44M8l58k89
$$ plain form
4223 -399 17 157 228 -202 7 -177 -136 -162 19 -20 -93 102 102 -25 101 144 189 -65 -37 257 165 -108 159 -327
4247 -327 -234 117 -20 -107 85 -293 238 146 22 -79 -267 47 -102 -158 -1 -14 165 217 -417 52 -163 7
4269 7 -35 70 4 96 -8 -62 103 105 -88 180 159 4 -51 66 -134 28 -29 -152 98 49 -383 -38 -49 202
4293 202 50 48 164 104 -18 359 -67 -83 -152 182 -1 -2 73 -70 485 190 -7 -99 -181 -368 -3 -146 102
4316 102 14 -108 172 -72 385 -17 -186 132 254 55 -43 7 36 -194 -131 -26 -194 -344 -77 239 8 -194
4338 -194 -120 137 -5 -27 257 112 -252 49 -180 -79 -68 -121 134 -13 -40 -247 -12 -64 305 145 -247 -222
4360 -222 263 38 -275 -46 -235 -39 159 -110 -57 -58 -125 -35 -104 -101 -50 102 -11 -75 14 35 -215 142 201 -70
4384 -70 -204 -270 -86 -36 -42 -280 -113 137 28 -64 10 -22 81 279 -177 131 178 18 -42 29 19 -221 -77 126
$$ packed form
4223c99M16J40P1m30K09j84M1k6J81l9p3J95%j27J26M3M5k54K8K94r2k73K67m86
4247c27R3L51j37q7J92l78N31r2j24j01j88L14j49n6J57j3J79N2o34M69k15J70
4269Gm2J05o6R2j04n4J65Kj93K68k1j55n5J17k00J62n7j23K50m9m32L45j1K51
4293B02j52kJ16o0j22L77m26j6o9L34j83jP5j43N55k95j97r2q2j87L65j43K48
4316A02q8j22K80k44M57m02j69L18J22j99r8N0K9k30O3J05j68j50K67L16k31k02
4338a94P4K57j42k2K84j45l64L01k29J01J1n3K55j47k7k07K35n2L69j60l92K5
4360b22M85k25l13K29j89J96J98k69N3jo7R0o9LN1J52j13o4Q9K1k50L57N9k71
4384g0j34o6J84N0ok38J67K50j09r2P4l2J03J98m56L08M7j60o0P1j0k40J44K03
$$ plain form
4408 126 -36 156 -76 -268 -227 258 -246 -226 -4 85 52 47 87 140 162 -291 67 119 -418 -337 176 -115 -18 149
4432 149 -14 -87 280 -140 -234 -34 -14 147 -365 166 16 -81 -72 -57 -25 -140 -192 -54 -231 -126 -110 168 -44
4455 -44 234 -52 85 -200 -134 -201 145 -16 -69 32 -183 17 153 -105 81 -17 131 24 -130 -10 81 -5
4477 -5 101 9 75 87 145 -33 -37 101 181 -150 16 90 -86 18 137 126 -34 223 294 112 -6 -115 -41 3 8
4502 8 103 0 75 -29 108 -158 -345 112 -163 45 -64 23 96 -30 -2 -82 32 -168 -27 -86 -1 70 -166 1
4526 1 10 -8 209 111 -266 -17 -20 -124 39 -172 67 -149 66 225 -304 -88 126 144 -354 -150 75 271 77
4549 77 -298 48 117 167 70 49 211 -41 14 105 214 -77 -74 -43 149 70 27 -126 -249 -119 115 159 -36 -34 -146
4574 -146 -16 -7 206 139 40 314 209 112 -231 -270 9 -292 -155 93 68 -9 80 -56 -66 -171 -187 7 -102 1
$$ packed form
4408A26j62J92k32j92M1M85n04K0K22Q9l3nM0N3K2m53L58N2n37Q1N13k91R7J67
4432A49j63p3L67m20r4K00K0J61n12N31j50r7RJ5L2j15n2J38j77J05J6K78k12
4455d4K78k86J37k85O6o7L46j61n3J01k15K00J36k58J86r8J48j07j54J20R1q6
4477eJ06r2O6J2N8j78mJ38Q0l31J66P4j76J04J19j1j60K57P1j82j18j09P4M4N
4502HR5j03P5j04J37k66j87M57k75K08j09Q7P3j26K8q0J14k00J41n9Q5P1k36J67
4526ARj8K17r8l77K49lj04J63k11K39k16K15J59n29K16K14J8m98K04K25J96j94
4549G7l75L46O9N0r7k1J62k52N5R1J09k91LL1J92p9m3j53j23J30K34M4j95Kj12
4574a46J30RK13o7r9K74j05r7l43l9K79l01J37K48k5p7Q9j36j0j05j6J94j09J03
$$ plain form
4598 1 8 237 93 -10 -194 -87 -65 -37 -28 -108 120 -235 243 -147 3 -171 -15 -239 68 257 -56 289 86
4621 86 -18 -94 128 52 82 22 -217 96 -110 -198 -116 -80 3 -130 80 239 -30 -25 82 -135 -22 -234 -113 157
4645 157 135 18 81 111 63 -23 99 -80 -62 -49 -181 19 31 -99 150 137 -399 189 221 -58 -30 161 -128 -11
4669 -11 -163 34 57 16 34 -83 75 9 51 24 -16 -212 25 -130 -312 -74 46 -31 115 107 104 156 141 32 -102
4694 -102 -169 70 -6 69 -187 105 111 87 -220 18 -7 -111 -151 -75 69 -294 -40 42 -113 -71 -182 190 11 -47
4718 -47 -113 -29 73 -125 68 97 -128 7 14 64 227 -103 141 13 158 74 -224 219 -166 202 144 -98 158
4741 158 50 53 67 163 29 -328 -109 158 118 121 -49 81 135 -4 206 -60 -14 -164 266 -25 123 113 120 -147
4765 -147 290 -53 75 -60 -186 137 -43 50 61 -96 184 42 -33 -166 -88 106 147 -202 73 387 -69 -321
$$ packed form
4598APK29j44j03j84J07K2K8Rq0K28l55M78l90J50j74J56k24L07J89l13L45k03
4621H6j04p6K22p6L0o0k39L13k06q8Q2L6Q3j33K10J59k69NJ07k17J13k12J21K70
4645A57k2j17O3L0m8q6J22j79J8J3j32K00J2j30K49j3n36N88L2k79K8J91k89J17
4669a1j52J97K3m1J8j17J58o6M2k7m0j96K37j55j82K38J20p7J46qlN2j5j09j34
4694a02o7K39p6P5k56K92Ok4l07K38k5j04m0P6J44l63K54Q2j55M2j11L72j79n8
4718d7o6Q4J02j98J93K9k25J35PN0J63l30K44j28J45q4k98M43l85L68n8k42K56
4741A58j08LJ4R6j34l57K19K67m0Lj70J30N4j39K10k66M6j50M30k91J48j0Pk67
4765a47M37l43J28j35j26L23j80R3J1j57K80j42p5j33P8J94M1l49K75L14m56k52
$$ plain form
4787 -321 129 112 -23 -72 57 75 -70 193 50 -121 65 68 -37 -186 -96 -97 11 -29 224 150 -19 -25 -54 -298
4811 -298 -166 -16 96 -41 70 -234 -144 308 215 76 41 67 -115 -139 248 -85 212 19 22 -4 127 1 46
4834 46 -80 -1 -139 36 138 106 165 -361 -21 -34 76 0 -165 58 117 -48 -44 85 0 -210 -276 347 -22 -56
4858 -56 -103 47 -118 -68 45 -20 11 -234 -32 157 185 20 -24 -42 -124 -286 18 45 -109 -188 -47 -168 103 -250
4882 -250 243 -135 -133 191 20 -185 -77 -166 221 146 155 167 3 -118 121 -132 -50 280 -20 144 -77 85 161
4905 161 224 -56 -39 -109 97 -89 185 6 -147 -130 170 103 -85 -48 99 -91 -196 60 103 -34 -285 87
4927 87 -46 -122 -124 107 -102 -32 243 157 9 304 160 97 -357 323 -24 -84 295 179 164 -36 239 -64 70
4950 70 117 -235 -34 30 143 0 -69 -58 -48 216 164 200 -35 9 156 -180 -222 205 -161 -286 279 79 -130
$$ packed form
4787c21M50j7j35m9J29J8j45K63j43j71J86Lj05j49R0jJ08m0K53p4j69ok9k44
4811b98J32J50J12j37J11l04R0M52r3j39l5K6j82k4L87l33K97j93Lk6J31j26M5
4834D6j26P9j38J75J02l2N9n26L40j3J10p6j65K23N9j65MJ29q5k10o6O23l69l4
4858e6m7J50j65N0J13o5L1k45K02J89K8j65m4j8q2j62L04K7j54p9J41j21K71l53
4882b50M93l78KL24j71k05J08q9L87p5RJ2j64j21K39k53Q2L30l00J64k21J62P6
4905A61O3k80J7p0K06j86K74j79j53J7L00o7j88L7J47j90j05K56M3j37k51L72
4927H7j33p6kK31k09P0K75q6j48K95j44o3m54O80l47o0L79j16j5k00K75l03J34
4950G0M7l52K01O4J13j43o9J1J0K64n2L6k35M4J47l36m2M27l66j25N65k00k09
$$ plain form
4973 -130 49 108 -275 -35 -213 4 -16 -485 -73 102 38 -60 126 -74 -58 92 71 107 -212 -17 -114 102 -11
4996 -11 -132 -231 -161 31 -15 -130 56 -72 146 -34 34 20 -117 43 95 -331 297 50 -7 165 123 -29 -148
5019 -148 119 -49 -146 -290 -88 -178 133 139 -121 -137 386 131 35 160 -35 -9 135 279 -88 -175 -399 -57 176
5042 176 -59 -59 21 -19 -31 62 -171 -8 -17 -107 -63 -38 -41 -219 8 130 -281 -95 -334 -170 -25 -269 -179 -89 -209
5067 -209 86 250 -224 74 101 -222 -21 -160 -9 -269 123 1 -100 -477 143 145 131 -21 -129 22 140
5088 140 354 -104 -53 -241 136 24 -18 -386 -80 -46 -35 -369 -110 108 181 172 -114 -80 -60 -149 169 -3 4 -58
5112 -58 -24 -19 250 214 186 -197 -324 245 218 18 54 267 55 22 -210 128 71 -43 -125 76 -421 11 77 13
5136 13 -15 -19 315 -153 -149 -109 -44 -45 164 -44 48 -386 -277 -152 72 -177 126 6 -291 -78 162 274 -172 -22
$$ packed form
4973a30J79N9l83K40j78K17k0m69M12J75o4r8J86k00J6J50k1L6l19J95r7K16j13
4996a1j21r9P0J92m6j15J86j28K18j80O8j4j37J60N2m26O28k47n7J72m2j52j19
5019a48K67j68r7j44K02r0L11Ok60j6N23k55r6J25j95K6J44J44l67q7k24L42K33
5042A76k35%Q0m0j2R3k33J63rr0M4K5lj78K27J22m11J86k39J64J45k44R0R0j20
5067b09K95J64m74K98K7l23K01j39J51k60L92j22j01l77O20Kj4j52j08J51J18
5088A40K14m58N1j88L77j12m2l68L06L4J1l34K59K18P3rk86L4K0q9L18j72Po2
5112e8L4NK69l6k8l83j27N69k7k00L6K13k12l3k32L38n7j14q2K01m97M32O6o4
5136A3k8mL34m68MM0O5jK09k08R2m34J09J25K24k49L03j20k97K13K40J12m46J50
$$ plain form
5160 -22 91 -36 -120 -4 21 201 -33 12 -349 -241 -40 -264 -136 -3 49 -70 4 98 -302 -228 -146 29 -119
5183 -119 -151 42 11 137 50 -106 -238 -60 193 -216 219 221 -137 33 47 -20 17 -111 162 236 143 291 130
5206 130 -28 44 165 50 -72 170 -199 90 -133 149 -48 -117 136 -53 20 -66 -80 26 18 37 42 -77 279
5229 279 220 37 4 -173 94 109 33 212 139 -118 161 -8 103 296 39 -69 25 -64 -209 -136 44 -92 -2
5252 -2 72 -15 -127 -281 123 158 47 -254 201 -25 71 -132 -283 206 -72 -102 -112 56 47 216 21 218 -185
5275 -185 12 -55 -39 114 -142 57 -96 230 -249 -234 144 -54 232 -89 2 -164 53 35 7 -56 -19 -165 -29
5298 -29 258 108 -98 -290 264 180 -42 277 129 -61 -15 -217 26 27 -267 17 -376 -164 301 63 10 147
5320 147 37 -1 152 -141 80 -28 32 39 -231 109 -152 80 -154 -316 -177 233 -203 -137 -8 39 153 -253
$$ packed form
5160b2J13j27q4J16K5J80k34M5l61J08K01k24J28J33N2j19P4R4m00P4Q2J75j48
5183a19l2J93l1J26q7j56j32J78K53m09M35Kl58J70J4o7L7j28K73P4r3J48j61
5206A30j58P2J21j15j22K42l69K89k23K82j97o9K53j89P3q6j4J06qJ9Nj19L56
5229B79n9j83l3j77K67J5p6J79p3k57K79j69J11J93k57j08R4q9j45P3J80j36R0
5252bP4q7j12j54M04L5j11l01M55k26R6k03j51M89k78l0j0J68rJ69j95J97m03
5275a85J97o7J6J53k56J99j53L26m79J5L78j98K86l21R1j66K17j8k8o3L7j46J36
5298b9K87j50k06j92N54q4k22L19j48j90M6k02K43Jk94K84l93K12M65k38n3J37
5320A47j10l8J53k93K21j08O0Pk70L40k61K32k34j62J39M10m36O6J29M7J14m06
$$ plain form
5342 -253 -12 -26 -133 -167 143 -52 -132 -243 -118 -51 -98 119 -166 -192 282 187 9 -71 -225 362 -52 -107 163
5365 163 3 -139 154 71 106 -102 316 108 -35 -17 -237 131 -177 202 14 229 220 -56 -39 -239 -87 21
5387 21 -32 -52 -54 13 -31 9 -118 97 218 -163 -44 217 163 -75 145 -17 -28 -150 89 -76 177 13 -17 -103
5411 -103 -299 17 -374 271 -47 42 70 -193 27 -118 30 139 97 -74 -114 168 -136 -87 -353 -210 7 -42
5433 -42 -79 -80 -7 84 -26 -81 156 -63 179 -164 -237 -134 -24 255 114 -77 -172 -153 206 -90 -74 -43 116 -11
5457 -11 -171 148 187 -119 -64 -175 113 -44 103 -108 -286 214 10 -206 105 -35 -131 -31 -42 103 -187 37
5479 37 -148 -158 -211 49 -78 182 -149 -135 95 -21 -293 -199 82 -52 33 53 -238 41 3 195 90 -122 28
5502 28 110 46 -39 -40 256 -149 -173 323 177 -89 147 317 -39 65 159 -70 34 -26 218 480 32 -131 -161
$$ packed form
5342b53K41j4j07l4L10j95q0j11J25O7m7K17k85k6M74r5j78q0j54N87m14n5K70
5365A63j60j42K93q3L5k08M18k08j43J8k20L68l08L79j88K15rk76J7k00J52J08
5387B1n3k0kO7m4M0j27K15J21l81J19K61n4k38K20j62j1j22K39j65K53j64l0q6
5411a03j96L16l91O45l18Q9K8k63K20j45J48J09m2j71m0K82l04M9k66J43K17m9
5433d2l7jP3R1j10n5K37k19K42l43p3J03J10K79j41j91r5J9L59k96J6L1J59j27
5457a1j60L19L9l06N5j11K88j57J47k11j78N00k04k16L11j40r6J00j1J45k90K24
5479C7j85j0n3K60j27K60l31J4K30j16k72R4K81j34Q5K0k91K79l8J92j05k12J50
5502B8Q2o4q5jK96m05k4M96j46k66K36J70l56J04R4k29J04o0K44K62m48j63l0
$$ plain form
5525 -161 -29 -214 -128 195 -169 -88 -19 96 -88 -115 115 149 -341 123 100 -283 -6 78 -222 73 -83 -61 38
5548 38 -194 49 270 -56 -24 59 -20 15 77 -103 20 -11 -94 310 243 38 -115 -63 -79 -67 212 -51 -88 58
5572 58 -67 14 -46 -105 -41 -89 -221 106 287 139 76 -20 17 -34 -117 -125 237 -120 268 -63 -372 -117 141 223 163
5597 163 35 -119 -51 -91 -89 126 -61 -215 -102 239 278 -166 11 -172 48 73 -9 -96 115 -35 -29 -21 -227 -124
5621 -124 82 -34 -188 53 22 57 -27 -107 111 -69 2 -20 -306 -136 -211 291 66 -5 -107 299 -166 -116 -14
5644 -14 120 182 -143 337 -192 -368 21 -161 240 27 111 -15 -251 86 86 -28 -198 -122 4 192 62 143
5666 143 -219 -164 39 -116 152 159 80 136 175 25 142 -35 -123 8 27 -139 -169 -241 -70 142 -89 -86 136 124
5690 124 -23 -25 -324 -295 -64 30 -40 -120 -192 105 -12 -10 -176 -84 17 124 -92 -215 162 -384 -27 33 -88 -166
$$ packed form
5525a61J32j85Q6L23l64Q1O9J15j84k7K30L4m90M64k3l83K77Q4l00K95j56K2R9
5548C8k32K43K21l26L2Q3p9L5O2j80J23l1q3M04o7k05j53N2j6J2K79k63l7J46
5572E8j25Q1o0n9O4m8j32L27J81j48o3r6L7n1q3qL62l57L88l31l09K55K58Q2o0
5597A63j28j54O8m0KK15j87j54J13L41L9m44J77j83K20K5q2q7K11j50OQk06J03
5621a24K06j16j54K41l1L5q4q0K18j80P1k2k86J70p5N02k25p1j02M06m65N0J02
5644a4J34O2l25M80n29j76L89j82M01k13Q4j26k36L37%j14j70P6J26J88j30Q1
5666A43l62N5K03j55K68Pp9N6L9j50J17j77q8J31J9j66l0p2J71K12k31LK22j2
5690A24j47kk99K9K31R4p0q0p2K97j17Kj66R2J01J07k16j23L77n46L57O0j21p8
$$ plain form
5714 -166 -120 -103 52 31 -72 -147 271 304 -44 -156 -142 25 181 5 24 291 19 -70 28 141 42 -239 110
5737 110 -2 -76 -81 20 -82 42 75 -60 -54 386 152 -19 65 96 119 52 107 126 -30 -75 -78 166 153 105 52 46 207
5764 207 -434 -123 76 36 9 -213 -227 -104 130 -82 213 44 195 -60 -41 -47 195 156 182 -58 -77 66 -244
5787 -244 33 142 155 -44 247 -75 -83 -128 -78 48 -51 -60 32 45 -20 16 135 148 -90 299 27 -109 -175 -96 -205
5812 -205 213 -160 140 210 2 -73 -52 415 -13 -71 124 159 110 86 -144 51 207 117 -28 130 101 101 90 -66
5836 -66 149 71 -42 -131 193 318 -69 78 283 215 -85 187 -202 -99 -121 -316 0 6 -14 179 94 -291 -179
5859 -179 81 -90 -169 -101 -1 -37 90 99 -148 -95 -46 131 88 281 243 104 -43 -153 -5 -17 34 -354 -190 -165
5883 -165 -78 128 0 -128 203 171 -90 -143 70 55 -85 -203 144 75 36 21 -172 -161 86 170 209 -158 165
$$ packed form
5714a66M6J7J55k1j03p5M18L3l48j12J4J67J56j76J9K67k72q9R8J13r9k81L49
5737A10j12p4nJ01j02J24L3j35OM40k34j71Q4L1K3o7N5J9j56m5lK44j3m8n3oJ61
5764B07o41L11J99m0k7k22j4J23K34k12K95j69J51k55J9oK42l9K6k40j9J43l10
5787b44K77J09J3j99K91l22qm5N0J26r9rR2J3o5L6J19J3k38L89k72j36o6P9j09
5812b05M18l73L00P0k08p5K1M67m28n8J95L5m9k4k30J95J56r0j45J58k9%j1j56
5836f6K15p8j13q9L24J25l87J47K05o8l00K72l89J03k2j95L16Ok0J93q5l85J12
5859a79K60j71p9O8J00l6J27Rk47N3M9J77m3J93l8j39j47j10J48j2N1l88J64K5
5883a65Q7K06j28j28L31l2k61n3K13j5j40j18L47o9l9j5j93J1K47Q4L9l67L23
$$ plain form
5906 165 4 9 79 49 50 151 11 -122 76 8 -10 1 200 134 481 -14 151 40 -219 -138 116 3 -231 78
5930 78 -12 -133 191 56 -82 46 -135 155 207 -87 -41 -21 -179 42 56 -132 40 9 -156 -26 128 124 140
5953 140 -187 -60 4 -304 -268 -228 -8 -118 -43 -173 -253 252 -249 -137 -43 -265 1 24 -126 92 -45 64
5975 64 -113 -32 -206 216 -19 17 -112 -64 -152 -140 6 27 194 146 34 9 176 340 -173 32 20 255 -205
5998 -205 7 32 85 26 20 -121 -53 -157 -113 411 -158 40 19 275 -15 41 -10 -229 31 -39 -50 -23 -216 -223 -112
6023 -112 -15 -151 -180 178 75 84 -40 144 -112 -39 156 -106 142 128 79 195 -29 74 -200 -172 -167 100 10 -38
6047 -38 -196 -60 96 56 -56 -163 121 -252 145 113 -78 4 -2 33 -90 132 96 -261 38 2 8 -193 -145 99
6071 99 72 16 -39 -2 -333 310 121 283 30 127 161 -109 121 -67 69 230 -138 0 11 269 -40 10 -58
$$ packed form
5906A65j61NP0l0JJ01j40j33J98o8j8J1J99o6L47m95J65j11k59Q1K54j13k34L09
5930G8r0j21L24j35j38J28j81K90N2k94M6K0j58K21J4j88J72l1j65J30J54mJ6
5953A40l27J27O4l08L6M0K20j10P5j30q0N05n01J12R4k22K66K3j50K18j37J09
5975F4j77Q1j74M22k35L6j29M8q8J2J46K1J67m8j12k5J67J64n13K05j2K35m60
5998b05K12K5N3n9oj41O8j04M4N24n69J98k1K56k90N6n1k19K60p0j1K7j93pJ11
6023a12R7j36k9L58j03Rj24J84k56P3J95k62K48j4m9J16k24J03k74K8NK67r0m8
6047c8j58J36J56m0j12j07K84l73L97l2j91Q2oL5j23K22l6l57K99l6Ok01M8K44
6071I9k7n6n5L7l31O43j89J62k53R7L4k70K30j88J36J61l68J38J1K58l09N0o8
$$ plain form
6094 -58 123 144 162 27 -294 -36 -20 -71 7 -294 -189 -89 42 152 -175 -13 44 85 6 24 78 106 190 -95
6118 -95 -38 58 -170 87 271 -146 -323 172 -69 65 -484 179 70 -156 -96 -337 -202 -103 -195 -17 -115 -140 -7
6141 -7 195 -175 -134 -32 -11 -217 -286 -71 79 10 -90 -116 46 48 -118 146 -157 86 235 49 -357 -110 112
6164 112 194 -93 156 76 -51 -249 -200 -56 52 2 203 150 113 196 -12 -399 53 5 78 31 -71 201 -93
6187 -93 -58 264 -155 65 17 -20 -129 64 -339 255 216 -141 115 -183 66 -22 -22 78 36 -3 258 102 59 22
6211 22 -141 -139 -134 0 77 259 -243 82 -19 -161 -73 371 223 -62 -151 138 44 98 -48 66 -125 207 -35
6234 -35 118 263 -412 -173 -191 -60 -169 44 78 -110 57 197 50 -160 -211 -68 157 -283 379 -15 -315
6255 -315 -132 32 -58 -262 275 22 -40 -98 111 -94 -33 64 -27 14 -277 2 176 134 211 20 -93 58 6
$$ packed form
6094e8J81K1J8j35l21K58J6n1P8l01J05J00J31J10l27J62N7M1p9J8N4K8Q4k85
6118i5N7R6k28K57J84m17j77M95k41J34n49O63j09k26O0k41J35R9r2J78r8k5J33
6141gK02l70M1J02K1k06o9K15J50o9j00k6J62Kj66K64l03K43J49j86m06K47K22
6164A12Q2k87K49q0j27j98M9J44J08n0K01n3l7Q3k08l87M52m8P3m7j02K72k94
6187i3L5L22m19K20m8l7j09J93m03N94l9l57K56k98K49q8%J00m2l9K61j56m3l7
6211B2j63KNJ34P7J82n02L25j01j42Q8M44j48k85q9K89r4N4j46J14j91L32k42
6234c5J53J45o75K39j8J31j09K13L4j88J67J40j47k10n1J43K25m40O62l94l00
6255c15J83J64r0k04N37k53o2n8K09k05O1R7r1M1k91K79J74m2P7j91j13J51n2
$$ plain form
6278 6 -196 118 -170 -112 -144 138 -51 30 -2 -75 -204 -106 -41 85 -56 -15 -90 -228 191 -87 -150 -242 -399 26
6302 26 12 -86 242 177 127 132 75 1 -155 -78 268 -116 -178 -8 58 64 103 -143 107 249 -71 35 85 -47 22 39
6328 39 -84 -201 -67 -132 185 163 92 -108 -134 -68 58 146 -27 -17 -47 -298 -113 64 -115 84 119 -110 -23 -197
6352 -197 -109 -45 -215 -101 175 45 -130 -54 -17 29 -30 92 -81 -103 -15 76 154 -152 -219 -11 -83 -133 119 -61
6376 -61 18 -102 110 -116 -98 163 168 -68 -224 -32 -211 -135 258 -48 10 50 97 -115 -77 22 -121 149 -46 -122
6400 -122 74 125 340 -310 138 358 -99 -143 156 164 75 228 -178 -179 26 -3 489 -75 -137 34 29 -283 -16 223
6424 223 36 -45 -99 17 -131 130 73 -19 54 157 98 71 -41 37 118 -70 61 -136 -305 78 116 -221 274
6447 274 80 -59 -21 145 -38 138 -141 -144 19 89 -75 180 -85 194 105 -52 15 -212 -48 166 111 -15
$$ packed form
6278Fk02L14k88N8l2K82j89Q1l2p3j29R8O5J26j41M1p5j38M19k78o3r2j57M25
6302B6j4r8L28o5n0Nn7p4j56P7L46l84o2J70O6OL9k46K50J42l20J06N0j32O9J7
6328C9j23j17J34o5L17k2p1k00k6O6J26Q8j73J0l0k51J85J77j79J99L5k29Q7j74
6352a97Q8O4j70J14K76j30j75P6L7M6n9J22j73k2Q8R1P8l06o7K08p2n0K52j80
6376f1P9j20K12k26J8K61Nk36j56J92j79P6L93l06N8M0M7k12L8R9j43K70j95p6
6400a22J96N1K15o50M48K20m57m4K99Qq9J53m06jK05k9M92n64o2J71nl12K67K39
6424B23j87q1n4J16j48K61n7r2P3J03n9k7j12P8Q1j88J31j97j69L83L8l37M95
6447B74j94j39L8J66j83J76k79lJ63P0j64K55k65K79q9j57O7k27J64K14n5j26
$$ plain form
6469 -15 -6 52 78 149 40 -206 -250 51 2 -23 -355 -170 30 51 321 -310 -151 -56 166 138 31 31 -43 -42 69 48
6495 48 -38 55 -23 221 -286 -258 -64 65 120 -169 -39 -131 94 -46 35 -114 -71 -35 123 71 -67 192 177 23
6519 23 -144 154 -13 -106 32 237 -113 12 -95 -130 -247 45 62 -158 -156 89 9 -22 -335 235 102 -8 81
6542 81 80 -232 105 51 61 -11 136 -13 59 -260 -349 197 240 -384 -23 -101 -197 -116 59 -209 -186 -103 235 97 -157
6567 -157 -27 144 271 -170 151 -82 -329 -30 302 -36 -331 230 167 209 -47 -253 -70 238 92 3 244
6588 244 -238 -36 17 9 -351 -9 63 146 -13 -5 97 -198 -329 172 69 -220 -33 -193 285 14 85 17 -121
6611 -121 -178 259 133 167 90 9 -154 -242 11 216 19 23 173 -14 -280 -307 -65 119 -85 176 22 -104 1
6634 1 -47 -19 -69 -55 -237 469 -124 -59 272 134 -12 -146 -8 -8 4 262 -182 87 -65 245 157 233 38 40 0
$$ packed form
6469a5RN8K6P1j09k46m4L01m9k5l32J85K00K1K70o31J59R5K22k8j07%p4JJ11k1
6495D8q6R3p8K44n07K8J94J29N5k89J30r2K25j40Q1j49M3L6J58n2j38K59j5j54
6519B3j67K98j67r3J38K05l50J25j07l5j17K92J7k20KK45q0l1l13N70j33j10Q9
6542H1jl12L37n4J0p2J47j49P2l19q9N46M3o24L61p8r6Q1J75k68K3Q3L38j38k54
6567a57J30J71J27m41L21k33k47K99L32l38k95N61o3M2k56k06J83L08j46q9K41
6588B44m82K02N3ql60L42P2Q3j59QJ02k95j31N01j03k89J87j60M78k71P1o8j38
6611a21n7M37j26L4p7q1j63q8K53K05j97MJ50j87k66k7K42J84k04K61j54j26J05
6634Am8K8n0J4j82P06n93O5L31j38j46j34J38%J2K58m44K69j52L10q8P6j95Km0
$$ plain form
6659 0 -71 -209 112 -242 -228 -116 -42 175 -119 214 30 -61 -27 -86 41 -23 -156 160 -77 -113 50 181 69
6682 69 -40 -99 -150 -47 -6 83 -53 17 39 0 54 98 58 178 -26 219 163 -49 253 -260 -154 24 -89 30
6706 30 -38 -102 75 -48 286 78 31 25 138 8 87 -94 -41 105 8 119 -133 102 -7 180 -7 104 282
6729 282 -27 -165 212 306 -193 83 275 130 -44 89 -92 -210 -71 242 30 -6 -59 107 -205 167 -69
6750 -69 283 -57 -135 43 105 -156 135 32 -47 -177 -189 8 -16 74 141 44 150 -5 -23 244 -198 -167 38 443
6774 443 53 -271 22 -167 -77 -176 26 89 -130 168 -98 100 -131 -130 148 45 27 -151 -196 35 115 -37 -52
6797 -52 -127 153 105 -186 -208 172 145 68 242 198 -114 74 159 -95 23 46 22 -111 107 4 96 -84 -119 238
6821 238 148 -83 225 49 -116 -124 -305 105 127 -224 95 282 56 -108 -209 138 11 49 155 -57 -2 111
$$ packed form
6659@p1j38L21l54J4J12P4K17k94L33j84r1L4n9J27o4j33L16k37l6J63J31j12
6682F9j09n9n1J03M1Q9j36P0K2l9N4M4m0J20k04K45n6k12L02n13J06J78j13J19
6706C0o8o4J77j23L34k08m7oJ13j30P9j81N3J46r7J11k52K35j09J87j87J11J78
6729B82l09j38L77R4m99K76J92j45j74J33j81j18J39L13k12l6n3J66l12L72k36
6750f9L52l40p8J78O2k61K91j03p9j30j2J97k4R0O7r7J06j55j8K67m42L1K05M05
6774D43l90l24K93j89R0r9K02O3k19K98k66J98k31JK78j03j8j78m5K31Q0j52j5
6797e2p5K80m8k91k2L80k7p7J74m4l12J88Q5k54J18K3k4j33K18j03R2j80l5L57
6821B38r0k31L08j76j65qj81M10K2l51L19J87k26j64j01L47j27L8J06k12N5J13
$$ plain form
6843 111 123 -31 90 105 36 104 -62 -227 -154 170 43 -26 44 -165 -92 68 -103 -26 -68 -66 -142 -171 67 83 -19
6868 -19 -122 222 112 152 142 -136 -101 -203 78 -273 87 -7 260 -89 -59 71 -72 -124 -39 -63 72 9 21 248
6892 248 132 74 118 -81 -25 111 -137 229 -96 -133 56 101 -178 43 83 -72 -73 252 41 -31 81 93 -42
6915 -42 -269 -196 31 -35 -184 -36 266 47 -181 75 18 -120 91 81 -1 -132 -179 -149 -19 -190 -336 -9 -115
6938 -115 17 -167 307 91 -24 -39 -17 -297 109 109 31 -126 -69 280 -294 -247 343 -176 32 66 -121 112 -65
6961 -65 179 240 -203 -230 48 -55 -47 -136 192 65 -119 164 52 -46 -122 127 282 100 -217 46 163 11 -279
6984 -279 77 208 -104 -272 221 117 -213 122 56 -99 -238 242 -8 -71 -57 353 41 -10 38 125 98 40 17
7007 17 -54 -146 11 328 126 3 -182 -326 83 114 171 -38 122 69 43 223 -86 -41 135 -24 -130 83 24
$$ packed form
6843A11J2j54J21J5o9O8j66j65P3L24j27o9P0k09P3J60j71P7m2Kp6k9K38J6j02
6868a9j03L44j10M0j0k78L5j02K81l51L60r4K67l49L0J30j43n2Q5k4J35o3J2K27
6892B48j16n8M4j99N6J36k48L66l25l7J89M5k79K21M0j55jL25k11p2J12J2j35
6915d2k27P3K27o6j49J48L02k19k28K56n7j38K11j0q2j31m7L0J30j71j46L27j06
6938a15J32j84M74k16j15j5K2k80M06%p8j57N7L49n74M7N90n19K08L4j87K33j77
6961f5K44O1m43k7K78j03Qq9L28j27j84K83j12r8p6K49J55j82l17K63J17j52k90
6984b79L56J31l12j68M93j04l30L35o6j55j39M80k50o3J4M10l12n1M8Q7k7n8k3
7007A7p1r2J57L17k02j23j85j44M09L1N7k09J60n3k6J80l09M5J76j59j06K13n9
$$ plain form
7030 24 30 -124 26 -118 -228 -39 76 162 347 -164 -48 -38 -270 42 23 -283 -152 -32 -74 75 -150 -27
7052 -27 -7 -242 86 33 -104 -27 85 5 -177 340 43 9 -116 -96 214 4 -54 110 270 -201 -330 -39 -143
7075 -143 -100 132 26 -316 35 -81 167 -55 -211 -30 208 163 139 -129 -59 -288 155 318 -176 -29 194
7096 194 50 50 -50 48 114 -280 18 68 -40 -27 338 -41 -265 14 -56 -251 -54 238 42 18 301 -143 278
7119 278 251 8 -35 157 28 -157 239 -252 -203 -135 242 85 -126 194 161 16 -365 56 88 -95 -25 55 37
7142 37 -60 -113 98 -247 2 29 6 -54 -264 -133 -131 -80 310 23 49 -151 346 51 -10 65 219 -125 -22 -90
7166 -90 130 251 -49 -88 168 33 -53 -12 -319 104 -25 172 171 -53 44 349 31 -75 223 54 56 -138 -110
7189 -110 26 -126 -288 -11 -263 -338 44 -86 209 49 82 -122 -16 -170 -50 -115 -17 282 30 118 -18 296
$$ packed form
7030B4Oj54J50j44j10J89J15Q6J85n11J16J0k32L12j9l06J31J20m2J49k25J23
7052b7K0k35L28n3j37P7J12q0j82N17k97l4j25K0L10k10n8J64J60m71j29K91j04
7075a43M3K32j06l42L51j16K48k22j56J81K38m5k4k68P0k29M43J63m94J47K23
7096A94j44%j00R8O6l94K98N0j08J3L65l79k24K79p0j95J97K92j96k4K83m44M21
7119B78k7k43m3J92j29j85L96m91M9O8L77j57k11L20l3j45l81M21L2j83P0Q0j8
7142C7r7n3K11l45K49K7k3o0k10J31KN1L90k87K6k00M97k95o1P5J54l44J03o8
7166i0K20J21l00l9K56j35q6M1l07M23j29J97jk24R7L05l18j06K98j69Kj94K8
7189a10J36j52j62K77k52p5L82j30K95j60L3k04J06j54J20o5R8K99k52Q8j36L14
$$ plain form
7211 296 50 150 -177 95 -23 193 -219 301 -172 -386 -18 7 -116 -10 70 -290 -106 66 136 -40 83
7232 83 103 102 -63 -210 20 -92 31 -142 -141 -19 14 -5 41 -149 -113 87 185 75 30 -69 -2 194 182 156 207 -133
7258 -133 -115 -52 210 -5 -324 -132 -58 -244 -47 140 -178 197 286 -75 -236 -78 241 -57 -351 67 27 162
7280 162 93 63 -165 -221 -25 166 123 -166 146 -15 139 -272 -190 215 -176 -86 -35 124 -61 -244 157 382
7302 382 174 25 64 2 -68 31 118 -28 -40 213 -204 98 103 -31 -26 -268 -210 120 6 129 131 -19 89 -191
7326 -191 90 -104 260 -82 77 98 150 -137 -120 -167 -260 72 35 -50 76 233 -10 -28 -228 -144 -199 -119 188 25
7350 25 17 116 240 104 72 -84 152 54 -3 238 -103 -200 94 93 -77 77 257 197 -49 59 168 -29 -89 -313
7374 -313 245 61 115 87 87 42 -7 32 -17 -148 16 163 -111 71 118 -122 13 -92 -18 219 -43 180 -126
$$ packed form
7211B96k46J00l27K72j18K16m12N20m73k14L68K5j23J06Q0l60J84J72P0j76J23
7232H3K0jj65j47K30j12J23j73JJ22L3j9M6j90L6K00R8j10m5r9O7J96j2k6N1l40
7258a33J8O3K62k15l19J92P4j86J97J87l18L75Q9l61j61J58L19k98k94M18m0J35
7280A62o9l0k28n6J96J91m3k89L12j61J54m11Q2M05l91R0N1J59j85j83M01K25
7302C82k08j49L9o2p0R9Q7j46j2K53m17L02Nj34Nk42N8L30j14J23Kj50J08k80
7326a91K81j94L64l42J59K1N2k87J7m7r3L32l7q5J26J57k43j8k00Q4n5Q0L07j63
7350B5qR9J24j36l2j56K36r8n7K41l41r7K94jj70J54J80o0k46J08J09j97o0k24
7374c13N58j84N4k8%m5m9L9m9j31J64J47k74J82M7k40J35j05P4K37k62K23l06
$$ plain form
7397 -126 123 40 -49 80 -149 -28 -110 -61 80 -45 -286 -44 -44 -139 137 376 91 -175 307 53 -200 -17
7419 -17 102 -116 -92 268 179 -83 -128 -137 63 -86 101 141 113 95 -106 232 254 -58 286 39 -299 152 69 -217
7443 -217 -44 37 125 252 -296 -134 45 142 -113 159 -157 -208 -229 71 -48 -201 232 21 -134 -76 -156 -14
7465 -14 86 292 400 -44 95 -182 125 -54 -228 100 -112 59 -108 -153 45 -105 -203 124 116 -112 -27 177
7487 177 -108 90 45 71 -149 -97 -56 -134 -274 287 124 -34 -230 -77 158 -161 71 -90 47 -214 -57 -5
7509 -5 54 34 -93 113 81 15 5 67 -19 -148 123 -21 -83 5 76 -39 59 -174 -201 -48 -8 60 100 -71 -83 47
7535 47 -46 188 13 67 -208 -42 -220 184 -122 -23 135 141 -70 -279 139 -11 -142 -62 109 2 76 -237 -44
7558 -44 -228 -192 -112 -184 -22 59 93 27 27 -19 278 -103 -163 122 134 -24 64 37 -95 63 -129 -344 -84 -92 94
$$ packed form
7397a26K49q3q9J29k29J21q2M9J41j25k41K42%r5K76K39k85k66M82k54k53J83
7419a7J19k18K4L60q9k62m5rK00j49J87M0k8j8k01L38K2l12L44k47l38M51q3k86
7443b17J73Q1Q8J27n48J62J79R7k55K72l16n1k1L00j19j53M33k11j55N8q0J42
7465a4J00K06J08m44J39k77L07j79j74L28k12J71j67m5J98j50r8L27qk28Q5K04
7487A77k85J98m5K6k20N2M1p8j40N61j63j58j96J53K35l19K32j61J37k61J57N2
7509eN9k0j27K06l2o6j0O2q6j29K71j44o2Q8P1j15R8k33k7J53M0O8M0j71j2J30
7535D7r3K34j75N4k75J66j78M04l06R9J58Ok11k09M18j50j31Q0J71j07P4l13J93
7558d4j84L6Q0p2J62Q1L4o6%m6K97l81o0K85J2j58Q8k7j32J58j92k15K60qJ86
$$ plain form
7583 94 -54 41 -64 -14 -284 207 6 -6 99 -21 31 219 -29 -7 -69 28 -28 -18 71 45 -303 115 -203 157
7607 157 -129 -29 25 -265 -210 -17 -166 49 132 386 -56 -117 98 106 -39 9 254 -50 77 -181 50 -129
7629 -129 -15 349 359 168 -79 276 -50 -199 161 66 31 -182 -71 -154 -236 -163 152 -82 -265 -38 -153 291
7651 291 -141 21 122 199 138 -41 -75 54 113 73 -35 -166 -7 -84 -39 168 59 116 16 12 144 -135 -40 -191
7675 -191 208 23 -87 -132 96 39 -85 114 255 -79 -347 43 79 -308 213 -98 -51 309 -151 79 80 -295
7697 -295 139 -211 -100 107 89 51 -89 -196 214 118 -101 -1 60 -4 -14 117 282 -55 -257 -33 -67 -84 13
7720 13 134 -159 -60 -27 -14 -43 49 206 -36 26 37 160 98 60 193 207 -243 217 67 73 56 287 -42 -275 -233
7745 -233 177 66 217 174 -120 195 218 34 204 94 -53 -23 -65 96 6 -27 84 11 -52 170 29 102 -3
$$ packed form
7583I4j48R5j05N0k70M91k01j2J05j20N2J88k48K2o2R7n6J0Q9k6l48M18l18L60
7607A57k86J00N4k90N5J93j49K15Q3K54m42o1K15Qj45M8K45l04J27k58K31j79
7629a29J14L64J0j91k47L55l26j49L60r5l5k13J11q3q2P3L15k34j83K27j15M44
7651B91m32J62J01P7o1j79l4J29N9m0j08j31J59p7M5K07j09N7j00mJ32k79R5j51
7675a91L99j85j10m5K28n7j24J99J41l34k68L90L6l87N21l11M7L60m60K30Jl75
7697b95M34l50J11K07j8l8j40j07M10r6k19J00O1o4j0J31J65l37k02K24l4j7R7
7720A3J21k93R9L3J3k9R2J57k42O2J1J23o2l8J33J4m50M60j50Oj7K31l29k33M2
7745b33M10j11J51m3k94L15K3j84J70j10j47L0m2J61r0l3J11p3o3K22j41P3j05
$$ plain form
7768 -3 296 -224 -197 -17 -66 -78 -33 -81 -6 154 134 49 13 -127 -153 235 -89 -107 -200 -76 -77 -154 -19 -77 139 155
7794 155 -74 -50 -286 -108 -224 -38 -131 2 5 126 -183 81 -188 -43 -86 -126 241 -39 59 60 72 -183 -36
7817 -36 273 79 1 67 60 -101 -105 127 31 93 182 -76 -3 -227 34 189 -172 -298 194 -144 -93 -111 -77 -320 224
7842 224 54 51 42 -269 67 6 -46 -105 13 -80 -66 -8 280 -100 39 156 -23 -138 250 -236 -223 109 -185 -5
7866 -5 182 19 -85 -29 -2 16 -22 -229 82 -149 -45 260 -316 -195 -12 29 -4 25 -75 -115 -85 84 -282 60
7890 60 -238 -41 -51 -126 51 8 445 155 -30 -60 -80 -3 49 -147 -216 80 97 -80 -90 95 -25 -161 203 310
7914 310 172 -122 -41 74 45 48 20 -18 224 46 195 164 -160 -17 153 177 80 73 154 -148 -301 8 24 -4 51
7939 51 -381 32 201 82 31 0 90 150 -92 0 16 -63 206 -129 28 -18 -19 73 -46 96 -65 -94 96 259
$$ packed form
7768cK99n20K7J80m9j2M5m8P5J60k0q5l6j40k6L88l24j8r3J24jp7J35n8K16J6
7794A55k29K4k36J78j16J86r3J33LJ21l09K64k69J45m3m0L67k80R8JJ2k55J47
7817c6L09j94p8O6pj61mK32r6O2Q9k58P3k24K61J55l61j26M92l38N1j8L4k43N44
7842B24j70lrl11L36o1n2n9J18r3J4N8K88l80J39J17j79j15L88m86J3L32k94J80
7866eJ87j63j04N6K7J8l8k07L11k31J04L05n76J21J83M1l3K9j00m0L0J69l66L42
7890F0k98J97j0p5J77m3M37k90j85l0k0P7N2j96o9K96J7j77j0J85j20j36L64J07
7914C10j38k94Q1J15k9Lk8l8K42j78J49l1l24J43J70K4r7pQ1l02j53L09J6k8N5
7939E1m32M13J69j19n1l1R0O0k42R2J6p9K69l35J57m6jR2j19J42j61k9J90J63
$$ plain form
7963 259 27 -171 270 93 -247 69 -166 79 248 -40 201 143 -90 122 214 -20 11 27 122 21 -17 87
7985 87 48 -36 92 103 -31 -7 79 74 5 139 -105 84 -227 -288 -106 -42 215 131 -176 -76 -53 34 -233 -32 76
8010 76 31 -11 -12 -7 118 -205 38 49 -147 161 -227 -80 16 104 -82 -60 16 56 206 140 362 180 -235 214 -173
8035 -173 -245 305 -130 -39 41 107 -231 -45 109 276 -54 10 -34 412 53 -402 -266 -72 -24 -193 85 -118
8057 -118 -41 -174 -5 -372 -145 283 -200 -3 116 115 15 15 135 -103 -69 -336 249 -129 -7 53 -44 -221 -191
8080 -191 54 45 168 43 245 11 -239 132 32 189 63 127 71 -310 17 57 254 58 -55 83 307 26
8102 26 -39 -110 -230 -18 39 -113 -119 153 51 105 -10 151 189 -311 -315 108 -179 -99 157 -111 -261 -58 128 -181
8126 -181 20 86 -120 81 -102 -192 54 -84 -37 -23 362 423 -116 -239 0 44 -114 -63 170 -14 -43 108 137
$$ packed form
7963B59k32j98M41j77l40L16k35K45J69k88K41n8k33K12R2k34L1J6R5j01l8J04
7985H7l9q4J28J1j34K4Q6no9J34k44J89l11o1J82O4K57q4l07J00K3Q7k67K01J08
8010G6m5m2jNJ25l23K43J1j96L08l88J47R6Q8j86K2P6M0J50o6K22j82m15M49l87
8035a73p2N50m35R1Q0O6l38J86J54J67l30O4m4M46l59m55J36J94M8j69K78k03
8057a18P7j33J69l67K27M28m83J97J19jj00%J20k38L4k67N85l78J22O0r7j77L0
8080a91K45rJ23j25K02k34k50L71j00J57j26O4n6l81L27M0J97j96j13J38K24k81
8102B6o5p1j20K12N7j52oK72j02N4j15J61L8n00mM23k87Q0K56k68j50K03J86l09
8126a81K01O6k06K01j83r0K46j38M7J4L85O1n39j23K39M4j58N1K33j84k9J51K9
$$ plain form
8149 137 67 151 -177 138 109 113 45 -8 28 -46 -28 -25 151 68 -132 -190 70 -62 327 -31 -229 204 -71 88 170
8174 170 63 -149 41 233 -22 -42 -56 57 -117 -277 -66 7 241 67 131 -10 -235
$$ packed form
8149A37p0Q4l28L15k9Mo8n3L6p4J8LJ76q3k00n8K60j32L89l58j98M33k75J59Q2
8174A70j07k12J90J92k55k0j4J13j74j60K11P3K34j74O4j41k25
8191b35
$$ Imaginary data points
##PAGE= N=2
##DATA TABLE= (X++(I..I)), XYDATA
$$ plain form
0 0 0 0 0 0 0 0 1 0 0 0 8 -8 8 -13 16 -21 24 -32 37 -42 50 -61 72 -85 98 -114 133 -151 173 -198 229 -257
32 -257 292 -328 370 -416 467 -519 579 -645 717 -793 880 -972 1073 -1185 1305 -1439 1582
49 1582 -1745 1922 -2119 2336 -2580 2858 -3170 3531 -3949 4443 -5035 5753 -6659 7829 -9403
64 -9403 11636 -15035 20775 -32184 63021 -306328 -747488 467890 292801 -498553 88177
75 88177 408623 -256073 -200295 169835 36420 -69675 -44748 10811 193138 -25641 -278988
86 -278988 47388 160591 -118399 44313 146314 -158535 -102664 98644 -28037 14748
96 14748 74814 -97576 21479 130052 -167165 -110574 184717 -215 -81847 138907 -49216
107 -49216 -208517 95449 133150 -73933 14867 48286 -78064 -15025 38802 -9716 13537
$$ packed form
0@%%%%%%Jj%%Qj6J6k1K9l7M5n6O9p9R2j11J33j57J83k12K47k84L24l71M27m86
32b57N49o20O98p86Q83r86J098j224J362j510J673j852K045k258K490k744L021
49A582l327L667m041M455m916N438o028O701p480Q392r478J0788j2412J4488j7232
64i403K1039k6671L5810n2959R5205l69349m41160J215378j75089p91354N86730
75H8177L20446o64696N5778L70130j33415j06095K4927N5559J82327k18779k53347
86b78988L26376J13203k78990J62712J02001l04849N5871K01308j26681M2785
96A4748O0066j72390J19055J08573k97217N6591K95291j84932q1632K20754j88123
107d9216j59301L03966L7701k07083Q8800L3419j26350O3039N3827m8518K3253
$$ plain form
118 13537 -7332 20698 104259 -94519 -182235 148715 137632 -153700 43653 150883 -197097
129 -197097 -103204 229842 23107 -135805 65483 48457 -48188 -3129 -57661 1758 141254
140 141254 -27890 -83528 111998 -46679 -184499 143421 176042 -138820 -62213 92538
150 92538 -34592 -41016 26083 -1513 53856 12720 -88303 48022 31286 -168234 47410
161 47410 224372 -96825 -139839 110865 -29828 -107907 122926 43045 -102439 46515 15647
172 15647 -94431 38933 18308 -70280 93981 65545 -135535 -27597 57822 -51250 33602
183 33602 87300 -66707 -45162 31179 -40576 7069 50786 -44033 19988 64856 -89485 -46131
195 -46131 73175 -36005 -1417 119996 -54078 -117020 65992 20348 -55712 71190 30577
$$ packed form
118A3537k0869K8030Q3561j98778q7716L30950j1083k91332J97353J07230l47980
129a97097R3893L33046k06735j58912K01288j7026r6645M5059n4532N9419J39496
140A41254j69144n5638J95526j58677j37820L27920L2621l14862P6607J54751
150I2538j27130o424O7099k7596N5369m1136j01023J36325j6736j99520K15644
161D7410J76962l21197m3014K50704j40693p8079K30833p9881j45484J48954l0868
172A5647j10078J33364k0625q8588J64261k8436k01080J07938Q5419j09072Q4852
183C3602N3698j54007K1545P6341p1755M7645M3717r4819O4021M4868j54341M3354
195d6131J19306j09180L4588J21413j74074o2942J83012m5644p6060J26902m0613
$$ plain form
206 30577 -70026 19876 9600 -51263 37545 20894 -25088 75512 -265 -128975 31185
217 31185 84887 -60825 25580 88470 -83682 -56427 71842 -8010 -16042 51320 -15433 846
229 846 36715 -80824 -27484 109403 -17231 -49200 96261 -26368 -132143 63979 80777
240 80777 -59792 12893 42021 -50007 -7773 6016 -32103 51583 28376 -63988 37929 28734
252 28734 -121566 11450 128717 -49936 -52772 76385 -39665 -79101 58710 24177 -27331
263 -27331 31692 -14972 -32921 24607 -43858 -28115 100430 952 -86047 49624 9533 -101179
275 -101179 46402 86950 -60841 -17039 41613 -47371 -19421 31390 -15549 28742 35346 -63545
287 -63545 -5801 42634 -66728 147 112308 -32739 -75304 57802 -3565 -64570 51432
$$ packed form
206C0577j00603Q9902j0276o0863Q8808j6651m5982J00600p5777j28710J60160
217C1185N3702j45712Q6405O2890j72152K7255J28269p9852q032O7362o6753J6279
229H46L5869j17539N3340J36887j26634l1969J45461j22629j05775J96122J6798
240H0777j40569P2685K9128r2028M2234J3789l8119Q3686k3207r2364J01917r195
252B8734j50300J33016J17267j78653k836J29157j16050l9436J37811l4533n1508
263b7331N9023m6664j7949N7528o8465J5743J28545r9478q6999J35671m0091j10712
275a01179J47581M0548j47791M3802N8652q8984K7950N0811m6939M4291O604r8891
287f3545N7744M8435j09362O6875J12161j45047m2565J33106o1367o1005J16002
$$ plain form
298 51432 39708 -33013 14360 -5933 -35066 30801 -2944 -23955 76412 10674 -93078 29342
310 29342 46309 -72215 23642 90035 -48166 -39902 41764 -23805 -15781 43648 -5442 7551
322 7551 27122 -60169 -14525 66930 -34360 -22884 91503 -21551 -89585 48506 23951
333 23951 -58378 40286 44814 -43911 -2116 1297 -36559 33809 21826 -39374 38663 17772
345 17772 -89789 10145 69046 -51399 -9680 71194 -39779 -53000 36066 -7452 -12230 40540
357 40540 -15973 -14761 27993 -53711 -27907 81795 -15131 -58461 70105 2120 -99245 36434
369 36434 59526 -53591 8003 45835 -43538 -19229 15638 -19151 28911 27089 -48335 16371
381 16371 34089 -76632 -3011 92972 -32665 -47366 67248 -8609 -70642 33809 38018
$$ packed form
298E1432j1724p2721M7373k0293k9133O5867l3745k1011J00367o5738j03752J22420
310B9342J6967j18524R5857O6393j38201Q264Q1666o5569Q024N9429m9090J2993
322G551J9571q7291M5644Q1455j01290J1476J14387j13054o8034J38091k4555
333B3951q2329R8664M528q8725M1795L413l7856P0368j1983o1200P8037k0891
345A7772j07561R9934N8901j20445M1719Q0874j10973j3221Q9066m3518m778N2770
357D0540n6513J212M2754q1704K5804J09702r6926m3330J28566o7985j01365J35679
369C6434K3092j13117O1594L7832q9373K4309L4867l4789M8062j822p5424O4706
381A6371J7718j10721P3621R5983j25637j4701J14614p5857o2033J04451M209
$$ plain form
392 38018 -19439 9732 2110 -13867 10833 -22520 -7784 64687 -3748 -54609 41375 14938
404 14938 -68486 24024 60510 -30691 -8319 24312 -27779 -3323 17789 -17273 31048 29397
416 29397 -60043 -1129 52684 -50932 -18952 85846 -14242 -62796 40551 5625 -51000
427 -51000 29650 29625 -22937 10562 -5609 -31988 22882 1831 -27597 46099 13044 -67915 14715
440 14715 35691 -54392 7323 63227 -36849 -34200 35039 -15735 -24369 27928 2834 -1705
452 -1705 11404 -36007 -6946 36081 -32691 -9306 68765 -28510 -66918 52143 15977 -60579
464 -60579 34858 41039 -48762 -1501 22654 -33970 9316 28402 -26854 17810 26269 -59181
476 -59181 -7835 59627 -22358 -23271 49132 -7444 -40394 18572 8995 -6581 16626 -7178 578
$$ packed form
392C8018n7457K9171p622j5977K4700l3353J4736P2471o8435n0861R5984k6437
404A4938q3424R2510L6486r1201K2372L2631n2091K4456K1112l5062M8321j651
416B9397q9440N8914N3813j03616L1980J04798j00088m8554J03347l4926n6625
427e1000Q0650k5n2562L3499j6171k6379N4870k1051k9428P3696l3055q0959Q2630
440A4715K0976r0083O1715N5904j00076K649O9239n0774q634N2297k5094m539
452a705J3109m7411K9061M3027o8772K3385P8071r7275l8408J19061l6166p6556
464f0579R5437O181q9801M7261K4155n6624M3286J9086n5256M4664Q459q5450
476e9181N1346O7462q1985r13P2403n6576l2950N8966r577j5576K3207k3804P756
$$ plain form
489 578 25653 -36022 -26705 62009 8010 -48521 35488 24019 -58507 2732 49450 -13385 -14886
502 -14886 16901 1249 -2387 -12401 -13730 32790 12474 -34364 20110 19832 -56439 3175 62348
515 62348 -25662 -27705 39463 -17551 -32693 36510 -1039 -28061 33570 3070 -35601 19846
527 19846 -646 -36031 36162 28046 -46407 -944 22580 -32941 1989 35963 -20847 -15208
539 -15208 19548 -11324 -9386 7005 -14541 12906 25306 -31348 -11720 26035 -28754 -10786
551 -10786 55365 -11518 -50195 28113 17200 -33389 8939 16496 -13489 10130 850 -19017
563 -19017 15765 -4960 -24546 47479 23666 -69357 -1862 59325 -29071 -26878 51617 1895
575 1895 -43641 13885 26858 -12320 -18981 4925 36740 8256 -50217 -958 48331 -24837
$$ packed form
489E78K5075o1675R317Q8714n3999n6531Q4009j1469q2526O1239M6718o2835j501
502a4886L1787j5652l636j0014j329M6520k0316m6838N4474k78p6271N9614N9173
515F2348q8010k043O7168n7014j5142O9203l7549k7022O1631l0500l8671N5447
527A9846k0492l5385P2193q116p4453M5463K3524n5521L4930L3974n6810N639
539a5208L4756l0872J938J6391k1546K7447J2400n6654J9628L7755n4789J7968
551a0786O6151o6883l8677P8308j0913n0589M2328P557k9985K3619r280j9867
563a9017L4782k0725j9586P2025k3813r3023O7495O1187q8396K193P8495m9722
575A895m5536N7526J2973l9178o661K3906L1815k8484n8473M9259M9289p3168
$$ plain form
587 -24837 -21996 59570 -4799 -65495 28779 43841 -35321 -8939 27491 -5690 -386 4717 -19569
600 -19569 5413 15687 -12158 14202 14754 -40906 -9230 41364 -3510 -20399 12610 -2970
612 -2970 -8253 10535 -8162 -5831 11599 -9765 5830 21954 -37797 -26187 50887 4033 -40631
625 -40631 27892 8825 -53419 19509 46082 -41222 -23422 40461 -311 -25269 3838 -1233
637 -1233 -2266 8265 -205 7101 -6591 -35739 15138 45534 -26978 -30027 32929 129 -26294
650 -26294 19988 4829 -21594 13566 9454 -8719 8661 -18437 -19288 48963 15623 -54482 9393
663 9393 37785 -34033 -7436 45146 -14916 -32232 26719 19974 -17883 -15098 1813 23835 11205
676 11205 -25319 -133 18823 -23094 -65 44757 -16197 -39745 29117 18613 -25654 5394
$$ packed form
587b4837K841Q1566o4369o0696R4274J5062p9162K6382L6430l3181N304N103k4286
600a9569K4982J0274k7845K6360N52n5660L1676N0594m4874j6889L3009j5580
612b970n283J8788j8697K331J7430k1364J5595J6124n9751J1610P7074m6854m4664
625d0631O8523j9067o2244P2928K6573q7304J7800O3883m0772k4958K9107n071
637a233j033J0531q470P306j3692k9148N0877L0396p2512l049O2956l2800k6423
650b6294M6282j5159k6423L5160m112j8173J7380k7098q51O8251l3340p0105O3875
663I393K8392p1818K6597N2582o0062j7316N8951o745l7857K785J6911K2022j2630
676A1205l6524K5186J8956m1917K3029M4822o0954k3548O8862j0504m4267L1048
$$ plain form
688 5394 8304 -14097 15529 11404 -23078 -790 7759 -9788 19182 13201 -35840 -6421 29046
701 29046 -7462 -9983 13506 -9765 -8744 16074 -2302 -12295 -381 -2839 13300 13645 -29607
714 -29607 -14241 28345 -6148 -15302 26893 -7607 -37215 23147 24827 -30588 -8692 19093
726 19093 -3804 -739 2610 -15848 455 10222 -5622 11234 5182 -33320 -96 37449 -11504
739 -11504 -24168 19405 4319 -16075 10319 4887 -14034 2155 8551 6029 4645 -20217 -11395
752 -11395 31129 6125 -25770 12745 12461 -24964 7421 26570 -19042 -14023 21802 6435 -6968
765 -6968 -3234 -7939 9534 14908 -12623 -548 13895 -19593 -4806 35323 -6607 -31280 18558
778 18558 17589 -18410 -739 9146 -7706 2640 6926 -2796 -56 -9882 -6381 24674 5519 -29524
$$ packed form
688E394K910k2401K9626m125l4482K2288Q549j7547K8970n981m9041K9419L5467
701B9046l6508k521K3489k3271J021K4818j8376r993J1914k458J6139L45m3252
714b9607J5366M2586l4493r154M2195l4500k9608O0362J680n5415K1896K7785
726A9093k2897L065L349j8458J6303R767j5844J6856o052l8502L3224L7545m8953
739a1504j2664M3573j5086k0394K6394n432j8921J6189O396k522j384k4862Q822
752a1395M2524k5004l1895L8515k84l7425L2385J9149m5612N019L5825j5367j3403
765f968L734m705J7473N374k7531J2075J4443l3488J4787M0129m1930k4673M9838
778A8558r69l5999J7671R885j6852J0346M286r722K740r826L501L1055j9155l5043
$$ plain form
792 -29524 3744 19705 -15986 -4889 17779 -9978 -12808 12828 4530 -8927 -7517 -4291 13695
805 13695 9806 -20986 -5150 17041 -12522 -8609 25117 -5730 -27198 14525 13806 -17762 -2878
818 -2878 6468 -4171 6333 591 -12517 5356 1810 -11835 16122 10118 -29042 182 27214
831 27214 -14498 -13966 21949 -2855 -16600 15000 5945 -15977 1722 8829 2294 3170 -7803
844 -7803 -6016 13028 -15 -9392 12559 2680 -16275 9183 14354 -12724 -4699 10849 1631
857 1631 563 -1934 -7228 8565 5930 -11942 9032 12695 -22797 -4463 28686 -7229 -22331
870 -22331 17181 11007 -16212 -30 9135 -4036 -2034 1297 3425 5542 -12736 -9059 21003
883 21003 2862 -23598 8322 15949 -19606 -4951 19322 -6992 -12978 10002 4314 -6518 -3964
$$ packed form
792b9524L3268J5961l5691J1097K2668k7757k830K5636q298j3457J410L226J7986
805A3695l889l0792J5836K2191k9563L913L3726l0847k1468M1723p19l1568J4884
818b878R346j0639J0504n742j3108J7873l546j3645K7957o004l9160K9224K7032
831B7214m1712N32L5915k4804j3745L1600r055k1922J7699P107o535Q76j0973
844g803J787J9044j3043r377K1951r879j8955K5458N171k7078Q025J5548r218
857A631j068k497n294J5793k635j7872K0974L663l5492J8334L3149l5915j5102
870b2331L9512o174k7219J6182R165j3171K002L331K128K117j8278L677L0062
883B1003j8141k6460L1920P627l5555J4655K4273k6314n986K2980n688j0832K554
$$ plain form
896 -3964 -3356 5818 5297 -11558 374 10798 -13524 -7359 18596 -4401 -16615 11632 5356 -13264
910 -13264 2254 3546 -5909 5317 189 -7609 7734 -2121 -13471 14180 9293 -21993 2799
923 2799 20420 -15193 -10714 19646 -698 -14041 8531 6547 -6673 -2031 1322 5974 5085 -11039
937 -11039 -963 16673 -7994 -13500 19410 6192 -20629 6295 16910 -12121 -7602 12511
949 12511 3361 -5294 -1280 2115 5485 -3236 -6788 11786 5639 -16667 2555 16535 -11657 -9531
963 -9531 15668 922 -11712 5388 3898 -5485 289 25 2063 4675 -8592 -4669 13233 -3686
977 -3686 -14311 12483 7427 -17989 361 14344 -9070 -8571 9491 2221 -6748 -3247 1091 4122
991 4122 -3108 -8908 8016 7342 -15303 -2640 16403 -6281 -13728 12159 6387 -12555 -1634
$$ packed form
896c964O08R174n21j6855J1932J0424k4322O165K5955k2997j2214K8247o276j8620
910a3264J5518J292r455J1226n128p798J5343r855j1350K7651m887l1286K4792
923B799J7621l5613M479L0360k0344j3343K2572j984j3220M642L353M652q89j6124
937a1039J0076J7636k4667n506L2910j3218k6821K6924J0615k9031M519K0113
949A2511r150q655M014L395L370q721l552J8574o147k2306J9222J3980k8192K126
963i531K5199j4746j2634J7100j490r383N774k64K038K612j3267L923J7902j6919
977c686j0625K6794n056k5416J8350J3983k3414M99J8062p270q969L501M338L031
991D122p230n800J6924o74k2645J2663J9043k2684p447K5887n772j8942J0921
$$ plain form
1004 -1634 6877 -752 -3372 -2178 3423 5207 -8934 -5621 14517 751 -15816 8462 12810 -13594
1018 -13594 -5178 14683 -1314 -9763 5863 5619 -3233 -3170 666 5398 1294 -6955 3398 8403
1032 8403 -8044 -3489 12611 -1217 -9180 8052 4859 -8021 1713 5133 -2972 978 2008 -2297
1046 -2297 3078 -177 -5064 7005 4106 -10721 2453 10120 -8418 -5537 10763 -584 -8644
1059 -8644 4751 4811 -5073 -3770 1692 4466 -720 -7835 1905 8457 -8226 -7333 12373 453 -14548
1074 -14548 4367 9989 -9122 -6355 6659 2429 -3414 -3390 -816 4499 -2594 -7754 7394 6319
1088 6319 -13475 -3315 14304 -3150 -12797 5751 7794 -6508 -4991 4636 3280 -5183 -4133
1101 -4133 8429 4849 -12547 -2794 14555 -2281 -12382 8548 7304 -10497 755 9868 -5080
$$ packed form
1004a634Q511p629k620J194N601J784j4141L313K0138j3766j6567K4278M348k6404
1018a3594Q416J9861j5997q449J5626k44q852O3L836M732m104q249J0353N005
1032H403j6447M555J6100j3828p963J7232l193j2880R734L420q105L950J030m305
1046b297N375l255m887J2069k899j4827J3174P667j8538K881J6300j1347q060
1059h644J3395O0r884J303N462K774n186p115R740O552j6683Q93J9706j1920j5001
1074a4548J8915N622j9111K767J3014m230n843K4K574N315p093n160J5148j075
1088F319j9794J0160J7619j7454r647J8548K043j4302J517R627j356q463J050
1101d133J2562l580j7396R753J7349j6836j0101K0930j244j7801J1252R113j4948
$$ plain form
1114 -5080 -5253 6415 3267 -1479 -1204 -2154 3056 3760 -3574 617 4814 -5121 -1509 9581 -1323
1129 -1323 -8031 5249 6032 -3693 -798 1937 -1241 689 1266 1052 1423 -4978 -2867 10119 1643
1144 1643 -12450 3159 10678 -7875 -4944 10979 -1792 -10557 5996 8831 -7456 -7993 4072
1157 4072 6343 -2592 -6643 2487 5095 -6458 -3241 9422 -2223 -12756 4422 10399 -6875
1170 -6875 -8545 3632 4135 -1597 -3109 -82 2708 -4152 -4094 9105 3037 -14446 -573 15167
1184 15167 -3961 -12295 6485 5045 -7623 915 6856 -4229 -6619 3817 7916 -744 -8523
1197 -8523 4 8000 -1067 -4560 4561 546 -5720 4491 7284 -5459 -5354 4454 4898 1110 -3049
1212 -3049 -3087 4142 2660 -2823 3156 2614 -8915 1067 13614 -3194 -11756 6721 7915 -5552
$$ packed form
1114e080j73J1668l148m746K75r50N210P04p334M191M197r935L612J1090j0904
1129a323o708J3280P83r725K895K735l178J930N77k14L71o401K111J2986q476
1144A643j4093J5609P519j8553K931J5923j2771q765J6553K835j6287n37J2065
1157D072K271q935m051R130K608j1553L217J2663j1645j0533J7178N977j7274
1170f875j670J2177N03n732j512L027K790o860N8J3199o068j7483J3873J5740
1184A5167j9128q334J8780j440j2668Q538N941j1085k390J0436M099q660p779
1197h523Q527P996r067l493R121m015o266J0211K793j2743J05R808M44l788m159
1212c049l8P229j482n483N979n42j1529R982J2547j6808q562J8477J194j3467
$$ plain form
1226 -5552 -61 4782 -4319 -2997 5727 3848 -3155 -6283 426 8618 394 -9031 1180 6332 -4668
1241 -4668 -1502 7108 -4336 -8923 6253 8290 -5955 -7437 1704 4673 -284 -3734 -88 1233
1255 1233 -3885 625 7218 -3675 -10294 3643 9084 -3998 -6765 867 2365 -744 -376 1808
1269 1808 -1701 -6031 907 9324 -1667 -11452 2236 9351 -3593 -4862 4282 -1696 -4829 5318
1283 5318 5033 -5753 -5214 3504 6629 666 -6091 -1753 6055 735 -2934 3955 413 -7526 3058
1298 3058 10636 -3484 -9810 3260 7902 -637 -3934 1062 2032 -2310 793 6861 -1144 -10076 2768
1313 2768 11634 -3053 -8580 4072 4308 -3085 1907 3249 -4243 -3322 4243 4820 -1737 -6440 -1285
1328 -1285 7273 1989 -6824 -274 3949 -3519 -478 6685 -3218 -9241 4455 8349 -3917 -6782
$$ packed form
1226e552N491M843r101J322Q724j879p003l128O709Q192q224r425J0211N152j1000
1241d668L166Q610j1444m587J5176K037j4245j482R141K969m957l450L646J321
1255A233n118M510O593j0893o619J3937N441j3082k767P632J498l109L68K184
1269A808l509m330O938Q417j0991r785J3688P115j2944j269R144n978l133J0147
1283E318k85j0786N39Q718L125n963o757M338P808n320l669O889l542p939J0584
1298C058P578j4120o326J3070M642q539l297M996R70m342L103O068q005q932J2844
1313B768Q866j4687n527J2652K36p393M992J342p492R21P565N77o557m703N155
1328a285Q558n284q813O550M223p468L041P163r903o023J3696L894j2266k865
$$ plain form
1342 -6782 1134 2578 -1241 -873 1738 -2236 -5064 2927 6900 -4443 -8477 3642 6365 -3458 -2484
1357 -2484 2135 -2576 -2272 4324 2207 -4782 -4437 2422 5834 -942 -6283 645 4844 -1343 -1533 3018
1373 3018 -1624 -4657 3798 6090 -2825 -6313 1661 6613 80 -5591 1078 4497 -2929 -1075 7236
1388 7236 -663 -9326 3848 10546 -3978 -8116 4309 5028 -3133 -468 3934 -1198 -4344 3333
1402 3333 6349 -2090 -6505 2490 7077 -1589 -4180 2332 1831 -2726 1521 3476 -3324 -4188 2536
1417 2536 4319 -883 -4394 -560 3945 15 -3037 457 876 -3644 457 4836 -2311 -6420 2188
1432 2188 5267 -2342 -3786 1284 760 -2134 395 2250 -2019 -4637 1728 5050 -2359 -6042 2023
1447 2023 3591 -2859 -1513 2976 -1242 -3794 2569 3653 -3009 -4438 1684 4120 -1164 -3903 1497
$$ packed form
1342f782P916J444l819L68K611l974k828P991L973j1343m034J2119K723r823R74
1357b484M619m711L04O596k117o989L45O859L412o776n341O928M199o187j90M551
1373C018m642l033Q455K292q915l488P974M952o533n671O669L419p426J854Q311
1388G236p899q663J3174O698j4524m138J2425P19q161K665M402n132l146P677
1402C333L016q439m415Q995M587q666k591O512n01m557M247J955o800q64O724
1417B536J783n202l511L834M505l930l052L494M19m520M101M379p147m109Q608
1432B188L079p609j444N070n24k894K529J855m269k618O365L322p409l683Q065
1447B023J568o450J346M489m218k552O363J084o662j429O122K436n284k739N400
$$ plain form
1462 1497 3328 -2821 -937 5149 -697 -6064 2680 6452 -2859 -4918 3308 3659 -2476 -1640 3378
1477 3378 997 -3558 787 6081 -761 -5955 3293 6532 -3862 -4236 4788 1911 -3854 1127 4228
1492 4228 -1448 -3259 2362 4200 -1413 -4194 1894 4217 -2244 -2830 3519 747 -3911 1168 3531
1507 3531 -2183 -3679 1941 3054 -1299 -2861 618 2475 -1603 -2871 2669 1244 -4900 -256 5243
1522 5243 -2002 -5504 2433 3504 -3187 -2473 2348 608 -3190 -668 3028 -306 -4435 345 4525
1537 4525 -2321 -5077 3365 2685 -5075 -433 4882 -2504 -4226 3783 2300 -3492 -1080 2450 361
1552 361 -1771 -330 1673 400 -1734 79 3019 -900 -3049 2554 3221 -2633 -1174 3196 1137
1567 1137 -1825 -222 2056 559 -2432 26 3803 -11 -3897 2317 4889 -3153 -2837 4953 953
$$ packed form
1462A497J831o149J884O086n846n367Q744L772r311k059Q226L51o135Q36N018
1477C378k381m555M345N294o842n194R248L239j0394l74R024k877n765M981L101
1492D228n676j811N621J838n613k781O088K323o461n86O349k772m658N079K363
1507C531n714j496N620J113m353j562L479J857m078j268N540j425o144M644N499
1522E243p245l502P937J071o691P14M821j740l798K522L696l334m129M780M180
1537D525o846k756Q442o80p760M642N315p386j722Q009j483n792K412L530k089
1552C61k132J441K003j273k134J813K940l919k149N603O67n854J459M370k059
1567A137k962J603K278j497k991K458L777l814l886O214K572q042L16P790m000
$$ plain form
1582 953 -4331 853 4175 -1181 -2463 1361 2556 -906 -2862 1279 3930 -2860 -3114 4508 1733
1597 1733 -5594 260 4840 -2789 -3934 2901 1602 -3050 -1268 1564 1019 -1677 -2013 1822 1565 -3591
1613 -3591 -879 4315 -1755 -4662 2693 2504 -3690 -807 2479 -1027 -1962 384 1170 -98 -2003 -427
1629 -427 2654 -688 -3179 2152 2151 -3934 -436 4225 -2110 -2980 3156 1147 -2703 455 1298 -199
1645 -199 49 -794 795 2184 -1866 -1709 4243 86 -4735 2580 4346 -3735 -1800 4697 915 -3768
1661 -3768 1270 3204 -792 -2566 1017 3426 -1211 -3207 3100 3464 -3594 -1257 4777 -539 -4051
1676 -4051 2276 3260 -2149 -1781 1548 1525 -659 -1795 674 2493 -1842 -2536 3478 1185 -4786 877
1692 877 4616 -2593 -3531 2537 1082 -2453 -387 1340 -37 -1718 -862 2021 569 -4017 -368 4299
$$ packed form
1582I53n284N184L322n356j282L824J195l462j956M141K651o790k54P622k775
1597A733p327N854M580p629j145O835j299m652J782K832n45k696l36L835k57n156
1613c591K712N194o070k907P355j89o194K883L286l506r35K346P86j268j905J576
1629d27L081l342k491N331jo085L498M661o335q70O136k009l850L158Q43j497
1645a99K48q43J589J389m050J57N952m157m821P315J766q081J935O497l782m683
1661c768N038J934l996j774L583K409m637j996O307L64p058K337O034n316l512
1676d051O327R84n409L68L329k3k184j136K469J819m335o94O014k293n971N663
1692H77L739p209r38O068j455l535K066J727j377j681Q56K883j452m586L649M667
$$ plain form
1708 4299 -1741 -3995 3055 1743 -4186 633 2716 -2492 -2639 1900 1600 -1200 -1656 306 1889 -1134
1724 -1134 -2073 2011 681 -3462 900 3435 -2262 -2747 2763 1295 -1686 -104 698 5 267 -382
1740 -382 1167 1561 -2436 -366 4791 -708 -4733 2823 3386 -3179 -427 3190 -961 -1899 2293 2073
1756 2073 -802 -1887 349 3337 -83 -3094 1673 2902 -2545 -602 3849 -1638 -3512 3168 2773
1771 2773 -2419 -1406 914 1146 -27 -1377 -159 1204 -1848 -742 3825 -677 -4558 2112 3883
1786 3883 -3084 -2291 2231 -143 -1614 1150 493 -1539 -1774 -43 2082 -285 -4277 158 3607 -1559
1802 -1559 -2431 2303 -378 -3273 2053 2135 -2678 -2361 1388 2166 -105 -2089 -632 2080 -260 -1656
1818 -1656 2273 144 -4171 1542 4417 -2738 -3356 2631 1987 -1036 -4 358 -627 -6 604 1550 243
$$ packed form
1708D299o040k254P050j312n929M819K083n208j47M539l00k800m56J962J583l023
1724a134r39M084j330m143M362K535n697m85N510j468k981J582Q02o93K62o49
1740c82J549L94l997K070N157n499m025P556N63o565K752L617m151r38M192k20
1756B073k875j085K236K988l420l011M767J229n447J943M451n487j874O680l95
1771B773n192J013K320K32j173j350J218J363l052J106M567m502l881O670J771
1786C883o967P93M522k374j471K764o57k032k35J731K125k367l992M435L449n166
1802a559q72M734k681k895N326Q2m813L17L749P78k271j984J457K712k340j396
1818a656L929k129m315N713K875p155o18N987o44l023J032L62r85O21O10R46j307
$$ plain form
1835 243 -3321 608 4878 -787 -3685 1884 2299 -1923 1271 1943 -2083 -1442 2666 1720 -779 -1716
1851 -1716 -412 2784 914 -2774 694 1556 -2423 1064 3922 -2691 -4153 3913 2590 -2716 -781
1866 -781 934 -932 154 1388 -450 -1205 -1521 1115 2899 -1755 -3782 1469 2294 -1704 -438 403
1882 403 -1914 -138 2182 -152 -1442 -1397 -454 2890 1114 -4543 -688 3776 -992 -2197 2667 -571
1898 -571 -3730 2335 3800 -2748 -3560 1423 2520 -171 -2370 191 1327 -1446 -286 3201 -1321
1913 -1321 -4367 2950 4434 -3149 -1857 2666 -113 -620 2496 -619 -2224 767 1347 987 264 -2347
1929 -2347 -678 3488 504 -2239 472 756 -548 1963 1309 -2008 -1167 1466 1523 693 -2051 -1695 2672
1946 2672 815 -2265 1269 987 -2999 1314 4502 -3079 -3807 3211 1932 -2282 -165 407 -1415 -140
$$ packed form
1835B43l564L929M270n665k898N569M15m222L194O72m026O41M108r46k499r37
1851a716J304L196j870l688L468Q62l979L487K858o613j462Q066j323n306J935
1866g81J715j866J086J234j838p55l16K636J784m654k027N251Q25l998J266Q41
1882D03k317J776K320k334j290M5R43L344j776n657L855M464m768j205M864l238
1898e71l159O065J465o548q12M983J097k691k199K561J136k773J160L487m522
1913a321l046P317J484p583J292M523k779n07L116l115j605K991N80l60p23k611
1929b347J669M166k984k743K711K84j304K511o54l317Q41K633N7q30k744L56M367
1946B672j857l080L534k82l986M313L188p581p28P018j279m214K117N72j822J275
$$ plain form
1962 -140 1618 615 -1379 -2101 859 3030 -1470 -3325 1701 1160 -1704 386 861 -2463 -1012 2116
1978 2116 820 -1494 -1706 -599 2456 623 -3336 -311 1987 -2075 -149 3126 -2165 -3364 3033
1993 3033 2080 -2235 -801 512 411 587 -433 -286 829 -1056 -166 3195 -896 -4030 2268 3515
2009 3515 -2282 -1099 1796 -1087 -296 2189 134 -1658 37 354 1561 956 -2504 -333 3025 -415
2025 -415 -1627 1566 -169 -1916 1993 2072 -1768 -1108 1046 1056 675 -1201 -812 1678 87 -1432 1959
2042 1959 247 -3537 1721 3360 -2493 -2122 2621 -65 -1399 1386 15 -1529 305 589 295 -300
2058 -300 -1612 197 2351 -960 -2482 1268 277 -1713 1456 587 -2283 -208 1237 -295 -76 -1013
2074 -1013 -956 1398 610 -2333 468 1669 -2414 122 2920 -1915 -2715 2260 1154 -1405 -226 467
$$ packed form
1962a40J758j003j994p22K960K171m500j855N026n41k864K090M75l324J451L128
1978B116j296k314k12J107L055j833l959L025K298m062J926L275n291j199O397
1993C033r53m315J434J313j01J76j020J47J115j885Q90L361m091l134O298J247
2009C515n797J183K895k883P91K485k055j792J695L17J207o05l460K171L358l440
2025d15j212L193j735j747L909P9l840O60K154J0l81j876L89K490j591j519L391
2042A959j712l784N258J639n853L71M743k686j334K785j371j544J834K84k94n95
2058c00j312J809K154l311j522L750r91j990L169q69k870K075J445j532K19r37
2074a013N7K354p88k943K801J201m083K536K798m835q00M975j106k559J179O93
$$ plain form
2090 467 -72 256 -365 512 759 -1704 -269 3254 -765 -3126 2279 2216 -2518 -106 2130 -1295 -758
2107 -758 1772 225 -597 13 121 1104 611 -1909 137 1918 -882 -1223 2148 -74 -1973 1464 1305
$$ packed form
2090D67n39L28o21Q77K47k463J435L523m019k361N405o3m734K412K236l425N37
2107g58K530j547q22O10J08R83m93k520K046J781k800l41L371k222j899L437j59
$$ [...]
8191g9
##END NTUPLES=NMR FID
##END=
