##TITLE=1H_SL0H-DOX(rechrom-B)
 CDCl3
 8 sc, 
 10.8.2023
##JCAMPDX= 6.0         $$ Bruker NMR JCAMP-DX V2.0
##DATA TYPE= NMR FID
##DATA CLASS= NTUPLES
##ORIGIN= UXNMR, Bruker Analytische Messtechnik GmbH
##OWNER= root
$$ XWIN-NMR		Version 3.5
$$ Thu Aug 10 15:14:14 2023 Russian Standard Time (UT+4h)  she@DPX200
##.OBSERVE FREQUENCY= 200.13135
##.OBSERVE NUCLEUS= ^1H
##.DELAY= (6, 6)
##.ACQUISITION MODE= SIMULTANEOUS
##.ACQUISITION SCHEME= undefined
##.AVERAGES= 8
##.DIGITISER RES= 18
##SPECTROMETER/DATA SYSTEM= spect
##.PULSE SEQUENCE= zg30
##.SOLVENT NAME= CDCl3
##.SHIFT REFERENCE= (INTERNAL, CDCl3, 0, 15.7039)
##AUDIT TRAIL= $$ (NUMBER, WHEN, WHO, WHERE, WHAT)
$$ ##TITLE= Audit trail, XWIN-NMR		Version 3.5
$$ ##JCAMPDX= 5.01
$$ ##ORIGIN= Bruker BioSpin GmbH
$$ ##OWNER= she
$$ F:/spectra/data/she/nmr/H-F/1/audita.txt
$$ ##AUDIT TRAIL=  $$ (NUMBER, WHEN, WHO, WHERE, WHAT)
(   1,<2023-08-10 15:13:08.07 +0400>,<she>,<DPX200>,
      <created by zg, POWCHK disabled, PULCHK disabled
       configuration hash MD5:
       00 E9 B6 7A A2 85 ED C7 34 08 36 98 17 FE 4E 26
       data hash MD5: 16K
       35 37 2B DE 88 63 AE B5 13 1E 5B 06 A6 FD 27 EF>)
$$ ##END=
$$ 
$$ hash MD5
$$ B2 7E 55 75 6D 93 94 AE A8 12 77 FD 02 79 53 F0
##$RELAX= 
##$RELAX= 
##$RELAX= 
##$RELAX= 
##$RELAX= 
##$RELAX= 
$$ Bruker specific parameters
$$ --------------------------
##$DU= <F:/spectra>
##$EXPNO= 1
##$NAME= <H-F>
##$PROCNO= 1
##$TYPE= <nmr>
##$USER= <she>
##$AMP= (0..31)
100 100 100 100 100 100 100 100 100 100 100 100 100 100 100 100 100 100 
100 100 100 100 100 100 100 100 100 100 100 100 100 100 
##$AQSEQ= 0
##$AQ_mod= 1
##$AUNM= <au_zg>
##$AUTOPOS= <>
##$BF1= 200.13
##$BF2= 200.13
##$BF3= 200.13
##$BF4= 200.13
##$BF5= 200.13
##$BF6= 200.13
##$BF7= 200.13
##$BF8= 200.13
##$BYTORDA= 1
##$CFDGTYP= 0
##$CFRGTYP= 5
##$CHEMSTR= <none>
##$CNST= (0..31)
1 1 145 1 1 1 1 1 1 1 1 1 1 1 1 1 1 1 1 1 1 1 1 1 1 1 1 1 1 1 1 1 
##$CPDPRG= <>
##$CPDPRG1= <>
##$CPDPRG2= <>
##$CPDPRG3= <>
##$CPDPRG4= <mlev>
##$CPDPRG5= <mlev>
##$CPDPRG6= <mlev>
##$CPDPRG7= <mlev>
##$CPDPRG8= <mlev>
##$CPDPRGB= <>
##$CPDPRGT= <>
##$D= (0..31)
0 1.2 0 0 0 0 0 0 0 0.06 0 0.03 0 0 0 0 0.0002 0 0 0 0 0 0 0 0 0 0 0 0 
0 0 0 
##$DATE= 1691665987
##$DBL= (0..7)
120 120 120 120 120 120 120 120 
##$DBP= (0..7)
150 150 150 150 150 150 150 150 
##$DBP07= 0
##$DBPNAM0= <>
##$DBPNAM1= <>
##$DBPNAM2= <>
##$DBPNAM3= <>
##$DBPNAM4= <>
##$DBPNAM5= <>
##$DBPNAM6= <>
##$DBPNAM7= <>
##$DBPOAL= (0..7)
0.5 0.5 0.5 0.5 0.5 0.5 0.5 0.5 
##$DBPOFFS= (0..7)
0 0 0 0 0 0 0 0 
##$DE= 6
##$DECBNUC= <off>
##$DECIM= 32
##$DECNUC= <off>
##$DECSTAT= 4
##$DIGMOD= 1
##$DIGTYP= 9
##$DL= (0..7)
0 120 120 120 120 120 120 120 
##$DP= (0..7)
150 150 150 150 150 150 150 150 
##$DP07= 0
##$DPNAME0= <>
##$DPNAME1= <>
##$DPNAME2= <>
##$DPNAME3= <>
##$DPNAME4= <>
##$DPNAME5= <>
##$DPNAME6= <>
##$DPNAME7= <>
##$DPOAL= (0..7)
0.5 0.5 0.5 0.5 0.5 0.5 0.5 0.5 
##$DPOFFS= (0..7)
0 0 0 0 0 0 0 0 
##$DQDMODE= 0
##$DR= 18
##$DS= 0
$$ [...]
##$SUBNAM2= <"">
##$SUBNAM3= <"">
##$SUBNAM4= <"">
##$SUBNAM5= <"">
##$SUBNAM6= <"">
##$SUBNAM7= <"">
##$SUBNAM8= <"">
##$SUBNAM9= <"">
##$SW= 18.05172834244
##$SWIBOX= (0..15)
0 0 2 0 0 0 0 0 0 0 0 0 0 0 0 0 
##$SW_h= 3612.71676300578
##$TD= 16384
##$TD0= 1
##$TE= 0
##$TE2= 300
##$TE3= 300
##$TEG= 300
##$TL= (0..7)
0 120 120 120 120 120 120 120 
##$TP= (0..7)
150 150 150 150 150 150 150 150 
##$TP07= 0
##$TPNAME0= <>
##$TPNAME1= <>
##$TPNAME2= <>
##$TPNAME3= <>
##$TPNAME4= <>
##$TPNAME5= <>
##$TPNAME6= <>
##$TPNAME7= <>
##$TPOAL= (0..7)
0.5 0.5 0.5 0.5 0.5 0.5 0.5 0.5 
##$TPOFFS= (0..7)
0 0 0 0 0 0 0 0 
##$TUNHIN= 0
##$TUNHOUT= 0
##$TUNXOUT= 0
##$USERA1= <user>
##$USERA2= <user>
##$USERA3= <user>
##$USERA4= <user>
##$USERA5= <user>
##$V9= 5
##$VALIST= <valist>
##$VCLIST= <CCCCCCCCCCCCCCC>
##$VD= 0
##$VDLIST= <DDDDDDDDDDDDDDD>
##$VPLIST= <PPPPPPPPPPPPPPP>
##$VTLIST= <TTTTTTTTTTTTTTT>
##$WBST= 1024
##$WBSW= 4
##$XGAIN= (0..3)
0 0 0 0 
##$XL= 0
##$YL= 0
##$YMAX_a= 129185
##$YMIN_a= -116067
##$ZGOPTNS= <>
##$ZL1= 120
##$ZL2= 120
##$ZL3= 120
##$ZL4= 120
##$ABSF1= 10
##$ABSF2= 0
##$ABSG= 5
##$ABSL= 3
##$ALPHA= 0
##$AQORDER= 0
##$ASSFAC= 0
##$ASSFACI= 0
##$ASSFACX= 0
##$ASSWID= 0
##$AUNMP= <proc_1d>
##$AZFE= 0.1
##$AZFW= 0.1
##$BCFW= 1
##$BC_mod= 2
##$BYTORDP= 1
##$COROFFS= 0
##$CY= 11.3945322036743
##$DATMOD= 1
##$DC= 2
##$DFILT= <>
##$DTYPP= 0
##$F1P= 15.7292609196834
##$F2P= 12.9074282941183
##$FCOR= 0.5
##$FTSIZE= 0
##$FT_mod= 4
##$GAMMA= 1
##$GB= 0.15
##$INTBC= 1
##$INTSCL= 1
##$ISEN= 128
##$LB= 0.24
##$LEV0= 0
##$LPBIN= 0
##$MAXI= 10000
##$MC2= 0
##$MEAN= 0
##$ME_mod= 0
##$MI= 1.114404
##$NCOEF= 0
##$NC_proc= 0
##$NLEV= 6
##$NOISF1= 3.799351
##$NOISF2= 2.8
##$NSP= 1
##$NTH_PI= 0
##$NZP= 0
##$OFFSET= 15.70392
##$PC= 1
##$PHC0= -21055.31
##$PHC1= 24.45272
##$PH_mod= 1
##$PKNL= yes
##$PPARMOD= 0
##$PSCAL= 0
##$PSIGN= 0
##$REVERSE= no
##$SF= 200.130013532006
##$SI= 16384
##$SIGF1= 3
##$SIGF2= 2
##$SINO= 400
##$SIOLD= 16384
##$SREGLST= <1H.CDCl3>
##$SSB= 0
##$STSI= 0
##$STSR= 0
##$SW_p= 3612.71676300578
##$SYMM= 0
##$S_DEV= 0
##$TDeff= 0
##$TDoff= 0
##$TI= <>
##$TILT= no
##$TM1= 0
##$TM2= 0
##$TOPLEV= 0
##$USERP1= <user>
##$USERP2= <user>
##$USERP3= <user>
##$USERP4= <user>
##$USERP5= <user>
##$WDW= 1
##$XDIM= 8192
##$YMAX_p= 0
##$YMIN_p= 0
$$ End of Bruker specific parameters
$$ ---------------------------------
##NTUPLES= NMR FID
##VAR_NAME=  TIME,          FID/REAL,        FID/IMAG
##SYMBOL=    X,             R,               I
##VAR_TYPE=  INDEPENDENT,   DEPENDENT,       DEPENDENT
##VAR_FORM=  AFFN,          ASDF,            ASDF
##VAR_DIM=   8192,          8192,            8192
##UNITS=     SECONDS,       ARBITRARY UNITS, ARBITRARY UNITS
##FACTOR=    0.0002768,     1,               1
##FIRST=     0,             0,               0
##LAST=      2.2672688,     0,               0
##MIN=       0,             -116067,         0
##MAX=       2.2672688,     129185,          0
$$ Real data points
##PAGE= N=1
##DATA TABLE= (X++(R..R)), XYDATA
$$ [...]
1822E50j58P3j64J78K76k04j67J93m55J78l3p4K47l95k99M7r0J02K60o73K09l
1844d02O6k4K52l75j1K39K15L4L6J85k42K53K33l44M03k16j38p1Q82o57N28m85
1866C61m2j84k16N99p56l51L38o5K2j15k97L76j09j2L90l00N64j15K31L9j96l13
1888a51K65J071r10j37M44l34l70L55K16o06J064p54l14QL39j067Q64O35j291
1907f73N31q9N5l36j34Q41j77j7N00N12m53l80J02L36Q3j22P33p54n65K79P54
1928A026j159R4J68j51K54J67q6m23l13J33K03k96J08J51n75m44P20P25q80r8
1948f76J108m33O80J24j208J013J89m05k61j45J73J94l00J19M20j265L00Q1K72
1967b0K63m94L26k88m48L61k48K24L77r61K95P95n48m7K26k9O82m90K03K59j51
$$ plain form
1822 550 392 465 301 479 755 551 384 577 122 300 267 193 440 45 -254 -207 -297 -195 65 -608 -399 -402
1844 -402 -336 -360 -108 -483 -494 -255 -40 -6 30 215 -27 226 459 115 518 302 164 93 975 318 846 361
1866 361 319 135 -81 518 -238 -589 -251 -316 -294 -409 -706 -330 -439 -451 -61 -361 203 88 319 358 162 -151
1888 -151 114 1185 275 138 582 248 -122 233 449 -157 907 153 -161 -153 186 -881 -17 618 -673
1907 -673 -142 -231 -176 -512 -646 195 18 1 501 1013 560 180 282 618 701 579 1312 558 -7 272 1026
1928 1026 -133 -39 129 -22 232 399 313 -110 -423 -290 -87 -383 -275 -124 -699 -1143 -423 302 -578 -676
1948 -676 432 -1 679 803 -405 608 797 392 131 -14 159 353 53 172 592 -673 -373 -292 -20
1967 -20 243 -251 75 -213 -661 -300 -548 -324 53 -908 -613 182 -366 -413 -187 -216 466 -24 179 438 287
1988B87P55p83p07L14P93M1l25k83k52K47j63J40m65j67J76Q09j005N07k03n39
2008h23L58P48l64o12R61n84J007l38K37k82L71l05M05K1M99q48l72N73j080Q25
2028C97m2k29j300J050m61O82J06p25k26N4L14J35J68n76L86N96j27Q4j49k25
2048h8K11P2KN3p8k28L59K93L03o17m38K38L17p86Q43l21l48J88k1R8j39q4n49
2071g20K23K86j96J94j88K88O05l51n85Q45L74o46P29m82J93j05l47P11n87j09
2091A32j20J5O4m6l19k04K95J21o17QJ60N43q7p7m30j80N37J96k53N21J4J2rl69
2115i3P26K25p45K08L15n86l7L70k8j67M64l97l40k79o1P5m1J37M2Qj13K6J53
2138a38K29l99K00k28M02J92p0O2K82k20K50o52K74J96J87l67M8L1K33m82k59
$$ plain form
1988 287 1042 259 -448 -134 659 700 375 92 -160 87 -76 64 -401 -568 -392 417 -588 -81 -284 -823
2008 -823 -465 283 -81 -693 268 -316 691 353 590 308 679 374 779 800 1299 451 79 652 -428 397
2028 397 355 126 -1174 -124 -585 97 203 -522 -748 -694 -380 -245 -77 -653 -267 329 202 286 137 -88
2048 -88 123 195 197 250 172 -56 303 596 899 282 -156 82 399 -387 456 135 -213 -25 -46 52 -87 -171 -720
2071 -720 -497 -211 -407 -213 -401 -113 492 141 -444 401 775 129 858 376 569 464 117 828 241 132
2091 132 12 27 91 45 -274 -478 -183 -62 -679 -671 -511 32 -55 -132 -562 -742 -205 -9 -262 259 273 285 276 -93
2115 -93 633 858 113 321 636 50 13 383 355 188 652 255 -85 -364 -425 -350 -391 -254 -212 -204 -317 -291 -138
2138 -138 91 -308 -108 -336 66 258 188 250 532 312 562 -90 184 380 567 200 248 279 512 30 -229
2159b29M74n94L41Ll22m78M41j4J72L4R4j46j60K27K1Q5J94m8k6K38k7L10q9j2
2183D89l21J34Rr5k61n8J10O7K87l40m86L4L07l93J12J63o2j64J68j58L63J66
2205G1j03n0qK42j07q8M72n3J1r3J99j2n08L24J1k20J28j12j54k10J82o4J75l14
2229b81j14n1M4L42k41J04R7jp9q4M43m93M66K4P0L65j75j56k53R8J85J13lj92
2253B28m96M72j18k13P2l18qJ9J11j11J46O2m5J08l2J49q5J53k37K04l6Q7j26
2276a4K71J7K57k4j93O0k57J52P9j41n9p8n6l56K35k25J38k5k01P4P9N9j08KJ2
2301c02K25j23L87j90k3K8K77J49k39L37l79J65j03P0K78m03k48L06j06j22K34
2322B18n39K45J30m27K38j57J30j45J85k0j20J75P6L1m6R6L5O1j1K48k44L92j6
$$ plain form
2159 -229 245 -349 -8 -5 -327 -805 -364 -378 -206 -172 -78 -224 -384 -157 -136 -51 143 95 69 307 280 590 501 489
2183 489 168 302 311 216 -45 -103 7 74 361 21 -465 -431 -124 -517 -405 -242 -304 -468 -300 -458 -95 71
2205 71 -32 -82 -90 152 45 -43 429 376 387 294 493 481 -27 297 308 88 216 104 -50 -260 -78 -142 33 -281
2229 -281 -395 -446 -402 -60 -301 -197 -100 -101 -180 -264 179 -314 152 176 246 611 436 280 27 125 310 423 420 228
2253 228 -268 204 86 -127 -55 -373 -381 -362 -251 -362 -216 -154 -199 -91 -123 26 -59 94 -143 61 25 112 -14
2276 -14 257 274 531 507 314 374 117 269 348 207 148 70 14 -342 -107 -332 -194 -219 -420 -346 -267 -208 -316 -314 -302
2301 -302 -77 -200 187 -3 -26 2 279 428 189 526 147 312 209 279 557 154 -94 212 106 -16 218
2322 218 -321 -76 54 -373 -135 -292 -162 -307 -122 -142 -262 -87 -11 20 -26 70 105 166 155 403 159 551 535
2345E35k72J00k15L7p0q1O6j70j15R8K48m53M3J19j66L1o3K33k06J81m6P7J88
2368I9K6o8O3J7K9J11m7P0j23J93j27Oo1oj90k7L99l48j96J10m59M07Lk92J90
2393b21r8K93k67J15q2K42j82J3K23Q9L02k51J62J7k1P6j59Q2o1j30J26j52m9
2416F7q8k2P3l82J31Q5j27Nj20K16J18l32O2M17l38m8Q2J59J91rk6M14k51J90
2440D67l39K58l20J80J33R3m07j6k53K33k29J22p8j63J28j02n4j00J18K09kj4
2462a36N2l1K77l08M43k27K89j37q7j65K01J69j39J10q5j23M18l57j72P3P5k70
2484a30q9N0k00M8l09K82J34N4r6r7J58j15L14k43OQ4L24Nn6J35Pj55J32k52K43
2509B34Nk45l6O2m7J03p4qP6j95O9k0k51P8Q1k24L72j10J81p6Qr3K62m8q4K01
$$ plain form
2345 535 263 363 148 185 115 34 100 -70 -185 -87 161 -292 -249 -130 -296 -265 -328 -95 -301 -120 -166 -89 99
2368 99 125 57 120 137 166 277 230 300 177 370 243 249 188 182 -8 -35 364 16 -180 -70 -529 -122 -119 -411 -221
2393 -221 -319 -26 -293 -178 -260 -18 -200 -187 36 125 427 176 338 355 334 410 251 333 272 142 268 116 67
2416 67 -21 -43 30 -352 -221 -136 -263 -258 -378 -162 -44 -376 -314 103 -235 -283 -201 -42 149 140 114 528 277 467
2440 467 128 386 66 246 379 472 65 49 -204 29 -200 -78 -156 -319 -191 -293 -347 -447 -329 -120 -122 -136
2462 -136 -84 -115 162 -146 297 70 359 222 135 -30 171 340 201 311 226 103 521 164 -8 65 140 -130
2484 -130 -219 -169 -369 -321 -630 -348 -214 -160 -256 -353 -195 -310 4 -239 -233 -149 175 180 124 259 266 111 243 -9 234
2509 234 239 -6 -42 20 -27 76 2 -6 70 -125 -56 -76 -327 -249 -168 -392 -20 -130 51 -25 -17 -110 152 104 20 221
2535B21J19j15n4j05L70m21K08J6k09K85j90m5m9O8k22J7j88J14j26o2J47P3L36
2558A88j59k70K89R5j62J12J99k46L60m3l20J69L09n94K85J1m3j19J24O1m47K6
2580a75n6Q2N8o2Q4j81O9J73k32N4j20O9L76m2j63L07p5r8J57Q3j75J37j50K41
2604C61n25L13L8j34J01L0j29o8k70J42j9L9P2k60O0J1P4k30J59J32K48j36J52
2627A61l83K54r8K13J69j51J8j29J52M5J79l14N0k84n3L82l90J74o0RL9j33j57
2650c07K50j24j93j4m3M49l78L19Q5R1n5k19qL85q2m2J17K0m0l29m1L00R8k01
2674C8j49J21j78J86J13m26K29l07J60l9J36m4L5K25k02J20o0J9K7M36M7l09J33
2697C11m76J53K43K24m8k4k51N6M0J21l06j01k09L06k83K5N5j04j54L0J36n2J89
$$ plain form
2535 221 340 225 171 66 436 15 223 239 30 315 125 80 31 99 -123 -106 -294 -180 -306 -368 -221 -148 188
2558 188 29 -241 48 143 -19 93 292 46 406 363 43 212 521 -73 212 223 180 61 185 246 -201 -175
2580 -175 -231 -149 -91 -153 -69 -250 -181 -8 -240 -186 -306 -237 139 97 -66 241 166 68 225 308 133 270 120 361
2604 361 -164 149 187 53 154 184 55 -13 -283 -141 -160 -121 -49 -309 -249 -238 -164 -394 -235 -103 145 9 161
2627 161 -222 32 -66 147 316 165 183 54 206 251 430 116 166 -118 -171 211 -179 -5 -65 -56 -17 -150 -307
2650 -307 -57 -181 -374 -388 -431 18 -360 -41 44 135 80 -139 -147 238 156 114 231 251 211 -118 -159 141 239 38
2674 38 -111 10 -168 18 131 -295 -66 -373 -213 -252 -116 -160 -125 100 -102 18 -42 -23 4 440 487 178 311
2697 311 -165 -12 231 455 407 383 132 188 228 349 43 -58 -267 39 -244 -219 -164 -268 -422 -392 -256 -308 -119
2720a19O2j20N8K69J01P7l36JOK61M4k43K25q8o7J88m57J4L43k45K03k03j36j54
2744c16J39l00J22K62k62J39N7j59K08R3o5Q0J35R5r7k44K30L34j70Rm8o1j94
2767a3j35K34j81j4J69j78l5k63L75K4j62K74l65O8J11l57J12L63l08M7K86k5
2789B7j26K2K31N3k01K43j57J20Mj02k8K17P3n25k04L34K17l89P1P8m25J50Q1
2812b36p7J56j79L22k52Q1J35K00k56J78K47k79o0J83j45l2K08J58j31j40J88
2833B69k14m6J12R9k20l8Oj27J43j88j5O0m9m7J36NP0j4r3M3O1L90j28j38J48
2858B25mk1q2L6j77J97O1n8k6n4L8j22k33K02j9J78l28ko4kk25M26j30J97K13
2883B26k36p2L55l13K26l2j41M71m04L8J07J1J00j38k25J51m03N04j9k39K09m5
$$ plain form
2720 -119 -57 -177 -119 150 251 328 -8 -7 -1 260 304 61 286 198 131 319 -138 -124 219 -26 177 -26 -162 -316
2744 -316 -177 -477 -355 -93 -355 -216 -159 -318 -110 -17 -82 -2 133 228 131 -113 117 451 281 290 242 181 -13
2767 -13 -148 86 -95 -109 60 -118 -153 -416 -41 -17 -179 95 -270 -202 -91 -448 -336 27 -281 -234 52 27
2789 27 -99 -77 154 207 6 249 92 212 216 114 86 303 376 -149 -353 -19 198 -191 -120 -42 -467 -317 -236
2812 -236 -313 -157 -336 -14 -266 -185 -50 150 -106 72 319 40 -20 163 18 -14 194 352 221 81 269
2833 269 55 9 121 220 0 -38 -32 -159 -16 -204 -219 -159 -208 -255 -119 -114 -44 -58 -151 -108 -47 343 215 77 225
2858 225 221 200 118 154 -23 174 235 177 151 97 135 13 -220 -18 -37 141 -187 -189 -253 -255 -480 -54 -184 13 226
2883 226 -10 -82 273 -40 186 154 13 484 80 118 225 236 336 198 -27 124 -279 225 206 -33 176 131
2905A31k16R8l49J45n7J50K4n4P9j8%j38J54M22j90J12k62jJ62R7J7j09J29j34
2929A92k36P1m0N5m9Q4K2j65p5n1j56K07r4Q2J73j33j79k4N0K60P6J91j25no3
2954F8K46j66N1l41M14J33K61p10n2J86m1J43r1k13k5k7J27l97L00M2N5j67j1
2977b15K15k07K07p2J06m2j9M0J19J37j47P1J28o5K8j00m8j89L66rl34n0J29j58
3001a09p8K06j83K40l03O4K3M0M0j28m5M03q2k63K49J66k44l2L53j32L66k52j34
3024A65N9k68J97j00J33o8n0o2j66j38J09k3J12O4p6J61l79L80L9j07p6K99q6
3047A19m2j8K48r1J9Q8l24K07QQ3j10j32mk02K09J14l93J14M2q1q2j9P8J46j50
3072a73J03j35J59R5l1k9K56k06L0O8P8K59l00l5j04J07r4j71o8L08k22J45K19
$$ plain form
2905 131 -85 13 -336 -191 -248 -98 -74 -128 -49 -67 -67 -205 -51 371 181 293 31 30 192 289 306 197 326 192
2929 192 -44 27 -13 42 -7 77 99 -66 -141 -192 -348 -141 -235 -153 20 -113 -292 -316 -266 -6 70 261 136 131 68
2954 68 314 148 199 -142 272 405 666 -44 -96 90 49 192 101 -112 -137 -164 -37 -434 -134 -92 -37 -204 -215
2977 -215 0 -207 0 -72 34 -8 -27 13 132 269 122 193 321 256 284 184 136 -53 313 304 -30 -80 49 -109
3001 -109 -187 19 -164 76 -227 -163 -140 -100 -60 -188 -233 170 88 -175 74 240 -4 -36 317 185 551 299 165
3024 165 224 -44 153 53 186 118 68 6 -160 -298 -189 -212 -100 -36 -112 49 -330 50 89 -18 -94 205 119
3047 119 77 59 307 216 235 323 -1 206 214 297 187 55 51 -151 58 172 -221 -107 -65 -146 -228 -247 -169 -23 -173
3072 -173 -70 -205 -46 49 18 -11 245 39 69 137 215 474 174 139 35 142 48 -123 -191 117 -105 40 259
3095B59l26k07J33m7K18l63N3K73j41j44k26K74L88k05J67j84R6J72j04n2j06
3116g2L17j1k44J45l4J27j35O2j77K02k90K68l06K81l26o0M4l1M8o2J89j19j28
3139c12M18r4r9M0m1J46p0J31p0K4J97r8l6L8j09ll8RlQ2l5q0j39J18l2j08n0
3166b14P9n6j59J71J52N3k96K12M8J61q4R2k16n0M01j87N7Ol7j07L34k57j51J19
3190G1j48R5l0j8L3j79J69k76NK55M6j47L5J77k27j23L24l4R3o5L9J60k31J71
3214A95L3j43k53L23L19m63J22l0j10J01k50K60j87Rj16K2J8j6NP1mP0Q9k1J57
3239B01o8j58m6K74O9k24J64O5l68K89L8k07rJ34k01J93j14j16J36k53J77p9Q7
3262a6rk42O3M26k41l52J77j5L26k30J57k0QJ80P4l41O38l52k31J0J49lj81o4
$$ plain form
3095 259 -67 -274 -141 -188 30 -333 -280 -7 -148 -292 -518 -244 144 -61 106 -78 18 190 86 34 -72
3116 -72 245 234 -10 135 101 228 93 155 -22 180 -110 158 -148 133 -193 -253 -209 -240 -192 -254 -65 -184 -312
3139 -312 106 12 -87 -47 -88 58 -12 119 49 73 270 172 136 174 65 62 24 33 30 112 77 -3 -142 -24 -56 -164 -214
3166 -214 -135 -191 -350 -179 -27 26 -270 -58 -10 151 67 159 -57 -107 294 107 164 170 133 26 360 103 -48 71
3190 71 -77 18 -12 -30 3 -176 -7 -283 -278 -23 23 -124 -89 88 -139 -262 62 28 121 56 95 255 24 195
3214 195 228 85 -168 155 474 11 133 103 -7 94 -156 104 -83 -74 -190 -168 -150 -166 -161 -90 -94 -24 65 44 201
3239 201 133 -25 -71 203 272 48 212 277 -91 198 236 29 20 154 -47 146 32 -84 52 -201 -24 -103 -16
3262 -16 -25 -267 -204 222 -19 -371 -194 -209 117 -113 44 24 32 212 286 -55 583 231 0 10 159 156 -25 -89
3286h9q0O4j5K08k95L4J25l34J51J83j18J62m1o1m7J07R5J32l7j2k42J73k8J9
3310E4L1O4P5j99J86j73J83j27l7j36M3N3L9q4j92m8Q0J22m0J40l34K85J20k09
3334a04K31m02J26L08l9k08K02K34j89p1Q6K4k20J8p4K83k09l4j05K9p4JK06J84
3358B03k99j47J42J68o9k31J47L1M2J54m4m2K9J34m2j76Q8K20j0j31j59L6kR7
3382A39m0J77l74J57l5j86k5KK75J46l94P2L3m4%J34L4j7J9k15N5K14r6j4J95
3407B12p9M7l5j14Q8j4j58O6J89j84j56J10n1j44P0K42k47Q4p1l0j32K99j70K6
3431a52K68mn5J6N5j78L58j22p7N2j42J42r7N2j46R3J1k43l1L59q9j14k1k12J77
3456a00K44q1k8J72m50K20J40l52L69k1o2m7Q8k25L38j24k1N7L8M2NK13l93O1
$$ plain form
3286 -89 -169 -105 -120 88 -207 -173 -48 -382 -231 -48 -166 -4 -45 -106 -153 -46 49 181 144 132 -110 63 35 54
3310 54 85 149 224 25 211 38 221 94 57 -79 -36 17 56 -28 -220 -268 -188 -66 -106 34 -300 -15 105 -104
3334 -104 127 -275 -149 159 120 -88 114 348 159 88 174 198 -22 -4 -78 205 -4 -38 -143 -114 -188 -187 19 203
3358 203 -96 -243 -101 67 -2 -233 -86 -55 -13 141 97 55 84 218 176 0 88 308 298 167 8 44 42 139
3382 139 99 276 -98 59 24 -162 -187 -185 90 236 -158 -86 -53 -97 -97 37 71 54 73 -142 -87 127 31 17 212
3407 212 133 180 145 31 119 105 -53 13 202 18 -138 -28 -79 -223 -153 89 -158 -74 -145 -175 -307 -8 -178 -152
3431 -152 116 112 57 73 128 -50 308 186 109 161 19 161 64 116 -30 63 74 -169 -200 159 70 -44 -65 -277 -100
3456 -100 144 63 35 207 -243 -23 117 -235 134 113 51 4 92 -133 205 81 60 117 155 197 202 415 22 83
3480H3r5n9p7K40j39Q3N6j8r6N7O9k45J6L6MJ22j67M11m01K57Q5J16j02k85J84
3505A35j98J17RK60j64p3k1P6k58K1J35O6m50K69jj59K57j51r5R5J36j60j95M05
3529E6P4m25L53L0j3Q3j9j20O3Qj19K42k13k7L1J44P0k45k02O8J32O5P4l92J79
3554a03n8L1Pq3K31q8K34l31K35j89K42M0Q0k05K99j58q0k14J11R9m9O9j80J05
3578D5k3k21L05j68N4k85Q3N8J84j72k5K3m0K34p6K04l24J61r0ML2N1mM2j09J62
3604A05j08L2o7Q4Q4l50L41j58k21J28N1m7k1O2ql08N14q9k63k1K71O8r4M2Rk04
3630a68J40M7K11K1l35M09l95J0J21j75p2M2J52LM0J52r8l80J40J30l01L30o3
3653c9N0k11R4J39J7j27J68P1j56K16k64K8j6J54k09J24J30j10K04m84J55P1k79
$$ plain form
3480 83 -12 -71 -148 92 -47 36 92 74 -22 35 104 -141 -125 -89 -85 37 -130 281 -120 137 222 338 236 -49 135
3505 135 -63 54 63 323 159 86 65 141 -117 -96 39 105 -345 -76 -77 -236 21 -130 -225 -130 6 -154 -349 56
3529 56 130 -295 58 88 75 158 139 19 82 90 -29 213 0 -27 4 148 218 -27 -229 -161 -29 36 110 -282 -103
3554 -103 -161 -130 -123 -206 25 -63 171 -160 75 -114 128 168 248 43 342 184 104 -110 1 100 51 120 -60 45
3578 45 22 -199 106 -62 -8 -293 -210 -152 32 -140 -165 -142 -182 52 -24 180 -144 17 -73 -69 -37 14 10 52 -57 105
3604 105 -3 29 -38 46 130 -220 121 -37 -258 -130 -79 -126 -147 -85 -93 -401 113 24 -239 -260 11 79 -15 27 36 -168
3630 -168 -28 19 230 251 -84 325 -70 -60 61 -114 -186 -144 8 11 51 203 105 -275 -135 -5 -306 24 -39
3653 -39 11 -200 -106 33 50 -77 91 162 6 222 -42 -14 -30 124 -85 39 169 59 263 -221 -66 5 -274
3676b74N35r9k38j43K19l6J4k26J05j02R1k48K99M0J97l12M49j80j98L08L9pP
3699B40k05r9L48m2pj50nq5o5J47r7j94J64k4M2K7n9p2Q0j34J72J35o49M50K59
3724A77k18J04nk40J75J29K3p7K81l26k06L48nj31R3J9j66j0M3j1k24mJ87j69
3748b13J37J8M9o4Q5j37K30j55J74N3j98Q5p4J97n7J22j48j83r2N5K28jj57O9
3772B3j01J52k98L2K78m28J35L63m70L57o2n0N0o1K18k22J05L48k88l1N1k69J77
3795Ij81L53p9j90R6Lj62O3P3j93J18j83K90j77L12k52J81k25L5p8M27j69k13
3818a42J81J26k02L1%N0J54o7l2Q8j54J69J37k22N9j41J39qk22J28j71j26j37
3841c62L11P9l14K10R9L0n4K1P6r7q6n6P6L53k95R3j93K09N4k20l7J81L7k7q0
$$ plain form
3676 -274 261 162 -76 -219 0 -36 -22 -248 -143 -245 -154 -402 -103 -63 134 -178 271 91 -107 201 240 233 240
3699 240 35 -64 284 242 235 85 80 -5 -70 77 -20 -214 -50 -74 -32 -5 -64 -136 -56 -190 -18 117 -532 -82 177
3724 177 -41 63 58 -182 -7 122 145 68 349 23 -183 165 160 29 122 141 -25 -35 8 -3 -227 -231 -44 -213
3748 -213 -76 -58 -9 -73 12 -125 105 -50 124 177 -21 64 -10 187 130 252 104 -79 -171 -116 112 111 -46 23
3772 23 -78 74 -224 -192 86 -342 -207 156 -314 43 -19 -69 -19 -80 138 -84 21 369 81 50 101 -168 9
3795 9 -172 181 102 -88 8 11 -151 -88 -15 -208 -90 -273 17 -160 152 -100 81 -144 -109 -187 240 71 -142
3818 -142 39 165 -37 -6 -6 44 198 131 99 187 33 202 339 117 176 35 174 166 -56 72 -99 -225 -362
3841 -362 -51 28 -286 -76 23 53 -1 20 96 -1 -87 -143 -67 286 -9 84 -109 100 154 -66 -103 78 115 88 8
3866HJ43R0j68k0j68O7qk12K13j22J46j93L86l81j69K43j37M26k14%l1K44j34
3889IN5L5O1k04J7j99L43J6j39J27r7j2j32p3K61m08R5L43l35J10j11M1L34j81
3913d4j88J95L5L91m84Q9R8oj9o1J20k87K93J27l13J26m16O23k92RK39l25j73
3936b63J08Q2K9k03J92j21K53j06p6N8L9J80m09M47o0q9p0L52l39J42k66L36k35
3959a9J30q1j84J70n9J4k19L72k02p6O0j27K38j88j27L0J9K17k0k69J96QJ63k43
3983a97J26L37l95J96j53K13R5J63p7j87JJ61l0j50j72J49M3k34k4J35j58K81
4005A23l19J2l8J33J35k23K74k78L53O2m39KN8O9J82j10J07J51k15J63l17L40
4027B25j92j47J43l64M53j78L8J79J01k41l11J89L24k75k44L72J3p4J65j44p1
$$ plain form
3866 8 151 241 73 53 -115 -48 -56 -268 -55 -177 -31 -224 162 -219 -388 -145 -282 144 -70 -70 -101 143 9
3889 9 64 99 160 -44 -27 -226 117 133 -6 121 24 12 -120 -193 68 -340 -245 98 -237 -127 -238 -197 137 -44
3913 -44 -232 -37 -2 389 -95 -6 92 86 67 6 126 -161 132 259 -54 72 -344 279 -13 -4 235 -90 -263
3936 -263 -155 -73 -44 -247 -55 -176 77 -29 -105 -47 -8 172 -237 210 150 61 -9 343 4 146 -120 216 -19
3959 -19 111 30 -154 16 -43 -29 -248 124 -78 -154 -94 -221 17 -171 -298 -268 -249 -32 -52 -321 -125 -117 46 -197
3983 -197 -71 266 -129 67 -86 127 222 385 308 121 122 283 253 103 -69 80 123 -111 -135 0 -158 123
4005 123 -196 -184 -222 -89 46 -177 97 -181 172 234 -205 -203 -145 -76 106 -4 103 254 39 202 -115 225
4027 225 33 -114 29 -335 118 -60 -22 157 258 17 -294 -105 219 -56 -300 72 85 11 176 32 -39
4048c9J61n6O1l3j54K74j05K9j2r6Kj09J10l1n1Q9j30Q3j73O9m1K19k65J94m7
4073e1j62j48N74o6k54j10J45J89P7k44K85l38K69k07M9L97j81j35j85L0j5J00
4095A9J57l49M4K61k40n7o2L0k13K39J74%P4r7j32O8j18K84j3j11J25k28L7K60
4119A52j29J4NJ1m5J30j51k92L02J9l09K28j6J17j98r0K12p2K21j11P7j43j33
4142b01J03J01j17J25J53j73J06j96K46k19R9K29j45o8m3j47J02J31l03L33n8
4163E8J17o1k63J96p4N1l6r6l7P6O8N4QNQ7l6r4L33j4m15L46N3m76K33p1r5J90
4190A07j00o9k22L97l94L47k25O2J65j13M2o6m7J1K29o7n5K5n8K17J60l97K87
4213B36J9m2k49L62j1j26l61L83K0l05J34O4j17O6l45M56k06k44O1K62n3o3J89
$$ plain form
4048 -39 122 66 127 94 -60 214 109 138 126 30 32 -77 33 2 -49 40 -90 -7 -180 -111 -152 67 -198 -4 -51
4073 -51 -213 -361 213 147 -107 -217 -72 117 194 -50 235 -103 166 -41 8 405 224 89 -96 -66 -81 19
4095 19 176 -173 -129 132 -108 -165 -227 -197 -410 -171 3 3 77 -20 -152 -84 -202 82 69 -42 83 -145 -108 152
4119 152 23 37 42 53 8 138 -13 -305 -3 16 -293 -65 -81 36 -162 -252 -40 -112 109 -2 75 -68 -201
4142 -201 -98 3 -114 11 164 -9 97 -99 147 -72 27 256 111 43 0 -147 -45 86 -217 116 58
4163 58 175 114 -149 47 -27 24 -12 -108 -145 -69 -1 53 61 66 153 117 23 356 342 -73 273 326 -150 83 12 -83 107
4190 107 7 -62 -284 113 -281 66 -159 -97 68 -45 -3 -69 -116 -105 124 57 2 27 -31 186 346 -51 236
4213 236 255 213 -36 326 315 189 -172 211 231 -74 60 124 7 73 -272 184 -22 -266 -205 57 4 -59 130
4236A30pk65J57M9m17O41m9q0P7j61L9nj71N9J3J00J30l07J94o8n9k18J07O2j7
4261f6k6K23j16J60k68K0o3J57k58R2J3M62k56q3O5o6Q6k08J49j06J52j11N3M
4285IJ91n3j03j33p5K19q1K13l41J86rk86L49k57K63j34LJ99j75n2K22K03l44
4308A4Q1o6j70R9J71p7J69l7k4j26J25j79j57J14m6j6K3Lk6J67k15K55j56K16
4332A42k50J38K3O6N3j64o7M9J80j41J01j85l3J88j50L7Kj60K87l99L64o6p8J59
4356I6j16p4J02n8J52j6N4j41M4n7n9K34j67K7r5K43j97J30N2J48l52k0J64n3
4380D1n5R0k01L50J03m34j38N24k60n0J1J65l57K14k14l0J96o2O8L3J67o0l84
4403b83K10p0J68K20k46L0J22R3j28K63m55N5J9P1r3j56J65Nm0P8k59K15L1M1
$$ plain form
4236 130 123 -142 15 64 -353 288 239 159 236 75 114 109 -62 -3 10 110 240 -67 127 59 0 -218 -111 -49 -66
4261 -66 -92 131 15 175 -93 -73 -136 21 -237 -145 -132 330 74 -9 56 -10 76 -132 17 -89 63 -48 5 9
4285 9 200 147 44 -89 -164 55 -26 187 -154 32 23 -263 86 -171 92 -42 -39 160 -15 -67 155 358 14
4308 14 95 29 -141 -42 129 52 221 184 160 34 159 -20 -177 -63 -109 -125 -102 -99 -125 42 -173 82 -74 142
4332 142 -108 30 53 119 172 8 -59 -10 170 29 130 -55 -88 100 -50 -13 -11 -171 116 -283 81 15 -63 96
4356 96 -20 -94 8 -50 102 86 140 -1 43 -14 -73 161 -6 21 -74 169 -28 102 154 302 -50 -70 94 41
4380 41 -14 76 -125 225 328 -106 -244 280 20 -30 -19 146 -211 3 -211 -241 -45 -107 -39 -6 161 101 -283
4403 -283 -73 -143 25 245 -1 29 151 244 116 379 -76 -21 -2 69 -24 -180 -15 -10 -50 28 -231 -16 15 56
4427E6k08J41q4N0J90n8j06l4j9K04j0J36k77K34n5R3q4q1m4j41J23o9PJ59l66
4452b43J97L6k6j79L63o2k96N6J38k7L28k83k3R7r7qK79l17L05k1m68N33j93l46
4476b57K15J6K50k42k33J31Q5N6m5K0J04r3l1P4l9N5j13L5j31J38K06l4k03K14
4500A78Kl75M40k34L27l82Q5K3r5J01j88J82jK02j83o3O7P0j68n6j35K52j13j59
4524b23J25RJ88J03j77j24J9L49j54K6j83k3J7K9o2J86k56O4j16M61n19L78o3
4547E4q0R8J23l07J46j92Q2l1J17o7j25L2j76N43j92o2J02qk87K00J02o8o4J71
4571A11l41N41n47N31m28K22o4%J90o7l36J37jk35K13J39N9l47K20J95o6o7k64
4594b05J89Q3M3q8m1L31m10k8J67K29l93J45J0K5L6n9k73L83j67p2J35l6j30k29
$$ plain form
4427 56 -152 -11 -95 -45 145 87 -19 -53 -72 132 122 258 -19 215 160 253 169 88 44 -97 26 -43 -36 123 -243
4452 -243 -46 -10 -36 -215 148 86 -210 -154 -16 -43 285 2 -21 76 -21 -29 250 -67 238 217 -251 282 89 -257
4476 -257 -42 -26 224 -18 -251 -120 -35 21 -24 -4 100 7 -24 50 11 66 -47 -12 -143 -5 201 167 -36 178
4500 178 180 -195 245 11 338 -44 41 64 -31 70 -118 64 63 265 82 19 86 156 -12 -68 -203 49 -64 -223
4524 -223 -98 -89 99 202 25 -99 -80 269 115 141 -42 -65 -48 -19 -81 105 -151 -87 -203 258 -261 117 54
4547 54 -26 72 195 -112 34 -158 -76 -107 10 -57 -182 -150 -326 217 25 -37 65 57 -230 -30 72 4 -60 111
4571 111 -230 311 -236 295 -133 89 25 25 215 148 -188 -51 -52 -287 -74 65 124 -223 -3 192 126 59 -205
4594 -205 -16 67 110 22 -19 312 -98 -126 41 270 -123 22 32 57 93 34 -239 144 -23 -95 40 4 -126 -355
4618c55L48o1J91r3q0O2L3k24J70q9mj9J66k3L1K60l23L67n19K85l19L42k37j82
4642b73J92Q5l15L95J9j61n4M8M9j98L49Rr0k7Q3j93o8K87k15K24n7p7J62k38
4666f4KK85o5j71o4J54J95k11pr2J21j45J99k31o1P4J50j58K36p1j29n3J00J71
4690A65K9k81J54J7k75K27R9jo7j67l5N8K27m77K81j61J63P3j72K78k07R8l1J9
4714A4k27J71M6k16K77j48J28J19N9k66R8q0K16m25K50j13K42j30l60M40p6q8
4736f9j66N76m14K19k64N7K25K03k04r2p9j8K5Pj32kJ44k7j63J25k16M05j76q9
4760a25K09j2n6J12k38J10J44l49L61k22KJ87j97J53L0n34O18j87l65M83j88M1
4782b3Lq4L16l10K5J32k3j96K14r7j72N03n01K12o1N9K24k95K31k32J32L25o63
$$ plain form
4618 -355 -7 -68 123 30 -50 12 45 -179 -9 -98 -102 -121 45 22 53 313 -10 357 -162 123 -196 146 -91 -273
4642 -273 -81 4 -311 84 103 -58 -112 -64 -15 -213 136 145 55 28 111 -82 -150 137 -78 146 89 12 174 -64
4666 -64 -62 223 158 -13 -77 77 272 61 54 -38 83 -62 137 -94 -155 -81 69 -89 147 76 -53 -106 -6 165
4690 165 194 -87 67 84 -191 36 135 134 67 -100 -135 -77 150 -327 -46 -207 -44 29 -143 135 -72 26 -5 14
4714 14 -213 -42 4 -212 65 -83 45 164 223 -43 55 -25 191 -234 16 -97 145 15 -345 95 19 -69
4736 -69 -235 341 -73 146 -118 -61 164 367 163 71 -8 -26 -1 6 -126 -128 16 -11 -174 -49 -265 140 -36 -125
4760 -125 84 72 16 128 -110 0 144 -205 156 -66 -64 123 -74 79 109 -425 193 6 -359 124 -64 -23
4782 -23 -20 -104 212 -98 -73 59 36 -160 54 -43 -215 288 -213 -1 -62 -3 221 -74 157 -75 57 382 -281
4805b81M67k43J15O8n6k01j28R3J29o7K13O0m3j24O3k52L2K56JrR6qo7M7j29j93
4831a61m9J92k9j61M7J09K07j16k05j77J90j5q3L42j1l3J58j31j09J48k73k0R9
4854h1rJ43j01k02L50j0q0J10m7L6J62k14q3j17K99l00p1N83m24K97m49K8NK58
4878H3k13J38K09j01l98J21K89l64O20n08J89O3r1k55P8P1J43J4k15K40q7jl14
4901b89L06K97l24j31L6n5O4J52k79J47k01K09J04Mp7O4r1J69P6M6j02k49R3k35
4925b66M32o8L7k65K36L1m2l07R1K29j07Kk32K7J82Q7n6R4k44K68p8k31M59k42
4949C7p8J03L36k37N1k81J70k04J44L09n17K35j67RJ10K48j37j91n2J90j59l05
4971c86M02jj03k47L93k12K34n0K57r5j85J56j72K7K0P1Q7L1j13j23N4l4N7q3
$$ plain form
4805 -281 186 -57 58 126 70 -131 -259 -166 -37 -104 109 169 126 2 65 -187 -155 101 102 93 189 181 114 161 32 -161
4831 -161 -210 -18 -47 -208 -161 -52 155 39 -166 -343 -153 -168 -251 91 80 47 205 74 -35 113 -160 -180 -81
4854 -81 -90 53 -48 -250 100 90 10 120 73 109 271 57 -26 -143 156 -144 -215 368 -56 241 -208 -180 -175 83
4878 83 -130 8 217 116 -282 -161 128 -236 384 -124 65 128 37 -218 -140 -69 74 88 -127 113 26 25 -289
4901 -289 17 314 -10 -141 -105 -160 -96 56 -223 -76 -277 -68 36 40 -37 27 -64 105 181 227 125 -124 -31 -266
4925 -266 166 98 135 -130 106 137 95 -212 -121 108 1 3 -229 -202 -20 67 11 105 -139 129 51 -180 279 37
4949 37 -41 62 398 161 212 -69 101 -103 41 350 -167 68 -99 -90 20 268 131 -60 -112 78 -81 -386
4971 -386 16 15 -88 -335 58 -154 80 30 287 192 7 163 -9 18 38 109 196 227 114 -9 45 11 68 -15
4995a5r8O7r5mP3N3l5L7k9l6p3J62l4oq8L39o6j23j42L64l80J81m4J48j70K5P2
5022H3J6J40n8m4j69K09l3j85j05K94j59l13K39J9j86Q6K50j64j57J77K3K4p3
5045h6O9j4k47K07K25m4J52j71k7j00o4J23j04N6J74k92K00m9j73lK79j64O3j2
5069bj50O8N7K12m6k83J08J93k33q1J62K5kK34k22O8Ml07L34j46O4J35j90M1q5
5094d2K5K9J18k48J82J32j18k00J17r4M6o7k1j02N53m31J18Q8R4j00q1K23m36
5117b15J57qJ0p6J83n8K30k71j8j16lJ6j7K07r0J31n0j28n8J67j66J11Q3l3L13
5142C01m17L7K05k2N2j70J54j11p2m9J50K76l66j1n8K47j54j15j41O35n07K58
5164A22j20J4m6p4oK57Qk26M8J51j69o6K69j25j23K4L46k41j97J81O1m8J48q6
$$ plain form
4995 -15 -113 -46 -141 -145 -72 -19 -54 -17 -46 -82 -155 7 -27 -33 -121 218 152 29 -113 251 -129 52 8 156 -14 11 83
5022 83 99 239 181 137 -32 177 144 -41 -146 148 -11 -324 -85 -66 -252 -166 84 -80 -237 -60 -37 -13 -86
5045 -86 -17 -31 -278 -71 154 110 262 91 64 -36 -100 23 -81 -25 149 -143 57 8 -165 -168 111 -53 10 -2
5069 -2 -152 -84 -27 185 139 -144 -36 157 -76 -157 5 30 28 262 40 108 112 -195 139 -7 57 192 2 43 -42
5094 -42 -17 12 130 -118 64 196 78 -122 -5 -99 -53 -120 -141 -243 310 -121 -3 85 179 79 -2 221 -215
5117 -215 -58 -66 -56 -132 51 -7 223 -48 -66 -182 -185 -169 -186 21 -69 62 12 -116 -174 -7 -173 -62 21 -12 301
5142 301 -116 -79 126 104 156 -14 140 29 -43 -92 58 334 -32 -43 -101 146 -8 -123 -264 371 -136 122
5164 122 2 16 -30 -104 -110 147 155 -71 -23 128 -41 -107 162 37 -86 -62 284 43 -154 27 88 40 188 102
5188A02J18j46q3p9L18j47j38q1K09K21m69j16K67N1J04j21R0K2r9m4M25n04P4
5211b6J51L06l75j29L47j73Q2j76J98o1k05K52j88J69j85K6K4k34J81o1M5P0r6
5234e8J23m71O96k40O9M4J09j36Pn3M5J9J15j98j72J32q5O0J8J49l28m7K39p0
5258c3j94K16L29k83n3O9o6j08R2R4k87J66J93K7j91M4m5K06j61j8R4n4L5j07
5282c5J15O4k77P0O5j00K46j94o6k19L90p9l0j17J62j35Q2R3J09k58R9M9q3K3
5306b6J66o5j98r3L68l29K57r4K51k72Q8L2j06j97N9J27p5n6L3J11o0j20L16j37
5330b0n3J12j97N1K19r4k46K91j5J65o4j92L32j80Q1k26l7K31m3j55M5j89J32
5353e2J09m46M56j15l24L40m7M43o40L48J18n44L82M8N4m4p0R3J5K05j33J01l89
$$ plain form
5188 102 220 74 -9 -88 230 83 -55 -136 73 294 -175 -291 -24 27 131 10 100 122 23 -21 404 -100 -26
5211 -26 125 431 56 -73 274 101 183 7 205 144 -61 191 3 172 -13 13 37 -197 -16 -77 -32 38 -58
5234 -58 65 -406 290 50 119 163 272 136 143 90 135 154 269 71 -101 31 -54 6 24 173 -155 -202 37 -33
5258 -33 -227 -11 318 35 -18 51 -15 -123 -31 63 -224 -58 135 162 -29 15 -30 176 15 -3 91 37 72 -35
5282 -35 80 144 -133 -63 2 -98 148 -46 -112 -331 59 -20 -50 -167 -5 -140 -58 35 144 -114 -15 34 -49 -26
5306 -26 140 75 -123 -216 152 -177 80 -14 237 -35 53 85 -21 -218 -159 -32 -107 -163 -130 -19 -79 -199 117 -20
5330 -20 -73 39 -158 -107 112 18 -228 63 48 213 149 -43 289 109 190 -36 -73 158 115 -40 5 -184 -52
5353 -52 57 -389 67 -48 -372 -32 -79 364 -276 72 190 -354 28 76 130 86 16 109 124 329 196 297 -92
5376i2J0J36L7l6j62M4K10o2l3j62r8L21k84j0M5J41j26j08P7J96R3l66N42l14
5400aO2k96L26j36l6J79n7l00L06J59r9L7k50J70K5k7K14k85P5r4n7J23J15j56
5424cj69J8J83l7j52R2n6K10j36J58Q4k47kj13J98N3l73L27n3L0p9P8K0j0J36
5449A57o5j55j12j3L66k75J41k57L01j53j39J76r1K09m4o5L0j82J96J80o8J28
5471B65k23oR9k06K15k53k6k6J45O1L9k66N9l2N1K10jL6j61j01k2L5%l3J52n5
5497d4l03K29K21j41K00m5j26J08q1j56J52q3j49M23K3o3k92J71Oj26J67m32K93
5520d8N5J74l48M7K7K67k38k16K58M1P5o6J01J9l4j29O1JQ3J48j70k24P5J65j98
5545g4K00m34J71L12k30k8j57J33J43K4j11K55k52RJ87l2j35K43n61N57K6l63
$$ plain form
5376 -92 -82 54 91 55 -107 -63 147 85 52 -110 -208 113 -171 -181 -136 5 -121 -229 -152 44 137 -229 313 -1
5400 -1 61 -235 91 -45 -81 98 41 -259 47 206 107 144 -106 64 89 62 276 -9 66 -28 -85 38 153 -3
5424 -3 -172 -154 29 -8 -160 -68 -124 86 -50 108 192 -55 -57 -170 28 81 -292 35 -18 12 -67 11 31 21 157
5449 157 92 -63 -175 -188 178 -97 44 -213 88 -65 -204 -28 -119 90 46 -19 11 -171 25 205 137 265
5471 265 42 36 135 -71 144 -109 -135 -161 -16 45 84 -182 -123 -155 -104 106 105 141 -20 -121 -143 -108 -108 -141 11 -44
5497 -44 -347 -118 103 -38 162 117 -9 99 18 -138 14 -69 -218 205 228 165 -127 44 50 -76 91 -341 -48
5520 -48 7 181 -167 -120 -93 174 -64 -280 -22 19 94 28 129 148 114 -15 46 47 130 278 108 -116 -41 124 -74
5545 -74 126 -308 -137 175 -55 -83 -240 -107 36 60 -51 204 -48 -39 148 116 -19 224 -337 220 246 -117
5567a17k2J2Q6L26j10Q3k16j3M5j78K4R2k4q5o6q0K64j35q3J19L69k90N4j55L7
5592f3K49j95k11N3L09r3m5J34j95N8J09N7n1j94K28l63J7J82K71j30l1j61l4
5615i9L08j80k50J07J77j07MN8j32l2R9L02j63O9j73O5j60k0L84j99o8K6M8K0
5639H4j54j49O3K22j17J39M4k62K73k19O6o9J50j66J53j02k7L20q9J07J38l14
5661I1j82L65n13K77P9r9R7k1j55J4L68m85J65l2N1k11J55O0J59Q0l49J88l0k00
5685a28j34J38O3J47j39J03k06J40L52l33n9N5j39J00R0R4j40J3J58l44L86j97
5707B0j85L85m20J91j64O0O7j61qK75l7r7p4J18K15k25q9Q1j16J04l5L06M5j79
5731G7M2j37L7j12Q2J04J15N3k88R3j7l32L49J05k15o0K1m3J73p8N8j4k77K20
$$ plain form
5567 -117 -139 -127 -41 285 175 258 42 29 74 -104 -80 12 -12 -97 -163 -243 21 -114 -197 -78 291 1 55 -100 -63
5592 -63 186 -9 -220 -167 142 49 4 138 -57 1 110 167 116 -78 150 -213 -196 -14 257 127 96 -65 -99
5615 -99 209 29 -221 -114 63 -44 -40 18 -114 -146 -47 255 92 161 -12 53 -107 -127 257 58 -10 16 64 84
5639 84 -70 -219 -156 66 -51 88 132 -130 143 -76 -10 -79 71 -95 58 -44 -71 249 160 267 405 91
5661 91 -91 274 -239 38 117 18 115 94 -61 -47 321 -164 1 -31 20 -191 -36 24 183 263 -86 102 72 -128
5685 -128 -262 -124 -61 86 -53 50 -156 -16 336 3 -56 -1 -140 -40 50 144 4 17 175 -169 217 20
5707 20 -165 220 -200 -9 -173 -113 -46 -207 -215 60 23 -74 -148 -30 185 -40 -129 -48 -164 -60 -95 211 256 77
5731 77 119 -18 19 -93 -11 93 208 261 -27 66 49 -283 66 171 -44 -104 -83 -126 47 -31 27 13 -264 -44
5755d4L36J54n59J85M9n0j6K30l20K8k3o7K88j52J2j93J26J68k34K2J08O5k57
5778a44J91k63J84j20L29k85n5O1M2q1K33O1k00M3L5R8K12k98L1Pr9j19J88K49
5802C00j92q8J43r2Q4K3l21J90j45J27M6k8q8p5r4L23l54M68l68J49M3m5J16r5
5826B7K29j17J21Pk57J5j38J85l71K49J19k0L4l7j28L13k76K14J36n13L54j32
5848A4r9J35k36K51J39r6R1l04J93Q4l65j2K7J28J41J36k82K6l2o8j9M1J34j09
5872h2N2R3k8k02K62j18l48M36r2j6j44J05M13m63J82k38K96k95J37J54J22j60
5894F6J04k37j09N9l6O2J02k02J01L3R6j64K91l7j68L4j84j96K58q0L0K39n2L5
5918D5K7j02j57N0p0O49n04N7j3P0L4J76l00j04n6L06qk10l5J52j4j61J43K02
$$ plain form
5755 -44 292 446 -113 72 121 71 55 285 -35 -7 -30 -97 191 39 51 -142 -16 152 -82 -60 48 113 -144
5778 -144 47 -216 -32 -152 177 -108 -163 -102 -60 -141 92 153 -47 -4 31 129 341 43 74 81 -18 -137 51 300
5802 300 108 20 163 71 155 178 -143 47 -98 29 75 47 -41 -116 -210 113 -241 227 -141 8 51 6 122 27
5826 27 256 139 260 267 10 25 -113 72 -299 -50 69 49 83 46 -82 231 -45 169 305 -208 146 14
5848 14 -85 50 -186 65 204 108 199 -105 88 172 -193 -205 -178 -50 91 227 -55 -29 -61 -129 -148 -107 27 -82
5872 -82 -30 63 35 -167 95 -23 -371 65 -27 -43 -187 -82 331 -132 50 -188 108 -187 -50 104 226 66
5894 66 170 -67 -176 -117 -153 -91 11 -191 -90 -57 39 -125 166 129 -39 -5 -189 -385 -127 -207 -177 62 10 45
5918 45 72 -30 -187 -137 -207 442 -62 -5 -18 52 86 262 -38 -142 -198 108 100 -110 -145 7 -7 -168 -25 177
5942A77j70L8M9J6nj62Q1J48Oj71k55K59Q8m8j10J43m9j53k8L25m4Q4j45o0j63
5967a49n2L35l28J29o4K77k01j1o4o3J56O7J9k08L92r9k35K59Q8n37L19J6k91
5990b45J85qJ43j97J39l3J7or6L0K21j81k4J29j89K40K2j64j10J79J20l51n8L81
6014A44R1k80J6P2O5J17k81J89k2qP4k48J22K7O8k45M7l9n5J37J81k30J27L4k81
6039a78J55k6Oj5J11rPp1m2L21k24O5j37Q1J55k94K44n3J7K44k62K6k91rJ32Q6
6065C9J52l07L5Q7J51k75k9N8N5j91L9K73k55L19k11J85J14j41n4no0J55k65M7
6089h4J96k34J55L03l29j55J22K20j95j63o7K12J02p6R0k10K26p3l9j09m0L93
6111B45j33k12J37j24J67m1l2J18j07N3j9J4j43J26n7L8j84J32J79k6k14J14k79
$$ plain form
5942 177 7 45 94 110 105 -57 24 172 178 7 -248 11 99 51 -59 84 35 -118 -146 179 135 219 74 14 -149
5967 -149 -201 134 -194 -65 -129 148 -53 -64 -128 -191 -35 32 51 -157 235 136 -99 160 248 -289 30 46 -245
5990 -245 -60 -68 75 -122 17 -16 1 -5 -101 -71 150 -31 -55 74 -115 125 147 -17 -127 52 172 -179 -237 144
6014 144 235 -45 -29 43 108 225 -56 133 111 103 177 -71 51 78 146 -99 -52 -91 -146 -9 172 -58 69 103 -178
6039 -178 -23 -49 -43 -58 53 44 51 -20 -62 259 35 100 -37 44 199 -95 149 96 113 357 95 121 -170 -179 -47 39
6065 39 191 -116 -81 6 157 -118 -147 -89 -34 -225 -186 87 -168 151 -60 125 239 98 44 39 -21 134 -131 -84
6089 -84 112 -122 33 336 7 -148 -26 194 -1 -164 -231 -19 83 7 97 -113 113 40 1 -108 -148 245
6111 245 112 -100 37 -87 80 39 7 125 18 71 52 66 -77 49 -8 30 -154 -22 157 131 -83 31 -248
6134b48J27L48J5l70J08m8N2%k16L23J33k46K68m83L95J3j26k11J99k07L14k88
6156a48J70O7o7j04N7mJ5j49J76P7J54k20N1k6j36L61k56L8Q8j07j33J64O3j57
6180b6J57L5k34J72j52K02j52M2J94j35J20j85o9J14M0l6j33o1J3K97l33J14l6
6203e2Q5l01L22L7J6k7p0n0m0J02j0n3L16k74O9L2R3j28m6K13m47J25k23L67o3
6228gj14r1L8M29k50r3j17L5n8L03no4j03L38n8r1j15l3J92j11R0k1M2K9k40J29
6254E4O3j0M9k20P8L9l28M85l32K18j35m5J11J0l5j19J52j43J29K02l21q0L67
6277A89l05O2K79j58j89M6J69j91L2K7Nk81K17o6K42m1j50K08r0J69k12P4k1n3
6301c8K11Jr5J8k18J30o3N4j37K82k60K29k11JL99m27J75O7k9JM0j76K66k34M2
$$ plain form
6134 -248 -121 227 242 -128 -20 -68 -16 -16 -232 91 224 -22 246 -237 158 171 45 -166 33 -174 140 -148
6156 -148 22 89 22 -82 -25 -29 -14 -163 13 90 244 24 75 49 -87 274 18 56 144 37 -96 68 131 -26
6180 -26 131 166 -68 104 -48 154 2 44 238 103 223 38 -31 83 123 87 -46 -107 -94 203 -130 -16 -52
6203 -52 33 -268 54 91 107 80 10 -40 -80 22 12 -41 275 1 70 102 195 67 21 234 -213 -88 -311 56 -7
6228 -7 -121 -212 -174 255 5 -88 -205 -170 -228 75 70 6 -97 241 183 92 -23 -56 136 25 115 94 136 165 -75 54
6254 54 117 107 156 -64 14 53 -275 210 -122 96 -39 -84 27 37 2 -117 35 -108 21 223 -98 -178 189
6277 189 -116 -54 225 67 -122 -76 93 -98 -66 -39 -34 -315 -98 -164 78 37 -113 95 5 174 -38 36 15 -38
6301 -38 173 174 79 97 -121 9 -54 0 -137 145 -115 114 -97 -96 303 -124 51 118 89 90 130 -46 220 -14 28
6326B8o7j33J51J42j07l8J6J7J4O9N4j43j08L98j87O4j67o4N5J29k74K96n19L24
6350e0J15j1q8j3q3J10J0M9n7q1J71r0j88N5OJ80k8n9K43j28j03L9P0j28j43K20
6376A8j02K38m8l48L89j92L51l51K40j59m34O87l14L18l72K21l65L31j76Q8M1
6397F1l84K62J2P9o7J17p9J5o1J29j36J82k31K13l45Q1R2K4N7K7j13K00Km08J49
6422a22J10J71k12j9J71o7P9m01J68K98j32k12J43o2K11j77J1J08p5P4k74L14
6444A05J28k01K63k38L3J3rj2j90r0K25K5l02K50j13L38l46J27j48K25J88k06
6466F5m0k23K29J10P5j76llm9n5k6O2M0n9l3l1R5N7j02J16j15J20j10L8N3Q1j36
6493b0K24j48k42J17O4o1K49k35QL9Q0k36J53j04J36J3K1j08r3K22j25K22q2l17
$$ plain form
6326 28 -39 -172 -21 121 14 -24 -8 9 23 92 146 3 -105 293 106 170 3 -61 -6 123 -151 145 -374 -50
6350 -50 65 54 -34 -47 -130 -20 -10 39 -18 -99 72 -18 -206 -151 -145 35 7 -52 191 63 -40 -1 69 -59 -202 18
6376 18 -84 154 106 -242 147 -45 306 -45 195 36 -398 289 -25 293 -79 142 -223 108 -68 20 61
6397 61 -323 -61 -49 30 -37 80 1 16 -45 84 -52 130 -101 112 -233 -152 -60 -36 21 48 -65 135 137 -271 -122
6422 -122 -12 159 -53 -72 99 32 111 -290 -122 176 44 -168 -25 -87 124 -53 -42 66 -9 65 -209 105
6444 105 233 32 295 57 90 103 94 82 -108 -198 27 52 -250 0 -113 225 -121 6 -142 83 271 65
6466 65 25 -198 31 141 216 40 37 34 -15 -70 -96 -34 6 -53 -86 -117 -22 35 -67 49 -66 54 -56 -18 35 116 -20
6493 -20 204 56 -186 -69 -5 -66 183 -52 -44 -5 75 -161 -8 -112 24 37 58 -50 -143 79 -46 176 94 -223
6517b23M17k6k32K73k25j64J88j38N4L0j28J86Q3j45nk35K51J67kk47K16J13j22
6540H6r4N0j42j07M10m96L28J07J43l07L0j0k30J09J97J48k96M7O0j25l1L6o6
6563a53J30j0n3J13j12L05j65o3J74L2l48L99k83K8R3n0p2k00Q8N2o6J20J51K0
6587A30j01j2k08K24j11k28L48j16R0q3J50J09l83J51J82M6j20j84K65l50L33
6608A32m0k12N03m13J41j27nJ21m40N06k56M5k51J71O5L9jK60n96M27N3R1k9j32
6632E2k10J79Qj01Q8k4J10j1j7k59L28k53K07K8n56M99j85R5NN8J0q1J62j54N5
6657C3r1J73j22O0N9j79n8K29k40K57P8n5n1l8p5P0L1m5j33J41k10o2n4K77p6
6682h1L09j91%J5m1jM1Q9j55O8j18j7Q3k79J82P5j84L68r9l4J4O4j28j06J54l9
$$ plain form
6517 -223 194 168 -64 209 -16 -180 8 -130 -76 -46 -174 12 95 -50 -55 -290 -39 128 126 -121 95 208 86
6540 86 -8 42 -100 -207 203 -293 35 142 285 -22 8 -2 -232 -123 74 222 -74 -27 33 -92 -123 -87 -153
6563 -153 -23 -33 -86 27 -85 220 55 -8 166 198 -150 249 -34 -6 87 37 -35 -235 -147 -95 -161 -41 110 130
6587 130 29 17 -191 33 -78 -306 42 -74 16 -67 83 192 -191 -40 142 188 68 -116 149 -201 132
6608 132 92 -120 383 -30 111 -16 -21 100 -340 166 -90 -45 -296 -125 -60 -21 -22 238 -358 69 122 213 184 52
6632 52 -158 21 29 -72 16 -8 102 91 74 -185 143 -110 97 125 -431 68 -117 -22 -17 41 51 -30 132 -22 33
6657 33 -58 115 -7 53 112 -67 -125 104 -136 121 199 144 93 55 -20 50 81 36 -97 44 -166 -228 -282 -5 -81
6682 -81 228 37 37 52 11 10 51 140 -15 53 -65 -82 1 -278 -96 -21 -205 163 64 30 44 108 -20 -126 28 -11
6708a1J84l16N2MP6jp1L1J93n9J99j73j46J49k49K02N6j23K10l34M63n8l34K2
6732c4J13j05j22M57j26k83P5J30j95o7l6K15p2K6RJ6N8P2K9j26l4K4N6j3Q7j57
6758cO0l14K78NP5q4J82j4j16K4%J3K0j80R9mO8j5j02J4j65L40m03K40J08j35
6784iJ17j58K6k67L71J47j63ql1j95J60P5p5orj0j17J29N1j66K6J6J47M1J4l61
6810b55L35m8j35J21Q6P8j80m2j25M1J8J38j6j17p8J37K30k45L7J15k10Q9p1J48
6834E1l4L8q1k9j8P7j50jJ45%qj02Q3N3O5oM6j83m4N2J7m9R2m3J22j87K35k18
6862g7J27j20K55j74p8k27K27M34n31R7K79k98R4p5J66j29k2p3J01k0J06J74m18
6885a82J11J3K90l02K12j97J60j1m8j13J37k21J18n8j5J01O0J37k86k12L13j22
$$ plain form
6708 -11 173 -143 -91 -87 -11 -12 -83 -52 141 82 281 108 -38 111 -138 64 120 -3 207 -127 336 278 -56 -34
6732 -34 79 -26 -148 309 183 -100 -25 105 -90 -157 -193 22 -50 -24 -15 1 59 131 160 34 0 24 80 67 154 -3
6758 -3 57 -257 21 26 101 17 199 185 69 93 93 106 126 -54 45 41 109 94 -8 6 -159 181 -222 18 126 -9
6784 -9 108 -50 -24 -291 80 227 64 56 25 -170 -10 65 -10 -16 -25 -35 -152 -23 28 -138 -112 -96 51 92 106 -255
6810 -255 80 32 -103 18 104 182 2 -40 -165 -124 -106 32 16 -101 -179 -42 188 -57 -20 95 -115 -26 -97 51
6834 51 17 55 -26 -55 -73 4 -146 -147 -2 -2 -10 -112 -29 24 89 83 129 -54 -98 -46 -29 -78 14 -29 93 -94 141 -77
6862 -77 50 -70 185 11 -67 -294 -67 367 -164 -67 212 -86 8 -67 99 -30 -52 -125 -24 -44 62 236 -182
6885 -182 -71 -58 232 -70 142 -55 105 94 46 -67 70 -151 -33 -91 -106 -5 55 192 -94 -306 7 -115
6907a15J99k69J63J22m3k29PK07j94K7K01K34l17m1O5J30j16m7R8M2j46l9K09
6930A48r2n0k06L37k9j44l19K46k08L14r3k6oL06j72k90J99O7j44N4L4m4K40M5
6954A67l01M9J40j80J19K35k75o3K64k35K72k69k01L18k36K72l4Q7j61J70k52
6975a14J42o2jk32J98L64l61J22r9K67k2k40J4j86L66j52p2l2O8J74k39K12l14
6998a99L38j92J75J02k10J76Q5k88m7j1J19L14n32K54j28K5n3k7K32M4M7q4j75
7021c5J86j85J32p5K05k3m9n9j17n6J99j56j14L90J1j86j20j06P7l3K32j08j97
7044a87J58j18K63K1k48J29L5M2Rj29K4J39k87J34j81O3J20J72j12J16j65P7N8
7067A33Kk29K54Nk69K2OL31l31J2K26k53QK78j16L4j09n2K20j80K5j7lj7K60l00
$$ plain form
6907 -115 84 -185 -22 100 57 -172 -165 42 -152 -125 76 310 -7 -48 17 147 31 -16 82 124 -22 -61 148
6930 148 56 6 -200 137 108 -36 -355 -109 -317 -3 -96 -122 -128 178 6 -284 -85 -18 -162 -108 -74 -118 122 167
6954 167 -134 -85 55 -125 -6 229 -46 -109 155 -80 192 -77 -278 40 -196 76 42 129 -32 138 -114
6975 -114 28 -34 -35 -267 -69 295 -66 56 -43 224 202 -38 -24 -210 156 4 -68 -100 -32 142 -97 115 -199
6998 -199 139 -53 122 224 14 190 275 -13 -60 -71 48 362 -170 84 -44 -19 -72 -99 133 177 224 140 -35
7021 -35 151 -34 98 23 228 205 156 97 -20 -76 123 -33 -147 243 254 68 -52 -158 -81 -114 118 10 -187
7044 -187 -29 -147 116 137 -111 18 53 95 104 -25 -1 138 -149 -15 -196 -133 -13 159 47 163 -2 75 133
7067 133 135 -94 160 165 -104 -82 -76 255 -76 -64 162 -91 -83 195 79 113 4 -48 172 -8 17 0 -3 -20 240 -60
7093f0k66J93L47m30J51K00l90L84j70M5r3J44p0k29J76Q8Qk9O8j9k23K43qq7
7117b7q7R7N0k61K53j81P1O8N0q9K0k69K07O0j54J81l4m2J19qk5L6j95J81l15
7142b94L40RR5j48K9m3n5R4K9J12l5k65P2J11R8k38J52k89R1J75o4j09Q6o6J75
7167F2o6q6j20L19p9l3j9O8k05J54p6J3K08l25L60p4J15r1K6p8j75J57j83J64
7191C6j26J3j04J8OJ22k7n9j56K25r2J95k16J06J22J18j70J65k16M1q1O8K93m00
7215a19K0J38j29O5J4L51l98J19j97J61k48L37M7k77Q6Pj22P1O8R8n1j42M29k21
7239A07P2l19K74k9j87o1J36J9o1j8OJ47j45M1n7J10K22m95J71K31j90j6j84R6
7263a30L8j10J97r2K08O0k78K8QK8J07l33M67R4j58n7m2N4J36j47N2j78R7O3j95
$$ plain form
7093 -60 -326 -133 214 -216 -65 135 -255 129 -41 4 -89 55 -15 -244 -68 20 28 -1 67 48 -175 68 60 -27
7117 -27 -114 -17 33 -228 25 -156 -85 -17 33 -56 -36 -305 -98 -38 -192 -11 -45 -87 32 24 -1 35 -160 21 -294
7142 -294 46 55 150 2 31 -12 -67 27 56 168 133 -132 -60 51 149 -89 63 -226 -135 40 -24 -133 -47 -113 62
7167 62 -4 -90 -210 109 30 -3 -22 46 -159 -5 -81 -68 140 -185 175 101 216 125 151 73 -102 55 -128 36
7191 36 -90 -77 -181 -163 -157 -35 -62 -121 -277 -52 -144 51 -165 -59 63 181 11 176 -40 1 -80 -12 281 -119
7215 -119 -99 39 -90 -25 -11 340 -58 61 -136 25 -223 114 161 -116 -30 -23 -145 -74 -6 92 41 -101 328 107
7239 107 179 -140 134 105 -82 -143 -7 12 -49 -67 -61 86 -59 -18 -75 35 257 -238 -67 164 -26 -42 -226 -130
7263 -130 -92 -202 -5 -97 111 171 -107 -79 -71 -43 64 -269 198 292 134 77 35 89 225 78 130 -48 49 112 -83
7288h3J75j56J49P8j99k0QJ24j06j34J91J86l92q0K49J72j54J08J9Q1n2P4k55
7311a7J19r1j66J92j29Q4J29K6n0j32J5k56L71j51j54J45J03k23R7j7J20J37r9
7334E3j42J5L3KN1j55M18j64M7q9r4p9K76k90J03k0k9Q9P3k41M7K3LM08l83N4
7360Io3j4k99J83Q8L36k03J11kr0j48j00K78k65QL6L3K82j90n6J84j50Q8K7r1
7385hj02m8N2N9J26L7j61J18m24K33p0K50k19K12m2k04J28L2j0n6K0L0J28J2J03
7410A96j28j10K8O6Q3lr2J46j96K00j65J8j36J54j32J08K5O6j06Mj99K04N4l12
7434b27J73J94k42j8K45l59K5J76j59J94l8n0L83o7l24J03k43K23oj10KL93l37
7457f9O9j79J45K35K6j97j71K76k25K55j03m2L20m76K11k48K6N8o4K21p5J37J72
$$ plain form
7288 -83 92 -64 85 163 -36 -56 -48 76 -30 -164 27 213 -179 -259 -10 162 8 116 135 216 164 238 -17
7311 -17 102 11 -155 37 -92 -8 121 147 97 -35 -20 -276 95 -56 -210 -65 38 -185 -88 -105 15 152 53
7334 53 -89 -74 -41 -39 12 -143 275 111 158 69 -25 -104 172 -118 -15 -35 -64 25 98 -143 -96 -73 -70 338 -45 9
7360 9 -54 -68 -367 -184 -96 240 37 148 146 56 -92 -192 86 -179 -171 -135 -102 180 -10 -66 118 -32 56 83 -8
7385 -8 -110 -158 -106 -47 79 116 -45 73 -351 -118 -188 62 -157 55 13 -191 -63 -31 -41 -97 -77 -47 81 93 196
7410 196 68 -42 -14 52 135 132 40 186 -10 190 25 43 -93 61 -71 37 62 128 22 26 -173 31 85 -227
7434 -227 -54 140 -102 -120 125 -234 -209 -33 -192 2 -36 -86 297 230 -94 9 -234 -11 -17 -127 -125 268 -69
7457 -69 0 -179 -34 201 227 30 -141 135 -90 165 62 20 340 -136 75 -173 -147 -89 -153 68 -7 130 302
7480C02l07J22k33K05l78L0K27qr4j77L09Rl48L82j29J77L0k13K88j33K9j04K86
7503B72l35K4M8l6qj7q8J57j26R2j41K21k24L3J39PL1J83j59j16J86r7M2k23K87
7528A52L3q3l0m0j09K61p8j09N5P2j8j95J64J42p3j33Q1p7O3k9j58r6K06j90P0
7553a19n8R2Q2J72o7j60K4K79k73q4P0J25j40K97k31j04J47J36j09n7J62j56k20
7576a92K12K7J09k31J49k2p9Jr2Q0o9K54j24j80K27k06J83j02J79j60R8Q4j22
7599B4kq0K19J72nm48K67j31L45m03P0O1J51k91l2q0J89n9j48J53J04j00q7q6
7623a97L41P1j44l31L20j61k2J02L03j42k33Q5J0k79K70J5J19m4j55J28N1k2K5
7646A10k3P5k30M5Q0Q6j86J3KJ00O5j08L8k2K37n05N12k95M5j51Q3K4R9Pj65m1
$$ plain form
7480 302 -5 117 -116 89 -289 -259 -32 -40 -134 -311 -2 7 -341 41 -88 89 119 -94 194 61 90 -14 272
7503 272 -63 -39 9 -27 -35 -52 -140 17 -109 -17 -158 63 -161 -128 11 18 49 232 73 -43 143 46 88 -135 152
7528 152 185 102 72 32 -77 184 106 -3 52 124 106 -89 75 217 144 11 92 15 78 49 -109 -205 1 -189 -119
7553 -119 -177 -85 -3 169 102 -58 -34 245 -28 -112 -42 83 -57 240 9 -95 52 188 79 22 184 28 -192
7576 -192 20 47 156 -75 74 52 -27 -26 -118 -38 -107 147 23 -157 70 -136 47 -55 124 -36 62 146 24
7599 24 22 -58 161 333 328 -120 147 16 361 -42 28 89 240 -51 -83 -163 26 -33 -181 -28 76 -24 -111 -197
7623 -197 144 215 71 -260 60 -101 -123 -21 282 140 -93 -8 2 -277 -7 8 127 83 -72 56 107 85 110
7646 110 87 162 -68 -23 57 143 -43 -30 -28 72 137 29 67 45 282 -223 289 -6 39 -112 -29 -5 94 101 -64 -105
7672a05K99l40p6J50O4k2j6%LO7k13M99l05k1l3K46l03K81k80K25j79L8j30O6
7696h5Q1k21M56k48K16k64P2j00J19r4M58m19J62q9o1P2j25J36k92L35k63J97
7718D3k10R4J19q6q6K05p5l1L7K21k04O4lk43K84o6jk13M29l20m0R6ll2K04k24
7744d1J12m17L20j12J34J00m5jR3R4k17j02J69J2j48M0k80K31j16J62l36L97K11
7767B60k21L5o2J5J69o5Pq5k66J63k32K29j0o9J4q5J79N0k03K74j89j94J32Q3
7791g1M4L64k69K20p8k04J53J4l49p8M58n01M47k97J04o1N2P0NL6J42q4j76J48
7815H9O8o0m2J6Jk41L86j00k41L03n0n7j03K47j63M2k24K58j32K53l86J57P9j70
7839g0O6j25J8j37K95j24PJ08J1r3L9J27m4n9J62k36P2P9J31m67L26P7k8j84J93
$$ plain form
7672 -105 194 -146 -222 -72 -8 -30 -46 -46 -43 24 -189 310 5 -16 -49 197 -106 175 -105 120 -59 -21 -151 -85
7696 -85 -4 -225 231 -17 199 -65 7 -93 26 -68 390 -29 133 44 -17 55 -70 66 -226 109 -154 43
7718 43 -167 -73 46 -40 -126 79 4 -27 10 231 27 91 88 -155 129 63 62 -151 278 -42 -82 14 11 -21 183 -41
7744 -41 71 -346 -26 -138 -4 96 51 50 143 237 20 -82 87 99 -49 -9 -289 -58 -174 -12 -348 49 260
7767 260 39 74 12 27 196 131 138 53 -213 -50 -282 -53 -63 -132 -118 -203 -24 26 -177 97 -92 -286 -154 -71
7791 -71 -27 337 68 288 210 6 159 173 -176 -254 204 -297 150 -147 -43 -104 -52 18 23 59 201 117 -59 89
7815 89 157 97 55 71 72 -169 217 117 -124 179 129 72 -31 216 53 95 -129 129 -3 250 -136 21 100 -70
7839 -70 -4 -129 -111 -248 47 -77 -70 38 49 -44 -5 122 78 19 181 -55 17 96 227 -240 86 163 135 -49 144
7864A44j3o7j87J63J70L9k89Q3J35ll95K48j87M41l7l18J33j67l6L87k11k7J47
7887A53j82j86J81j19j08J88K97j07p9pj3R8K60m62o9J53P7L1j60J12J51n2j21
7910C6p3J92k76K90k02j46K54J57k05p3j29JJ57p7p9K28J52J92k13l82K90j11
7932a7l8M0l31L77k78K87p3k15J64p3L30j47L74n05K20o3k48K85k32M0k59N66
7954B04q0l08L58j69j64J50J64k31L86q1j77o0PJ42m28M85j21p6k15J1K41p8o
7977d6m3O4j17j29L54P0j26J7j47K07q2O1kor6Q0J3j9l4j41K14%l24OL09j54J7
8004e4J71j38j16K91p1j96L20k21j29J63j84m8J72J38j17J17l67P6J60j85L4K47
8026F3J22P2k42j8P6j28J60J84k40N2j29k40L10k14R2J86k9K6k31m3L00j6l31
$$ plain form
7864 144 131 64 -123 40 210 249 -40 43 178 175 -220 28 -159 282 245 -73 60 -107 -143 244 33 6 153
7887 153 -29 -215 -34 -153 -261 -73 224 117 38 31 18 116 376 -86 -155 -2 75 106 -54 58 209 157 36
7910 36 -37 155 -121 169 -33 -179 75 232 27 -46 -175 -174 -17 -94 -173 55 207 399 186 -196 94 -17
7932 -17 -55 -15 -346 31 -247 40 -33 -248 -84 -157 173 26 400 -105 115 52 -196 89 -143 -103 -362 204
7954 204 124 -184 174 5 -159 -9 155 -76 310 229 52 -8 -1 141 -287 198 77 1 -214 -203 38 -40 -46
7977 -46 -89 -25 -142 -271 83 153 27 44 -103 104 22 83 81 75 -21 59 72 53 19 -122 92 92 -232 -226 83 -71 -54
8004 -54 117 -21 -137 154 83 -113 207 -14 -143 20 -164 -212 -40 98 -19 98 -269 -193 -33 -218 -184 63
8026 63 185 257 15 -3 73 -55 105 289 49 101 -28 -268 42 -172 -80 106 77 103 -128 -171 129 113 -218
8049b18J95n8R2r2J07j26j7K60k9K3j68R7j6rk55K89j42K9J19p6j0M8J68j79k11
8074a79L02n4j2q3K33P6j90N1q2j23R9J09j66J23j16o7P5J29q0l36L98L98n46
8097d1r5J00l2O7q6n4n6J81r7J30j37M8J11n9oj17L22k01K27j17j84K21j80J84
8121A29K6l1k43J03j35J68N6j59O8J74j88n2K0Q4k06K78M2J07l22R2j2p9J73J2
8145A05j80l2J37J53j86j43K76j98J26m9j52L53k04N3J03k58L27k18N4L4J9k03
8167h3rJ48l5j23J78k09q8K15N5R2N0j99J56k88K73q1K4j27K6n8J28J43k94J1
$$ plain form
8049 -218 -23 -81 11 -81 26 -100 -117 143 114 137 -31 66 50 41 -214 75 -67 -38 81 5 -5 43 211 32 -179
8074 -179 123 69 57 -26 207 283 93 144 62 -61 38 147 -19 104 -12 -79 -4 125 45 -291 107 505 -41
8097 -41 -136 -36 -68 -1 -87 -141 -197 -16 -113 17 -120 -72 39 -20 -26 -143 179 -22 205 88 -96 125 -55 129
8121 129 155 124 -119 -16 -151 17 73 -86 -18 156 -32 -84 -64 20 -186 92 134 241 -81 11 -1 -80 93 105
8145 105 -75 -107 30 183 -3 -146 130 -68 58 9 -143 210 6 59 162 -96 231 13 67 101 120 -83
8167 -83 -92 56 21 -102 76 -133 -221 -6 49 141 191 -8 148 -140 133 52 76 -51 -25 -83 45 188 -106 -95
8191i5
$$ Imaginary data points
##PAGE= N=2
##DATA TABLE= (X++(I..I)), XYDATA
0@%%%%%%%%%%%%%%%%Pj5J6j6J6j8K6l2L4m2M9n7O8p6Q8j03J18j34J50j68J89k13
38a13K41k68K96l31L71m13M58n07N58o15O78p47Q24r08J002j105J217j343J484
57G79j646J833k046K295k591K952l402L975m736N798p389J0028k0808J44143p9292
72D9893j65960J21395K5343p6636L4652K2326l9563N6531J036q7325L4306Q9693
84F5691n5079n5650M8784L3001k9815k2000Q751K5296K176k3897j2767K0759K0596
97B5846k4373l5373L4453M2970m7143m2206M7127J9472l3546N339Q149j6497J9340
110C558K872l8955L1061M5224o0959k8515O8182N159m1034J9331J0344k1443J0074
123D899J795j7265K4760J0391m5723o02M4957j0704l0267J3529J2477r372k369
$$ plain form
0 0 0 0 0 0 0 0 0 0 0 0 0 0 0 0 0 0 7 -8 8 -8 8 -10 16 -16 18 -24 25 -32 36 -40 48 -55 63 -71 79 -89 100 -113
38 -113 128 -140 156 -175 196 -217 241 -266 292 -323 355 -392 432 -476 526 -579 638 -705 779
57 779 -867 966 -1080 1215 -1376 1576 -1826 2149 -2587 3211 -4178 5850 -14958 129185 49893
72 49893 -116067 5328 30671 -45965 -11313 11013 -28550 27981 29017 -58308 -24002 65691
84 65691 10612 -45038 3746 36747 6932 -15068 -6317 18979 21155 -2742 -15509 5250 25846
97 25846 1473 -33900 553 43523 -3620 -45826 1301 20773 -12773 -7434 715 -15782 3558
110 3558 6430 -32525 -1464 43760 -17199 -45714 22468 27627 -13407 5924 16268 -5175 4899
123 4899 6694 -10571 14189 24580 -21143 -21745 23212 12508 -17759 -4230 8247 -1125 -3494
136c494j067m95R497j577j6866M63K1169l427k4572J1036K9249j1671k0317J1223
150h49O874n558P820N77j1023Q584J875k3566J0975L0465k1482k3763K1127N762
164G818j5398O949M189r379O276P95j4346Q856J7027j5795j2381J8770M887j5114
178f846K174Q221m917R39K985n313K260J0199o878j1088J3986Q045j9223q74J8126
193A1796n719r898P436l120p946R331J371j0963Q240N572j8301L88K0493o530
207B150j1667R760l28p409Q781L415p424M880K996j0492K889J3501n720r871Q318
222C779L784r156J315M104m750O80M806m810m714O404o49r391O697Q496j1377
237d782n112J0245j100m602P807j649p122O082L625p159N907Q198j1194n141J2399
$$ plain form
136 -3494 -4561 -5056 4441 2864 -14002 -13539 7630 4203 -20369 -9333 19916 8245 -12072 -849
150 -849 6025 467 8287 8864 -2159 6425 8300 -15266 -4291 26174 4692 -19071 2056 7818
164 7818 -7580 -631 3558 -5821 455 1250 -13096 -4240 12787 -3008 -15389 3381 8268 -6846
178 -6846 -4672 3549 -1368 -429 2556 -2757 -497 9702 2824 -8264 5722 13767 -5456 -6330 11796
193 11796 6077 -3821 3615 495 -7451 1880 3251 -7712 528 6100 -12201 -11813 8680 2150
207 2150 -9517 243 -85 -7494 1287 4702 -2722 2158 5154 -5338 -2449 11052 5332 -4539 3779
222 3779 7563 -1593 -278 3826 -924 -244 4562 -248 -4962 1442 793 -8598 -1901 6595 -4782
237 -4782 -9894 351 -749 -5351 2456 807 -6315 -233 3392 -3767 2140 10338 -856 -5997 6402
252F402j558p224P739l22q018M550L436p344J802N881q381l992J0211o79q909
267f406M265K790o331K280M974n816k53P019k876l844O882O05q327M066R261n408
283B881l487N214l204k970P629m28p012K291K084o659K150P486o236o581O061
298g81j49m952O014J531p751K358N069m510k49O290l028m458O954K220o841L195
314I12M344o266J798O617o124l106O057j052n326M793J921q778R10O584m413k083
330c212M850m154m432N394K040m095K226K196n496M56P436j300m693M357R69m820
346b278M534L660n329%M011l543j539N537j913o974M729L381o816M39M150n787
362c738q10O820l288m544N190m40n090N190M376p032r17O219k472o61O004k195
$$ plain form
252 6402 4844 -2380 5359 5037 -2981 1569 5005 -2339 -537 5344 -3037 -7029 3182 2503 -6406
267 -6406 -2141 649 -5682 -3402 1572 -4244 -4497 2522 -354 -4198 2684 3289 -5038 -972 8289 2881
283 2881 -606 4608 1404 -1566 6063 5635 -1377 914 2998 -3661 -1511 5975 -261 -6842 -781
298 -781 -930 -5882 132 1663 -6088 -3730 1339 -3171 -3420 2870 -158 -4616 2338 4558 -2283 912
314 912 5256 -1010 788 7405 1281 -1825 4232 3180 -2146 2647 4568 -4210 -3300 3284 -1129 -3212
330 -3212 1638 -2516 -6948 -1554 486 -3609 -1383 813 -4683 -4227 3209 1909 -2784 1573 2542 -2278
346 -2278 2256 5916 587 587 4598 1055 -484 5053 3140 -3834 895 4276 -2540 -2101 2049 -3738
362 -3738 -4548 2272 -1016 -5560 -370 -810 -5900 -710 3666 -3366 -4283 1936 -536 -1197 4807 2612
378B612n290M881K047m180K317L276n376j981N345j155l683K947p51m772K792
393i71K608m404p43L951k430k833M325J173m803J888L460l037O53M394l981k180
409b930N946Q5l672L351J434n265J802M564l950k090L873k874l322N630K80o164
425c302J299K297m048J371M147l563l214M385M35l147L611J430m904J600M705
440C102l109l80L736j991k558M500J033n058J519L091l616Q9L804m198l059L712
456F17k04k660K979K83n318K30L989j238j619L163j186k939L242J670k349J567
472B27J634k504L63L856r94k760K291N39k612K288J825m924j71L632k398j958
488a666L180j286m855K741L133l790r1L659m077j159N846j525l946M208J004l777
$$ plain form
378 2612 -2678 2203 4250 70 2387 5663 287 -1694 3651 2496 -1187 1760 1009 -3763 -971
393 -971 1637 -2767 -3510 441 -1989 -4822 -497 676 -4127 -2239 1221 -1816 -1163 3231 -750 -2930
409 -2930 3016 3101 -571 2780 4214 -1051 751 5315 1365 -725 3148 274 -3048 2582 2862 -3302
425 -3302 -2003 294 -3754 -2383 1764 -1799 -5013 -628 -193 -3340 271 1701 -3203 -1603 3102
440 3102 -7 -387 3349 1358 -1200 3300 4333 -725 794 3885 269 358 4162 -36 -3095 617
456 617 413 -2247 732 1015 -4303 -4073 -84 -1322 -2941 222 -964 -3903 -661 1009 -1340 227
472 227 1861 -643 -280 3576 2582 -178 2113 2652 40 2328 4153 -771 -942 2690 292 -1666
488 -1666 1514 228 -4627 -1886 1247 -2543 -2634 1025 -3052 -4211 1635 110 -3836 372 1376 -2401
504b401L005L353m610o90M153j142j344M478j856n244L499J865l221J375Q39l633
520a574l02K577j043j973J921l67l003K236K034l176l85K697J19j024J584N22
536H43k661R20L355m76j770K537n79l417L036J981k931M67J328l209q55L816j960
553D25l014K864n02l430L116O52m233K337K282l407J374L353l602j391M482j13
569A193k030L576l54m142K481K995l255N40K468k662j340K403m69j688L11N90
585F17j007l43J252j845j740J840O88j128P51L07k115j95L140L37j256K000m58
602H45l155L234K788l478Q54K611l105o76L044j453k586L073M48l528J126J706
618A748l880m32L237j416j367J753j089k104K109J954j626o4J539j523k77K837
$$ plain form
504 -2401 604 3957 -653 -1343 2810 1668 324 4802 2946 -2298 1201 3066 -155 1220 2059 -1574
520 -1574 -1876 701 -342 -2315 -394 -761 -3764 -1528 506 -2670 -3055 -358 -239 -1263 321 843
536 843 -1818 -898 2457 1981 211 2748 2169 -1248 1788 3769 838 1305 2633 -576 -1431 2385 425
553 425 -2589 275 -227 -3657 -541 111 -4122 -1785 497 -2910 -1536 1817 -1785 -3176 1306 1193
569 1193 -837 2739 2385 -1757 724 3719 464 1004 3472 810 -530 1873 1404 -284 27 617
585 617 -390 -733 519 -1326 -3066 -1226 -538 -1666 -915 -608 -2723 -2918 222 559 -697 1303 845
602 845 -2310 924 3712 234 1088 3699 594 -82 2962 1509 -1077 1996 2444 -1084 42 1748
618 1748 -2132 -2564 673 -743 -2110 -357 -1446 -3550 -1441 513 -1113 -1177 362 -1161 -1438 1399
634A399L60k094J957j22j657J955J090k285m32K820j522j505J794o44l497K135
650b48J778k811P12P14l252N01K345o74j032J177k02j129J059J737j132J5J582
667A140o95M0J474j6j571K03J833n14r97R36j066k355K615P93k877O48J196l386
685b599L38K908j699j778K354r47j938L163O65l197K283K237k835R16K110k065
701h4m04L155r74j039J700p94k416J824J411j779j88M98j638n47J443m18r55J96
719a009K1p76j46J153J58j574J044J425j270N17J306j566m3K758k92j539J597
736A764Ok192K086J116k165J66J241k796k22K747j899j871K084n79j769J196P44
753c43j791M9J973r41l09J591r51o71J431J159p41j09P42p12m7J518l1j300M27
$$ plain form
634 1399 1759 -335 1622 1500 -157 1798 2888 603 171 2991 1469 -36 1758 1114 -2383 -248
650 -248 1530 -1281 -569 145 -3107 -2606 -261 -935 -1967 -790 -992 -2121 -1062 675 -457 -442 1140
667 1140 445 485 1959 1943 372 575 2408 1894 897 1833 767 -1588 1027 1820 -1057 -409 787 -2599
685 -2599 -2261 647 -1052 -2830 -476 -1423 -3361 -198 467 -2730 -447 1790 -1045 -129 1981 -84
701 -84 -488 2667 1693 654 2354 1560 -856 968 2379 600 412 910 -728 -1275 168 -250 -1205 -1009
719 -1009 -988 -1764 -1910 -757 -599 -2173 -1129 296 -974 -457 849 -717 -760 1998 1706 167 1764
736 1764 1770 -422 1664 2780 615 781 2022 -774 -996 1751 -148 -2019 65 -514 -2283 -1087 -343
753 -343 -2134 -2085 -112 -1053 -1362 229 -722 -1393 38 1197 456 347 1089 377 330 1848 1817 517 944
772I44O53j649P27J104j544q55Q07o56p72J351m76k001Q24J616k182J69K053j845
790a732m50K510j57j219J598Kr41Q37J902j585k47J317p55o14J239l46j257N42
808F44J42r48j66P12j098j303J835k21j221N69N07j394M88J722j332o2J184l10
826b52n99J546P76j309R0J289r18Q5J822j407j020J470k21j493M75M26j310j12
844f62R11o27p60Q74p04q57J548nj159M53P07q62O7J219k33q40J014R66j056Q60
864H54R13j446k9J804o56p06O85l12j251P72K70j581j76J278j639m74J627p35
882h02j148Q89J72p18J053O38j155K58J326j45n63R45L25j080R62M66n07J67K44
901A327p77j33R81j14j672L08M12j108P1Q52j319k72Q96l60o26J049J93j562R13
$$ plain form
772 944 1597 -52 675 1779 235 -620 187 -469 -1241 110 -366 -2367 -1543 73 -2109 -1940 113 -1732
790 -1732 -2182 328 171 -1048 550 552 -389 448 2350 765 518 1835 1080 466 1705 1359 102 644
808 644 786 -162 -328 384 -714 -2017 -182 -403 -1624 -1055 -548 -1942 -1454 268 -1064 -1126 58 -252
826 -252 -851 695 1471 162 252 1541 623 708 2530 1123 103 1573 1352 -141 334 760 -550 -662
844 -662 249 -378 -1138 -264 -968 -1825 -277 -282 -1441 -988 -281 -1143 -1076 143 -90 -930 84 1050 -6 854
864 854 1767 321 292 2096 1440 734 1419 1107 -144 628 898 -683 -859 419 -1220 -1694 -67 -802
882 -802 -1950 -1061 -889 -1607 -554 84 -1071 -813 513 368 -195 750 1075 -5 957 1423 916 1083 1327
901 1327 550 417 1398 1284 -388 -80 332 -776 -705 147 -1172 -1444 -548 -908 -1534 -485 -292 -1854 -941
920i41R22m64j96J359q36j24J805k05j285J296K55r74L01R23q94p47Q25p52p01
939d33J245m09j700Q10J52j330O05K19n54j54J102k93m35P05R3n37J020P73m23
958D56K0K98N4J40Q7L72k57n68K28k53m12O58m26j040M06L42q48K09On04n62R43
980f51k12r14J386P1j200J299P40j493P94R82q32L34J556j098n72J166N4j094
998C16P75O52j630J99Q71j507jO71j318OO85n35m89K93m36k1O86M80m27K4M52
1019b54n7K3P79K28O0l38M10K40m68L10M18j129N41K36j056J2Q48r81k97N17k01
1040a59j241N42M29j187R25P33j192k06J313o58n70J427N89j034N17P48o62J11
1058D25J239p80m42R32k04j253R89j40r03L32L62j031k99L91m52l58O96J66j088
$$ plain form
920 -941 -19 -483 -679 680 -156 -280 1525 1320 35 1331 1586 612 913 1836 942 195 1020 268 -433
939 -433 812 403 -1297 -487 -335 -1665 -1060 -841 -1395 -1549 -447 -740 -1175 -470 -377 -914 106 879 456
958 456 476 774 828 968 1055 1427 1170 602 830 577 165 823 397 -643 -237 105 -743 -534 -528 -1032 -1594 -651
980 -651 -863 -1777 -391 -320 -1520 -221 519 -974 -180 802 -30 304 1860 762 190 1356 1410 316
998 316 1091 1743 113 312 1183 -324 -325 346 -972 -966 -281 -816 -1305 -1012 -1448 -1469 -783 -303 -730 -706 -254
1019 -254 -311 -288 491 719 779 441 851 1091 623 933 1351 222 763 999 -57 -45 803 -178 -475 42 -159
1040 -159 -1400 -858 -429 -1616 -691 42 -1150 -1356 -43 -701 -1271 156 745 -289 228 976 314 425
1058 425 1664 884 442 1374 1170 -83 906 766 -137 195 557 -474 -773 -382 -834 -1192 -496 -330 -1418
1077a418M37Q7l56J020K69n02K02L0m6O90m6M84j88j33O76j81n67K24J88n13N10
1098H67k89l77n49L84l52m50P78k08j313M25K61m82O90O06r50n0R06L7m29O81
1118A86M14q28J071N09j056N02N22r29o2J175j104k43N37n31m72R17k49j020P0
1137e91Q9r06K42J112p35l54K88J8N2K63K07K46M44K75o7l61L80K13o5R1K00j78
1159H63k87k05j05j61L79K64j133k30N98p80pR37o30p43R04l62p07J018J47o23
1179h63L47J062r14j57J121m07P3J126n68o05P06P4m23M03K01o12j44k37l09l49
1199d75N07P1j191L99K41q55K75K68J8N0J26K04l69J34N65K7j36R36l67j19J50
1220D59M04j4JM54q46k28L92k79n58M87O9r10L88j00q54N14j39j46K51N44m11
$$ plain form
1077 -1418 -981 -894 -1250 -230 39 -463 -261 -231 -277 413 367 851 663 530 1206 1025 458 682 870 357 867
1098 867 578 201 -348 36 -316 -766 12 -196 -1509 -1084 -823 -1305 -615 -9 -959 -1009 -103 -66 -495 186
1118 186 600 -228 843 1352 296 798 1320 391 329 1504 400 157 694 163 -309 608 359 -661 -591
1137 -591 -502 -1408 -1166 -54 -789 -1143 -855 -837 -785 -522 -315 -69 375 650 583 222 602 815 750 841 1041 863
1159 863 576 371 266 105 484 748 -385 -615 -17 -797 -804 133 -497 -1240 -336 -698 -1405 -387 -240 -863
1179 -863 -516 546 -368 -525 596 189 262 1388 820 215 921 995 572 975 1176 564 420 183 -126 -475
1199 -475 32 103 -1088 -689 -448 -1303 -1028 -760 -742 -692 -566 -362 -731 -597 -32 -5 -141 795 428 309 459
1220 459 863 849 850 1304 458 230 622 343 -215 272 341 -569 -181 -281 -1135 -621 -760 -906 -655 -111 -522
1241e22n62P75J55l42P41L38p61M64J11jLO35j05p26M14M58o76k8L48k30j93N2
1263C48m47l12L57l15l36K0L67r88n5O73J41p6N58k53m05J128J44p71M55R85l80
1284H38j06N95k34l03K54n50J84M13K9j323L81M53n52J5q10N96j25m63R74m87
1304b21r51P38j44n01R80l3p0M42j1p00J568m35n66r2J828j092l07J88o10L79
1324C90r48L87q8l69R65p79O3Q38j146K13j29M23q71p6J15L79O86n99P01Lj71
1345a3N34M45l35q30P94P5L25j62o28M23m13k83P67m24j007L5M46J2j502J166
1365e75k05K24l15P26q15M43O44q92N42l0N47k47Q9M95n29J23O29j67J26J06q52
1386F7j9J149j046k79L80p60J211o36n55k16K48J00J83o37N58n59L3J15L08o14
$$ plain form
1241 -522 -1084 -309 -154 -496 245 583 -178 286 397 396 399 1034 929 203 617 1075 399 371 719 489 296 348
1263 348 -99 -411 -54 -369 -705 -685 -318 -1306 -1361 -688 -547 -623 -65 -318 -723 405 549 -222 233 1218 838
1284 838 732 1327 1093 790 1044 494 678 1091 1120 -203 178 631 79 94 -716 -120 -245 -708 266 -221
1304 -221 -1172 -434 -578 -1079 -99 -132 -202 240 229 -471 1097 662 96 4 1832 740 433 621 11 390
1324 390 -558 -171 -259 -628 337 -442 -379 459 -687 -474 -603 -180 -1051 -1127 -1012 -633 53 -546 155 158 -13
1345 -13 521 966 631 -199 595 670 995 833 205 628 215 -68 699 275 -732 -697 -251 -239 -1741 -575
1365 -575 -780 -556 -871 -145 -960 -517 127 -765 -223 -253 294 47 136 631 102 225 854 687 813 919 67
1386 67 48 1197 151 -128 252 -508 703 67 -488 -704 -456 -356 -173 -810 -252 -811 -778 -663 -355 -969
1406i69O80M91J00J0l5O09j011R01N80l92Q1m21k2m4J8J95o78J61L0p55j54Q59
1428B34o61j67k6q75J422l64k63m01P66J83l21K68J072p34K08M54o33r4P69m06
1448D31n8J77L9L41l51l67L8j79l78M10l02o26L98n3k25O2O2m60Q18P5L16p67
1470e99N11q34N69K44O67l80M16l47K9P51l0l24o25P61o46L9J60q3o60J18J54
1491a09l89R9l7p23Q6Q74k51k33O39k71n37O51N13j02j80M72j05M97k02k78P6
1512D90L70o39Q8K60j14m5n34q5K57k32M9l23j81m2M42l72K70k8m41R6J19N86
1534in46L67K74l18N33M12m31j26M98l9k84N24k91m26N6M54n00J14j4n88k34N85
1556A1j80m69K26j85j8J29l41M34Q3K42n51J08R38p44J40M04J33K50j19N1k74
$$ plain form
1406 -969 -289 202 302 312 277 886 -125 776 1356 964 1045 624 602 558 576 771 93 254 284 -471 -625 234
1428 234 -427 -594 -620 -1495 -73 -437 -700 -1101 -335 -152 -473 -205 867 133 341 795 162 68 837 431
1448 431 373 550 589 930 579 212 250 71 -307 103 -199 -825 -427 -480 -705 -643 -581 -1041 -223 -148 168 -599
1470 -599 -88 -922 -353 -109 558 178 594 247 276 1027 997 673 48 809 163 202 362 279 -381 -263 -109
1491 -109 -498 -399 -436 -1159 -1073 -199 -450 -683 -44 -315 -852 -201 312 210 30 502 397 894 692 414 490
1512 490 860 221 309 569 455 410 -124 -209 48 -184 -135 -458 -639 -681 -239 -611 -341 -369 -810 -714 -595 -9
1534 -9 -555 -188 86 -232 301 713 282 156 654 615 331 855 564 138 194 648 148 262 248 -340 -574 11
1556 11 -169 -638 -412 -597 -615 -486 -827 -393 -310 -68 -619 -511 427 -317 -177 227 360 610 491 542 268
1577B68J8L07K91j51k20k22k33m34L93K27o80r5K0ol55O76m59rK90J70k35K42
1599a97o5k29P06Q3j90L42j4o1j16Q37m23m94M89l48k20M57M0r19N18j10p76J79
1621e11K83k99j23L26l01j51K27J21k04L80L70k93K78k56J3K05L55P7K18k81K76
1642G10k10k68O99n70J4o8p6l8m99J87R7n56J06J19k34L92l01m20N30L32m20J9
1664d55J82L9O7J70M44k67L68Mn09N05K94j76k1Jm98j9L53n41j32J73m2k54N4
1687b60j28k24L5J63j5O3J46p32P14L99K2m9L0l4K28j10M03j40J4r3J37l13r3
1710A63J56j75k99L07K81p30n0J31l34K21J46r3j38r0n09N36q2M57l8K4K04j79
1732i1M0M35pj80K73J65n23K15j5J5J9J17j68k62J86l77j3L02j15k84l9m21K3
$$ plain form
1577 268 286 593 884 733 513 291 58 -376 17 244 -436 -531 -511 -517 -872 -196 -655 -664 -374 -204 -439 -197
1599 -197 -262 -491 215 298 108 450 436 375 259 1096 673 179 668 320 100 557 597 -322 196 86 -690 -511
1621 -511 -228 -527 -650 -324 -625 -776 -549 -428 -632 -252 118 -175 103 -153 -140 65 420 497 715 434 710
1642 710 500 232 931 361 375 307 231 193 -306 -119 -22 -578 -472 -353 -587 -195 -496 -916 -386 -54 -474 -455
1664 -455 -273 -234 -167 3 447 180 548 552 43 548 842 666 645 646 148 129 482 -59 -191 -18 -60 -314 -260
1687 -260 -388 -612 -577 -414 -429 -366 -220 -952 -238 161 183 134 164 130 358 248 651 511 525 432 569 256 163
1710 163 319 144 -155 152 433 -297 -347 -216 -550 -329 -183 -276 -414 -504 -1013 -477 -559 -102 -140 -116 88 -91
1732 -91 -51 384 377 197 470 635 112 327 312 327 346 463 295 33 219 -158 -171 131 16 -268 -307 -728 -705
1755g05M63k6m0L3q9O8K27J9N0J72N3N27j37k06n8l36M40J04K09l80p9n0n03R2
1779a52J17o1k82r0p0J46k90M04r7m40L27K95L0J07M8J10k01M63j36q6J02Q5m9
1802B80L89K13o88O2J88k03J24J34n40j17q9m7K38J02m81j9k19L50j86K61k61
1823e09K58MJ79Rj13L13j93L78J13P5j07k1j99K67l8L52l11l52O5n7n2l09J63
1846h5l75nl1M69o14kK42r9K84L23n36n39O52j02P51j4J18o05M77J94k88J04J57
1869D76M0n60N09j70k32J04k42J37Q9l50M20p77K42k66Q21p98L20l7j65N35m62
1890c66O86J70m41K89J57J72o86L30K50J59p60K37O06j151n96Q75L34n10K46n19
1910e18m98J447j52r15K32q6k03j45O38M45m24L20J1M11j23q86O15L51m23K54
$$ plain form
1755 -705 -242 -268 -308 -275 -364 -296 -69 -50 0 172 225 752 615 409 351 15 455 559 768 388 309 259 -244 -152
1779 -152 -35 -96 -378 -468 -538 -392 -682 -278 -375 -815 -488 -193 -163 -56 -8 102 -99 364 228 142 244 329 280
1802 280 669 882 194 256 444 241 365 499 -41 -158 -247 -294 -56 46 -435 -454 -673 -323 -509 -248 -509
1823 -509 -251 -247 -68 -59 -172 141 -52 326 439 514 407 386 187 454 416 768 457 105 170 113 61 -248 -85
1846 -85 -460 -465 -496 -27 -641 -643 -401 -500 -216 107 -429 -968 -316 -418 333 319 437 -168 309 503 215 319 476
1869 476 516 -44 465 295 63 167 -75 62 151 -199 221 -556 -314 -580 241 -557 -237 -274 -439 96 -366
1890 -366 320 490 49 338 495 667 -19 311 561 720 -40 197 803 -348 -944 -69 265 -245 1 -518
1910 -518 -1016 431 279 -636 -404 -490 -693 -838 -200 245 -179 141 152 563 440 -446 169 520 97 351
1930C51k09L28M04p66O20q60O14l30M52j62q39J06Q19J3o14J01k33R5k38l00P93
1951A45j81m84N59m05K35l09L64J45M38N34p20P06j201M32lm11O44l56r5Q53q82
1972Hn9j55n54R27m68k47R72l51m13J55l00K80K18r9j38O53j135K60O27l3L35
1993D83J64o26qO03n7K70n83J019p02j61N72q46l61L62J25o34k71L12N4m47J85
2014e47N69k04n36k67J332j001J073o04J45O76j31l88j06N59q91J021o23O85r16
2033a54Q36L39m99o92N79j275J322n63l83L99j15K25n64L26P0k60K62O8J1J82
2053A14l7j72M82m03K94j1J52k08j3L68o16J3O13l79J54j19j12j87n5r4k10J90
2075b36j25m5Q6j43P0J95j50l7k97J068l69L23k71j3J3L98j07J36P10r85L7M99
$$ plain form
1930 351 142 470 874 108 728 -132 482 152 604 442 -397 -291 528 541 -73 28 -205 -110 -348 -648 145
1951 145 -36 -520 39 -366 -131 -440 -76 69 507 1041 321 1027 -174 258 255 -156 488 132 37 890 8
1972 8 -51 -206 -760 167 -301 -548 424 73 -340 -185 -485 -205 13 -86 -224 429 -706 -446 181 148 483
1993 483 647 21 13 616 559 829 246 1265 563 402 974 128 -233 129 254 -380 -651 -339 -285 -732 -547
2014 -547 22 -182 -718 -985 347 -654 419 -185 -40 636 505 117 11 570 -321 700 77 762 -154
2033 -154 682 1021 522 -170 409 -866 456 -107 -490 -91 -206 19 -545 -219 -149 -409 -147 -79 -68 114
2053 114 77 -95 387 -16 278 267 419 211 198 566 -50 -37 576 197 351 232 120 -67 -122 -216 -426 -236
2075 -236 -361 -406 -320 -463 -393 -198 -348 -385 -682 386 17 340 69 56 69 467 360 496 1206 221 258 757
2097G57o87k02L76k1J73j73m72j6J47k07j75L58j07m04K47J10Ro0K18K14p8J81
2119A88k93L75j52l53N12M84q40N00k84L54j1m65J56n5Rk67n5L9K90j04n1o8j93
2142b84j91N08n96N06n4k32J10L24lO1J98J48k28L6J6k2J19l1j20K73l32k54M93
2165D45k70m7Q4l05l22Q9k05M12l61J63J56l78J02J26p2J83L66j80J94K8o6j00
2187D2J66K2J66j40j66K0K19K11l36k34O3j72L1j45l6J43j48O7O9j47j34J61l44
2210f22L58j05K03N9o1J22q0L36L32j03M8j25j08j50M60j18p2O8k77j23P0L2l19
2233a75j66P6O7l14M27k52R9L8k23J68J30qr2k26N09Q5n7K9j84j03L42M30j36
2256D64j54j44k3p5K18L5m52N1J92j83L0k63N0k10J63N3M1%q2j11j9L14K20k87
$$ plain form
2097 757 70 -132 244 223 396 223 -249 -265 -118 -325 -500 -142 -249 -653 -406 -296 -287 -347 -129 85 7 188
2119 188 -105 270 118 -235 277 761 -79 421 137 491 480 15 171 116 125 -142 -197 -158 132 28 -23 -91 -284
2142 -284 -475 33 -563 -57 -111 -343 -233 91 88 149 347 495 267 303 319 297 416 385 265 538 206 -48 445
2165 445 175 128 212 -93 -415 -326 -531 -119 -480 -317 -161 -539 -437 -311 -383 -200 166 -14 180 208 142 42
2187 42 208 230 396 256 90 110 329 540 204 -30 33 -139 -108 -253 -289 -146 -294 -227 -158 -305 -439 -278 -622
2210 -622 -264 -369 -166 -107 -168 -46 -126 210 542 439 487 362 254 104 564 446 374 442 165 42 112 144 -175
2233 -175 -341 -265 -198 -512 -85 -337 -238 -200 -423 -255 -125 -133 -225 -451 58 143 86 115 -69 -172 170 600 464
2256 464 310 166 143 68 286 321 -131 -80 112 -71 -41 -304 -254 -464 -301 -248 -207 -207 -289 -400 -419 -105 115 -172
2280a72K56k28M20j1nlj78K13J7r0j2M1r7J00k75r6J9j66P5j7J22l9J5m41J17
2305d35K69l33K40R6J04L7j04K63N3k3k3R8q5J24m7o4M7jq7j18J7Q4j22Q4n9r2
2331g7O9q3l58Q5J68n2K74l72j42J38N9p6M08p4M4K52j34O0J89k70K04j60Q7m7
2355A92q0Jl37M93l7m06J27N0m4q2j42K39k69n6O6m6K3J53l4K84n2p6K29L2K3
2380B51j22K21j61K25k3j99j42J66K15k14j93J01l46L4r6L62k60j58K7P3j03J36
2402b06l1p7p1K92j11K1K43q2q2J76J52J56r6j00mmK30l71J06R5m4j10o8p6L9
2427b3k08J97k46J10k31J45K1mj24K94j57m4J44K15J39k44L4j19L44m3J9Pj10
2450A16Q1K40k17l51L75l37J44j7q4J7J6j90j16J17k15K25N0r8kq1L33j60K73
$$ plain form
2280 -172 84 -144 276 265 260 257 79 292 309 219 207 248 151 251 -24 -120 -101 -267 -192 -209 -87 -126 -111 -552 -435
2305 -435 -166 -499 -259 -163 -59 -22 -126 137 190 167 144 242 157 281 234 170 217 216 129 11 28 112 -10 74 15 -77
2331 -77 -8 -91 -449 -364 -196 -248 26 -346 -488 -350 -291 -367 41 -33 11 263 129 189 378 108 312 152 239 192
2355 192 112 113 -224 269 232 -174 -47 3 -41 -123 -265 -26 -295 -351 -285 -331 -308 -155 -189 95 43 -33 196 228 251
2380 251 129 350 189 414 391 192 50 216 431 217 24 125 -221 -187 -283 79 -181 -339 -312 -239 -342 -206
2402 -206 -237 -314 -385 -93 -204 -183 60 -22 -104 72 224 380 284 184 180 176 406 35 141 236 192 82 14 -62 -23
2427 -23 -231 -34 -280 -170 -401 -256 -235 -239 -363 -69 -226 -270 -126 89 228 -16 18 -101 243 200 219 226 116
2450 116 197 437 220 -131 244 -93 51 34 -50 -33 -17 -207 -323 -206 -421 -196 -146 -244 -246 -327 6 -154 119
2473A19l63L00j19Q0N19o6l60K30J1J16j64k17l3k3o4J07j13m2k39L52l1k70J61
2496a09l2J48m20J77J67k03N1R2k6L04j59K49j0j19J08Lj54K11r6o5K48p4j30
2519A61k71J46O6k13m4J88j98j8o3MN8q2L12k04J47k18K65n0j04J04n5L33k7N0
2543B87P3k77J3K2K27M1q3j71j47N2K84l12j38LM1k26K07P0l21J32k09K32j08
2566c08M7J85j0k2N3L99m09O9K50K51m05L77l72q1k1K21J78l65K82k78j33J19
2588B7l33K51rN0K7m33L00K7o1k1j11L25k04Q8J12k67M83j68K26O8r3J02j50L6
2612B72M8N6k30J34r5j45k2j94j5j16O3K05k76k5Q0k1K18l61K40j34K75M0J37
2635A34N3M5p6J48k0O6j66J61l9l21J73K16J15n72J40J22l90J22K6Mj67l09K10
$$ plain form
2473 119 -244 56 -63 17 536 470 110 340 351 467 303 86 53 30 -34 73 -40 -82 -321 31 0 -270 -109
2496 -109 -141 7 -413 -236 -69 -272 -221 -129 -155 149 -10 239 229 110 218 221 67 278 182 117 365 291 161
2519 161 -110 36 102 -111 -155 33 -165 -183 -246 -242 -184 -266 46 -158 -11 -229 36 -14 -118 -14 -69 264 237 287
2543 287 360 83 96 118 345 386 303 132 -15 37 321 9 -129 -126 -85 -311 -104 -34 -355 -223 -432 -200 -308
2566 -308 -261 -76 -86 -108 -55 344 -65 4 254 505 100 477 105 24 3 224 402 37 319 41 -92 27
2588 27 -306 -55 -64 -14 13 -420 -120 -93 -154 -175 -286 39 -165 -77 35 -232 251 83 309 377 284 386 236 272
2612 272 320 376 146 280 185 40 18 -176 -191 -307 -244 -39 -315 -340 -260 -281 -63 -424 -184 -318 -43 -3 134
2635 134 187 232 156 304 284 350 184 345 306 -15 158 374 489 -83 57 179 -211 -89 -63 -59 -226 -535 -325
2658c25J76k02J20J05qJ25r8J83k12J20Q3k66L48J19k52K20Q9j10j38o4K98k43
2680F8k3L0m4P6j94N3l01Q2J31J9p6k11K34j95%J15p8L63r6J59L9j8j23J90r1
2705A09L0J01K79j83k34j10R3J32r4J81j11j01k90j38L58m09J36K61j91J74j31
2726a38j49Q9M0j83R8J82n5L04q6r8L26j28J66o3j0j80J86k10L3j59L05k00J2
2749H2j23j16k37J16n5M11m48%O6k2L36n3QJ28J3l56K67J11M0j14J12M7l9Q6j38
2774A22J54q6j5j90K2j31R2r1r9Q6j21K43ok20K98m15Q0J39j41N85o71M58k60
2797a67J72N1J29m8J28J02j58l9K43l61j05L28qk17nJ30k25n7l9PM9m3L0m15L83
2822a35j19j07L44Q7j3k18J74M8K6q0L44j82J84j22J71k25K8k17M0L2O8r0k68
$$ plain form
2658 -325 -149 -351 -231 -126 -134 -9 -107 76 -136 -16 67 -199 149 268 16 236 325 215 77 13 311 68
2680 68 45 75 31 107 -87 -34 -335 -253 -122 -103 -179 -390 -156 -351 -351 -236 -314 49 -47 112 151 133 10 200 109
2705 109 139 240 519 336 102 -8 85 217 123 304 193 92 -198 -336 22 -387 -251 10 -181 -7 -138
2726 -138 -287 -198 -158 -341 -243 -61 -116 188 102 4 330 202 368 305 295 115 301 91 124 -35 270 70 82
2749 82 -41 -157 -394 -278 -333 78 -370 -370 -304 -326 10 -43 -35 93 106 -250 17 128 168 54 166 213 174 260 122
2774 122 276 190 175 -15 7 -124 -32 -123 -222 -136 -257 -14 -20 -240 58 -357 -277 -138 -279 306 -365 93 -167
2797 -167 5 56 185 137 265 367 209 170 413 52 -53 275 267 50 45 175 -50 -107 -146 -139 -90 -133 -103 -518 -135
2822 -135 -254 -361 -17 70 57 -161 13 61 87 7 351 169 353 231 402 177 205 -12 28 60 128 38 -230
2845b30P6j23K57l40K29j45P2M8n8J41k73R1J28J4L8K71n7j14J70k36K94K4j39
2868A38p7L0R0J62j08n0k21q7oJ01o5J46j66QP4k00J81j84J59m8k0K75k93O1J73
2893G3l0Or8L04j78O3Q1M8n8k40J05K01m3j96k30J22N8n9o4LN5m34K06qJ15J45
2919e3j17k45O34k70j27J09KJ55l5q7M38k19j4k1o1k1P4k21L43k92J62l5k72O2
2943a11Q1O5l63J72k52J80J47L1J57l77L35j88K45j38O6J03m5o0K54q6m2J01r9
2966A76J55j71J01k58R2q3r9j1J22j75q2k9p1J08K13j39k29K20q5L37k28l2K63
2989I5n7R3J41Jj21J03N7l4l10J3M07k53o8K3k79L36L7k41j5j22L9k7J92j41m5
3014a76l9kk46K82r5K34q7L50j25MJ39p6j03M2J37p4Kk83K52q1J2J44j94N2K05
$$ plain form
2845 -230 -154 -277 -20 -360 -131 -276 -204 -156 -214 -73 -346 -255 -127 -113 -75 196 139 25 195 -41 253 277 138
2868 138 61 91 181 343 235 185 -36 -123 -129 -28 -93 53 -113 -105 -31 -231 -50 -234 -75 -123 -143 132 -161 -100 73
2893 73 43 49 -49 255 77 140 221 269 211 -29 76 277 234 38 -192 -70 -12 -71 -135 -132 -77 -511 -305 -313 -198 -53
2919 -53 -170 -415 219 -51 -178 -69 -67 88 53 -34 404 185 171 150 89 68 142 -79 264 -28 134 99 -173 -111
2943 -111 -30 35 -328 -156 -408 -228 -81 -50 107 -270 65 -123 122 -16 50 153 108 48 302 216 174 275 176
2966 176 331 160 261 3 95 12 -87 -98 24 -151 -233 -262 -333 -225 -12 -151 -380 -160 -245 92 -136 -168 95
2989 95 38 131 272 273 152 255 312 278 -32 -19 388 135 67 90 -189 147 184 -57 -72 -194 -155 -182 10 -131 -176
3014 -176 -215 -217 -463 -181 -276 -42 -129 221 96 100 239 163 60 102 239 165 167 -116 136 55 67 211 17 69 274
3039B74m26K9r3K48k8k44L06R4k66K3R2M0m6j9P0j64K54J6j19J88K67n04L4J6
3063D2J6J92j94L02k12J45n85K58J49n39M72k94L13l47PK14j53K63j63J05mj22
3085a35po9K76J53j88P5J01O1J88k05n44M72n0N3k52j24J18j38J6r7J72J72l17
3108b69J38Kj51L3Q6k38L68l93L59L29l97J85k3o7J9K58q5K33j73k36N3O1J50
3131B42j98l10K57PJ6N7L3k42N3p0p4J23o9q0J73k36K24q5k7J95j4j2J69j11K7
3156D8L32r7k73M39l35m5j4q4J31l83l0L62j18j88K22p6J6j42J96n6k09J99K49
3179A44j43K5j88K33K34n2QKl69j16M69k46M7L9K3p3j21J96k51K24Mk43p7Ll8
3204b66j80K84j43K42j49J51j94J19O5l7Q0K2P6j2j70J29L14k23q7O6NP5L12k46
$$ plain form
3039 274 -152 -123 -216 32 4 -240 66 160 -106 -83 9 49 3 -16 54 -110 144 160 41 229 496 -8 26 42
3063 42 58 250 56 358 146 291 -294 -36 113 -426 46 -248 65 -282 -275 -61 -214 49 -114 -9 -13 -135
3085 -135 -142 -211 65 218 30 105 206 267 455 250 -294 178 128 181 -71 -195 -77 -215 -199 -296 -124 48 -269
3108 -269 -131 -129 -280 -247 -161 -399 -31 -424 -65 264 -133 52 29 -38 -19 239 154 387 214 -22 31 92 242
3131 242 44 -266 -9 -2 14 71 104 -138 -85 -155 -229 -106 -175 -255 -82 -318 -94 -179 -206 -11 -25 -37 132 21 48
3156 48 380 283 10 449 114 69 55 -29 102 -281 -311 51 -67 -255 -33 -109 -93 -235 -39 -95 -304 -105 144
3179 144 1 26 -162 71 305 253 261 263 -106 -222 247 1 48 87 110 37 -84 112 -139 85 89 -154 -231 -228 -266
3204 -266 -446 -162 -305 -63 -212 -61 -255 -136 -71 -108 -28 -6 70 58 -112 17 331 108 21 87 92 167 479 233
3228B33m85M75j40o0j57J24l9j76J61o3j90J58J98k0l07j7K92J25k69K26o0P6
3250H5J0K83l22q4R7J3k07L44j89j61J30J81k45r7L29j11j6P7j23k40J99m02K83
3273a66J18j87K22j32o0L08j12k1L1nP0K11m16J72J44n2j17J93L7q6j35N3k00
3296a30k87L83j46R9P1r1J18j04K1j18kj10R8L00j81K31Np6J13l39J47J60K7j45
3320D4LP4J47k96J82j6l50J27L74k32o5r0R6j86j02J03q7Q6k35M46j18N5j56L22
3344A26k90N04l80L9J29J79j28j2o6K33m3k31p2R5l7J11j80j3j06L2l1j8R0j12
3368a81k6o2J06J49J72k32J13j10j43J70L2K46k10K0k9J35K0q8P7r8Q7j27N1q3
3392a1q6j00K47K68m32K74Kn38M79m43J12O5r1K97J11l07L50or4p5J6j82K93J00
$$ plain form
3228 233 -252 223 83 23 -134 -10 -49 -225 -64 -127 -317 -159 39 19 -288 -305 -13 112 -157 69 9 85
3250 85 95 378 56 -28 69 82 -125 219 30 -131 -1 180 -65 -162 167 56 40 117 -6 -246 -47 -449 -166
3273 -166 -48 -235 -13 -145 -205 103 -9 -30 1 -4 66 277 -139 33 177 125 8 201 238 152 17 70 -130
3296 -130 -417 -34 -180 -81 -10 -101 17 -87 -66 -184 -186 -296 -198 102 -79 152 157 81 194 -145 2 162 189 44
3320 44 47 121 268 -28 154 138 -212 -85 289 57 -8 -98 -2 -188 -290 -187 -274 -188 -423 23 -95 -40 -196 126
3344 126 -164 340 -40 -1 128 307 179 167 101 334 291 60 -12 83 46 157 -23 -36 -142 -110 -141 -159 -69 -181
3368 -181 -207 -269 -163 -14 158 -74 39 -71 -214 -44 -12 234 24 44 15 150 170 82 159 61 148 21 72 -11
3392 -11 -97 -197 50 318 -114 160 162 -376 103 -340 -228 -163 -254 43 154 -153 197 191 97 22 38 -144 149 249
3416B49q6k78K85M4k62K57j22q5J35j41q5M8k57K96j19L3p6J07L3P9r1N5o9J13
3440F3N3k3Jj43O11n84J63j13J88l4M9l15P6M2p9K57k45J43k65J04l4r7oK17k56
3465b27J4J49r4lj23J3J92J11J15j46N4k4J34nO1j03p6J68j2j72O1J15o0q6j99
3490a43J76n8kn6j24L66j90Q7l02L53l11j0K60k62L27j60o5K04o0K8m0k09L49
3513A58j24J15j83J66j12O7L2k80K83m65K59k75L01l6l1k32L14L1K6n3l55N01
3535A07k70K59oN7L7J04n5j07J71k03J05m53L09l8k22L99m14J66k7K41k78R7q3
3558a04R4p9J71k26j41K27J5j89L28j86Q5O9j07J53j76L56m30J08R6j08J59l0
3580H5o5pN8j07J3n5k2l0N9J43l09K4R1K42k85K0L3K78k25J13o3J21R8k23L7Q4
$$ plain form
3416 249 163 -115 170 214 -48 209 87 2 137 -4 -89 -41 -298 -2 -121 -88 -164 -57 -24 55 -36 19 -50 63
3440 63 116 93 94 -49 562 -22 141 28 216 182 231 -84 -8 34 -45 212 -33 110 -155 -51 -85 -182 -188 29 -227
3465 -227 -213 -64 -158 -161 -284 -271 -79 32 147 1 55 31 165 160 221 118 42 210 198 26 87 202 142 56 -143
3490 -143 33 -25 -27 -83 -207 159 -31 56 -246 107 -204 -214 46 -216 111 -49 -114 90 30 58 18 -191 158
3513 158 34 149 -34 132 20 87 119 -161 122 -343 -84 -359 -58 -94 -125 -357 -43 -12 14 -39 -394 107
3535 107 -163 96 90 147 184 288 233 126 297 94 199 -254 55 17 -205 194 -220 -54 -81 160 -118 -21 -104
3558 -104 -10 -89 82 -144 -285 -58 -43 -232 96 -90 -5 64 -43 110 -66 290 -140 -32 64 -44 115 85
3580 85 20 13 71 -36 -23 -78 -100 -130 -71 72 -237 -213 -122 120 -165 -145 -112 166 -59 54 -9 112 210 -13 24 108
3606A08J72K3q6j51J2N3o2q0j0K06j70j72L62M9l02L5j19J46Q3j85p8j40L06j52
3630a52K5k34L22K1OJ50k05Q5j50J54J99l7q6K3Q4q3J77j16r0k23L24k15k38K75
3654A6k11j9R4L56m49K27L9j55j53K14Q1o0k57L15J95k83J02o5J45J95L8k31k14
3677h0R4J16p9j62K00p4n1P5j80J88j08j95kM4R8l5L4J8N5Q5J44k07J68o1K9m4
3703G0N7q8J83k56J16P0M9Lj82r6rJ99k32L07k04R3r1M2j88O7J25j08j07M3N0
3728h7Q3M3J38k32rJ29j86K62nj03N9k8J57q1j7j63K97m37K25M6N1m18K49k58
3752b85J10J86K0j57Q5J5n4P2k70K13Q3K02n29L90J96m04J67L50l41m2L79k01
3774A85j45M1J38k86k41K15K11k9j5k50j59L41k87L21k53J2J42l4J47k3K6K08
$$ plain form
3606 108 280 303 217 66 78 131 69 -11 -21 185 15 -157 205 254 -48 -13 -132 14 97 -88 -166 -306 0 -152
3630 -152 -127 -361 -39 -18 -12 138 -67 18 -132 22 221 184 98 121 205 122 299 183 93 -130 194 -21 -259 16
3654 16 -195 -214 -120 236 -213 14 53 -102 -255 -41 40 -20 -277 38 233 -50 52 -13 132 327 365 134 -80
3677 -80 14 130 51 -111 89 15 -36 39 -141 47 -61 -256 -258 -214 -116 -151 -117 -99 -44 41 185 -22 146 85 114 70
3703 70 127 39 222 -34 82 152 201 204 22 -74 -83 116 -116 191 -13 80 -11 31 -157 -90 35 -73 -180 -137 -87
3728 -87 -4 39 177 -55 -64 65 -121 141 136 33 92 64 221 140 123 -40 257 -180 45 91 142 -276 -27 -285
3752 -285 -175 11 31 -126 -41 -26 -80 -8 -278 -65 18 220 -309 81 277 -127 40 390 49 7 386 185
3774 185 40 81 219 -67 -308 -93 118 89 74 -176 -335 6 -281 40 -213 -201 -59 -93 54 31 57 265
3796B65k45J07j02J26k36J67Q8o7J24j67L3J14k60l2O7l13K19j90N14m04K03l53
3818c42J70P5k52K09L6m7J45r2K25l11K35R5j72j73K09O3R1m9j67J16j29K15R1
3841B41k84p3K08k22J77l27L01J28l09Q2k3j58K40j30k6J46n2l9L67l13J67k19
3863a18J40J64j1l67M2R5K06k0J04k96q1K66O4k43j2J20j43k69K21J9K52k7j85
3886g9L3J25k08r9K05J62j2J05j86O9j68m7M57n23J64K8r9j3L67o0j79J8l9J98
3910B19k97O4J77l9r0q9kR6j52jR1j70L55j1m89M79j21n5K49j83Q6m0k0K05l68
3935a06L18PQ9k10l67K59j67L5q3K16k35J83kP9p5j39K78m04K19P6M1J50k2pl37
3960b04M33j90m9M1pJ19J1j45n3MO4j5L9l14J14o0L5j9M39m04m4K40k01K49q0
$$ plain form
3796 265 20 127 25 151 -85 82 170 103 227 60 93 207 -53 -85 -18 -331 -112 -302 212 -192 11 -342
3818 -342 -172 -97 -349 -140 -104 -151 -6 -98 127 -184 51 146 -26 -199 10 73 164 115 -52 64 -65 150 241
3841 241 -43 -116 92 -130 47 -280 21 149 -160 -78 -101 -259 -19 -149 -175 -29 -81 -120 247 -66 101 -118
3863 -118 22 186 175 -192 -150 -55 151 131 235 -61 -142 124 188 -55 -67 53 -90 -359 -138 -119 133 106 -79
3886 -79 -46 79 -129 -228 -23 139 127 232 46 115 -53 -100 357 -166 -2 26 -73 -86 281 221 42 60 21 219
3910 219 -78 -14 163 124 34 -55 -57 39 -113 -114 -23 -193 162 151 -338 141 20 -35 214 31 117 77 57 262 -106
3935 -106 212 219 308 98 -269 -10 -177 -142 -225 -9 -244 -61 -63 16 -59 -198 80 -324 -105 -29 12 162 140 133 -204
3960 -204 229 39 -10 31 24 143 154 9 -44 -40 24 9 48 -266 -152 -212 -177 -196 243 -161 -205 35 -166 83 3
3985CJ06k65K05P2J16j46K25l09K12J1j42j08j85J09N6K60J3k91K5j88M3L13o
4008A29k46pQ0J59k2l66J94J47j17n8j30J80J61K8j21N3J5M4q6L6K28k40k5O0
4032I6N5j43Mj45K00j65K11l60J46J83j91N7L53k52q0R2J1j62J72j51j04K22K09
4055B58j62m6J8J35j55m5J56j07J81k36J30p3j83o1J41L7N4k3j22j69K93P6k87
4078a90o9L95j52j81J49K19l2k14j59L30j05K4k21L65k18J76q0j34J90mpL34l66
4101E0l7k5J89k70J00j34k26L05j81J73K0K13k77OL40k82j08J64K12M7k46J35
4123A68k86J53n7N7k6l7o6J74p3L52l39j37K8r9N1j3N1k04J18J00m6j53nK52J00
4148F3o4J11l40J16K31M7j11j74ON2J46L4k25J78m6O5l32K68m4J94k13r7R4R8
$$ plain form
3985 3 109 -156 49 121 237 91 316 7 219 230 88 -20 -205 -96 -40 220 233 -58 -33 -221 -178 135 129
4008 129 -117 -124 -44 115 93 -273 -79 68 -49 -107 -237 -57 104 132 11 64 79 123 37 73 301 61 36 96
4032 96 151 8 12 -133 67 -98 113 -247 -101 82 -109 -52 301 49 -31 61 72 -90 82 -69 -173 49 258
4055 258 96 50 68 203 48 3 159 52 233 -3 127 54 -129 -190 -49 -12 42 19 -103 -272 21 97 -190
4078 -190 -259 136 -16 -197 -48 171 139 -75 -234 96 -9 15 -206 159 -59 117 37 -97 93 89 82 416 50
4101 50 13 -12 177 -93 7 -127 -353 -48 -229 -56 -36 177 -100 -94 246 -36 -144 20 232 279 33 168
4123 168 -118 35 -22 35 9 -28 -94 80 7 359 20 -117 -89 -188 -137 -150 -99 -303 -185 -85 -131 -284 -289 -37 63
4148 63 -1 110 -230 -114 117 164 53 -121 -115 -63 83 117 -108 70 24 89 -243 25 -19 175 -38 -135 -41 57
4172E7m3o0O5K15m37K57l46O2M06k65J55j34M81l64J10r6k27J63J19o4K46K20
4194E20l67k19L31m52J65n7J69j20L33j59l56J58j98J79l1m7r6K88J72j76k0J71
4216A88j57J16j81k19M32r8R1j6j49K44j50p8l06P1J61K33m5k64K76j33J4J73
4238B03l09J98l99J60K39o1L4k07R3J43J58j7l33L83M9k62K22m29J27Qj27j94
4260c21L62q9q4J82L5j90J89n2k42L22o6j09j68J46J4k53R4J77p9L74j14k08K06
4283A26j46K75k39J7K43k20K15j35l80M35k24r4K05O2j88n2N7L3n0Njj0j1J04
4307B7j16O5Q4N9n2M9Nn9J40m0M3k84K49o0N9J43j83j85O3j93K16J07l32K21j4
4332A2J11q9j51k79N21j01k5k77J89J22j00k8j9J50q0J8PN3J1O9J6j63L14k59
$$ plain form
4172 57 14 -46 19 234 -203 54 -292 -230 176 -89 66 -68 413 49 159 63 -164 -1 118 54 300 520
4194 520 153 -66 265 -187 -22 -79 90 -30 303 144 -212 -54 -252 -73 -104 -151 -247 41 213 37 17 188
4216 188 31 147 -34 -253 179 81 172 156 7 251 101 23 -283 -212 -51 182 137 -127 149 16 30 203
4238 203 -106 92 -307 -147 92 31 65 -142 -49 94 252 235 -98 285 334 72 294 -135 -8 0 -127 -321
4260 -321 41 -48 -132 50 85 -105 84 32 -210 112 46 -63 -231 -85 -71 -324 -230 -53 -132 242 128 -80 126
4283 126 -20 255 16 33 276 56 271 136 -244 191 -33 -127 78 140 -48 -100 -43 -10 -60 -55 -56 -66 -77 27
4307 27 -89 -24 60 119 67 116 121 62 202 162 205 -79 170 110 169 312 129 -56 7 -186 30 137 -195 26 12
4332 12 123 34 -117 -396 125 24 -1 -278 -89 33 -67 -95 -114 36 -44 -26 -19 34 45 114 130 -33 281 22
4356B2K04m58O0N6M5j98K42j04OJ51M5r4j64O3J48N4j85J46o2j02L9L39k46J00
4380A07M4J00k61nK21k49Q7J31k93L88m47j5K87q1j84M8M3Q3k42J34jJ11j73N0
4404a17K00k45J08J40m0j54J88k1j40K83j33j62M7J12r3n6L07l04K08j4j64J60
4426A10l24l1J5M9J76L1J54j33Q6k22l2K40n5k57Q8J8J48J53R2l91K44j55J33
4449A37M2k56K5K10j51k63k7J95O2j10J14k37K07K12j76k23J91j22Q4J37q7Q8
4471E2p0p6j01L05j86J71k30J15K05k67k9Q4j7K46o0m9J23k17k6p2j33K40n4j25
4495a71L28k22J1R7K06l10k7L81k52r6K28j9l4J71k86r8P6K3J4J96j63k05K07
4518E5N6k7l36L14j39j64J81j4K12l9l48J91LJ89k35k3J7q0J93j89J87n1J29J00
$$ plain form
4356 22 226 -232 -172 -116 -71 -269 -27 -131 -125 26 71 -23 -187 -124 24 78 -107 39 -23 -125 -86 253 7 107
4380 107 151 251 -10 -15 206 -43 44 175 -118 270 -177 -192 95 14 -170 -122 -79 4 -238 -104 -105 6 -167 -117
4404 -117 83 -162 -54 86 46 -108 80 59 -81 202 69 -93 -46 66 -27 -83 224 -80 128 114 -50 110
4426 110 -214 -245 -230 -181 -5 26 180 47 133 -89 -121 119 64 -193 -105 -87 61 214 306 -85 159 4 137
4449 137 179 -77 -52 158 7 -256 -283 -88 -26 -136 -22 -259 -52 160 -16 -239 -48 -170 -86 51 -36 52
4471 52 -18 -94 -195 110 -76 95 -135 -20 185 -82 -111 -27 -44 202 142 93 216 -1 -27 -99 -232 8 -46 -171
4495 -171 157 -65 -54 43 249 -61 -88 293 41 -55 173 154 120 291 5 -93 -17 6 20 216 53 -152 55
4518 55 111 84 -252 62 -77 -241 -60 -74 138 99 -249 -58 -55 134 -101 -124 -107 -187 6 -183 4 -47 82 182
4542A82J63k71j30K00J53r7j49p5q0n2j2J35j07K7J96l00LK59Mn1l1o3J40L4j09
4567c1k22J69J65P4l1p8J88m8JK14l33j15K03j51M4lq3R4r4p2r6O1OK96m10K03
4593d9J51Nj37O8j34M2k15L31J42m61L47R8M3k8l7Jl3pk52J12L25l00O4N2j06
4618B2p6R6R7l43K89k20J28j4r2J97o3j6r4kJ55J7J1Q8r7Q2k80L07k21K8j39L
4644a37L13j99Q0j04LJ09p2q1J08j44M59o04K5J91l01K87p7MR4K1N4l7p6R1Q8
4669I5q4k58M45o6K25l21j8p8K7J11L8M1k63j68L55j57l3J01M7n0r9r4k4L04k78
4694b02l6K36j03K43j39l5J02p2J04n0L6l7J81j14p8P6k28K71j53k0K36j73N5
4717A00k43L58l09K8j46J12k05L03J3j14R4j4M6k44O4J69j71L34j41q0J41k52
$$ plain form
4542 182 345 74 -56 144 297 200 51 -24 -104 -156 -168 -33 -140 -113 83 -217 -214 45 49 -2 -33 -96 44 78 -31
4567 -31 -253 -84 81 155 124 46 234 186 187 401 68 -47 156 5 49 46 -37 57 -37 -109 -205 -144 -138 158 -252 -49
4593 -49 102 107 -30 38 -96 -54 -269 62 204 -257 90 188 231 203 166 167 134 127 -125 -13 312 12 76 128 22
4618 22 -54 42 139 -204 85 -135 -7 -21 -113 84 21 5 -89 -91 64 81 92 180 83 165 -115 192 -29 -1 -140 -137
4644 -137 176 -23 57 -47 -44 65 -7 -88 20 -124 335 -269 -244 -53 -354 -67 -144 -140 -46 -25 29 -8 -84 7 95
4669 95 11 -247 198 132 357 36 18 -60 -33 78 116 157 -106 -274 81 -76 -109 -8 39 -11 -110 -204 -228 76 -202
4694 -202 -238 -2 -105 138 -1 -36 66 -6 98 48 84 47 228 114 36 112 -116 155 2 -18 218 45 100
4717 100 -143 215 -94 -66 -212 -100 -305 -2 11 -103 -9 -23 23 -221 -157 12 -159 175 34 -46 95 -157
4739a57M21k98j60K77l2j47M05j72q2J06k06p5J43r8N7rQ3j65K86k07J33Q1k42
4762e8q8K76kj65O5K6L3J3J32k26N5m8j6O2l19J38N6q4K27k00P4j28J73Q0j85
4787a09J71m25J69K62J2r8l00L82r5J75j10j00O3P9R5j92j10L82m24M56k55j69
4809a41MJ33r1Qr3J25O6m1K39j97O5l70L52p6N2J04k33p5K54p8j3J64J25o2n1
4834A70O4k2k75K71m3j87K06j03r8j55K17j72K40k66K88M9j24q1J60o5r4N1k77
4857b46J95m7nL23k12L0K1j6J4rJ52p5R6l46N9n6N9p3L00l54K70k41k2J30k60
4882c13K57o5r5M12l10J13j48Q6Q6J28k14J76k2q0j96L4K56P5k15J4p0K53m2J13
4906B33k23m1K09k88Q1J97k58j61L90j62l42M88k28j8J32j77P4j23J62p0L10n3
$$ plain form
4739 -157 264 -34 -194 83 51 -96 309 137 55 161 -45 -120 23 -75 -18 -27 56 -109 177 -30 103 184 -58
4762 -58 -146 130 128 -37 28 54 87 100 232 6 61 13 -3 59 -260 -122 -66 -150 77 -123 -49 -177 -4 76 -109
4787 -109 62 -363 -194 68 80 -18 -318 64 -31 144 34 -66 -3 76 171 -21 -131 251 -173 283 28 -141
4809 -141 -137 -4 -95 -87 -180 -55 11 -30 209 12 77 -293 59 -17 35 139 -94 -169 85 7 -6 158 283 221 170
4834 170 234 212 -63 208 165 -22 184 81 -17 -172 45 -127 113 -153 135 184 60 -21 139 74 -20 31 -246
4857 -246 -51 -98 -103 220 8 38 59 43 57 48 200 125 221 -125 -66 -122 -63 -136 164 -190 80 -161 -183 -53 -313
4882 -313 -56 -121 -216 196 -114 -1 -149 -63 23 151 -63 113 91 11 -185 -151 105 180 -35 -21 -91 162 120 233
4906 233 10 -31 178 -110 -29 168 -90 -251 139 -23 -365 123 -105 -123 9 -168 -94 -217 -55 -125 185 132
4928A32j49OK37j5l60J36J17j8j37M7R8j36ml61K38o9O4L33m42L88m42J32Qj05
4952c02M04k01J93k36J57q6K94j72k4J81k33N0J31j70o0K8J44j44J31Rk44R6O4
4975A0j30J78j55O7j73K35j38J69k75K9j56M23l7p0k67M08p2l3J3%l2K03j56m3
4999bj02J84r1J01K00m98N6j78K48%J67k96J46J30k89J28p9J17r5K38J95j69n0
5022F1m7L6mn8nk25J60K86l4j16j65m0K19n4k24K10J12k01Q9k11m8L31j42M0r0
5047a20K18j54q3J0K15J43k04q4OJ2J61J44l43j20O7J25K01l46K64j54K33k57
5069f6J13J19k12J77n05L98k69L6L3K00P4l51R4O6l8K51J6j08P1k33K35k40l7
5092a76N8L0J18or8J12L15m13j82L22o9q3l6K04l88K39j70J93K88l35o5Q4K98
$$ plain form
4928 132 -17 -11 226 211 -149 -13 104 86 -51 -4 94 -42 -46 -407 -169 -238 -174 159 -283 105 -337 -205 -197 -302
4952 -302 102 -99 94 -142 15 -71 223 51 27 208 -25 25 156 -14 -74 -46 98 -46 85 94 -150 -54 10
4975 10 -120 58 -97 -30 -203 32 -106 63 -212 -183 -339 84 47 -23 -290 118 46 13 26 26 -6 197 41 -2
4999 -2 -104 80 -11 90 290 -208 -152 -330 -82 -82 85 -211 -65 65 -224 -96 -175 -58 -153 85 280 111 61
5022 61 14 50 46 -12 -17 -242 -82 204 170 54 -111 -151 68 14 -210 0 112 -89 0 -211 -259 72 -70 -30 -120
5047 -120 98 -56 -139 -129 86 229 25 -59 -53 -41 120 264 -79 -199 -132 -7 194 -152 112 -42 191 -66
5069 -66 47 166 -46 131 -374 24 -245 -209 -176 24 98 -253 -159 -93 -131 120 136 28 99 -134 101 -139 -176
5092 -176 -118 -88 30 24 -74 38 353 -60 -242 80 11 -72 -108 96 -292 -53 -223 -30 258 -77 -142 -58 240
5115B40l07M9k31L33J42k74O6p9N6R4j55r7j11M47pk32K45j85Nm2J67j29j11J02
5139a4J40j65K4p8J44Q8o3j3k10K78k86K12O9j65nJ07N2K1m7J45l69m4M08k30
5163ao9L4J21j72K52k78k3P6J91j3k90J76m9J09J48k40J44j42rl3n9J63k16l2
5187b12K79J54q8L8j06Kj29P8j41L18j98j25J6N8P1J16j82K5M3j33K51m3l22M23
5211A93q5J6j20N0n9J52j99M0p3NJ14Q3j78N7j05J49N0k37J7K45N2L1k37J68l02
5236a73J74j0j72j70J17L12k4j08o9J62N1j08p5J37j64n1M91l63r8M22l47K18
5258A52l08L85m37K47q6p0N6J55q7l3O4j86n1J71q9n0R6j09L15k15J96K8k53J22
5282A3J35k65j14M00k69O8L80m04j49K28m5P3J16j47j04N7j50J48L20j08j50L2
$$ plain form
5115 240 -67 -18 -249 84 226 -48 18 -61 -5 89 -66 -163 -274 173 166 -66 179 -6 -1 -43 124 -5 -116 -14
5139 -14 126 -39 -15 -93 51 139 76 63 -147 131 -155 57 126 -39 -44 63 115 136 89 234 -135 -179 229 -1
5163 -1 -70 -36 85 -87 165 -113 -136 -60 131 118 -172 4 -45 64 212 -28 116 -26 -35 -68 -127 36 -180 -212
5187 -212 67 221 133 171 65 67 -62 16 -125 193 -5 -130 -114 -56 15 131 -51 -26 17 -116 135 92 -230 193
5211 193 108 124 4 54 -5 147 -52 -12 -85 -80 34 117 -61 -4 -109 40 90 -147 -130 115 167 198 -39 129 -173
5236 -173 1 -9 -181 -351 -234 78 54 -54 -123 39 90 -18 -93 44 -120 -171 320 -43 -141 281 -66 152
5258 152 -156 229 -208 39 -47 -117 -61 94 7 -26 38 -148 -199 -28 -117 -167 -71 -180 135 -80 116 144 -109 13
5282 13 148 -117 -231 169 -100 -32 348 -56 -205 23 -22 51 167 20 -84 -27 -177 -29 291 183 33 65
5304F5l53O5R4lL2J98J21j27l9Q0kJ61k25M2L8o1M4Q4k02j01JK56k54%L47m52
5330a91K11j92J3N1J19j72J67j54r1L55j2k19J53J43l06L94l75J92m1J13j28J15
5352A45pl00K48j87Q7j54N21m92k2L18j31m07L01M0J55j68j32M7O6L2J1J12k80
5375a97J74n6K2J03k5J34q2K0n5j37J96K6m2p9Qj63K06J07k10J59j71MJ15k53
5399a96l0K59l10J28J25k38J67J34j99L78k99K66J22l06L4J17j84q6M1L6r7R3
5421d5j25L59l98J79M0q9J56j63M9o5J23p2p2K79o9Rk51J53l8J07p0j55L4M4K54
5446A74j75J85l82M15k1k65J01j04p7lL00j98j8j54M2p6M86l46K56j71j45J61
5468a5k14L83k39p2K20j02P6J67j16j66J50Q6j40Q2j16L24n04K96k96N76m53J7
$$ plain form
5304 65 -288 -223 -129 -132 -100 98 219 92 53 133 131 292 67 109 147 86 130 214 12 -89 -88 168 -86 -86 261 -191
5330 -191 20 -172 -159 -108 11 -161 6 -148 -239 116 104 -115 38 181 -125 269 -106 86 45 158 30 145
5352 145 138 -162 86 -101 -14 -168 353 -139 -161 157 26 -381 -80 -40 115 -53 -185 -138 -72 -40 -29 83 -197
5375 -197 -23 -79 -57 46 21 155 73 93 38 -99 97 123 81 2 10 -153 53 160 -50 109 -62 -58 57 -196
5399 -196 -226 33 -277 -149 -24 -262 -95 39 -160 218 -81 185 307 1 35 152 -32 -118 -77 -41 -138 -45
5421 -45 -170 189 -209 -30 10 -79 77 -86 -37 -102 21 -51 -123 156 87 96 -155 -2 -40 67 -3 -158 -124 -80 174
5446 174 -1 184 -198 217 196 -69 32 -72 -149 -152 148 -50 -68 -222 -180 -256 230 -116 140 -31 -176 -15
5468 -15 -229 154 -85 -157 63 -39 37 204 88 -78 72 158 18 100 -16 308 -196 100 -196 380 -73 -56
5490e6L3j48K17Q0l02L25k54K15k0r5j82J13j21L25l0j37J16J9j49k76L37p4k8
5513i2O5J53j96L8RL2NL3n4j61m7j69K92j16K61L1J57l94J09O2J85l67j47M00
5537H9M2J17k81K87m58J38j15J1K40n5O9o1j26O0K2j1P4k17O0K22j57k77O7K82
5561B2k41N6K14l09L46j45j6J19K42j74P3L1m26qL97J35n01J49L5j21J96l20K64
5584A8j14J07K63k56p4j76K21m4r3j06J6M02k39j41J16L3K52k66qK66j2J49j6
5607B98l30J56P2m13J64R4j0o9K73p4k05n3M9J18r3L1j26J86p8j38J71k3l7J71
5631A34j45P4J27n9j73J05Q7k61J44J71k90L63k15o2K67m00m9Q3J35J4J17j10
5653E7j69K05O3l97J48J50M9k45J65N6q4K2j58J59N1q6j05J98O8n2Q7j69k04L1
$$ plain form
5490 -56 -23 -171 46 126 -176 149 -105 110 90 -5 -187 -74 -195 130 100 -37 79 98 -51 -327 10 -64 -92
5513 -92 -27 126 -70 -32 -23 9 14 47 -7 -168 -215 -384 -92 -208 53 84 241 -153 -44 18 203 -164 -311 89
5537 89 131 248 -33 254 -204 -66 -181 -170 70 15 84 23 -103 -43 -21 -32 42 -175 -115 107 -50 -327 -260 22
5561 22 -219 -163 51 -258 88 -57 -73 46 288 114 187 218 -208 -216 181 316 -185 -36 -1 -122 74 -246 18
5584 18 -96 11 274 18 -56 -232 -11 -55 -148 -254 -238 164 -75 -216 -100 -67 185 -81 -89 177 165 314 298
5607 298 -32 124 196 -217 -53 41 31 -38 235 161 -44 -97 -48 70 -23 8 -118 68 -10 -148 23 0 -37 134
5631 134 -11 63 190 131 -42 63 150 -111 33 204 -86 277 62 0 267 -133 -182 -99 36 50 167 57
5653 57 -112 93 156 -241 -93 57 106 -139 26 82 -2 20 -138 21 72 -14 -119 79 147 95 182 13 -191 -160
5677a60J68m3n9K08K5l28J72o4j5M8O7j90j53N8J60J22J5m5k0L1l3K00k73N4J76
5702A21jK0r7J9m4Jj11K14k12J17K8N1J63m26K10j83L4m1P2j31j84O14k77J38
5726I5J9l54L90k5j95K06j62j5L58m23L12j0J94l81L16k12j94J80j32R1j44J39
5748E3l33K92m7l41L44N1M0j92L96m18Q8k52L57j11k1K05m3M0pk57M6M0k9K59
5772A60q3j16j3K48j91q3J66l31N34l36q5M01l88M07k01k47l9J3J21J31r5L3O0
5795F6R7M3k94m8P1j56R6R6J07j53K8l0po6K18j06j85L45m36K91mN7l36K47J3
5820d6L1K4k50m9M77l48K28n7Q2r0j31M57j38k49J93j9N7j50q2J4J69k95M29n0
5844B07k79M7m1K16o4q1j45L3K24n23K78R5j71J14L21p9m79M01Kq6P3J66j05J17
$$ plain form
5677 -160 8 -35 -94 114 139 -189 -17 -81 -96 -48 19 -171 -324 -266 -106 16 31 -14 -34 -3 -36 164 -109 -55 121
5702 121 120 140 43 62 18 19 -92 122 -90 27 55 106 269 -157 53 -130 -96 -137 -65 -196 -380 234 -43 95
5726 95 114 -240 150 125 -70 136 -26 -41 317 -106 206 196 390 9 325 113 -81 99 -33 58 -86 53
5748 53 -280 12 -35 -376 -32 19 59 -133 263 -155 -67 -319 38 -73 -94 111 68 108 101 -156 -110 -70 -99 160
5772 160 77 -39 -52 196 5 -78 88 -243 291 -45 -130 271 -117 290 89 -158 -197 -184 -63 68 -27 6 66
5795 66 163 206 -88 -136 -65 -221 -125 -29 78 -75 -47 -77 -84 -150 68 -38 -223 122 -314 -23 -27 30 -306 -59 -46
5820 -46 -15 9 -241 -290 187 -161 67 10 92 2 -129 328 190 -59 134 115 172 22 -60 -46 123 -172 257 207
5844 207 -72 -25 -66 150 86 5 -140 -107 117 -406 -128 -33 -204 -90 231 152 -327 74 76 -10 63 229 124 241
5868B41q2mj23l7J49j98p9K13m6j08r4P3N3j9j09K29j6j16Q6j54o6M06l97l6L49
5893A15J8k76M32l43K0mk6J04J84k34j09L98m08L80l92J30J76k66J30j4k15J98
5915bP6l2l61L77k8J0J2o9q1R1m4n2J72j80K77q9j54j31J22K1J24o8M5j77M70
5940C29k77l2m4J24o3m0l1K8j01q5L36m60J02J84QP8k78l3J50Q0pk7l9J61k2R2
5966A33n1j16p1q5J35L81l67j25K38k69J87K5k19L7R2n7K43j61Qj4L02k94J15
5989F7j03K9l34M45m6N4k15J70L1M9k46K45k11M0l1j4k1R7j7J89j57p5j86J50
6013i0M1k39K63L5q8K31k27O9k43J76K22k02Q9L22r0k11N2j81P0M6J09l70K98
6036H2n1k76K62P0j49M2j04J33J7j9J9k14J4K87o6m35K18K61n3j0J95o3j37n0
$$ plain form
5868 241 159 155 32 -5 144 -54 -133 80 34 -74 -168 -95 -42 -61 -170 59 43 -73 13 -141 -207 199 -198 -234 115
5893 115 133 -143 289 -54 -34 -38 -64 40 224 -10 -119 279 -129 251 -141 -11 165 -101 29 15 -200 -2
5915 -2 74 42 -319 58 30 40 52 -17 -98 -7 -51 -103 69 -111 166 77 -77 -208 -86 -65 59 -9 36 -141 329
5940 329 52 20 -24 100 37 -3 -34 -6 -107 -192 144 -316 -214 -30 -22 56 -222 -255 -105 -25 -32 -59 -98 63 41 133
5966 133 82 -34 -105 -190 -55 326 -41 -166 72 -197 -10 15 -204 -167 -75 -132 111 -50 -42 -56 246 -48 67
5989 67 -36 -7 -341 104 58 112 -103 67 98 147 -99 146 -65 -25 -56 -70 -91 6 -11 178 21 -54 -240 -90
6013 -90 -49 -288 -25 10 -78 153 -74 -5 -248 -72 150 -52 37 359 269 58 110 -71 -1 45 154 -216 82
6036 82 31 -245 17 87 -62 -20 -124 9 26 7 26 -188 -174 113 47 -388 -170 91 38 28 223 160 23 -27
6060b7K38k16j72K24J15o4j8m5j20Q8j60J92k27J00qJ84j16k68M68k63M1r8N9
6083i3K24l11K93r6J12r0N2j38J33p1Q6k62J23L12o1L5k74K65j88k33P3k6L54
6106B19o0j45p9m2P5Q8Q7p9j39Mn7J54L0l28J80R2n6qR4j06n8Q9q1L46l59K3K4
6133i2L34j29j66K55j93J64l08L29r6j66j88L44j91L01J56l63J83k25l1j13J07
$$ plain form
6060 -27 211 -5 -177 47 162 98 80 35 -85 3 -157 35 -192 -92 -100 84 -32 -300 168 -95 -54 -152 -93
6083 -93 131 -180 113 17 129 39 91 -47 86 15 101 -161 -38 274 213 248 -26 239 51 -182 -109 -135 219
6106 219 159 14 -65 -107 -32 56 143 64 -75 -71 -128 26 56 -272 -92 0 -56 -64 30 -76 -134 -45 -126 220 -139 -116 -92
6133 -92 242 113 -53 202 9 173 -135 194 98 -68 -256 88 -103 198 354 -9 174 -51 -82 -195 -88
$$ [...]
8191a6
##END NTUPLES=NMR FID
##END=
