##TITLE=1H_SL95-Dau
 CDCl3
 8 sc, 
 19.11.2021
##JCAMPDX= 6.0         $$ Bruker NMR JCAMP-DX V2.0
##DATA TYPE= NMR FID
##DATA CLASS= NTUPLES
##ORIGIN= UXNMR, Bruker Analytische Messtechnik GmbH
##OWNER= root
$$ XWIN-NMR		Version 3.5
$$ Fri Nov 19 11:39:55 2021 Russian Standard Time (UT+4h)  she@DPX200
##.OBSERVE FREQUENCY= 200.131346
##.OBSERVE NUCLEUS= ^1H
##.DELAY= (6, 6)
##.ACQUISITION MODE= SIMULTANEOUS
##.ACQUISITION SCHEME= undefined
##.AVERAGES= 8
##.DIGITISER RES= 18
##SPECTROMETER/DATA SYSTEM= spect
##.PULSE SEQUENCE= zg30
##.SOLVENT NAME= CDCl3
##.SHIFT REFERENCE= (INTERNAL, CDCl3, 0, 15.7039)
##AUDIT TRAIL= $$ (NUMBER, WHEN, WHO, WHERE, WHAT)
$$ ##TITLE= Audit trail, XWIN-NMR		Version 3.5
$$ ##JCAMPDX= 5.01
$$ ##ORIGIN= Bruker BioSpin GmbH
$$ ##OWNER= she
$$ F:/spectra/data/she/nmr/H-F/1/audita.txt
$$ ##AUDIT TRAIL=  $$ (NUMBER, WHEN, WHO, WHERE, WHAT)
(   1,<2021-11-19 11:38:17.79 +0400>,<she>,<DPX200>,
      <created by zg, POWCHK disabled, PULCHK disabled
       configuration hash MD5:
       00 E9 B6 7A A2 85 ED C7 34 08 36 98 17 FE 4E 26
       data hash MD5: 16K
       02 14 50 E9 0B E6 7F 23 21 A3 D3 16 B4 52 B0 0C>)
$$ ##END=
$$ 
$$ hash MD5
$$ F8 53 BD 6E 47 C7 A6 F5 17 B7 77 12 D6 15 3D 88
##$RELAX= 
##$RELAX= 
##$RELAX= 
##$RELAX= 
##$RELAX= 
##$RELAX= 
$$ Bruker specific parameters
$$ --------------------------
##$DU= <F:/spectra>
##$EXPNO= 1
##$NAME= <H-F>
##$PROCNO= 1
##$TYPE= <nmr>
##$USER= <she>
##$AMP= (0..31)
100 100 100 100 100 100 100 100 100 100 100 100 100 100 100 100 100 100 
100 100 100 100 100 100 100 100 100 100 100 100 100 100 
##$AQSEQ= 0
##$AQ_mod= 1
##$AUNM= <au_zg>
##$AUTOPOS= <>
##$BF1= 200.13
##$BF2= 200.13
##$BF3= 200.13
##$BF4= 200.13
##$BF5= 200.13
##$BF6= 200.13
##$BF7= 200.13
##$BF8= 200.13
##$BYTORDA= 1
##$CFDGTYP= 0
##$CFRGTYP= 5
##$CHEMSTR= <none>
##$CNST= (0..31)
1 1 145 1 1 1 1 1 1 1 1 1 1 1 1 1 1 1 1 1 1 1 1 1 1 1 1 1 1 1 1 1 
##$CPDPRG= <>
##$CPDPRG1= <>
##$CPDPRG2= <>
##$CPDPRG3= <>
##$CPDPRG4= <mlev>
##$CPDPRG5= <mlev>
##$CPDPRG6= <mlev>
##$CPDPRG7= <mlev>
##$CPDPRG8= <mlev>
##$CPDPRGB= <>
##$CPDPRGT= <>
##$D= (0..31)
0 1.2 0 0 0 0 0 0 0 0.06 0 0.03 0 0 0 0 0.0002 0 0 0 0 0 0 0 0 0 0 0 0 
0 0 0 
##$DATE= 1637307497
##$DBL= (0..7)
120 120 120 120 120 120 120 120 
##$DBP= (0..7)
150 150 150 150 150 150 150 150 
##$DBP07= 0
##$DBPNAM0= <>
##$DBPNAM1= <>
##$DBPNAM2= <>
##$DBPNAM3= <>
##$DBPNAM4= <>
##$DBPNAM5= <>
##$DBPNAM6= <>
##$DBPNAM7= <>
##$DBPOAL= (0..7)
0.5 0.5 0.5 0.5 0.5 0.5 0.5 0.5 
##$DBPOFFS= (0..7)
0 0 0 0 0 0 0 0 
##$DE= 6
##$DECBNUC= <off>
##$DECIM= 32
##$DECNUC= <off>
##$DECSTAT= 4
##$DIGMOD= 1
##$DIGTYP= 9
##$DL= (0..7)
0 120 120 120 120 120 120 120 
##$DP= (0..7)
150 150 150 150 150 150 150 150 
##$DP07= 0
##$DPNAME0= <>
##$DPNAME1= <>
##$DPNAME2= <>
##$DPNAME3= <>
##$DPNAME4= <>
##$DPNAME5= <>
##$DPNAME6= <>
##$DPNAME7= <>
##$DPOAL= (0..7)
0.5 0.5 0.5 0.5 0.5 0.5 0.5 0.5 
##$DPOFFS= (0..7)
0 0 0 0 0 0 0 0 
##$DQDMODE= 0
##$DR= 18
##$DS= 0
##$DSLIST= <SSSSSSSSSSSSSSS>
$$ [...]
##$SUBNAM2= <"">
##$SUBNAM3= <"">
##$SUBNAM4= <"">
##$SUBNAM5= <"">
##$SUBNAM6= <"">
##$SUBNAM7= <"">
##$SUBNAM8= <"">
##$SUBNAM9= <"">
##$SW= 18.0517287032376
##$SWIBOX= (0..15)
0 0 2 0 0 0 0 0 0 0 0 0 0 0 0 0 
##$SW_h= 3612.71676300578
##$TD= 16384
##$TD0= 1
##$TE= 0
##$TE2= 300
##$TE3= 300
##$TEG= 300
##$TL= (0..7)
0 120 120 120 120 120 120 120 
##$TP= (0..7)
150 150 150 150 150 150 150 150 
##$TP07= 0
##$TPNAME0= <>
##$TPNAME1= <>
##$TPNAME2= <>
##$TPNAME3= <>
##$TPNAME4= <>
##$TPNAME5= <>
##$TPNAME6= <>
##$TPNAME7= <>
##$TPOAL= (0..7)
0.5 0.5 0.5 0.5 0.5 0.5 0.5 0.5 
##$TPOFFS= (0..7)
0 0 0 0 0 0 0 0 
##$TUNHIN= 0
##$TUNHOUT= 0
##$TUNXOUT= 0
##$USERA1= <user>
##$USERA2= <user>
##$USERA3= <user>
##$USERA4= <user>
##$USERA5= <user>
##$V9= 5
##$VALIST= <valist>
##$VCLIST= <CCCCCCCCCCCCCCC>
##$VD= 0
##$VDLIST= <DDDDDDDDDDDDDDD>
##$VPLIST= <PPPPPPPPPPPPPPP>
##$VTLIST= <TTTTTTTTTTTTTTT>
##$WBST= 1024
##$WBSW= 4
##$XGAIN= (0..3)
0 0 0 0 
##$XL= 0
##$YL= 0
##$YMAX_a= 141595
##$YMIN_a= -269383
##$ZGOPTNS= <>
##$ZL1= 120
##$ZL2= 120
##$ZL3= 120
##$ZL4= 120
##$ABSF1= 10
##$ABSF2= 0
##$ABSG= 5
##$ABSL= 3
##$ALPHA= 0
##$AQORDER= 0
##$ASSFAC= 0
##$ASSFACI= 0
##$ASSFACX= 0
##$ASSWID= 0
##$AUNMP= <proc_1d>
##$AZFE= 0.1
##$AZFW= 0.1
##$BCFW= 1
##$BC_mod= 2
##$BYTORDP= 1
##$COROFFS= 0
##$CY= 11.3945322036743
##$DATMOD= 1
##$DC= 2
##$DFILT= <>
##$DTYPP= 0
##$F1P= 2.36226072786647
##$F2P= -0.459571619588291
##$FCOR= 0.5
##$FTSIZE= 0
##$FT_mod= 4
##$GAMMA= 1
##$GB= 0.15
##$INTBC= 1
##$INTSCL= 1
##$ISEN= 128
##$LB= 0.24
##$LEV0= 0
##$LPBIN= 0
##$MAXI= 10000
##$MC2= 0
##$MEAN= 0
##$ME_mod= 0
##$MI= 1.114404
##$NCOEF= 0
##$NC_proc= 0
##$NLEV= 6
##$NOISF1= 3.799351
##$NOISF2= 2.8
##$NSP= 1
##$NTH_PI= 0
##$NZP= 0
##$OFFSET= 15.70392
##$PC= 1
##$PHC0= -15514.27
##$PHC1= 13.80081
##$PH_mod= 1
##$PKNL= yes
##$PPARMOD= 0
##$PSCAL= 0
##$PSIGN= 0
##$REVERSE= no
##$SF= 200.130013532006
##$SI= 16384
##$SIGF1= 3
##$SIGF2= 2
##$SINO= 400
##$SIOLD= 16384
##$SREGLST= <1H.CDCl3>
##$SSB= 0
##$STSI= 0
##$STSR= 0
##$SW_p= 3612.71676300578
##$SYMM= 0
##$S_DEV= 0
##$TDeff= 0
##$TDoff= 0
##$TI= <>
##$TILT= no
##$TM1= 0
##$TM2= 0
##$TOPLEV= 0
##$USERP1= <user>
##$USERP2= <user>
##$USERP3= <user>
##$USERP4= <user>
##$USERP5= <user>
##$WDW= 1
##$XDIM= 8192
##$YMAX_p= 0
##$YMIN_p= 0
$$ End of Bruker specific parameters
$$ ---------------------------------
##NTUPLES= NMR FID
##VAR_NAME=  TIME,          FID/REAL,        FID/IMAG
##SYMBOL=    X,             R,               I
##VAR_TYPE=  INDEPENDENT,   DEPENDENT,       DEPENDENT
##VAR_FORM=  AFFN,          ASDF,            ASDF
##VAR_DIM=   8192,          8192,            8192
##UNITS=     SECONDS,       ARBITRARY UNITS, ARBITRARY UNITS
##FACTOR=    0.0002768,     1,               1
##FIRST=     0,             0,               0
##LAST=      2.2672688,     0,               0
##MIN=       0,             -269383,         0
##MAX=       2.2672688,     141595,          0
$$ Real data points
##PAGE= N=1
##DATA TABLE= (X++(R..R)), XYDATA
$$ [...]
1882d95k06Q37N47r71p20J165M95j081k39J163N90j219r39J326O11j003p18J340
1900D83N21j506l56R22Q00p46r05P86P65j082o79Q39J016r02r78O82P16n65j51
1919c40M84O39n98o21N63N34L3o19j2K69M5j248Q42P83m18q97J97J52j74J73n
1940b18N93n22j94O0L36k71K37J20p1k5j20N27o6l8n54Q97n7r32j1P96K04p03
1962a2m96M71K51l78p41Q75O03j188n32J048O29p62p10Q09Q64r17o63J128J074
1981A353p75j227R02P85r09q46Q21J057q82j322O92J171p77j165J032P76q09j249
1999a372O95J243m63p69N68P40n88q07P82J050p21r17N19P66n92m75M82P28q32
2018C7l53N01N13q61n51J124j16q11l05J073L72j109k70J231J4j104p4J121M82
$$ plain form
1882 -495 -701 136 683 -288 -1008 157 652 -429 -668 495 1085 -134 -1073 253 864 -139 -857 483
1900 483 1004 -502 -858 64 864 118 -787 -1 764 -318 -997 -158 858 -44 -1022 -340 376 -189 -340
1919 -340 144 783 185 -436 127 661 694 75 63 332 377 -871 -29 754 336 -561 -364 -212 -386 -213 -218
1940 -218 375 -147 -341 -281 55 -216 21 141 70 45 -75 452 386 348 -206 691 634 -298 -309 487 691 -12
1962 -12 -508 -37 214 -164 -905 -30 573 -615 -1147 -99 530 -232 -942 -133 731 -186 -849 279 1353
1981 1353 578 -649 253 1038 129 -717 104 1161 279 -1043 -351 820 43 -1122 -90 686 -123 -1372
1999 -1372 -677 566 103 -666 -98 642 54 -753 29 1079 358 -559 -40 726 134 -341 141 869 37
2018 37 -316 185 698 -163 -714 410 294 -517 -822 251 623 -486 -756 475 489 -615 -689 432 914
2037I14j395n01J567K24j515K25J287nr87o07J483N07j523l85J208M60j851k69
2055a163J506M00j343l07J391L46j427j62J398K06j347q6Q32N19j252j15J288
2072F84J00j236m95J317L13p39j43O29r0q27R8Q94O1j007P7Q84j20o92J51P38
2092E97l45q85O30N28o13n83P52Q67r85o85L26R84l71r95N35P33m96o68N01Q21
2112F48n31q13O65P03l88r56Q37P75n96j034M49P75m18p10K70R20o64n50L2J140
2132E54m10p07L18N73q7o93N00L91o2n97J98M23K21p86J13N01k90k73k04K45J55
2153H3m25Q3J54J8k44R0K17L18m13rK36m66l0K97K20L7k67J10L89j29k80L96J94
2176E79k68o04L19K25l75j22k70P28m83k87j42Q86mr62J66Q01kp32L72O90k01
$$ plain form
2037 914 -481 -982 585 809 -706 -481 806 801 -186 -793 690 1197 -326 -711 497 957 -894 -1163
2055 -1163 343 743 -600 -907 484 830 -597 -759 639 845 -502 -588 244 763 -489 -604 684
2072 684 784 -452 -947 370 683 -56 -199 430 340 -487 -389 505 566 -441 -364 520 400 -292 -141 597
2092 597 252 -633 -3 525 -88 -671 81 948 -37 -722 -396 588 217 -778 -243 490 -6 -674 -173 648
2112 648 117 -696 -31 672 284 -672 165 940 344 -690 -241 534 116 -594 -324 596 -68 -618 -586 554
2132 554 144 -563 -245 328 241 -452 48 439 377 -220 -22 401 622 -164 -51 450 160 -113 -317 -72 83
2153 83 -342 -259 -105 -87 -331 -241 -24 294 -119 -128 108 -358 -388 -91 129 166 -101 9 398 269 -11 385 579
2176 579 311 -293 26 251 -124 -246 -516 212 -271 -558 -700 186 182 -780 -614 187 185 -547 -175 515 314
2197C14p28J24R67Mr52k2R09L2j181J07R51J36j014l91J140J27j174j51J005K83
2217D86j067q9O10O12r80j68R61K52q51k42Q50K28r46lQ73rr25J20Q22p9p48k7
2239c20N69Q7o83N9Q49n36q19M12J106o25n78L50P30o17p25N77R55m82o78M83
2259A14P07o23p04N04Q15o06q76P27O20o64q10Q88O71p05q89M31J264n34r10K06
2279c74J043m99j044P36R07p62o26L53J010o52o54M67Q75r19m17L88P19n66n25
2298e40L82J102p87q41L64P76m08k31N19K36q88PM72K51o13KM44l50k44j32Q88
2319D09n3q25j35R67l3p47M9Q29o9p70l77J327o1n99k54N66J78p62O8O95N0o91
2341b38l08O42L97p34l83R54o8q16l82R74M15o29m25Q62J53o43j66P54L86q01
$$ plain form
2197 314 -414 -290 677 681 -271 -293 616 648 -533 -426 525 661 -353 -744 396 523 -651 -802 203 486
2217 486 -581 -670 -60 552 -428 -596 365 617 -234 -476 374 602 -344 -347 526 517 -408 -288 534 455 -293 -320
2239 -320 249 336 -347 -288 561 25 -794 -382 724 99 -479 -129 601 -16 -741 -164 791 309 -369 114
2259 114 821 198 -506 -2 813 207 -669 58 678 14 -796 92 763 58 -831 -400 864 330 -580 -374
2279 -374 669 170 -874 -138 769 7 -619 -266 744 92 -562 -95 780 -139 -556 -168 551 -15 -540
2298 -540 -158 944 157 -684 -320 456 48 -183 336 572 -316 -309 163 414 -199 -197 247 -103 -347 -479 409
2319 409 356 -469 -604 363 330 -417 -368 461 392 -378 -755 572 511 -88 -342 224 402 -360 -292 403 453 -238
2341 -238 -546 96 493 -241 -624 330 262 -554 -936 38 453 -176 -601 261 414 -229 -395 359 745 -56
2361e6pJ16M65m26k69M32K00o22l7J53J00l81O3N2L04j20o8P6J38k39L8J28j01
2384f1j70m7N55O5m70k4L65J87m87O5K70j21m95N0P72m44m18J09M74N7n55j77
2406e00P09k08l01j92N08K61n99k24O33L85o22j62M72O78p17m04N94M49q50k72
2426c62M69M60l51m44L17N34n01q23O31O72p93m62J99P01m54o18R56J83j20o47
2446d53K61O06j49m61K50J09m39j2M65J84l67l20M15J05m00p9M86J96l72n06L20
2467a61N10o24m8M77R5m16m65R32K34n62m9M72J36j215L18R27j33p40m1P37J15
2488D99r09j80Q28L65p67p24J023L37q07j58Q27J91q81k69Q97K15p98k50Q67K19
2508E25o44k87P77K57o59l13K68M31n43MP44k79l79m03Q24k01k09k40P28k15n40
$$ plain form
2361 -56 -63 53 518 92 -177 255 455 -167 -204 -51 49 -332 -269 -217 87 -33 -101 -25 113 -126 -88 40 -61
2384 -61 -231 -278 277 342 -128 -152 213 400 -87 -22 248 127 -368 -318 454 10 -408 -299 175 232 -323 -500
2406 -500 209 1 -300 -492 16 277 -322 -546 87 472 -150 -312 160 838 121 -283 311 760 -90 -362
2426 -362 107 567 216 -228 89 623 122 -701 -70 602 -191 -653 -454 247 -207 -825 131 314 194 -453
2446 -453 -192 414 265 -196 54 163 -276 -288 177 361 -6 -326 89 194 -206 -285 201 397 25 -481 -161
2467 -161 349 -275 -323 154 249 -167 -632 300 534 -28 -77 395 531 -684 -366 561 428 -312 -353 384 499
2488 499 -410 -590 238 603 -164 -888 135 472 -335 -493 334 525 -356 -625 272 487 -311 -561 306 525
2508 525 -119 -406 371 628 -31 -344 -76 355 -188 -184 560 281 -98 -501 323 122 -87 -327 401 186 -354
2529c54K33M42j61m97K29K37O8p43L97N85l52p15M40M93n89nM73N00n67o74M92
2550f8N78p45j39M47P18p85m10M88O21m78q60K30J079r56m22K89Q41m77n61L65
2570b45N58j22p04L96M36k78n15K48P89q5p96L73L37k32k90j07P04k62k04J23
2590A24j73J78m68K79P1o6m68K03L20j60r3K65J24k19l15M81L78l58j95L63K83
2611E54o05K55r9J68j06k20j83L91r8k76M59j11j23l55K75K14r5k96J48J45j28
2632h6k08K12N88m35j16J27L78k71m58L28N70l06n53m1Q38k22p18K02M02j32l25
2653b26k1L11J65n96Q6M42k5m89Q7M77j93Q1j88M63O6o59L61K61l17r0n5L38j75
2676A04k45qM11j67k84k07N95k61j97K44m5j55j43K53K02q1m93M31K54k18l45
$$ plain form
2529 -354 -121 321 160 -337 -108 129 197 -546 -149 436 84 -631 -191 302 -287 -292 181 681 114 -560 -68
2550 -68 510 -235 -374 73 791 6 -404 84 705 227 -633 -403 676 -280 -702 -413 428 -49 -610 -245
2570 -245 313 191 -513 -117 319 41 -474 -226 563 478 -318 55 392 160 -130 -237 467 205 1 124
2590 124 -49 129 -339 -60 11 -55 -523 -320 0 -160 -253 12 136 -83 -398 83 461 103 -92 271 554
2611 554 -51 204 105 273 167 -53 -236 155 57 -219 240 129 6 -349 -74 140 45 -251 -103 42 -86
2632 -86 -294 -82 506 71 -45 82 460 189 -269 59 629 323 -230 -271 567 345 -373 -171 231 99 -226
2653 -226 -247 64 229 -367 -281 161 136 -353 -266 211 18 99 -89 374 440 -219 142 403 86 -4 -59 279 104
2676 104 -141 -149 262 95 -189 -396 199 -62 -259 -15 -60 -215 -358 -105 97 16 -477 -46 208 -10 -355
2697c55M98L54n15l24M60K97m78l67N13K20k96k87K90L11j12p51N53J87k88j92
2717b82K26M46m89l23O16p6l6n48M67M81m92l34K49M93k25l45K86R5p3n45M49
2738D0J73l90J80L9L78l94k6J74P0l66l1K01L03l27k28Q0K71j41l90N04K78m62
2760f4k22K19K92m63J68L22K02o71l0N90j22m0m67N49k30k39J07M06o0l56k38
2781c47N65J51n62j05K81R8k12l76O08O4l48j60L83M7j73j47K71K86o8m21J77
2802A2J20j74P0J55J73n28q9M60r1o0j99K75J87j84k61K13N8k52o2j05L08k71
2824b45J74J44oK9J73l4No82J58M66q1l24J43L39j0o85L22J78j27l07K10K86j13
2847A3m32K62N74k32l96j16N71J18l42l54N30m7k95n6L32M1m01M7L01J86l54l01
$$ plain form
2697 -355 143 497 -18 -342 118 415 -63 -430 83 303 7 -280 10 321 209 -542 11 198 -90 -282
2717 -282 -56 390 -99 -422 194 118 82 -466 1 482 -10 -344 -95 398 173 -172 114 209 136 -409 40
2738 40 213 -177 3 42 420 26 0 174 244 -122 -153 48 351 24 -204 -124 147 6 -384 120 398 -64
2760 -64 -286 -67 225 -238 -70 252 454 -217 -247 343 221 181 -286 263 33 -206 -99 307 247 -109 -347
2781 -347 218 369 -193 -298 -17 81 -131 -507 101 165 -183 -343 40 87 -86 -233 38 324 256 -165 12
2802 12 132 -42 28 183 356 -172 -261 199 108 48 -151 124 311 127 -134 79 137 -115 -177 -282 26 -245
2824 -245 -71 73 67 96 269 235 240 -442 -284 182 101 -223 -80 259 249 -436 -114 64 -63 -370 -160 126 13
2847 13 -419 -157 417 185 -211 -327 244 362 20 -334 196 149 -146 -202 130 171 -230 -183 118 304 -50 -351
2869c51L91K8j30l82O81k33j24LJ76J39j09m47L28K84j49k31K61Q7j86k61L80
2890A55R2j73k96L48J35p06M94j2J81n71K01J57M3j97q9N11k19j75J23L03j52
2911A53m30j4O04k3p12K94L34j48o21L42M57nk65k18N37j07l77p7L60o4l41M52
2933A31K01m3p48M02K79p9o27R4L26K8l0j92M15j1k76n2M26m17K0P3N30l73j95
2956a18P6O6P2q0j57M86l24j73K35J26k21n1J37P1J39k99L0J96j38l29R6L52k26
2979c4j04J03J41r0l02M82R5k48l09K94J99k9m19L35J50Om09Q6K83l95R7o1K78
3002A49l32j39J99M96l06l37J64K03lk07J90N3k1k34O6J63q2j12J8K59k6l16J25
3025c0K86k57j43Q5J02Mk31J10m3K14m16J45M49p8j41j18O8Q8j97J68r1k5KoJ99
$$ plain form
2869 -351 40 68 -62 -444 237 4 -120 -117 59 198 89 -358 -30 254 105 -126 135 222 36 -225 155
2890 155 247 74 -222 126 261 -445 49 37 218 -353 -152 5 48 -149 -238 273 54 -121 2 305 153
2911 153 -277 -291 313 290 -422 -128 206 58 -563 -221 236 231 -34 -252 285 178 -199 -276 84 20 -321 131
2933 131 332 289 -459 -57 222 143 -484 -390 -64 -36 -66 -258 157 146 -130 -182 244 -173 -153 -80 450 77 -118
2956 -118 -42 24 96 16 -141 345 21 -152 83 209 -12 -63 74 145 284 -15 15 211 73 -256 -160 192 -34
2979 -34 -138 -35 106 16 -286 196 291 43 -266 28 227 198 -221 114 264 270 -139 -53 230 -165 -68 -129 149
3002 149 -183 -322 -123 373 67 -270 -106 97 94 -113 77 130 109 -125 -59 104 22 -90 -72 187 161 -155 -30
3025 -30 256 -1 -144 -59 43 47 -184 -74 -117 97 -319 -174 275 197 56 -62 6 94 -103 65 -26 -51 -49 -55 144
3050A44j07K13k26J56j54j13K6J65n8j10pM0N5k3j02kM5j17K07K28m14m5J9L47
3074A67Q8j62q4N35m31j90R2K57l43l3MN01k27o56M67J48n1k64J56M26j31n53
3096b84q6O76n31j6L34OK6m23L78l8P7K0l52J23n2j7J7M55k18k06JM64k77j30
3120e3J95k11J97n20M99R8j67j77K67k23J62l36J11L74l95J97m0M64m92k35L65
3141H0K51m93m4K15p0J20l51K95K65k20j93Q3J40j31m62P57k8k96j34L67J33l70
3163h6qqK62k56j38L47k12K12m03K12K49l02m2K93O2q5l40M09q4l69K34O0J36
3186A43m17L14k34L88l78j59J87K2J60P3k60P1J7k14K00L00l18J56J52l04J58
3207E7N7Jk5j63K11J92r1m73K18P0j44mr1K75P4j79k2P4O4j07J69k52J31j08p1
$$ plain form
3050 144 37 250 24 180 26 -87 -61 104 46 -64 -71 -31 24 1 -101 -103 -58 -175 32 260 -154 -199 -180 167
3074 167 255 93 9 544 113 -77 15 272 -71 -104 -100 401 174 -482 -15 133 82 -182 -26 400 269 -284
3096 -284 -370 306 -225 -241 93 99 125 -298 80 42 119 139 -213 -90 -142 -159 -142 313 95 -111 -110 354 77 -53
3120 -53 142 -69 128 -392 107 205 38 -139 128 -95 67 -269 -158 216 -179 18 -22 442 -50 -285 80
3141 80 331 -162 -206 9 -61 59 -292 3 268 48 -145 -62 78 -53 -515 242 214 -82 -216 151 284 -86
3163 -86 -94 -102 160 -96 -234 113 -99 113 -290 -78 171 -131 -173 120 182 97 -243 166 82 -287 -53 7 143
3186 143 -274 40 -194 194 -184 -343 -156 -134 26 99 -161 -90 -73 -287 -87 213 -105 51 203 -101 57
3207 57 114 115 90 -73 138 330 239 -234 -16 54 -90 -94 -185 90 164 -15 -37 37 101 -6 163 -89 42 -66 -137
3232a37K32j67M8j1N2n7P2k2M2K15n68K11K70j69k9o9j62M85m21K7K40j4k54J16
3256g0m9p7K17j51M25l37J0p6J77q4J9j42J47Q0k87p7K41J41o8J80k14jp7j00
3280a73K62J38q8j24J0m6j02j43L41j0Ok1J8n3j69K14J34k26k2R8K0J06k69K1
3304g8J16O9k40J07j23N04k86k30L23j09j30R8Q8n5r1q7J03J3l39J91K74m0l54
3327b76J26jJ34L04m07J17o1J50j85j1K73k80lL20Q8l86L0K67j67N6n2j72K02
3350F6j95j48M99k97j99J50K03k63l2K30M7k06J70l0J50k57J75J01K43j41k22
3371D4j83L41j70j02rJ93j00j77J18J33j42Nk5O2n2Q9p8L03k75J51o6R4p5k09
3395a30k03M06m8n0J60j71J50n2M2k49R7r1J45j6l0OJ68m4k49J36q0Q6P2j52K78
$$ plain form
3232 -137 95 -72 -24 -35 17 -40 32 10 52 267 -301 -90 180 11 -18 -87 -249 236 -185 -158 82 68 -186 -70
3256 -70 -119 -196 21 -130 295 -42 -32 -108 69 -15 4 -138 9 89 -198 -275 -34 107 39 219 5 4 -73 -173
3280 -173 89 227 139 15 25 -21 -123 -266 75 65 71 50 68 15 -154 60 194 -32 -54 44 64 170 -99 -78
3304 -78 38 107 -133 -26 -149 355 69 -161 162 53 -77 21 109 54 -37 -124 -21 -8 -347 -156 118 78 -276
3327 -276 -150 -151 -17 287 -120 -3 -64 86 -99 -110 163 -117 -120 200 288 -98 -68 199 32 88 36 -136 66
3350 66 -129 -277 222 -75 -274 -124 79 -184 -216 14 61 -145 25 -5 145 -112 63 164 407 266 44
3371 44 -139 202 32 -70 -79 114 14 -163 -45 88 -54 -49 -74 -12 -64 25 -53 250 -25 126 60 154 79 -130
3395 -130 -333 73 25 -25 135 -36 114 62 104 -145 -48 -139 6 -10 -40 -34 134 90 -159 -23 -103 -17 55 -97 181
3420A81j44Q7j27j17K52j61O3O3J36k37j41Q1J35n4j41K81j22m76J66K64J37k39
3442a13J05K2l9K64k34L2R4o0k01R1J4n2J50k26R5K2j42K95j28qK9L8N8j14n0
3467e8l0J20j13j6p2K34o2P9J0j10k21J91K39l57J28j02R3J54p6q5L1J29k52J47
3491AJ10k9j44k3P5P0n9j02K08j76k8n8M41j47k00p1n8J87j23J49q4J64k33L46
3515B16j81K5K22l03J12j30J41j39j77L15M5j35j51k8P3k34L8J89J56k9J39j91
3537b7J18N7k71r0L58n3j59J61n3J84p8k09k3p7J65j61J58J47q9j32J01J97j99
3560B5l8j07o1lM05l64K09j27J74j7J35j39k37J6M1K9J07N6j2O0l8j10PQ7q5M1
3586E4j30J70J93k84Q3J75j14k94J97J23j56O2j93n2K46J19r8k30O4n7K18r7p8
$$ plain form
3420 181 37 124 -3 -120 132 -29 34 97 233 -4 -145 -64 71 17 -124 157 35 -441 -275 -11 126 -113
3442 -113 -8 14 -25 239 5 37 131 71 -130 -39 -25 -77 73 -153 -58 -36 -178 117 -11 -19 10 48 106 -8 -58
3467 -58 -88 32 -81 -97 -169 65 3 82 92 -18 -239 -48 191 -166 -38 -140 -47 107 31 -54 -23 106 -146 1
3491 1 111 82 -62 -85 -10 60 1 -101 107 -69 -97 -155 286 139 -61 -132 -190 -3 -126 23 -61 103 -130 216
3515 216 35 60 282 -21 91 -39 102 -37 -214 101 146 11 -140 -168 -95 -329 -291 -102 54 25 164 -27
3537 -27 91 148 -123 -213 145 92 -67 94 41 225 147 -62 -85 -162 3 -158 0 147 58 -74 27 224 25
3560 25 -13 -120 -181 -184 221 -143 66 -61 113 96 231 92 -145 -129 -88 -59 48 104 92 152 114 4 11 98 13 54
3586 54 -76 94 287 3 86 261 147 -147 50 173 17 79 -114 -166 80 199 101 -129 -65 -122 96 -1 -79
3609g9O8K7o4O1O2K7j78K18j44j24J43p7K19j78M2J18k59R3l8R5L7n15L05J01
3633d0J21j07n2L90k74J4p1Nk6j5K23k53o6L33j1k17n1J58k7p7K74o2j12m4o3
3658e0J95j25j72K93j69j15j44K39J86j13j11k0oL02k4J4p4o4J63j67K94m87O3
3681i2m2J10J55q9N7j95J73j69K46k13P2p6n5j5J76j06l3J44j96L70m30J94k40
3704b54M50k85J13k14L79l80K98J65l37j0m6J91nL2j01j22p8J33J28j46n7K84
3726A38n8k3j43O2P5j76K22N3n6j66J34%M5p8j72J32R3j38j58P0M1J58k71J85
3750c1O7Lj69J44n0j2j11J90pj00K96q0K0o3j32K24p8j3N1k4n3K09l43R0J38n8
3776A08l53K74q3M3j23J47j30M7J61k33K36n9j78K91P8l34J72j39N5N7j75O5J26
$$ plain form
3609 -79 -11 16 -48 13 75 102 -76 142 -2 -126 17 -60 159 -19 23 141 -118 -25 -63 32 69 -446 -141 -40
3633 -40 81 -26 -78 312 38 52 -19 -14 -40 -55 168 -85 -151 182 171 -46 -97 61 34 -43 231 169 57 13 -50
3658 -50 145 20 -152 141 -28 -143 -287 -48 138 25 -86 -106 -112 190 166 180 106 42 205 38 332 -155 -92
3681 -92 -134 -24 131 42 99 -96 77 -92 154 -59 13 -63 -118 -133 43 -63 -96 48 -148 222 -208 -14 -254
3704 -254 196 -89 24 -190 189 -191 107 272 -65 -75 -121 70 65 97 -4 -126 -204 -71 57 -89 -146 138
3726 138 80 57 -86 -24 51 -125 97 150 94 -72 62 62 107 29 -143 -11 82 -56 -214 -144 -103 55 -216 -31
3750 -31 36 39 -130 14 -36 -48 -159 31 24 -76 220 140 160 97 -35 189 111 98 149 125 72 281 -62 28 166 108
3776 108 -245 29 -54 -11 -134 13 -117 -70 91 -142 94 35 -143 148 226 -108 64 -75 -20 37 -138 -73 53
3799E3Q0j01L17l16n1m1K71j76j2N8k07J58K8l69M11j45j21K78n5j42P9J03Q2
3822A82k85P2j82K71O9k48K29j31J92k90j77M39m9k58J32J1J21j13k9J86j56k70
3844b84J93N7j52J31L73j72k73J24nJ60j79p1j02L71j20l41J78K2K34k37o9L44
3866A82j34NN4k84L53l00K57j78J5lp9j09L29j41R9l3J49j96J0J46m35L58j81
3889a16J46J66m10J68J18k0j73j7L02j13k1m8m4L3P5j49K28p5j82oN60l12l90
3912b80L42J33q3j2j99L3j81L9L4L72j94j70K17l3j89M34k45o7n2J87j15L34m37
3935a32K25j92M3O9m9n3j42J49k45M66l2k21p7k2O0n3P5Q1J33M2q1P0k90M28k51
3960Ar0L6J18j31J1P3K71l71OJ19k65J68M7K14m4k95M1J75j66J45%k5R4j28J32
$$ plain form
3799 53 133 32 349 33 -18 -59 212 36 24 82 -125 33 61 -308 103 -42 -163 115 60 -82 -3 100 182
3822 182 -103 -31 -213 58 127 -121 108 -23 169 -121 -298 141 92 -166 -34 -23 98 -15 -44 142 -14 -284
3844 -284 -91 -34 -186 -55 318 146 -127 -3 -8 152 -27 -98 -200 171 51 -290 -112 -90 144 -93 -162 182
3866 182 48 53 107 -177 176 -124 133 -45 -30 -33 -112 -221 108 -33 66 33 182 -14 -4 142 -293 65 -116
3889 -116 30 196 -214 -46 72 52 -121 -138 164 51 30 -18 -62 -29 46 -103 125 50 -132 -138 422 110 -280
3912 -280 62 195 112 100 -99 -66 -247 -208 -174 198 4 -166 51 18 -171 263 18 -49 -101 86 -29 305 -132
3935 -132 93 -99 -56 13 -36 -89 -231 -82 -327 139 107 -114 -191 -213 -153 -206 -131 -50 83 125 44 114 -176 252 1
3960 1 -89 -53 65 -66 -55 18 289 -82 -76 43 -222 -54 -7 207 163 -132 -91 84 -82 63 63 38 132 4 136
3985A36j17O8k37o7J50j2k8J41m03J68L47l23L03k61M6p8K77r0o8j50J99K11k84
4008g2J94j0j61M9p4M37o40L72m0j46J14n9K35l39M19m03J73n9r1Q0j57K12k1
4031A3k19R9L10k15oj77L34k59J19J26j5n1R1j68J73j24k87M33m76K67J3J29j39
4054b9K2N2k11L02j57l5R5r8N8o9M0o8p0J98j50K35j15J33r0J48k75N1J0L47n13
4079a89K3K75K6n5j91P9J66j06j67L75m33Q1J6J93l51J82m1K99k51R3k07OM46
4102B69l57J31m2O8kj63L00k75PJ65o4Nnn9J28K68k91l05J21L60k22J78n6j02
4126E7k22J85P3R8l40K07k53N29k75n9r7K09j84M6J55l76K80L3K5l10r2K58J61
4149A08k86K12m7J63j04n0j87M34J02j70j77P6r2k54P6L41J58j66q7n2M8l21O
$$ plain form
3985 136 19 87 -150 -217 -67 -79 -107 34 -369 -201 146 -177 126 -135 -89 -167 110 20 -48 -198 1 212 -72
4008 -72 122 112 -49 0 -74 363 -277 95 55 -91 23 -36 199 -140 279 -124 49 -10 -101 -21 -178 34 13
4031 13 -206 -107 203 -12 -18 -195 139 -120 -1 125 110 59 150 -18 155 31 -256 177 -299 -32 -19 110 -29
4054 -29 -7 45 -166 136 -21 -56 39 -59 -1 -70 -30 -98 -168 30 -120 115 0 133 43 191 -84 -33 -23 324 -189
4079 -189 -166 109 135 80 -111 -32 134 28 -139 236 -197 -116 -100 93 -258 -76 -117 182 -69 24 -183 -177 269
4102 269 -88 43 1 69 67 -96 204 -71 -64 101 37 42 37 -22 106 374 83 -222 -101 259 37 215 159 57
4126 57 -165 20 93 191 -149 58 -195 334 59 0 -97 112 -72 -26 129 -247 33 66 91 -219 -311 -53 108
4149 108 -178 34 -13 150 46 -4 -191 243 345 175 -2 74 -18 -272 -196 145 303 137 50 -2 46 -275 -269
4172b69L28o8n2j27J44O9J4r0K08J2j75n1M64n62K24j15n6O6K48k67q1K12j70
4195i4K4%R8mj36k02M75m10K21Oo9J18J60k88J98l4m8R0j17j49M33k13Q6o6j62
4220h3J75Q8m79K97J07k62K66p0r9K2r5J33R6Pj65K3K89o1l26k32K94j56J04m4
4244a71N63m60N2j36N09m51j06J70K89Nl20k1Q3K5J6j28K70N5m05K58p2j34j16
4267b25O6K87o4r1r9J10J70k68J84o7k26n2J57K69j19k29K54j10o7M9J42j36j54
4290b19K37N5L9r2k11K39N6j42n4J60J46k46k71J19km1j62M56J95k70m7J27o1
4313A1n0Q1j74L09ok69J58R2k69J30Q4%k44pL6K94J06m78K73J57m76J19K29L01
4337D07l83M5n0M7J9k6j63J16J5k21K70P1%j94J83j00p3L9L1k24K01k03J15n5
$$ plain form
4172 -269 59 -9 -61 -188 -44 25 39 -51 157 169 -6 -57 407 -155 69 -46 -102 -36 212 -55 -136 76 -94
4195 -94 -70 -70 28 24 -112 -314 161 -249 -28 -22 -91 27 187 -101 97 63 15 105 -12 -161 272 59 145 79 -83
4220 -83 92 180 -299 -2 105 -157 109 39 -60 -38 -133 0 96 103 -62 -39 250 189 -137 -369 -75 -231 -127 -171
4244 -171 392 -68 -16 -152 357 -94 -200 -30 259 264 -56 -77 6 31 47 -81 189 244 -161 97 25 -109 -225
4267 -225 -159 128 64 -27 -126 -16 154 -114 70 3 -223 -275 -118 151 32 -197 57 -53 -120 -71 71 -65 -219
4290 -219 18 73 112 20 -191 48 104 -38 -92 68 214 -32 -303 -184 -186 -227 -389 67 262 -8 -55 72 11
4313 11 -39 42 -132 177 171 -98 60 152 -117 13 97 97 -147 -154 -118 176 282 -196 77 234 -242 -123 106 407
4337 407 24 69 19 66 85 59 -104 12 27 -194 76 147 147 -47 136 36 -37 2 33 -191 10 -193 -78 -133
4361a33Q8o9J59K16k22q9J61j68N3J82k3l20K66j74R3k66L20k04J86j14J8o1R3
4384hN8j91J01J83j89q8J20N2M4k31O9j15K60N4m91N22j11k2o4R9J70k56k46K20
4408f0M46j80k69j33L60l87M8J19J01P7k5j02K84l27r4J45K22k90j16R3J60k7
4430D5j3J1q0J99n32J75K28J70k97o2M24j07k57J54l0Kj13r7L82l40K02M2j35
4453b9Lk28L74j21J04k47J47K2k1o9p1K8k8j22K91j02rj2J51R6L1k65R4n7J4J63
4479A37k43K88rn38L91K30k12j56P3K32j45l03L00R4j95j40J47R0l01K22K72k43
4501iK35k56J39k30K2j04K75M9j81N4J5J79k32j3J95k3j78r1K40j40j64l7J92
4524f3K32j6l13K51K4k83K33M6j64j49J63q7L00m29J27J94n7n6K7N5o2Nk36O1
$$ plain form
4361 -133 -45 -114 45 261 39 -50 111 -57 -4 178 155 -165 101 -73 20 -246 74 -130 56 -58 -40 -101 -8
4384 -8 50 -141 -40 143 -46 -134 -14 38 82 -149 -80 -195 65 119 -372 150 39 17 -47 52 222 -34 -280 -60
4408 -60 386 206 -63 -196 164 -223 -175 -56 45 122 97 -5 279 -48 -142 3 225 -65 -181 -88 72 45
4430 45 32 43 -37 162 -370 -195 33 203 -94 -156 268 161 -96 58 28 30 -83 -180 202 -138 64 106 -29
4453 -29 -26 -254 120 -1 103 -144 3 25 4 -65 -136 -108 -136 -258 33 -69 -78 -90 61 157 188 -77 17 -40 -26 137
4479 137 -106 182 173 -365 26 256 44 -112 -39 193 48 -255 45 139 -56 -196 -49 41 -260 -38 234 -9
4501 -9 226 -30 109 -121 -99 -203 72 121 -60 -6 9 188 -44 -57 138 115 -63 -154 86 -54 -218 -255 -63
4524 -63 169 153 -160 91 115 -168 65 111 -53 -202 -39 -126 174 -255 -128 66 9 -47 -20 35 -27 -22 -258 -197
4548a97K40j01j10J87p4L6J16J2m5j20K3L51m09k64M34q7L9k47O3oJ37M1k10R6
4572i5l4K16k71L89l71m0J76o6K45k27J05n3K22k80J08J52o4l16o9L50J14q8l3
4595G0J65j07L2m45L68J43l01n9L75j06m35J07K75k60QL45%l18j67L04J72k69
4617a03Q4j56K95r0m6J0j02J75k0j26r0K56q5k90N54j96k85M4K53jj02M8L90m19
4641bJ14O3k05j8Q8K3M8J2j92k19K26P2j46n8K69K5l34J02L23m36L28k8J38q5
4665A08J32l80J32J23j19NJ20J63o16K45J92j96j85L71k45J17k17J72J00k9N8
4686E1j71J77J52n29K10M0J46k62K62l6J61l97o9M14M7k77J12J42j99r4N6K63
4708A99l98J26p8J68k9j90J62%R6mj32J2K68j66m2J22P6k73Q0K8m0r8j4J64nk16
$$ plain form
4548 -197 43 -58 -168 19 -55 -19 97 109 64 -56 -33 318 -91 -355 79 -8 31 -216 -153 -159 -22 19 -191 -95
4572 -95 -129 87 -184 205 -166 -206 -30 -96 149 -78 27 -26 196 -84 24 176 112 -204 -273 77 191 103 70
4595 70 235 128 160 -285 83 226 -75 -134 241 135 -300 -193 82 -178 -170 175 175 -143 -310 -6 166 -103
4617 -103 -19 -175 120 30 -16 -6 -108 67 47 -79 -169 87 2 -288 266 70 -215 -171 82 81 -21 27 417 -2
4641 -2 112 175 -30 -48 40 63 111 123 -69 -288 -62 10 -136 -194 75 100 -234 -132 191 -245 83 55 193 108
4665 108 240 -140 -8 115 -4 1 121 284 -332 -87 105 -91 -276 95 -150 -33 -250 -78 22 -7 51
4686 51 -120 57 209 -320 -110 -70 76 -186 76 40 201 -196 -265 149 196 -81 31 173 -26 -120 -64 199
4708 199 -199 -73 -151 17 -12 -202 -40 -40 56 52 -80 -68 200 34 -8 114 190 -83 -3 25 -15 -113 -127 37 32 -184
4734a84K9M13l87J81j17K27l23k26K29K61n4l81K18J09J7j07K64j78J1l4j46L26
4756A48n7J3l6J32j29j79QL57l90j28M9J62L4k42K16M16k84l20M77n3m23J15J88
4779G4J23j98l5J62Q0k07j54J03l4J46j39K10K25o21J32J48K14l33J12o4N9K5
4801B8Ok7o6o3K56Q7j42l53M9L2J67l1j18J67J83l09J15K19j25l15J67J36p1l9
4825d7L9R1p8J22M4n8J53j82m3J75j95O3q3K57k53r5J73J38j31j66J95p7k10J46
4849b2j91K55n9O5k85K84Q4k80O0Q4Q6j50j09J37J35j00r9J59N0j39r3J37L8k29
4873a82M8L03m0j10q6K67q5j20J41k11L28m29Q1L8K94k97J20J22j05n4J1n2Q0
4896F2l89K28NJ92j76K65J47m46J7j12N20k7l08j01N0J70O9l48J50J86l83J09
$$ plain form
4734 -184 -155 258 -129 52 -65 162 -161 -387 -158 103 49 -332 -114 -5 12 -95 169 -9 2 -32 -178 148
4756 148 91 104 68 200 71 -108 -100 257 -133 -261 -212 -50 -16 -258 -42 374 90 -230 247 194 -229 -114 74
4779 74 197 -1 -36 126 206 -1 -155 -52 -86 60 -79 131 356 -265 -133 15 229 -104 8 -56 3 28
4801 28 34 7 -59 -122 134 221 79 -274 -225 -193 -26 -57 -175 -8 175 -134 -19 200 75 -240 -73 63 -8 -47
4825 -47 -8 83 5 127 171 113 266 84 41 216 21 84 1 258 5 -90 83 221 90 -76 119 42 -168 -22
4849 -22 -213 42 -17 48 -237 47 131 -149 -89 -5 81 -69 -178 -41 94 -6 -105 54 104 -35 -128 9 47 -182
4873 -182 -134 169 129 19 -67 200 115 -5 136 -75 253 -176 -95 -57 237 -60 60 182 77 23 34 -18 62
4896 62 -327 -99 -94 98 -78 187 334 -112 -95 -207 313 286 -22 -123 -73 97 166 -182 -32 154 -229 -120
4918a20L10j16k7o3k02M66k19k06L20m7n3n11K85L77l43R8J23J77l79P0L13j05
4940A48j21n5K54k50j70K34K42k67k3k92L06J24k87K39J9k15j7k80N23K1j33j1
4962a1k17J44K4L8P3j79K42j91J21R0j28J8K50j20k57R4J10mj8k03K18j19N1L5
4986F1Mk27K4Q0J95j96k45K41Q4J44n34K07M27m1k71J1Q4M2j72J59J15l6k24J49
5010H1j14J32m85N04J02q6l30Q2K35j47R4k50J09k2N4oK25j98m6J21J43j76r7
5033g5K5o8Q5O6j74K00j39%J83R5k14j4j54K64Q3m26K10K94o6m29O8K13M8j75
5057a00J16r4l6J69k13K47j19j18J23o7K53k03j48N42k53k61J86O4N8l36k6L34
5079A18j14m8j7L10k05j26k27L63j24R9k77K18J33k81J43j23K35p1ol45N50m11
$$ plain form
4918 -120 190 74 47 -16 -218 248 29 -177 143 96 43 -468 -183 194 -149 -51 72 249 -130 -60 253 148
4940 148 27 -28 226 -24 -194 40 282 15 -8 -300 6 130 -157 82 101 -114 -131 -411 112 133 0 -11
4962 -11 -228 -84 -60 -22 51 -128 114 -77 44 134 6 24 274 154 -103 -9 101 97 79 -124 94 -25 26 61
4986 61 65 -162 -138 -58 137 -59 -304 -63 21 165 -369 -162 265 224 -47 -36 48 90 -82 77 192 156 -68 81
5010 81 -33 99 -386 118 220 134 -196 -114 121 -26 68 -182 -73 -95 -41 -47 178 -20 -66 55 198 22 -75
5033 -75 -50 -118 -33 33 -141 59 -80 -80 103 198 -16 -30 -184 80 163 -263 -53 241 175 -254 -186 27 75 -100
5057 -100 16 -78 -114 55 -158 89 -30 -148 -25 -92 161 -42 -190 352 99 -162 24 88 146 -190 -216 118
5079 118 4 -44 -61 249 44 -82 -309 54 -70 29 -248 -30 103 -178 -35 -158 77 6 0 -345 205 -206
5101b06K79Q3j85Qnl08N34m66R5Q9o7J43j44J84j39j7j74J98J30j22m6K1K08l26
5125b33K27J63k65L7p8K32k0l24K47J65l1l66K44K90l33k7L78j82j91O6l05K81
5147b5jj34%L30m4k40Q1M32m26j54R3K87Lm90M03j3K8j32l7K85m07J27J63M6K7
5172B02l69J29K16k94j99K72L2K4L1j25j38L09j93J81R3l42K04l6J08p7j04J81
5194A05Rj19q3K22J75l10p9J27P4k76K16j69K53k10j09R9L50k88j79K35N4p6j09
5217h8J00K79l93L59J04mm06k19L01K51m67m0K53J14j20j29L38j82r3pK57Rj72
5240D5k01L48%l63j7J48J58j02J6K75k21j66k9P1N7Rj00K57j43j37l0K26n4j95
5264a48K40J70k10j13q2L08m7k70R3K21K68l70p9j04p1L82n63M00n3j48J30o0
$$ plain form
5101 -206 73 156 -29 -21 -26 -334 200 -266 -171 -82 -149 -6 -150 34 -105 -122 -296 -98 32 -90 -136 -115 93 -233
5125 -233 -6 157 -108 -71 -149 83 63 -261 -14 151 120 -246 -2 288 -45 -72 306 124 -67 -1 -306 -25
5147 -25 -26 -160 -160 170 126 -114 -33 399 -27 -181 -88 199 202 -288 115 102 130 -2 -39 246 -161 -34 129 175 202
5172 202 -167 -38 178 -116 -315 -43 -11 13 44 -81 -219 90 -103 78 171 -171 33 -3 105 28 -76 105
5194 105 114 -5 -88 134 309 -1 -80 47 121 -155 61 -108 145 -65 -174 -75 275 -13 -192 43 97 21 -88
5217 -88 12 291 -102 257 361 357 -49 -268 33 284 -183 -223 30 144 24 -105 233 51 -42 -49 208 217 45
5240 45 -156 192 192 -171 -188 -40 118 16 32 307 86 -80 -109 -38 19 28 -72 185 42 -95 -125 101 47 -148
5264 -148 92 262 52 -61 -143 165 118 -152 -59 162 430 60 -19 -123 -194 188 -375 25 -28 -176 -46 -106
5286a06K95l20J91n0K16k00RK82j97j13J6K73l49O7j78M39m4j69J20j49J11k95
5308a51j56K52Q3L2j15K57k20J7J13J07l78J39k1M0J38O2k10j4M74l98K8Pl2r2
5332c8m3j5K20m6j61M34j02l72j21K80L44n87J46J56j35j71J83K59O1m59K28O0
5354A21K7m24p5L50Ol1j34L03J16m08J34M16l14k28Q1Q8q8J5p7P7KJ8J52M0j13
5379E4l2r5K51J74o00L35J28k4l93J26L4J18j59n6K53j07j00j1K94k25PJ63K29
5402C64l82J34k72J67J21l55K67L03q1l09J34K9R8l25J28J75k5m40K02K19j14
5423C8l1j52K76R2p12N32L28m36q7l8N13k03l05o2K86Rk64K61J82l48o5K58M1
5446A13j24r8J9J59N8j03j22L1K34k78m6K78j49j52n6M09m6k55o6K51L9L8n1J26
$$ plain form
5286 -106 189 -131 60 10 226 26 35 317 120 7 23 296 -53 14 -164 275 231 62 182 33 144 -151
5308 -151 -307 -55 28 60 -55 202 -18 -1 112 219 -159 -20 -41 -1 137 199 -11 -25 449 51 79 86 54 -38
5332 -38 -81 -96 124 78 -83 351 249 -123 -244 36 380 -207 -61 95 -40 -211 -28 231 292 -167 61 121
5354 121 148 -276 -351 -1 5 -26 -160 143 259 -149 -15 401 87 -141 -60 28 -60 -45 -122 -45 -43 -25 127 167 54
5379 54 22 -73 178 352 -248 87 215 191 -202 -76 -42 76 -83 -139 114 7 -93 -104 190 -35 -28 135 364
5402 364 -18 116 -156 11 132 -223 44 347 266 -43 91 120 218 -107 21 196 171 -269 -67 152 38
5423 38 7 -145 131 223 -489 43 371 -65 -152 -190 323 120 -185 -247 39 48 -216 45 227 -121 -186 72 113
5446 113 -11 -109 -90 69 127 24 -98 -67 167 -111 -157 121 -28 -180 -236 173 127 -128 -194 57 96 134 83 209
5470B09k30l5J57j24O8j65K8j02K99j93L79j57j5m06J79L20l8k70L20k18J00k34
5492a28Q5J67L8m21J37J39k14K29oM8j71N4J14J10j80j48kK44p9p7R4K22k91n9
5516i5K41PQ9k22L6J97j65k55J35KK0j34M8J27p9j92K99p9q5j52M73Q7j99O0k12
5541d8Q0j14J12M02k96o2j33l07M75k28l0P3J25J69l99O8J67k2l20L56q3J5K9
5564B9P7N3l44j12K93J88l02M5J17M32m41n7K80q2l61j11O9L24k56o7K45J01l82
5587b62L7J74J41j59p2J81K7k9k40L54L1k86m6J68K16k89j0K10k4k47m0J17J64
5610A16l92J29N37l73r6m8L11K4k10j82N25n7j35q5q1J37k97j8L65q3k63L72J
5633A97j07j62J64J61o5l20P5R2R3j90J00k1M5k00J05K76R1m09o2K86j63m7o4
$$ plain form
5470 209 -21 -56 101 -23 45 -120 -92 -194 105 -88 291 134 119 -287 -108 212 174 -96 224 6 106 -128
5492 -128 -43 124 162 -259 -122 17 -197 32 26 74 -97 -43 71 181 1 -147 -149 95 16 -61 33 255 -36 -95
5516 -95 146 153 242 20 56 253 88 -167 -32 -30 -10 -144 -96 31 -48 -240 59 -20 -105 -257 216 303 104 164 -48
5541 -48 32 -82 30 432 136 74 -59 -366 109 -119 -149 -76 49 218 -181 -113 54 32 -288 68 -15 0 29
5564 29 106 159 -185 -297 -4 184 -118 -73 44 476 35 -22 258 176 -185 -296 -227 97 -159 -226 19 120 -262
5587 -262 -225 -51 90 -69 -141 40 67 38 -202 152 183 -103 -149 19 235 -54 -64 146 122 -125 -165 -48 116
5610 116 -276 -147 390 17 -79 -127 184 208 -2 -184 341 284 149 64 -17 120 -177 -195 170 87 -176 196 197
5633 197 90 -72 92 253 188 -132 -57 35 128 -62 38 17 62 -138 -33 243 334 -75 -137 149 -14 -61 -125
5656a25L73l73j78M42j32R7j38k0J23J26m61J19K16p7k7j48J25j03j90K67J68
5677H4Q8l30N8K85n7l77K03J07Kj55%J0m5J55r2M90l54k58L8K8K00l30J79L12
5701B41j93l01K63L50m6m56O9K45K58n10j94K27j5R2M8N9k39O7k45K28K21k74
5723a05J07J7j79L37k94K94L4k64k7O1K57j71j91L40p8j20N6J38l9l20j9K83j33
5746a6Q5l22N67j91l90K72J56k30j01j29K76K38k84r8M04j41m3R0Qj60k25J47
5768h7K20j24k07J48J82k23m1J67k2j21K21k07K30k08J10k68O57k63l23J50M08
5789C99k82k24K80N1J07o28K64l9K1j02J01J45n0m12M05J7L7o8o1Kko3J32j62
5813a32Q4J26OJ56j71r7mJ54l38Q4O2L63l97r8O5K16l33L72j95M66m39n3J99k0
$$ plain form
5656 -125 248 -125 -303 139 7 104 -34 -54 69 195 -266 -147 69 -8 -35 -183 -58 -161 -351 -84 84
5677 84 172 -158 -100 185 128 -249 -46 61 63 -92 -92 -82 -127 28 -64 426 72 -186 -148 -120 80 -250 -71 241
5701 241 48 -253 10 360 314 -142 -73 172 430 -80 -274 -47 -62 30 78 137 -102 -35 -280 -52 169 -105
5723 -105 2 19 -160 177 -117 177 211 -53 -80 -19 238 67 -124 216 138 18 74 212 173 -147 -166 117 -16
5746 -16 69 -253 314 123 -267 5 161 -69 -170 -299 -23 215 -69 -167 237 96 53 143 151 -9 -234 -87
5768 -87 133 9 -198 -50 132 -91 -132 35 13 -108 113 -94 136 -72 38 -230 427 164 -159 -9 399
5789 399 117 -107 173 224 331 -297 -33 -72 -51 -153 -52 93 43 -369 36 53 90 22 -39 -37 -39 -102 30 -132
5813 -132 -48 78 84 240 69 -28 -32 122 -216 -132 -70 293 -104 -202 -137 79 -254 118 -77 389 -50 -103 96 76
5837G6r6j34L49R1k41j4n1K60l20r9L61j19m5J0Q5J8k68J10J58O1n7k54PK32K2
5862A42n30J96M47k38l18L56J48k7l34P7N06m83j51K25K65l97J11R7R4j8l35L00
5884A33J33k01jO5K13m03l00M09R1k38o5J83r3J4P0r1K48j2k73K15n7k33K02J21
5908A30k38R9p5n6J07nl9j18K55k28J83j14K35k01j99K88J58k21n3q2M09j32j43
5931d0j35J24k17J02L19p4m2l15L81j24M7j88oN56l03j43J86R1j82K2J81j20J65
5954B85j60j82K12q5k14R9J09J23k90K3K56k25j26P7O5j12q8K78P3l14J90J04
5976I8l4j88J37P1K14l82J26j43J47k89L72Nj51J52k03j2N9q0KK5P0j75J8J63
6000Bj07J24J1KJ41k94l0P1N48m79r1J86J23k61k09L33P4o5m9J56j94j38k6L17
$$ plain form
5837 76 -20 -154 195 286 45 31 -20 240 -80 -179 182 63 18 28 113 131 -137 -27 131 192 135 -119 -112 120 142
5862 142 -388 -192 255 17 -301 55 203 176 -158 -81 425 -58 -209 16 281 -116 -5 92 186 168 -167 133
5884 133 266 65 64 129 342 -61 -361 48 139 -99 -164 19 -74 -60 10 -81 167 155 -118 97 40 -193 9 130
5908 130 -108 -9 -84 -140 -33 -38 -77 -195 60 -168 15 -99 136 -65 -264 24 182 -39 -92 -174 235 103 -40
5931 -40 -175 -51 -268 -166 153 79 37 -278 103 -21 26 -162 -168 388 85 -58 128 219 37 59 240 120 285
5954 285 125 -57 155 70 -144 -45 64 187 -103 -80 176 -49 -175 -98 -33 -145 -233 45 118 -196 -6 98
5976 98 64 -124 13 84 298 -84 42 -101 46 -243 129 134 -17 135 -68 -80 -21 -101 -99 -74 -4 -179 -161 2
6000 2 -105 19 30 32 173 -121 -151 -80 468 -11 -102 84 207 -54 -263 70 144 79 30 186 -8 -146 -172 145
6024A45j02k72J33mL64m44j5K55m9J68j62P5J15l62J56j85K45R9j64J58j33j73
6046a52J6K88k72Lm0K99k9j51q2J52O0k76J39m8j07j4J92Q0j31k02J72L91k69
6069A9j37n9J30o4jN4J24J26j47n7J96n1k4j13P7q2l8J19oq7K6J71k6%j54k16
6095b20L70m8l21J19J45L3%j44J53k12Q2j36K72Rk00J54j5L4k02K57j0O7l49n
6119a67K49J9n3l13L36j07o3P2K5r3K0M1J83o9k22L64j14o6O9j85L2K22q9j22
6143c1J29O1q6j00J23j57%qL82j17l49J9K76M5k62j72M95m53J92J3j37L8k14M55
6167A42k6O1N8k02K38j09m61L41J35l6k19K17j57j24J2L52k16Q6j69N0M31j70
6189B34k48o8L08k76J06mj10J90k06J15K89j18l02M2J52j17P7J52j0j82LJ20L7
$$ plain form
6024 145 43 -229 -96 -100 264 -180 -195 60 11 179 17 92 207 -155 1 -184 61 160 -4 154 21 -152
6046 -152 -136 152 -120 -117 -157 142 113 -38 -120 32 92 -184 -45 -93 -200 -214 -22 58 -73 -275 -103 288 19
6069 19 -118 -177 -47 -111 -112 -58 66 192 45 -12 184 133 109 -4 73 -9 -47 72 66 -21 5 176 150 150 -4 -220
6095 -220 150 102 -219 -100 45 78 78 -66 87 -125 -43 -179 93 102 -98 56 41 75 -127 130 120 187 -162 -167
6119 -167 82 101 48 -265 71 -36 -99 -27 -2 -95 -75 -34 149 80 -142 222 108 42 111 -74 -42 180 91 -31
6143 -31 98 159 73 -27 96 -61 -61 -69 313 196 -153 -134 142 187 -75 -247 248 -205 -13 0 -137 -99 -313 142
6167 142 116 177 235 33 271 162 -299 42 177 141 -78 139 -18 -142 -130 222 6 92 -77 -27 404 234
6189 234 -14 -82 226 -50 56 52 -58 132 -74 41 330 212 -90 -48 104 -13 64 216 206 24 27 147 184
6212A84q5j61L14Nl59j51L15R8k29j93K79K0j71L0k7K70j92p5Q5J16R7l84L51
6235A37j91L07l74K0J60J0L6p9R0%j43qL15j58k04m0J6L19l07J68O6o4j09J11
6259G8j2K67n06M97J9k42j30j40K26p3o4L2K16l31Q2q1J91q5P7j06j6n0J29J73
6283A51k87L6J60n1K52k55k14K00J78q9l1K24k76k05J62J02P2k06K0k4L01n32
6305c12K11J62r7J58k34Q9L92o52L03J51j08o2k45K53mr5J11R3j0o8j72j01J46
6328i1k07Q2J93r0k16L40O9j9j5qn4r3J76l1J00p2M7K2n1j96O7j05J68K86k95
6353Gm6J71l28J89K7lJ28l1m25J86J1J36O9n1K18l83J69j8j44k7J00l0R7J24l73
6378b27J86K16m0j06J03M8j31q2j14K18r3MO1r0K7j46L30K4l31K9J87Q1j71kj40
$$ plain form
6212 184 99 -62 252 257 -102 -253 62 160 -69 -262 17 37 -134 -104 -131 139 -53 -128 -43 73 170 -214 137
6235 137 -54 253 -121 -101 59 69 105 26 116 116 -27 -35 280 122 -82 -122 -106 213 -94 74 140 76 -33 78
6259 78 66 333 -173 324 343 101 -29 -169 57 -16 -80 -48 168 -163 -81 -162 29 -56 21 -85 -101 -151 -22 151
6283 151 -136 -100 60 9 261 6 -208 -8 170 81 50 274 -2 -207 -45 57 129 -77 -57 -81 220 -312
6305 -312 -101 61 -36 122 -112 -23 369 -283 20 171 63 1 -244 9 5 -90 21 114 104 36 -136 -237 -91
6328 -91 -298 -216 -23 -113 -329 11 80 61 46 38 -16 -109 67 36 136 64 111 133 82 -114 -47 -152 16 302 7
6353 7 -39 132 -196 -7 20 17 145 114 -311 -125 -114 22 91 40 258 -125 44 26 -118 -145 -45 -75 22 146 -227
6378 -227 -41 175 135 29 132 180 49 -33 -147 71 -22 -18 43 -47 -20 -166 164 188 -143 -114 73 154 -17 -19 -159
6403a59J96j22n8K07j06j50N4J06L16l78j30L70K0l1n3L7J95m68r9K84J10r8K14
6426B57r7j92L3j07M08l06j59L5K1j8J10l00L39K03k52k6L15l48k5k59N72p9m6
6449G9k99K58k1j54L21n1j3k59j14L38J25k09r3K16m21K6L3L56m2m5p5M7M9k33
6473a81LK14p2J9lk0K06q4k45N43j95l74K60L2%N6l73K22K41j69j89L08j62k94
6497b57J29K69k55o2L63l84K52m6J66r6j98J53K1M17o01K03k02J43j30JO1K03
6519A50k26k21K08J49q7j97J67K06k79K2J82k57J3J03l04L31K45k38k0J15J38
6540B00k37j12L34q5j05O1Q9j53l2K68J8k35K00l48J93j22J15K16l41L74m48K54
6562A04j73K20k84K92j7l24Q6O0J15l09J65p3O6OJ84j07M7q3QJ72r9l05K34l8
$$ plain form
6403 -159 37 -85 -143 64 -42 -192 -138 -32 284 -94 -224 146 166 135 82 119 314 -154 -253 31 141 43 257
6426 257 160 -32 1 -106 302 -4 -163 -128 -107 -125 -15 -315 24 227 -25 -51 264 -84 -109 -368 204 125 79
6449 79 -220 38 17 -137 184 133 120 -139 -253 85 210 1 -92 124 -297 -271 -238 118 76 31 -44 3 52 -181
6473 -181 -178 36 -36 -17 -20 -40 166 82 -163 380 185 -189 71 103 103 159 -214 8 249 80 -109 199 37 -257
6497 -257 -128 141 -114 -176 187 -197 55 9 175 79 -119 34 55 472 -129 74 -128 15 -115 -114 -53 150
6519 150 -76 -297 -89 60 -27 -224 -57 149 -130 -108 74 -183 -170 -67 -371 -40 205 -33 -53 62 200
6540 200 -37 -149 185 100 -5 56 145 -8 -40 228 246 11 211 -137 56 -66 49 265 -76 298 -150 104
6562 104 -69 151 -133 159 142 -182 -96 -36 79 -230 -65 -138 -72 -66 118 11 58 -25 -17 155 56 -249 -15 -53
6586e3L9p8K8J72k03J42N8j02O3Q4m04K40K09R3n17L70k30L30m96pL99r1j69L47
6610B24l9j7k69J29j18J91k18L9K6k4R8J01K4l97L77j80n5J18k4o7K16k47j3J57
6634C2j1l7K6J92L2k81p0K47j40p8K92k81J63m27M64n4Rl41J50R8n2m4N0L16q0
6659A75k28j77J84O3L0j49J73K57k46j5k29K54o5j48J18M17m38l1J18K8k82J50
6681d1o9M3J99k47K57J6r4p2J83j96k7L1l0L65j86m19K02J87J13m93K95Mj79O
6705a52L60j35j58j27K64J10l44K6J50j27rP3J44j66j58L52k4k0j15R5P3j31j56
6728a75L20n4j6n9m2o9Q2m5n6Q9J78j58O4P1k49Nj32M73r3j10k25K80k6j11J87
6753A29n0J51m49L47J2l5r6j36M1M3l17J17K52M0J05N3j55J17l07J28K24J04j90
$$ plain form
6586 -53 -14 -92 -64 108 -95 47 105 3 66 150 -254 -14 195 288 -229 141 -89 241 -255 -262 137 46 -123 224
6610 224 185 168 -101 28 -90 101 -117 -78 -52 -76 22 123 147 -250 127 -53 -108 10 -14 -81 135 -112 -125 32
6634 32 21 -16 10 202 234 -47 -117 130 -10 -88 204 -77 86 -341 123 69 78 -263 -113 -15 -67 -111 -61 255 175
6659 175 -53 -230 -46 17 47 -102 71 328 82 67 -162 92 27 -121 -3 414 -24 -55 63 91 -191 -41
6681 -41 -110 -67 132 -115 142 158 64 -8 175 -21 -48 -17 -47 318 132 -287 -85 102 215 -278 17 21 -158 -152
6705 -152 208 73 -85 -212 52 162 -182 -156 -6 -133 -142 -69 75 -91 -249 103 79 59 -56 39 112 -19 -175
6728 -175 145 91 75 16 -26 -95 -13 -58 -114 -25 153 -5 59 130 -119 -114 -246 227 134 24 -201 79 53 -58 129
6753 129 79 230 -219 128 140 105 9 -127 -86 -43 -360 -243 9 49 154 207 52 169 -138 -10 214 318 128
6776A28p6m0J42k60j51J03L04q7l40L27r9R6j55N7kJ51j03m5M6k8l9K56l28J65
6800B2p7Q4p4k38L80n0Q8m26K15K50m7l19J96M8j59m5M1M5L1j31K45j86J4l1J94
6825G0P0l61K15OlQ7l32K20J71j97K5k06L67o6j17j13J96j54p5kL31J4l10J48
6849a6R9J14k59O7JJ81k48q5K53l1j46R9K5L64o04J61K17l74Q6k3n9Q4J26l1m
6874cJ69k52r0L76k54K2r4L64l31k73jN35J6k62p2L52q4k98K74J07N9l49J35k4
6898B2K37k21m8R7k57J22l1K04k53K8J31j24Lj71K23N0J19q6K5N0L0j32m7K14
6922A85j91oq8K64l37Q3P8J02k33j40K99M0q6Ml3J97j18j75J57nK3k19J30N8R1
6947H0r1j95M65l77m7m5K68j95O6j0r4J25j40N40k40l28L14r6J91j64l8J80k12
$$ plain form
6776 128 52 12 154 -106 -257 -154 150 63 -277 50 -49 47 -108 -51 -53 98 -5 -50 -4 -32 -71 185 -143 22
6800 22 -55 29 -45 -283 97 47 135 -291 -76 174 127 -192 4 52 -107 -152 -111 -66 -35 -166 79 -107 -93 -124 70
6825 70 140 -221 -6 0 -3 84 -248 -28 143 -54 -29 -235 132 66 -51 -164 32 -122 -197 -199 132 146 -164 -16
6849 -16 83 197 -62 5 6 187 -61 -146 107 76 -70 29 54 418 -186 -25 192 -182 -96 -119 -178 -94 32 1 -3
6874 -3 166 -86 -176 200 -54 -32 -126 238 -93 -366 -367 168 184 -78 -150 202 118 -180 94 201 260 -89 46 22
6898 22 259 38 -10 87 -170 -48 -79 125 -128 -100 31 -93 -90 -261 -38 12 131 45 70 120 150 18 -29 185
6922 185 -6 -12 -100 164 -173 -90 -12 90 -143 -283 16 56 -30 -26 -59 138 20 -155 2 -3 20 -199 -69 -11 80
6947 80 -11 -206 259 -118 -165 -210 58 -137 -71 -81 -175 -50 -190 350 110 -218 96 0 191 27 -11 169 -43
6970d3J00q0L77k97j47j57K44j38J23j46r7P45m94O7l9J8j73j65L84k68NQ2j0
6993a09l8l2J26NJ81K6l66j73L80j08l10L94P0m7k03Q3K56q8r2J09rk44L37r4
7017E4M2j84J4q8K48j08J80k18K44k77J07J01j48l5j69K69j11Q9o9J04o8J2q5
7040i6L45p1k74N1J72j46n2J25m6RP9j23j56K34J18j47L0J56L8j32J5R7k35q0
7064h9J46n7p6j05J97K1j41M8K1q2K04r3K31n1j97L4m4j2K59l79M29m01q9J50
7088g6J28j79K86k14r1Kj29M46l41j01J94q1K24J39j23j60J74O6m56K11L96q1
7110B34q4j29m5o2R2q0J48M6k97n9L94j56K11j38j67K05j53j22K11O5m6k20J82
7133C0Pr1P5l7K69k06M7J09j46j79J34J72j66j56K46j80Kqn4J3J21j15K71k40
$$ plain form
6970 -43 57 -23 354 57 -90 -247 -3 -141 -18 -164 -261 484 -10 57 18 36 -137 -302 82 -186 -181 -99 -109
6993 -109 -147 -179 -53 -48 133 159 -207 -380 0 -108 -418 -24 46 -1 -204 -121 135 47 -45 64 55 -189 148 54
7017 54 96 -88 -74 -162 86 -22 158 -60 184 -93 14 115 -33 -68 -237 32 -79 10 -59 45 -23 -11 -96
7040 -96 249 178 -96 -45 127 -19 -71 54 8 17 96 -27 -183 51 169 22 52 208 246 114 129 226 -9 -89
7064 -89 57 0 -76 -181 16 37 -104 -56 -35 -117 87 -6 225 174 -23 11 -33 -45 214 -165 264 -137 -226 -76
7088 -76 52 -127 159 -55 -146 -144 -273 173 -168 -269 -75 -156 68 207 84 -76 98 164 -292 -81 315 234
7110 234 150 21 -24 -86 6 -74 74 120 -177 -236 158 2 213 75 -92 113 -40 -162 49 114 68 -152 30
7133 30 37 -54 21 -16 253 47 94 203 57 -122 12 184 18 -138 108 -72 -70 -78 -132 -119 2 -113 158 -82
7157h2K32o9j39J27M2r9q6K34j29j46P5J03k10J64N9P4n9j48k5K60k39K73k41
7180b9K7j49O8O1J60r8j76q2O1N1R2J04J12k23j30J94R0k58r8J47J29m5k6n0J28
7205F0m2j5P3N9k19k33K93p7O4L7k58K37J15j85j58L64k77j9p4K82k3j43P2L45
7229B78m30q6L02q9J06k03o2L33J5j85K11J36l12k00J99J04j92K0O6j70J84j0
7251A5j7J99j16k15J41L13n38K25Q3J40o5l33L15l35L87l94J98K33k94K7j01J28
7273dK44k69k49K13j50K41J10j78j42K0j69M04m9j99k04K54M66l94l8K84L0l01
7295h0m1L39k02o8m9K69nk47l4K34J23l04J46K34l16RP0r3M9j77K22k57k8K22
7319A6j40L63k53LM8N4j6k60O8K46l11L6J61J10l70Q4J97J58j53n5j62O2J47k72
$$ plain form
7157 -82 150 81 -58 69 111 12 -74 160 31 -115 -40 63 -147 17 76 150 91 -57 -82 178 -61 212 -29
7180 -29 -2 -151 -83 -22 138 40 -136 -218 -157 -106 -14 90 202 -21 -151 43 133 -125 -223 -76 53 8 -18 -68 60
7205 60 18 3 76 135 -84 -317 -24 -101 -37 0 -258 -21 94 -91 -249 115 -162 -181 -255 27 4 -139 -67 278
7229 278 -152 -238 64 -25 81 -122 -184 149 164 -21 190 326 14 -186 13 117 -75 -55 11 -159 25 15
7251 15 -2 197 81 -134 7 320 -218 7 90 230 165 -168 147 -188 199 -195 3 236 -58 -31 -132 -4
7273 -4 240 -29 -278 -65 -215 26 136 -42 -184 -164 -333 71 22 -177 -381 -127 339 -55 -93 191 221 -80
7295 -80 -121 218 16 -52 -101 168 163 -84 -118 116 239 -65 81 315 -1 8 78 -15 34 -143 79 -178 -206 16
7319 16 -124 239 -14 -11 37 91 75 -185 -117 129 -182 -146 15 125 -245 -161 36 194 41 -14 -176 -114 33 -239
7343b39J28K51k37P7P4o9m23L85K80k62J06j04m0n2K40j97J32J30k24J86k61n0
7365a69p5J48J08r8J41p8J24M5m08K02J32J98k43m0O2m0J59j6k85L45j48o7j52
7388a55J89j8j0K0J18l94K50J89j88J17j08R3M1k44j47J78K22k0k08N4J24l4k73
7411b04L31Rp7q0J23n4J5j70J91j45O8r5J06K9O0k29M1j15J40J07k5R0k22O4J96
7436A54j40q2J6j7J53j72o6N8L49k65M2j01L2r7k4J37kr6J41J2J03L9o2m2l1J04
7462A43k37j0L24l67M3J32k68J46j99K08K04k82K52J19j07j56k7J66j16o0M7K07
7484A62k49J63l44K51lJ22o1j06K11J11n98J54K56k44q0M43j85k27J67L55k65
7505C3j19Qj6M81m04J18j02R5K6l4O8j13o3j8J33k50O1K6K40j28j93l5K90J45
$$ plain form
7343 -239 -111 140 -97 -20 54 -15 -438 -53 227 -35 71 -33 -73 -125 115 -82 50 180 -44 142 -119 -169
7365 -169 -244 -96 12 -86 55 -23 101 146 -262 -60 72 270 27 -13 49 9 168 152 -133 212 64 -3 -155
7388 -155 34 16 6 26 144 -250 0 189 1 118 10 103 144 -100 -247 -69 153 133 -75 -21 103 69 -204
7411 -204 127 136 59 -21 102 48 63 -107 84 -61 7 -88 18 47 107 -122 -81 -196 -56 51 26 116 -106 -42 154
7436 154 14 -68 -52 -69 84 -88 -154 -96 253 -12 30 -71 -39 -136 -160 -23 -25 -121 20 32 135 174 112 70 39 143
7462 143 -94 -104 220 -147 -104 28 -240 -94 -293 -85 119 -163 89 208 101 -55 -82 84 -32 -92 -45 162
7484 162 -87 76 -268 -17 -20 102 41 -65 146 257 -341 -187 69 -175 -255 188 3 -224 -57 298 33
7505 33 -86 -78 -94 387 -17 101 -1 94 120 86 154 41 -22 -40 93 -157 -96 -70 170 42 -151 -186 104 249
7529B49m62P7J17J7K60m13k4K31k12J66M9M4j40j69L96j45k37J5j1J85j35NK02
7552F5K6k59o1J31J69k6n5J28q6j79K91q8j16J54j1j33j21qO0L07j39r2k06L94
7576A45M1k58P9n9J79k6o6K1Lj41o2L80L2l65J3J06k22J08k24M62N0m35L66j81
7600e4J61k03O6J49k7k63JK19L5j17L2J63j00j24L39k43j33J38l5J19k38J23Q9
7623I7q7J09k60K28o1m6n7R8J28k39P6l5K45k17J53j24R1O0l10L80j79l0K2J00
7647A42r6rk34N7L90j97q0R3l12L03o9K28j35n8l5j55K57LL3j73R1k0LL9j01M9
7673A4J31j41K29j16k67J06P6n9K55l99K37n9k12K89R4l00j64L12j52m4N2R7q8
7696a09K97m14K89J06l89Q7J09J61k15J41K9n0Q4j09J45j96O2j14K20k39K53k03
$$ plain form
7529 249 -213 -136 -19 -2 258 -155 -179 52 -160 6 55 99 -41 -210 186 41 -196 -181 -192 -7 -142 -137 65
7552 65 91 -168 -229 -98 71 45 -10 118 32 -147 144 56 -60 94 83 -50 -171 -179 -119 188 49 -43 -249 145
7576 145 186 -72 7 -52 127 101 35 56 59 -82 -144 236 268 -97 -84 22 -200 -92 -316 146 196 -239 127 -54
7600 -54 107 -96 -30 119 92 -171 -170 49 84 -33 -1 162 62 -62 277 34 -99 39 4 123 -115 8 97
7623 97 10 119 -141 87 26 -20 -77 21 149 -90 -14 -49 196 -21 132 8 99 159 -151 229 50 20 42 142
7647 142 46 37 -197 -140 250 53 -27 66 -246 57 -12 216 81 23 -12 -167 90 93 126 -47 44 24 27 66 -35 14
7673 14 145 4 233 117 -150 -44 32 -27 228 -171 66 7 -205 84 178 -122 -286 26 -126 -170 -118 -21 -109
7696 -109 188 -226 63 169 -220 -133 -24 137 -78 63 92 42 126 17 162 -34 28 -86 134 -105 148 -55
7718e5J61p5k4L4P8O1j57O1p8L8J06l01K86K60k63l27L05j25N4r1O0l35K14J31
7742A8n2j13J21NJ19l05K49j91J18M02m35M7J23k94J37J8Q8L9Q0l58K16K54l00
7765a4k3k87N82j05j04nj24nK76n5j16k38J51K01k67J65N8j37P8j71Q2K11j69
7788a6J65j18p3p2L13k68J3K20l52K05M6r6N2N0N0M2k08l5o7K45k31N1K0r9J85
7813B2j46j02K77j86J75m0M3j59R6l0L72l07k23K45p7j8l9J63j48J01N6Lq5J09
7837A02k45K87J63j29l60K23P8L9l62K12P0k88J87j36K83o3k02K24j84O6J36j34
7859c3o8K3j52K56K28k13j05Q7L03l34J42qJ3l38j2K87j69p6K07n2k45L20l0n5
7883b4J39k06O3J16j59O6k3L7J65j36n6Q1Pr5j18K37j71R5N7r7J80j39j86L14
$$ plain form
7718 -55 106 31 7 41 119 180 23 84 6 44 150 -151 135 395 132 -195 110 -15 39 -52 8 -327 -113 18
7742 18 -34 -147 -26 -21 98 -207 42 -149 -31 371 -64 -17 106 -188 -51 -33 55 94 174 -184 32 286 -14
7765 -14 -37 -324 258 153 49 44 -80 -85 191 136 20 -218 -67 134 -133 32 90 -47 31 -140 -58 153 -16
7788 -16 149 31 -42 -114 199 -69 -56 164 -188 17 63 -33 19 69 119 161 -47 -82 -149 96 -135 -84 -64 -163 22
7813 22 -124 -226 51 -135 40 0 43 -116 -20 -50 322 15 -208 37 -40 -58 -97 66 -82 19 75 78 -7 102
7837 102 -143 144 307 178 -182 41 119 158 -204 8 78 -210 -23 -159 124 61 -141 83 -101 -35 101 -33
7859 -33 -101 -78 -230 26 254 41 -64 23 326 -8 134 126 139 -199 -211 76 -93 -169 38 -14 -259 61 31 -24
7883 -24 115 -91 -28 88 -71 -5 -28 9 174 38 -18 63 70 -25 -143 94 -77 18 75 -22 158 19 -167 147
7907A47l23J4k08L04J55j41j88K15j31J85Q0k77N23m06j58N45k76m5o8Q2O7j00
7929dn3J47k45J50k17L88j46j20j55K17Nk78K9J72J78k20K38k81K42k14J12rJ83
7952A19r3j30K56j7j86L4oM5J1j73M29l21M6j12J49o1K50k54J20j68J93P1k76
7975g4K57m86K31J7J60N0l11M14k22J57p4R6J0l22j2%k4J66P8J00j31j5j7k16
7999a68K24j35J06Lj0k63J73K17Nk71J67L5n5j77n3L64k79K87j66J3m3o0R1J2
8023A7K6O5l69J86L16j45L6q9J85l66Q4K26l34P6J4J51j10R8O3m8J8r0j48j48
8047b86L64pk14K98p6k20O0J36q8k01J94RQ3r3j52L72j28lo2P2j56N9J58K07l03
8072B3m6J95m58J58O3K16k58K55k6j42J80Lj64l39K35j93L03j12J07n8j65L6M7
$$ plain form
7907 147 -176 -162 -370 -66 89 -52 -240 -25 -156 29 109 -168 355 -51 -209 336 60 15 -53 29 96 -4
7929 -4 -57 90 -155 -5 -222 166 20 -100 -255 -38 -33 -311 -282 -110 68 -152 86 -195 47 -167 -55 -64 119
7952 119 26 -104 152 135 -51 -17 -23 22 33 -140 289 -32 14 -98 51 -10 240 -14 106 -62 131 202 -74
7975 -74 183 -303 -72 -55 105 155 -156 258 36 193 119 215 225 -97 -109 -109 -133 33 111 211 80 65 48 -168
7999 -168 56 -79 27 30 20 -243 -70 147 152 -119 48 83 28 -149 -202 162 -117 170 4 17 -26 -86 5 17
8023 17 43 108 -261 -75 241 96 132 43 228 -138 -54 172 -162 -86 -72 79 -31 67 130 82 100 10 -138 -286
8047 -286 78 71 -143 155 79 -141 -81 55 -33 -234 -40 -31 52 -41 -193 179 51 48 -14 58 -98 -39 119 326 23
8072 23 -23 172 -286 -128 -65 151 -107 148 122 -20 160 163 -1 -340 -105 -298 5 -107 0 -58 -223 -187 -140
8095a40L47k25J76m0j27j05M90m58P5j22J55l5P3R1k60J60q7Q7j48K57j28N7J23
8118B16r7j7j91L16j24j79K29j06l56K68L44j51J31k48k02J04O9l3J36J1j23k2
8140b5J1lK16k25m0K91j20j75L7L09l06k50J61O4L65k99j93J67R9N2j70Q9Q9J0
8164A54k73L78J78o53K86j07J29j78Q2k23J94N7kk2L5k49J75m9J22j1j20K18l5
8187H6k8q3J2m1
$$ plain form
8095 -140 207 -18 158 118 -9 -114 376 -82 -7 -129 26 -9 64 155 -105 55 -32 55 -93 164 36 93 216
8118 216 119 102 -89 227 103 -76 153 47 -309 -41 303 152 283 35 -167 -63 6 -27 109 120 -3 -25
8140 -25 -14 -17 199 -26 -66 225 105 -70 -33 276 -30 -280 -119 -55 310 11 -182 -15 84 136 -34 55 144 154
8164 154 -119 259 437 -216 70 -37 92 -86 -4 -227 -33 24 22 0 35 -214 -39 -88 34 23 -97 121 86
8187 86 58 -25 -13 -54
8191e4
$$ Imaginary data points
##PAGE= N=2
##DATA TABLE= (X++(I..I)), XYDATA
0@%%%%%%%%%%%%%%Qj6J6j6J6k1K9l2M0m8N2o0P2q4R4j08J24j42J61j83K07k32
36a23K61k93L28l64M05m52N01n54O12o76P45q20R04r98J100j212J336j472J626
55H54j801K001k231K499k814L193l659M248n021O081p636J0137j4808K6417j07395
70h9935j79448K55391J55587j65837q0720J75837L5263j06775m8317O8582N9755
81G9383m1950p2015Q154N1547k8137n2019P3845M1901q9455o4712P4475N9117
93D0134o8078M10Q3894k1687o7158j7759L6025L0758K952N473j0224m597p853
106B290j9684L4022K4561l5657k4830J9881j1017l9283O2456O1764p6885o2084
118f4466N0043M1446m9485j3709P2327j393o3218r932L3289K4668j2912m357J4558
$$ plain form
0 0 0 0 0 0 0 0 0 0 0 0 0 0 0 0 8 -8 8 -8 8 -13 16 -16 24 -24 28 -32 40 -44 50 -58 66 -76 85 -98 109 -123
36 -123 138 -155 173 -191 214 -238 263 -291 321 -355 390 -430 474 -524 576 -636 700 -772 854
55 854 -947 1054 -1177 1322 -1492 1701 -1958 2290 -2731 3350 -4286 5851 -8957 17460 -89935
70 -89935 -269383 -13992 141595 -24242 -104962 70875 106138 -637 -48954 19628 79383
81 79383 37433 -34582 -26428 25119 -3018 -55037 18808 60709 -28746 -93458 -18983 40134
93 40134 -27944 -27534 56360 34673 -32485 -50244 -14219 16539 19491 24964 14740 10143 2290
106 2290 -17394 16628 41189 5532 -19298 583 -10434 -49717 12739 74503 -2382 -64466
118 -64466 -14423 27023 -22462 -36171 36156 34763 -28455 -38387 -5098 19570 6658 2301 16859
131A6859n92k3391l3066K5502N0371j4545l4795J0359L0445k3073k4673L8329
143A7730J6253l3693l1075k79J8832O882J1080O883o705q761k0870Q580L8121
156B2978R065j9420j5326O698p569j3292J3246M834m351R49m093q876O658L3245
170B4746j292l5306J873J3793j1098j2196J9619K4435j1324j0742p835j2136J0455
183g008J6111K501n582k73o020j3915J6771J9132j4476j5400k513O07m921O272
197h714J3859r82J792p176j8605R166K7356N946k1921m093J5252r694j3057N306
211e565J1261N559j1478j0624M288J4959j309j5371J5964J3809l4340k5312K9645
224h514K9086k2334j4292K5827J478k3860k498K6934J4792k1110k2396K885K2462
$$ plain form
131 16859 16267 -7124 -40190 -14688 35683 21138 -13657 -3298 27147 4074 -20599 17730
143 17730 33983 290 -30785 -31064 -12232 -5350 5730 12613 5908 -2853 -23723 -15143 22978
156 22978 32043 12623 -2703 3995 -3574 -16866 -3620 1214 -3137 -2188 -6281 -15157 -8499 24746
170 24746 23454 -11852 -9979 3814 -7284 -19480 139 24574 13250 2508 -5327 -17463 -7008
183 -7008 9103 11604 6022 5749 -271 -14186 2585 21717 7241 -8159 -10672 -10065 -14986 -8714
197 -8714 5145 4163 5955 -1221 -19826 -10660 16696 22642 721 -3372 11880 2186 -10871 -5565
211 -5565 5696 11255 -223 -10847 -6559 8400 7091 -8280 7684 21493 -12847 -38159 -8514
224 -8514 20572 -1762 -16054 9773 11251 -12609 -15107 11827 26619 5509 -16887 -14002 8460
237H460L233k1908R231K7077j2292l1623O389K9670n518j9294M828R39j2088k367
251a5263J0757M292o227J782M255K44l097j295J3767R552j2663j4575R30O145
265a396m207Q572J6770j5409k0710J3044K1303j0103j7222J6339J2106k1953j9573
278b2439J4205K6459p254k6801q02J7349k818k0359J1662L2703p717k8574P102
291g284K9298q493l0269J0749K7485j4064l2296O978L5168N73k5092K763K0131
304A5647o821k6496N284L0498Q12k5079r457J1717K385r897M927J0586l064j0424
318i382L531J4247l22o142M325R62j2900r997J3660J5894n554o107N019J212j1669
333c223o296J0885M740j1613n988J0457M262j4690L30K3566L988k5752j0892K2799
$$ plain form
237 8460 11693 -10215 -984 26093 13801 -17822 -11433 18237 12719 -6575 -1747 -808 -12896 -15263
251 -15263 -4506 -214 -6441 -4659 -404 -160 -3257 -4552 9215 18767 6104 -8471 -7541 -1396
265 -1396 -5603 2969 19739 4330 -16380 -3336 17967 7864 -9358 6981 19087 -2866 -22439
278 -22439 -8234 18225 10971 -15830 -16632 717 -2101 -22460 -10798 21905 14188 -14386 -7284
291 -7284 22014 13521 -16748 -5999 21486 7422 -24874 -17896 17272 17845 -7247 -4484 15647
304 15647 8826 -17670 -12386 18112 18924 -6155 -15612 -3895 -1510 -11407 -6480 4106 1042 -9382
318 -9382 -5851 8396 8074 1932 6257 7219 -5681 -15678 -2018 13876 8322 2215 7234 8446 -3223
333 -3223 -9519 1366 6106 -5507 -11495 -1038 3224 -11466 -11136 12430 16418 -9334 -20226 2573
347B573J1387j6284l091J5346j257k1711n050K2245J0793j1335o917Q652M360
360I711j3318m200J8223O255k0033j5340J3915J3290j0979p874J1054Q698j1738
373b336j2695Q099J3673J081p666j698L623l860l242P305Q247k003r391l884k51
388d998j057L264N012J282l498l750l52K439P015M375n587r066j546O379L808
403C720j886L71O83l806p783j838Q870R212J218m869k785J841k779o167R54Q151
419C107Qj2590l625J0414P364j647j628K900m19p515k038J0485J2427n354j5583
434c694j442O348o539q862J2420J5739j0367j6982O178J5331m62j2239j376P880
448A933k079j1164J79J8030P214j3719n365J0602j125j3634P237K0830n261k1004
$$ plain form
347 2573 13960 -2324 -5415 9931 8674 -13037 -18087 4158 14951 3616 -3301 5351 9711
360 9711 -3607 -7807 10416 16671 -3362 -18702 -4787 8503 -2476 -10350 704 9402 -2336
373 -2336 -15031 -6932 6741 7822 156 -1542 2081 -1779 -5021 2284 10531 8528 -863 -4747 -4998
388 -4998 -6055 -2791 2221 3503 5 -3745 -4097 -1658 5357 9732 4145 -4921 -6467 -88 3720
403 3720 1834 2205 2888 -918 -8701 -10539 -1669 7543 8761 3892 1107 2948 169 -5998 -5044 3107
419 3107 3115 -9475 -13100 -2686 4678 3031 1403 4303 3884 -3631 -5669 4816 17243 11889 -3694
434 -3694 -5136 1212 -5327 -14189 -1769 13970 3603 -13379 -7201 8130 7668 -4571 -5947 1933
448 1933 -146 -11310 -11131 6899 14113 394 -4971 5631 4506 -9128 -1891 18939 13678 -7326
462g326j835J2060R9p618K666P937j082j0717o207R724R573o616p445K227j829
477f389o419Q410J4343l389p740N781K111r251Q99J4236N89j3805n124N487J149
492H88n617J182R973L127j2798j1160J1585J2648j1012r824J2702L613k0064m642
506a9399K4849J0308j6735p076J2518M487j0599k158J4859P163j5689j6825Q082
519f215J4002p233q909J1526Q299j5649r599J5203R742j1559p043O546J039q466
533h316n59J0261N839m181p027p60N079J664P77N116J991q423o707M879J858m011
549b520L581N173p191r418O664J0433l781n824K725M85o789k793Q902R222l590
564E279q275O30O247l079p301P118J0941o963j5242L671J3550k775r547M674Q268
$$ plain form
462 -7326 -9161 2899 2998 -4620 -1954 5983 4901 -5816 -12023 -2299 7274 658 -6787 -4560 -6389
477 -6389 -12808 -4398 9945 6556 -1184 4597 6708 -2543 -1644 12592 13181 -624 -5748 -261 888
492 888 -4729 -3547 6426 9553 -3245 -14405 -2820 9828 -1184 -11008 1694 5307 -14757 -19399
506 -19399 5450 15758 -977 -8053 4465 8952 -1647 -3805 11054 18217 2528 -14297 -6215
519 -6215 7787 554 -8355 3171 11470 -4179 -13778 1425 11167 -392 -7435 -889 150 -8316
533 -8316 -8875 1386 7225 3044 -3983 -4743 336 2000 2777 7893 9884 1461 -5246 -367 1491 -2520
549 -2520 1061 6234 -957 -10375 -3711 6722 2941 -2883 -158 327 -6462 -9255 -353 8869 5279
564 5279 -2996 -2366 3881 802 -6499 619 11560 4597 -10645 -6974 6576 3801 -5746 -1072 7196
579G196o518r062M908J0575R38p839n084L917J137o136j29J2228L240j2650n060
594h339J0757M696o438j258M461k428p297o93M237M210J254l212l453K287K010
609G94j778K158M542k958n858N80K731n37J761L089l526m627K295J639m70L021
625B856K598m180m919K28J80Q93K615j164k002J801o10k306O023P494o871r825
641g189N241O597m775l574P458N235n533q190K7P038L729o011n028O260K939r843
657e619k364J2341K694j3021l849J0219K072o138J689Q535pr539n196O182P723
672E722l853n923O122O256q132n987R611O787r227p203M953K587m501n88N022
687A646J248m885m031J397M292Q00m99K359J3m963j680N403K154m953K83N285
$$ plain form
579 7196 678 -8384 -3476 7099 8037 198 -4886 -969 168 -5968 -6097 6131 9371 -3279 -8339
594 -8339 2418 7114 676 -582 3879 1451 -5846 -6539 -2302 1908 3162 -50 -3503 -1216 794
609 794 -984 1174 5716 2758 -3100 -2520 211 -326 1435 4524 998 -3629 -1334 305 -165 2856
625 2856 5454 1274 -3645 -3417 -3237 -2344 271 -893 -2895 -1094 -1704 -4010 2013 9507 2636 -7189
641 -7189 -1948 4649 -126 -3700 3758 8993 3460 -4730 -4703 2335 6064 53 -4975 1285 4224 -5619
657 -5619 -7983 4358 7052 -5969 -9818 401 2473 -3665 -1976 6559 6552 -2987 -8183 -2001 5722
672 5722 1869 -4054 2068 8324 192 -5795 3816 10603 1376 -5827 -874 1713 -2788 -3376 1646
687 1646 2894 -1991 -6022 -4625 -333 467 -32 2327 2340 -2623 -4303 1100 3254 -1699 -1416 3869
703C869k784n969N659Q094m363p214K890L848n711m018P195N807o694q996L335
718e052Q500k904p017M672R038o813j0906O245J2420l900j0717M468R315n264
732B085r554O937J1364n152j1283J816Q815j624p953K553Q573l280j1034L55J0830
747C448O26q203J687O698m218p513M393P313k367n391J983L233k110j268L836
762B147L179k627m240O13K964n85j098L065L15o148l613N389K824m940k41O570
778C574j065p568O11P670J263o665j497M146O00l665j0O578K081p723m329O893
794H94L424n712q46P832Mr735k437P763L110n217k438L939K255l837k795M802
810A006N061l891p218J485N365l48k776K583K974l578m142R91K981J290r48j276
$$ plain form
703 3869 1085 -4884 775 8869 4506 -2708 182 4030 -1681 -5699 1496 7303 609 -8387 -5052
718 -5052 3448 544 -6473 -1801 7237 424 -10482 -4237 8183 4283 -6434 -1966 7349 2085
732 2085 -7469 -532 10832 5680 -5603 -3787 5028 3404 -4549 -1996 6577 3297 -7737 -7382 3448
747 3448 4074 -4129 -2442 4256 38 -7475 -3082 4231 1864 -3527 -1544 1689 -421 -1689 2147
762 2147 5326 2699 -1541 -928 2036 1451 353 3418 3733 -2415 -6028 -639 2185 -2755 -2996 3574
778 3574 2509 -5059 -4448 3222 4485 -2180 -3677 469 1069 -2596 -2606 3972 6053 -1670 -5999 894
794 894 4318 -1394 -2240 5592 5596 -4139 -6576 1187 4297 -920 -3358 581 2836 -1001 -3796 1006
810 1006 6067 2176 -5042 -3557 1808 1460 -1316 1267 4241 663 -3479 -2488 493 1783 835 -441
826d41l11k98j071N60L032Q51k747j769J647J157P12Q42L88j364j603j341l04
843b060J586K476Mk210j452K05J382Q01Q0m66k79j533j947K14M148J856l126j726
861b047K163R59k017R52M225J332n268m057L699M053k859m230L594K369n329m773
877g234N466O880l125n897J546M049k989m136M233O431l153o743J872O868r02
892C166n307L517M618l835o925K749P472p34n802L00K814k576m182J846N857j315
908A663n528mL739j179k109L298L270l661l078L280K955j620k24K953k60n284
924a789j685M655K514l628j184M061j54o601k3P615Q71p383k321N869L76o386
940e193L79Q084N98q300j460P596K966n214r42O567N46q017k253P708K639p547
$$ plain form
826 -441 -752 -1050 -2121 -1561 1471 2322 -425 -2194 -547 610 1322 2164 2552 1188 -415 -1756 -2060
843 -2060 -474 2002 2006 -204 -1656 -1451 -69 732 812 346 67 -1466 -3413 -3199 949 2805 -321 -2047
861 -2047 116 1075 -942 10 4235 5567 299 -3758 -59 3994 1135 -3095 499 2868 -2461 -7234
877 -7234 -1768 5112 1987 -3910 -2364 1685 -1304 -5440 -1207 5224 2071 -4672 -2800 4068 3166
892 3166 -2141 1376 5994 2159 -4766 -2017 5455 4721 -1081 -781 2033 -543 -4725 -2879 2978 1663
908 1663 -3865 -3869 -130 -1309 -3418 -120 3150 -511 -3589 -309 2646 1026 802 3755 3495 -1789
924 -1789 -3474 1181 3695 67 -1117 2944 2790 -3811 -3834 3781 4652 -2731 -5052 817 1193 -5193
940 -5193 -4814 3270 3868 -4432 -5892 1704 4670 -544 -1486 5081 5627 -2390 -4643 3065 5704 -1843
956a843k295O135R16p011n39Q064K380p326l591N322K195m800r28M925J356n757
972b797j839M752K910k875p42K715m71l550O08M223K9l079l46K006j777k682K910
989eL337k518l281J490K049k046j358K775K232l462k880L079L737j895l112K540
1005F82K142m030m072L972N244k824m798K775M044l237l167M283L626l123m762
1020c245J674L784l68l728N96L527j223m653J166N979j38m066O1K469j078l286
1036b529O47L085q0k640j485J882J875o46j132J508J336k243j441K247K078j003
1052A459j221m04o04j99O81P90K66O39o96j466L56J240l57o71J5q56o70Q69N04
1071c25k83Q79N15j973j178K030J847j008o54R92J89j089r02J112K577m85l416
$$ plain form
956 -1843 -4138 1997 2913 -4098 -4637 3427 5807 -1519 -5110 212 2407 -2393 -3321 1604 2960 -2797
972 -2797 -4636 116 3026 151 -591 2124 1653 -1897 -1289 2934 2963 -116 -462 1544 -233 -2915 -5
989 -5 3332 814 -2467 -977 1072 -974 -2332 443 2675 -787 -3667 -588 3149 1254 -1858 682
1005 682 2824 -1206 -5278 -1306 3938 1114 -3684 -909 3135 -102 -3269 1014 4640 1517 -3245
1020 -3245 -1571 2213 1845 -1883 -1287 2240 1017 -3636 -2470 3509 3371 -695 -634 1835 757 -2529
1036 -2529 -1882 1203 1123 -1517 -3002 -1120 755 109 -1023 485 1821 -422 -1863 384 2462 1459
1052 1459 238 -166 -770 -969 -288 502 768 1407 711 -755 -399 841 484 -187 -172 -1028 -1698 -829 -325
1071 -325 -608 271 786 -1187 -2365 -335 1512 504 -150 842 1031 -58 -960 152 2729 2244 -1172
1088a172l99L074j10l280O26L666j341n103O16M883L48l685LL201k55l443l27
1105b698M520J764m578k252M025K006l182j494M922J271m994k147M331J595l289
1120b00j385K599P43m101q50L556J579k662j732K042J029k687O3L434Q89l860
1136a543l69K862K21k242J679K660j935k969J408L141j924k241J906J613k980
1151g13k755L253L402k613l454K065K867k633l911L763M963l998m886L323M626
1166C299l151l852M250M197m412m242L584N041k754m057J881L368k454n130L278
1181a154M944k491n042J908M200k476l353L261L401l308l249K582K913j483k171
1196a518J581K242k517k244K138K912j344k480J822J167k325j075L100P86l524
$$ plain form
1088 -1172 -1571 1503 1393 -1887 -1261 2405 1064 -4039 -3423 1460 1808 -1877 -1874 1327 1072 -2371 -2698
1105 -2698 1822 3586 -992 -3244 781 2787 -395 -1889 3033 4304 -690 -2837 1494 3089 -200
1120 -200 -1585 1014 1757 -2344 -3194 362 1941 -721 -2453 -411 618 -2069 -2006 1428 2317 -1543
1136 -1543 -1912 950 1171 -1071 608 3268 1333 -1636 -228 2913 989 -1252 654 2267 -713
1151 -713 -3468 -215 3187 574 -2880 -815 2052 -581 -4492 -729 4234 236 -4650 -1327 3299
1166 3299 148 -3704 546 4743 331 -3911 -327 4714 1960 -2097 -216 3152 698 -4432 -1154
1181 -1154 3790 1299 -3743 -1835 2365 -111 -3464 -203 3198 -110 -3359 -777 2136 653 -1518
1196 -1518 63 2305 -212 -2456 -318 2594 1250 -1230 592 1759 -566 -1641 1459 2245 -1279
1211a279l71K559o18k583J656K813j176l462K23L153N86k600m4L338n91m153O5
1228b484M583K94m409J99L848q18l831J560M145p16l678q24L209N41k650j19L027
1245A877L66l989r66L707J360k927q92K421K10k794M4K444Q31j782j392P29O36
1262a17m74k07J059N94q19j380N96J019M57n7O9j23q91K01N70L22j34m5p42q49
1282i51MJ161N50m27p24j31l11j85Q2Q62R77j021j077L90Q72K91n92P35J016q20
1302G01j577P48J974J55j738q72J187R7j774m98K226J438k669j939J748K188j672
1319b77j482K080J545k982j925K635K616j751j983J866J631j597j848J926L128
1334C582j956l037O07K564j057k470J704J873j812k848J280K761r20j830P03J488
$$ plain form
1211 -1279 -1650 909 291 -2292 -636 2177 1001 -2461 -2238 915 1501 -1099 -1143 2195 1604 -2549 -2484
1228 -2484 2099 2393 -2016 -1817 2031 1213 -2618 -1058 3087 2371 -1307 -2131 1078 1619 -1031 -1150 1877
1245 1877 2243 -1746 -2712 995 2355 -572 -1464 957 1167 -1627 -1583 861 1692 -90 -1482 -753 -117
1262 -117 -591 -798 261 855 36 -1344 -748 271 728 671 740 617 -274 -73 497 819 685 640 -102 -951
1282 -951 -947 214 764 337 -387 -518 -829 -1014 -932 -70 907 -114 -1191 -801 71 362 -230 505 1521 701
1302 701 -876 -128 1846 2001 263 -609 578 675 -1099 -1597 629 2067 -602 -2541 -793 1395 -277
1319 -277 -1759 321 1866 -1116 -3041 -406 2210 459 -1524 342 1973 376 -1472 454 3582
1334 3582 1626 -1411 -804 1760 703 -1767 -63 1810 -2 -2850 -1570 1191 271 -1559 -856 632
1350F32j399j268J615J840r38j204R42J077j626n39K410Q52k550j139K039O48
1366A392j985p1K477m92k879r6K482J94k368r4K385k29l391N14L579L95l577l14
1384b078L716n8l355O60L908k52m227l95L597M94l239J21L245K5l944l69L925
1401A774L19l263q79L261O7l422j33L532K69l140l60K711N5j529J22K477m05k378
1419i22l18K302j70j904L83J634o45k103J231K047j130j247O26J308j461j339
1435a708J963J525j468j854J260J475j739j165K318J411k473j980K459J979k318
1450c15j333K265J038j991j607K259K217k242k080J751J785j999j924K561J833
1465B218k185k043J625K189j270j613J107J445j149j916O42J865m01j919N57J275
$$ plain form
1350 632 -767 -2035 -420 1420 482 -722 220 1297 -329 -868 1542 2394 -156 -1295 744 1392
1366 1392 -593 -664 1813 1321 -1558 -1654 828 1022 -1346 -1440 945 716 -2675 -2161 1418 1813 -1764 -2078
1384 -2078 1638 1580 -1775 -1115 2793 2541 -1686 -2081 1516 2010 -1229 -1108 2137 2162 -1782 -2151 1774
1401 1774 2093 -1170 -2049 1212 1279 -2143 -2276 1256 1525 -1615 -1975 736 791 -738 -616 1861 1456 -922
1419 -922 -1240 1062 892 -1012 -629 1005 360 -1743 -512 1535 405 -842 -216 1092 -369 -1708
1435 -1708 255 1780 312 -1542 -282 1193 -546 -1711 607 2018 -455 -2435 24 2003 -315
1450 -315 -1648 617 1655 -336 -1943 316 2533 291 -1789 -38 1747 -252 -2176 385 2218
1465 2218 33 -2010 -385 1804 534 -1079 28 1473 324 -1592 -950 915 514 -1405 -848 427
1481D27p39q78R80J434q61j068L61R58k70m65R85j07n13q26N84K84L41k54m2l
1501C28o45n68R73K05n15l29M07jj190P56Q99Q1j033l23J026M86n61j25R44N21
1521A336j362l99J092N98q14p78R00N37j494q98J191J244j206j593P02J678j086
1538c52r68J060J721r60k072Q10J933l69j744N64J616l77j961N61K492l46j709
1555a01m62J906k73j739K08J443m01k022jJ567J47j242L02J077j22j764M25J885
1573H33j57j254M73Q19n53p69R13J259j163q45O97M23p56o11J378M18j548j023
1591a466J148J276j313j029J953Q76k580j109K531J449k357j091K124Q79k049
1606g58j055K613J506k116j821J867J712k086j338J917J730k690k034K477J898
$$ plain form
1481 427 -312 -1190 -210 1224 363 -705 -344 614 344 -121 864 757 244 -582 2 286 627 373 331 328
1501 328 -317 -885 88 293 -222 -551 -144 -145 -1335 -579 320 401 -632 -955 71 557 -4 -129 815 1336
1521 1336 -26 -425 667 1265 451 -327 573 1110 -384 -1282 -91 1153 -53 -1646 -944 734 -352
1538 -352 -1320 -260 1461 501 -1571 -761 1172 803 -941 -377 1239 862 -1099 -538 1954 1608 -101
1555 -101 -563 1343 1070 -669 -461 982 581 -1441 -1442 125 272 -970 -668 409 287 -1477 -1052 833
1573 833 676 -578 -105 714 161 -608 305 1564 401 -444 253 676 -80 -691 687 1105 -443 -1466
1591 -1466 -318 958 -355 -1384 569 1445 -1135 -2244 287 1736 -621 -1712 412 1291 -758
1606 -758 -1813 800 2306 190 -1631 236 1948 -138 -1476 441 2171 -519 -2553 -76 1822
1621A822j993j376J829J315k251j104J804J483j502j267P56J370j248p71J473
1636C40Q89j497j157J769P88j168m12J235M6j655k04J398J56p53QR19m50j132
1654h80M22J229k8j549j63J322rj351N84J715m48k229P42J699o80j553P51J239
1672H13p41j263J72K202Q2j861R8J663j8k201L48K085k89k180p6K094m50j158
1690f80Q9J620j93j515l43J332N12j116k94O55L31j501k90J580O21q81m76Q36
1708B87o7m38K52O95P0l05r36N27K48l52j32M45l06n23P9N74j0m23j13M27k47
1729b48p71N43J090j63j142M50P85m76m27O06Q61l89j438P79Q12j53r48o1J158
1748H68k88j568jJ677J63j450l59J272j91j514N03J585K16j603j07J167M62j253
$$ plain form
1621 1822 -171 -1547 282 1597 -654 -1758 46 1529 27 -1240 -484 886 -362 -1133 340
1636 340 1229 -268 -1425 344 1132 -36 -448 787 833 -822 -1026 372 528 -225 -217 702 252 -880
1654 -880 -458 771 743 -806 -969 353 344 -1007 -423 1292 844 -1385 -643 1056 376 -1177 -426 813
1672 813 72 -1191 -1019 1183 1265 -596 -498 1165 1147 -1054 -706 1379 1090 -1090 -1166 928 478 -680
1690 -680 -591 1029 836 -679 -1022 310 822 -294 -588 67 398 -1103 -1393 187 808 -73 -549 287
1708 287 220 -218 34 729 799 494 -442 85 333 -19 -151 294 -12 -535 -456 118 108 -315 -428 -1 -248
1729 -248 -1019 -476 614 451 -691 -241 544 68 -359 247 1108 719 -719 60 872 719 -229 -290 868
1748 868 580 -988 -989 688 851 -599 -958 314 123 -1391 -888 697 913 -690 -797 370 832 -421
1766d21j76J226L85j366p06J582Q07j135q85J078P06j561j54J219J36j047p86
1783a098R61R5m68n74J171L97q36n91J222K68p94n8J092l94q67J36J299m80o93
1802b12M42N00k97r51M51J051m87j461O03Q94n07j470J167R17o77j478R16J750
1820A151r75j403J286J317j167j679R64J659l86j689O60J388p55j810R94K103
1836A658r57j844L63J834n91j478N53J437o50j700O43J582m60j352O72R34l98
1853B46j004K97J630q14r25L83P92l50p56N74N82m34j122N66J116p81m08O64Q3
1872C39l12o54Q37P31q32p91P87M20j244k35J139M31j231k51J260K49j061l46
1890g64J038P79j529j87R99O41j294n19J087R59j579o52J322P67j018r45J184
$$ plain form
1766 -421 -597 629 1014 -352 -1058 524 1331 196 -689 389 1095 -466 -620 599 735 -312 -1098
1783 -1098 -137 -42 -510 -1084 87 484 -352 -943 279 547 -247 -305 787 393 -474 -338 961 481 -212
1802 -212 230 730 433 -518 -67 984 497 -964 -361 533 26 -1444 -277 640 -37 -1515 -599 1151
1820 1151 176 -1227 59 1376 209 -1470 -506 1153 767 -922 -262 1126 371 -1439 -445 1658
1836 1658 701 -1143 -780 1054 463 -1015 -462 975 325 -1375 -732 850 390 -962 -290 644 246
1853 246 -758 -461 1169 355 -570 -187 605 255 -501 73 655 221 -901 -335 781 0 -408 256 339
1872 339 27 -627 210 941 109 -682 105 525 -719 -954 185 616 -615 -866 394 643 -418 -764
1890 -764 274 1053 -476 -663 336 977 -317 -836 251 1210 -369 -1021 301 1068 50 -895 289
1907B89N47q34r17R87N42p27r72P15P79m82p91R02J48k59p55N16Q95l28o09L40
1927a4L76k87n20N44N82k92n69R8O16l67l59L59J11j80m03K46K73m26j80R7M58
1948A63m92o4K48L38k03l79O20K04m61j76P72M34j044j53N47M34q12n18O73K16
1968C47m67r23Q59R14o46q63P80M82r19n59Q44Q86p27r98R23P73m30j159R96J082
1988A195r21j228P42J162o94p68O19J062r03j041O45J005p86q01K75Q30n22r65
2006a094Q66Q28m20j171O14R95n24p26P86N55q24n54Q62P47r08m40N41M09q99
2025c57M3O84O95j397l98J171J29j100k83J663k5j650k09J451J50j095j41J330
2043F61J89j475l35J534M78j404m67J537R8j545o7J438N46j669l92J402L51j380
$$ plain form
1907 289 836 2 -915 72 614 -113 -1085 -370 409 -73 -864 38 186 -73 -828 -312 583 255 -354 -14
1927 -14 362 75 -445 99 681 389 -180 -82 534 167 -192 167 278 98 -305 -59 214 -212 -392 -295 163
1948 163 -329 -393 -145 193 -10 -389 231 435 -26 -202 570 1004 -40 -193 354 788 -24 -542 131 347
1968 347 -120 -1043 -184 730 84 -779 1 483 -436 -995 -151 735 8 -990 -67 706 276 -883 113 1195
1988 1195 274 -954 -212 950 256 -512 107 1169 266 -775 -130 875 89 -712 -437 393 -129 -1094
2006 -1094 -228 600 180 -991 -377 618 94 -632 154 709 -115 -669 193 940 32 -408 133 542 -357
2025 -357 -314 370 1065 -332 -730 441 570 -530 -813 850 825 -825 -1034 417 567 -528 -669 661
2043 661 850 -625 -960 574 1052 -352 -819 718 816 -729 -796 642 1188 -481 -873 529 880 -500
2061e00l28J450r4r07n32J326J94q28m16J047K01j112l53J312L65j295oJ113l42
2080B95p52L38Q02k00q02Q1P58j23r03L69P76l73j045P22P35m54p29M51Q79p63
2100F2o65N03P60l69j306N40R23m80p89O93Q17o35q25M15J016o31o50Q48N61n98
2120A90q72M66Q77k79r33M79Q94n42j154M58R48m0r99j32J124j52p67j6P39j52
2140A37n20k22P71K82o27Q6M64m4m96p6P29Nk16j10j0N9l7k38K25J18k76k4k24
2163b44p3l5M11L5m29k8N2K60j2k67M38K76l29j57J84L80j77l88N0O46k18m29
2185e4K21L90k92p28N4P45k65m19J66M80l63l95j86R95p5o42J2Q09P8r42j3J059
2207F35Lp74j60Q44O9q69n0P51Np49l10Q96K68q85l34O97M0o12l37J001K88q52
$$ plain form
2061 -500 -828 622 528 -379 -911 415 609 -219 -635 412 613 -499 -852 460 825 -470 -476 637 295
2080 295 -457 -119 683 483 -319 -238 520 397 -506 -137 639 266 -779 -57 678 224 -505 -54 825 62
2100 62 -603 -100 660 291 -1015 -475 448 -32 -821 -128 689 54 -771 -356 660 29 -621 227 788 190
2120 190 -682 -216 661 382 -551 -72 822 280 -874 -416 532 492 -507 -639 485 333 -434 -450 289 137
2140 137 -383 -605 166 448 -179 -93 371 327 -169 -245 484 489 273 163 153 212 175 -63 162 280 4 -20 -244
2163 -244 -317 -352 59 94 -335 -363 -311 -51 -63 -330 108 384 55 -102 82 462 285 -103 -53 593 375 -54
2185 -54 167 557 265 -463 -409 336 71 -348 -182 298 -65 -460 -646 349 274 -368 -356 453 531 -411 -424 635
2207 635 638 -136 -296 548 617 -252 -302 449 454 -295 -605 291 559 -326 -660 37 77 -535 -872 129 417 -435
2229d35L4M69M12r39J19O74J78j017M55L84j71l51M0R25m81q39M56O45m32o50
2249e24L34Q36o88r59P80Q12m63q90O69P56p75n80Q50O97o66p59M45J033p31r14
2269g37R12O81o24j054O60Q94p04q87O80Q17n11q85P68P17o89r62P47P04m06r30
2289h09O68Q64p30n40N51N22m44p02P19M46o70n32N33O15n53m22M61L49n56k26
2309d56O82L85r16j02P39J16o05j53L55K70o91j87P42J29o58j9Q36p0r22j74J072
2330C73J53j057P0R50o2q79J14P51M25q81m37O85K94q59m7O55L68r76J2N15K76
2351D43m36o17Q67M1p21j13K95N03o11l51N79M42l77j00N17R6k58m28M51K54n58
2372h2J10n5J83l54j34O38j95r9l50L26q7k60K52P3m3l51J29L52j32k47J45L67
$$ plain form
2229 -435 -401 68 480 -459 -340 334 512 -505 -50 334 163 -188 -148 777 296 -543 -87 558 126 -524
2249 -524 -190 646 -42 -1001 -221 591 128 -762 -93 663 -112 -692 158 855 189 -570 -125 908 177 -737
2269 -737 175 856 232 -822 -162 732 28 -859 -179 638 127 -758 10 727 38 -924 -177 527 121 -809
2289 -809 -141 723 -7 -547 4 526 82 -620 99 545 -125 -657 -124 491 -62 -484 -23 326 -230 -456
2309 -456 226 611 -305 -407 332 448 -157 -310 45 315 -376 -563 179 308 -350 -369 467 397 -525 -699 373
2330 373 526 -531 -461 489 427 -452 -338 413 838 -43 -480 205 499 -360 -407 248 616 -360 -348 167 443
2351 443 7 -610 257 298 -423 -536 -241 262 -349 -700 -121 321 -56 -156 361 457 199 -229 222 476 -82
2372 -82 28 -27 156 -198 -332 306 111 12 -338 -12 -99 -359 -107 -34 -77 -428 -299 53 -79 -326 -181 186
2394A86J6k05O4K11J82m49n8L39J1l99QL87K9l93l66Q08Ro64j07N44O4k19n71
2417e73M75L39l31m00M44L40n43m8N31M54n22l32J49N44m92l53M68K11k49m70
2437c58L08N30o06l82K05L85m85l48N40N26k66m70O26K3j05m82N87K06m65j95
2457b26L02K33j97l01N25j00l06k78L92J36k64k87M84nl37m1M69J99n64q2N33
2478B85p0n25j73J082q9j010k1P14L15j083P6Q64K54j272j5R58M34j108k6R50
2498E40k43o72l5R75O7j004j56Q78kn48j44O46j07p28K12N32p8l28M1M19q0n26
2520c41k28P59J70n08P5M49qp98N1O66r8k92Q8M33k51m92L08L88k78n45L35N95
2542D78n08m74L04Q07l72q93O16N17l51m82L25L84j95n26M31M02p9r01L49Q44
$$ plain form
2394 186 202 -3 61 272 454 5 -53 286 297 -102 -94 293 322 -71 -437 371 380 -284 -391 153 217 -2 -573
2417 -573 -98 241 -90 -490 -46 294 -249 -297 234 688 166 -166 -17 527 35 -318 150 361 112 -358
2437 -358 -50 480 -126 -508 -303 82 -403 -751 -211 315 49 -421 205 228 123 -359 228 434 -31 -226
2457 -226 76 309 112 -189 336 236 -70 -348 44 180 -84 -371 113 108 -229 -270 199 398 -166 -248 285
2478 285 215 -310 -483 599 510 -500 -521 193 508 -575 -499 365 619 -653 -668 290 724 -384 -410 540
2498 540 297 -375 -410 565 632 -372 -528 350 348 -200 -344 302 195 -533 -321 211 133 -195 -154 265 185 -341
2520 -341 -569 190 360 -148 -73 376 368 -430 -379 287 189 -103 -15 418 167 -325 -17 371 93 -452 -117 478
2542 478 -30 -504 -200 607 235 -658 -42 475 124 -358 -33 351 156 -370 61 463 384 -517 -168 676
2562F76m78n64N60N01p52l18J98N39l55k24L4N70m49l46K2M16j62l1J29L54k48
2583G2l69L71L39O9p32J58K25K16n77M07K55m25l53L28J56Q6n80K16J43l99O3
2604c31K35M72m60j57K18J00L3m33M18J72k90k32J86K48J43j55J05J16m12q9L15
2625B02Rj43l58K95j2k0l82R0N44n59m2L61K28k06j20J2M01O4o34M69J18j02l87
2648a72K79L63o8m53j20K98q0j97M9M05rp13j2M48o5k16o2N05j68k45j91O36n2
2671A60l44kN21k32m56M23j5j3k18J16K05Pn39L27K82k32l22M61P1n69M5J1M97
2694A84j93l48N76O8l36k83K97L65k32m29M66K50m95m24M59M11l59l66K71N33
2714D15o46l3L77K05m01k84L05M10k82o65O45J61k71k19M68J64k61l01J49K85
$$ plain form
2562 676 198 -366 194 695 -57 -375 -177 362 7 -217 -183 387 -62 -408 -386 30 -132 -163 -34 320 72
2583 72 -297 74 413 482 -250 -92 133 349 -228 179 434 9 -344 -16 140 226 -354 -138 5 -394 -331
2604 -331 -96 376 -84 -241 -23 77 110 -323 95 267 -23 -255 -69 179 322 167 272 388 -24 -113 202
2625 202 211 68 -290 5 -7 -27 -409 -319 225 -334 -376 -15 213 7 -113 -101 300 364 -270 199 317 215 -172
2648 -172 107 470 402 -51 -171 127 47 -150 -101 304 295 -418 -430 18 -47 -263 -325 180 12 -233 -424 212 160
2671 160 -184 -186 335 103 -353 70 55 42 -176 -60 145 152 -387 -60 222 -10 -332 129 200 -369 -324 -313 184
2694 184 -9 -357 219 287 -49 -332 -35 330 98 -331 135 385 -110 -534 -75 336 -23 -389 -118 415
2714 415 -231 -264 113 318 -83 -367 -62 348 66 -599 46 207 -64 -283 185 349 88 -213 -64 221
2734B21l01k90N25K23n34l88O29J55l08J19qL09m00j74K53L28k57m28M80qj40
2755Fl96O14p3m38j30M49L4rr1J96Q3o86J11N16N8k72l21M15K13l85J3K81J91
2778C79j74m23M81Q8m91N9L5M01m97l0M78j84m40K20J87J25m36r1M34P8l13j40
2800b54L10L22k93k96K13M80o53J5K17K26k21k77L59k8j96qQ0K25j61k56K29P1
2822A04l78J50J34l45J41L7J87r3j9j63N32o3m66r6L24J05l14K10K41j51j79R
2844i3K69k04k99K26M39k31l81o8M63Q7k29n4J27ol38K92J03L7j37k63M74R0l40
2867c6j39K48K11k5m14K64L56l40l52J07L37m88J94kK76m13q5N25j72k52R7nL04
2890A96q3n31O70q2j97M8J95j75J0k55K96J97l25Q1kR1k86Q7J71M8l62L11r3L2
$$ plain form
2734 221 -80 -370 155 378 -156 -544 85 240 -68 51 43 352 -48 -222 31 359 102 -326 154 146 6
2755 6 -390 224 151 -287 -417 32 66 57 -34 162 245 -441 -330 186 244 -28 -349 66 279 -106 -93 188 379
2778 379 205 -218 263 351 -140 -81 -46 355 -142 -172 306 122 -318 -98 89 214 -222 -313 121 199 -114 -254
2800 -254 56 378 85 -211 2 482 -171 -156 61 287 66 -211 148 120 -76 -84 -4 221 60 -196 33 104
2822 104 -274 -124 10 -335 -194 -157 30 -63 -82 -245 287 224 -242 -338 -14 91 -223 -13 228 77 -102 -93
2844 -93 176 -28 -327 -101 338 107 -274 -342 121 208 -21 -75 52 46 -292 0 103 140 3 -260 214 304 -36
2867 -36 -175 73 284 259 -155 109 465 125 -227 -120 217 -271 -77 -79 197 -216 -301 224 52 -200 -103 -108 196
2890 196 113 -418 252 170 -27 21 216 41 51 -204 92 289 -36 45 43 134 -152 -65 106 154 -208 103 10 42
2914D2k33K21R0Ol80K5K98J35k31j06K26J60m51N6M01j58l43Q8O52l76k34R8L23
2937C09k14l62L7O11j94l56L22N6Rm39K32N8K14n91J80L06M4l90K49L15k71k99
2959a74j62M66j52j40J65K02j35k95L34R8p7j79P1L9rm69K20L6M6r0K75J74m83
2982b39K15M2J26l36k60M54J67l03m7L10J68m34K08k26N93o05ML16P8m6m78N17
3004B24j19L1m21L75J50j64k84M3J74J15l40J61q9R5n2p0P4J97k00K51p2j41k2
3027h4K34l5j89l3K8J56m3k19J95J04l77K33O8l6k27L0j33M31j58ol1J9j7K0J22
3052E2K56l65j23r4K52mP1J38r3P3l09N5K95k07k19K52J80j65k44K15p6Jp6J38
3076CK78o04R6J34K04n7q3J47M18o56J10k70M22k50R5o0J07M6k68K03j00O7o4
$$ plain form
2914 42 -191 30 120 126 -254 -229 69 204 -27 -133 93 253 -198 -142 259 101 -242 -154 498 122 -112 -14 309
2937 309 95 -267 -230 381 187 -169 153 209 218 -221 11 69 283 -308 -128 178 222 -168 81 396 125 -174
2959 -174 -336 130 -22 -162 3 205 70 -225 109 207 130 -49 22 61 52 -417 -197 -161 -115 -205 70 244 -239
2982 -239 -24 18 144 -192 -452 2 169 -134 -181 129 297 -137 71 -155 438 -167 -163 153 231 185 -293 224
3004 224 105 136 -285 90 240 76 -208 -165 9 124 -216 -55 -144 -49 -101 -171 -97 100 -100 151 79 -62 -84
3027 -84 150 115 -74 -107 -79 77 34 -185 10 114 -263 -30 38 2 -225 -195 -328 103 -55 -61 -92 -73 -90 -70 52
3052 52 308 -57 -180 -274 -22 -26 45 183 90 163 -146 -91 204 -3 -222 30 210 45 -199 16 -60 -59 -135 3
3076 3 281 -323 -227 -93 111 54 -29 118 536 -120 -10 -280 142 -108 -13 -73 34 80 -188 15 -85 -18 -82
3099h2O6J78K77p20n0K94J84k83J05Q5r7j7LK03q0j8L0J2j82k2J08j5k6J24P8
3124A55P8k76k32L65L03p12K86J45Jk38J29K1J87m06K36n3K06j97k30K25k9j39
3146a75j02K45L07l20n62Q24r8O4n94O95Q6m44j47K59N3q5j76K72o0k96P2N0K91
3169A59k61l2K5K74k05j60K05J28q0j12k1K31l36J97K14j74k71K77J81k16k03
3190a80K7M2J54l70P8L51j38j21j47K77K0j79J23L41l15r5k16L45K04k69J97J82
3212C11n3m63J48K48k09m2K44j49Ok6J2K23l75RK08QJl40K74L8o8k52mK1K03j25
3238a52n2L06j26j16K17j8J44j03k8j46K7L8J88k28m4J54m4J63p5j98M1J04l00
3261b48K09K33j30j16j01N7n5L5j29L05K02j40o5N4n0j18N3j2j75K24N2j60R4
$$ plain form
3099 -82 -16 162 439 -281 -331 -37 147 -136 -31 54 -43 -60 -57 146 66 48 78 90 -92 -114 -6 -21 -47 77 155
3124 155 233 -43 -275 90 393 -319 -33 112 113 -125 4 25 212 -194 42 -11 195 -2 -232 -7 -36 -175
3146 -175 -277 -32 275 -45 -607 217 119 183 -411 284 370 -74 -221 38 91 6 -170 102 42 -254 -182 -132 159
3169 159 -102 -134 -109 165 -40 -200 5 133 53 -59 -80 151 -185 12 226 52 -219 58 239 23 -180
3190 -180 -153 -111 43 -327 -249 102 -36 -157 -304 -27 -7 -186 -63 278 -37 -132 -348 -3 201 -68 129 311
3212 311 258 -205 -57 191 -18 -60 184 35 41 15 27 250 -125 -116 92 100 101 -239 35 73 5 -247 -251 -230 -27 -152
3238 -152 -204 102 -24 -140 77 59 203 100 72 -74 -47 -9 179 -49 -93 61 17 180 105 -93 -52 52 -248
3261 -248 -39 194 64 -52 -153 -96 -151 -116 -245 60 262 122 57 111 61 -57 -4 -16 -191 33 85 -75 19
3284A9l9j0J46l19L73k29o9K22n2J02k52K10k48O1J39k43K52O9j27J0Q8k43J25
3307a5L11l97J2J05r5J52o3q4o8K31j41j3n2L03j36o5J47J32n35N6J91J99j29
3330D6m8R6j20K14l10K83j05p8j83J05J71k77L19L7l38J42n5j7K62j83M0j66J51
3353a4oj33J75j23N3rO1j72J26k9K42l35KK37J19n2j86N3J23k26j53L92p4J22
3377A93l87K50K12p6k40J34J56k22j55J6k3K90l59ML02l13J37N9j1P5j74J00p7
3400a09L22j72Q1R0j77j81K55j03j68O3K59j33j75K62j94K27k39J84p2j77LKJ85
3423C3K5p7k1r6K38m2k21K03j72k11J20L46pj76o6K39k28J45PJ31J99n24J62k26
3447b19J55j98J24K17k6j37J05M0J08n69J61L27J29k21j78J29M2N4N9j02J10k03
$$ plain form
3284 19 -20 -30 116 -203 170 -59 -128 94 42 144 -108 102 -146 -85 54 -189 63 132 5 15 103 -140 -15
3307 -15 296 -101 -89 16 -79 73 10 -74 -142 89 -52 -65 -117 186 50 -15 132 264 -271 -215 -24 175 46
3330 46 -2 94 -26 188 -122 161 56 -22 -205 -100 71 -206 113 150 -188 -46 -101 -118 144 -39 1 -165 -14
3353 -14 -20 -153 22 -101 -48 -57 4 -168 -42 -71 171 -164 -162 75 194 142 -44 9 132 -94 -247 145 71 193
3377 193 -194 56 268 192 -48 86 242 20 -135 -119 -142 148 -211 -207 95 -218 -81 -22 -33 42 -132 -32 -109
3400 -109 213 41 122 212 35 -146 109 6 -162 -99 160 27 -148 114 -80 147 -92 92 20 -157 -154 -152 33
3423 33 58 -19 -40 -136 102 60 -161 42 -130 -341 -221 125 118 -58 -124 115 -113 32 39 170 369 -155 7 -219
3447 -219 -64 -262 -138 79 53 -84 21 61 169 -400 -239 88 217 -4 -182 -53 -11 43 102 0 110 -93
3469i3j17J07O6L3j58M36k58n6k9N1j54K41m8l3n9J64L9j52J29k30K06m61M82
3492A06j09p1J00M5p0j40K02o5j59R0M6P3j28KL60l68o2N2rJ26j54J20j02J43
3516B8j03J31k98K28j50J11k6L17k29j36K04Jj59O8J5J20K2m47K79j4j19K63k82
3539a76R7L7k45K30n6J05j7R1M2j60J96Q9n9k41J52m3qK2j50O7K9rK80j48j62
3564c7J9j34K04J56m23J28j08J81J05n0r1K14k60K10l7N7k34R2j45K53kL3j08
3587B3k9j29P7Q3j17L1l0J99k1k63L89k34J43p5k0J25k63K14k80K43k49K35R9
3610A51L6k87m6Q5qO6L7Q5k00L2j12N3Q7J51k09L3M9J89k33j19j1J97P4k84J00
3635h4j5K25lm11J16J30M5L29n81J87L4J85k56J59q9m9J55K06k68M0Q5l11K91
$$ plain form
3469 -93 -210 -103 -37 -4 -162 274 16 -40 -69 -18 -172 69 21 -12 -71 93 132 -20 109 -121 85 -376 106
3492 106 -3 -74 26 71 1 -139 63 -2 -161 -71 -25 48 -80 -78 282 -86 -148 -96 -105 21 -133 -13 -115 28
3516 28 -75 56 -242 -14 -164 -53 -79 238 9 -127 77 78 -81 -13 2 122 144 -303 -24 -38 -157 106 -176
3539 -176 -79 -42 -287 -57 -113 -8 -25 66 108 -52 144 233 174 -67 85 42 34 56 -94 -27 2 -7 273 125 -37
3564 -37 -18 -152 52 208 -215 -87 -195 -14 91 41 -50 164 -96 114 77 134 -100 -8 -153 100 98 131 23
3587 23 -6 -135 -58 25 -92 -61 -91 108 87 -176 213 -21 122 47 27 152 -111 103 -177 66 -183 52 151
3610 151 187 -100 -146 -61 -69 -3 34 119 -81 -49 -161 -108 -21 130 -79 -46 3 192 -41 -160 -171 26 100 -184 -84
3635 -84 -99 126 123 -288 -172 -42 3 332 -249 -62 -28 157 -99 60 -29 -78 77 283 15 55 140 -171 120
3658A20K00j98k09J83J8j26P4J64k01O3m73M06r5J28J47k96J09K1M9Kj94L57j50
3681I9l2K0k21K79m13K60r3K22k08q5K09J48mk40N6j34K45P7l63J47k30L11k10
3704a60qL24j0Kj40m4o1m6K06j12M5P9j06J09j28j9O0J23r9r7O3M7OJ06l74M17
3730A83j35m5j33J05l8R7j53J07M6j23K98l62J45k6j08K47k13K71j11K19k87k42
3752b58K78q2Q4K5j5J00j43m7Kp9L15L4j91j15K58l59L81j40j70L1j75J24J80
3775C8qop0L23l75Q3j5p4q3K80m9k67K64k2n1N6j18o8M67j99k25L9P9Q4k08L05
3801A80r8n3k7q9J53j23j9m6O4Q9j43N9N0J46o6K0l1j34J14J50l48j13L48j95
3825a12L18j24r4J8J23r2j07p0K46j49J67j1j9k12J57m0m3j1O3J06j29J51k14
$$ plain form
3658 120 320 122 -87 96 114 -12 62 226 25 88 -385 21 -74 54 201 -95 14 35 84 86 -108 249 99
3681 99 67 87 -134 145 -268 -8 -101 121 -87 -172 37 185 181 -59 -3 -137 108 185 -178 -31 -261 50 -160
3704 -160 -168 156 146 148 8 -36 -97 -143 63 -49 -4 75 -31 78 -50 -69 -9 114 15 -82 -19 28 34 140 -234 183
3730 183 48 3 -130 -25 -63 34 -119 -12 34 -89 209 -153 -8 -34 -142 105 -108 163 52 271 -16 -258
3752 -258 20 -62 22 47 32 132 -11 -58 -56 -135 180 214 23 -92 166 -193 188 48 -122 -91 -266 -142 38
3775 38 30 24 -46 277 -98 -15 -30 -104 -187 93 44 -223 41 19 -32 24 -94 -162 305 106 -119 -80 -1 83 -125 180
3801 180 82 29 2 -87 66 -57 -76 -122 -58 31 -112 -53 -3 143 77 97 66 -68 46 196 -152 -265 83 -112
3825 -112 206 82 -12 6 129 37 -70 -140 106 -43 124 113 94 -118 39 -1 -44 -55 8 114 -15 136 -78
3848g8J92J26n33K49r6L39l91J07lK9k47J41K30k76K21j8J21j1j62K2Lk4K0j05
3872a44J77Q2mj19N0j83j31M25j93n7j20K92O2k26L3p5J68J55p0j45J3N4j74K48
3896A18j83Q2P5j60K1J8R7J39l20K5L09k04K96m76K01J9JmO6j52j23K29j6L7j37
3921d2J07q2J79k01J08j41q6L03j14j75j47L45N3j09Q7J17k49k33N54l03Q3j37
3943h3J34j0j21J80r5qK08l34M0J76j01m8p5K11j2Pj47N4J20k08R7p8J90j47Q0
3968C0m5J78j73R1j36K29l32J45R3qj04j07J33k7J72m04MK64J14j63L21l32O0
3991Cp0L4j20K88j32p1J61j54P7J05q0j88k5L04j28p1o2o5J83k06N6K06J01O3
4015B09j06n2K1k00J95N0j12r9K86j16K15m05n0J40k4l3J01p8Q3r6J98J74n36
$$ plain form
3848 -78 114 240 -293 -44 -140 199 -192 -85 -88 -59 -306 -165 65 -211 10 -8 113 102 -60 -38 -35 -59 -39 -144
3872 -144 33 115 111 -8 42 -141 -272 153 -40 -97 -217 75 137 -89 -56 -131 37 192 122 -23 -10 44 -130 118
3896 118 -65 17 92 -68 -47 -29 68 207 -113 -88 221 17 313 -163 38 57 58 54 120 -32 -155 74 58 95 -42
3921 -42 65 -17 162 -39 69 -72 -158 145 31 -144 -291 54 107 -2 85 202 -47 -280 274 -29 54 -83
3943 -83 51 41 -80 100 5 -3 205 -129 -89 87 -14 -62 -137 74 62 69 -78 -24 96 -112 -15 -93 97 -50 30
3968 30 -15 163 -10 81 -55 174 -158 -13 80 72 -32 -139 -6 -33 139 -265 -261 3 117 -46 275 -57 3
3991 3 -67 -33 -153 135 3 -68 93 -61 16 121 41 -147 -172 132 4 -67 -129 -194 -11 -217 -161 45 146 209
4015 209 103 51 72 -128 67 117 5 -94 192 76 291 -114 -164 -24 -48 -81 20 -58 25 -71 127 301 -235
4038b35J34P8K23k12j36K39J43l26r0P1L73k36K5m5k9J20k21J36PM2j65O2J34
4061I2k6jj62K71l8k62J25J78m27L42o0K39l74lJ15j11L12l68K20P0j04r8L3J07
4085G0Nk76J60P4j65m3K52J09l94K02Q9Q8l73J34J12J06k85K48p9j8p4j10J66
4108bm6J20k91J1J69Q7p7k57L70k27K08Rj36K27k78J42jJ61j43J09p5M1k23J62
4132F0j44J25J90j33J67k05m8K71k9l30R2K32k30j43N5R5J16j55k15J67O4k41
4154b39Q3K81r8J07l37K2L67k78j31L37n9o7MJ61M2k73j35K63J73k83o4J60j22
4177h6nK2K33j7j34l9n2O8j12J89l3P5q3j27K27J05j35j60J7M9k5j69K61P3j51
4202iM8j82K37j61j98L47r5j29j03L88l11l0J38J24m8k52K27N1Qk85j9M18j1l47
$$ plain form
4038 -235 -101 -23 200 -12 -148 91 234 -92 -182 -111 262 26 51 6 -23 97 -124 12 19 61 -104 -42 92
4061 92 66 65 -97 174 136 -126 -1 177 -250 92 32 271 -103 -106 9 -102 210 -158 62 132 28 -70 -37 70
4085 70 75 -201 -41 33 -132 -175 77 186 -208 -6 83 171 -202 -68 44 150 -135 113 34 16 -58 -168 -2
4108 -2 -48 72 -219 -208 -39 48 -29 -286 84 -143 65 74 -62 165 -113 29 28 189 46 155 80 121 -102 60
4132 60 -84 41 231 98 265 60 12 283 254 -76 16 248 18 -125 -70 25 141 -14 -229 -62 2 -239
4154 -239 -156 125 27 134 -203 -181 186 -92 -223 114 55 -12 -8 153 195 -78 -213 50 223 -60 -124 36 -86
4177 -86 -91 -69 164 147 13 -26 -78 -10 -122 67 34 109 26 -101 126 231 96 -64 -47 2 -23 -192 69 142 -9
4202 -9 39 -143 94 -67 -265 82 -13 -142 -245 143 -168 -198 -60 64 16 -236 -9 42 50 -235 -254 164 153 -194
4226a94j00K00L0Nj67K69K51n28K65J07k3Qk14K80k87rJ70Ok78ML00J80k66m4
4250c5J68m2pk75J02J18l6M5q9P3L6k40O3K76j34Qj92J12J72j01K2J01r1J11j63
4275BM8M6j64J9J71k7p8k69M64L0n74L04q3K26j40K13r7j77J24J42k16n0QP1J33
4300A26j71J90r4j5k1l75N68j74J12q3K4k5j66%p6K71kj46o6K95l77K00P4mj60
4325i5j52Q8K75n0l27K56J41k45J01o3K29n1j1l16K02N4K5J58l08J67j06LM2J17
4349A34j97J48K02k06K6k71K59k34L06k66J18L5r3J60j11K17o19M25j28K44r3
4370E6n5J79p6j03K9J57k51K01k7J5j59j97J89J14j57K02J13k22k10j21J97J81
4392E5l21LJ24P4J79l75J38J89j39Q1k4L2j14q7J67J53R0k77J55Q5l66j67L55
$$ plain form
4226 -194 -294 -94 -64 -59 -226 43 294 -234 31 138 115 123 -91 189 -98 -107 63 69 -209 -205 95 275 9 -35
4250 -35 133 91 84 -191 -89 29 -7 38 -51 22 58 -182 -119 157 23 31 -161 -49 123 22 44 145 54 165 2
4275 2 50 96 -68 -49 122 95 17 -252 212 242 -332 -28 -111 115 -25 188 91 -86 38 180 -36 -86 -78 -7 126
4300 126 -45 145 51 36 15 -360 208 34 146 63 87 62 -104 -104 -180 91 89 -57 -123 172 -205 -5 69 65 -95
4325 -95 -247 -159 116 66 -261 -5 136 -109 -8 -71 158 107 96 -220 -18 36 61 219 -89 78 -28 -25 17 134
4349 134 -63 85 287 81 107 -164 95 -139 167 -99 19 54 -39 121 10 227 -392 33 -95 149 56
4370 56 1 180 104 1 30 187 -64 137 110 125 -34 -231 -42 72 -85 117 230 8 -202 -323 -126 55
4392 55 -266 -263 -139 -65 114 -261 -123 66 -73 8 -16 16 -98 -185 -18 135 225 -52 103 188 -178 -345 10
4415A0O4K9N1k2K39n12R0R2l2Q3k49J6K39l09J77J89Q9j35k09P7K25k55K0p0K22
4440A19j44L6Lj67L24j49j05M06o6k39l26M63q0k71L34n6j09N1%M7j37J2mK2m
4465d0q4J24K24l50j99N63k70Lj54J30J91j60k94L94k4R3n60K82L66k54q2J56
4487E5j33N5r4Q9K82j18l58J60K70j51j03n3R7pk90K72N8j59K76J9M7k03R8j73
4511f4K65k92L08q8M1j07n6J45R0l37j64L36j0m2k19K80m32L52k21L92n0m16K07
4534h2K52r5k19n2L93l31J20J43j20K78n25N32m7k43m1p2J83p3j42L8N6J30j01
4557a8j06M94k68m34K61J69j44o2K05n5J55j41j50J17j5M8l60K90K01j84p5K02
4579A30j38m9M7k9J77m5m29M88j23k3l9K1O0k40K91o9K0m1j2qO6K07m28K23K67
$$ plain form
4415 10 74 103 154 132 371 -141 -51 41 9 92 -157 -141 98 -211 -34 155 244 109 -100 -23 202 -53 -33 -103 119
4440 119 -25 11 14 -153 171 22 -83 323 257 18 -308 155 75 -196 138 82 -27 24 24 71 -66 -54 -58 -36 -40
4465 -40 -124 0 224 -126 -325 238 -32 -29 -183 -53 138 -22 -316 78 54 147 -413 -131 235 -19 -101 55
4487 55 -78 -23 -117 -28 254 136 -222 -62 208 57 -46 -99 -2 -9 -299 -27 31 -128 148 167 214 11 109 -64
4511 -64 201 -91 217 129 170 63 7 152 242 -95 -259 77 67 25 -194 86 -346 6 -215 177 127 -289 -82
4534 -82 170 75 -144 -196 197 -134 -14 129 9 287 -238 294 247 4 -37 -109 74 1 -141 -103 -47 83 -18
4557 -18 -124 370 102 -332 -71 98 -46 -108 97 42 197 56 -94 23 8 56 -304 -14 187 3 -72 130
4579 130 -8 -57 -10 -39 138 93 -336 152 29 6 -33 -12 48 -192 99 30 50 9 -3 -11 55 262 -166 57 324
4604C24l80q4J98j8j53J78O2J30l11P8p8J52J09k73Q6L14k77p2P1j92K6M8J36
4627G4k17k4K15j20K20k66K46J0k76pL57k33L93m73M6L39o3j59P5n9L0l36M4L84
4651B00j76J06m29K65L08l83N0n7K11p9l22M38j81L7K92k41Mj22r0L30j57N3m2
4674A5M5R4l4k19J59J9j84Q3j39J72j92J96kL9j96R4P2K5k80K8N15l82j8J50N2
4699A12j28P3m7P5n3k16J84O1M4k84L33M9k59r9j3L35k76O7j20K04K80l79k29
4722b86K27Jm3L18r0k09p7J82K59m0l47J91J47n34K34l9J13j91Q8J14q5R3j64
4745a38o6K30m8j62J27O0m9J41k13L5J29K8OJ02j31j63Q6L50j40l53J87K12m30
4768b00J12K92K6l75j07J67L52l50n3K35K2Mk19Q2J66j84Kk41K62J86j99r7K38
$$ plain form
4604 324 -56 -140 58 40 -113 65 127 257 -54 24 -54 98 207 -66 20 334 57 -15 56 -136 -110 -62 74
4627 74 -143 -167 48 -72 148 -118 128 138 -138 -145 212 -21 372 -101 -55 284 221 62 137 78 108 -228 -184 200
4651 200 24 130 -299 -34 274 -109 -59 -116 95 16 -306 132 -49 -12 280 39 43 -79 -169 161 4 57 15
4674 15 60 154 120 -99 60 79 -105 -22 -161 11 -181 15 13 52 -144 -50 22 47 -233 -205 310 -72 -90 60 112
4699 112 -16 57 10 85 32 -184 0 61 105 -179 154 203 -56 -155 -168 167 -109 -42 -162 42 322 -57 -286
4722 -286 -59 -58 -101 217 127 -82 -159 23 282 242 -105 86 233 -301 -67 -106 7 -184 -96 18 -67 26 -138
4745 -138 -204 26 -22 -184 -57 3 -46 95 -118 -83 46 74 80 182 51 -112 -26 324 184 -169 18 230 -200
4768 -200 -88 204 230 -145 -252 -85 267 -83 -136 99 121 125 -94 -12 154 -30 -28 -269 -7 179 -20 -117 121
4791A21k02N5M4o8J68k62J61J00l37K19L6J3m05K08J5K30l6R9m3J7n9j50k4J66
4815F6j43J74k52J59O0k54J40K40l30l2M66l15Q9j88K01j89O1N5J06j3j85J06
4837B2J88J51l87k2MJ88p9J26j32j60K5N9J48%j13j61K97k17l8lJ02q3J75k53
4861a63J95l8J35O7k8j39j02Q4j8k9N4l39L80j8K4j36n0L36k36O1J79j75J06l52
4885b02J65L2l30J81L27o2k8j66J54O1j42J7m3L14l72o1J63J18k11QL28j00k34
4908h3k76L34MQ2j45J72R3j49j89K15K25m06L09r3L1k18Q5J44j15J94j98j1O7
4931G2j81N5J7j15J03j23J75J30l81O0J91J46k29J26J02J2j89m0L13k22j61M1
4953i8M70r0k75J29j3k03k2R7J51K0n31K99K34J29n43J97j26R9j48K16L26k85
$$ plain form
4791 121 -81 -26 18 -50 118 -144 17 117 -220 -1 35 48 -357 -149 -134 96 60 159 116 133 74 -76 -100 66
4815 66 -77 97 -155 4 64 -190 -50 190 -140 -172 294 -21 68 -120 81 -108 -47 8 114 101 -84 22
4837 22 210 361 -26 -48 -44 144 65 191 59 -101 -76 -17 131 131 18 -143 154 -63 -101 -104 -2 -85 90 -163
4861 -163 32 -6 129 196 168 29 -73 11 -7 -36 18 -321 59 41 65 -71 -121 215 -21 40 219 44 150 -202
4885 -202 -37 -5 -335 -154 173 111 83 -83 71 132 -10 7 -36 278 -94 -155 8 126 -85 -77 251 151 -83
4908 -83 -359 -25 -21 61 -84 88 181 32 -157 58 283 -123 186 93 124 -94 -9 135 20 214 16 5 72
4931 72 -109 -54 -37 -152 -49 -172 3 133 -248 -188 3 149 -80 46 148 160 -29 -69 244 22 -139 -98
4953 -98 372 282 7 136 123 -80 -102 -5 146 166 -365 -66 168 297 -246 -49 -175 -76 -224 -8 318 33
4975C3j41q9K23q2j61K49MN6l90K31K19Q5k99k8K16n3j69K2K46j32l4j68L13o1
4999I0q9p0O7Q9k82M21l25L50k24j69K43N3j29j99N5L4K33j06r6L34l76n3K57
5022A08N1l28j44N82l34J47j68K3J08Oj04J18k9r2J56Q9J4j75j79J07K35l96K41
5045C6Q6J20k77q0K79R1l10j07J64J08j35N8J73K5j83j74M60o69L03K7K21k95
5067g9j9M8Q9j71J7R0q1L2k6J7K01k55j57L65J1K47m17J41K30j33j96j92L85j27
5091B0j38o9M78j22k43O3J46J37m58P3J21o6k15L88R3m17R5O6L16l15J06j2J28
5114A75k14M9qJ34k45p1J41L6J18l38L95q1r9j41J77L06l95k25K60L02k00k11
5136a35L0M83m21p3R7J28%j15M0K87k28l14L66j02J62n6j84J49p7j83K72K39l29
$$ plain form
4975 33 -108 -197 26 -56 -217 32 36 92 -298 -67 152 237 -62 -90 126 73 -96 -74 172 40 6 -162 151 90
4999 90 1 -69 -2 87 -195 226 -99 251 27 -142 101 154 25 -174 -119 -85 148 42 -54 280 -96 -149 108
5022 108 159 -169 -313 269 -65 82 -86 -63 45 51 -53 65 36 -56 100 189 203 28 -151 -44 191 -205 36
5045 36 122 242 -35 -115 164 255 -55 -162 2 110 -25 33 206 231 48 -126 334 -335 -32 -5 216 -79
5067 -79 -98 -50 39 -132 -115 -25 -106 -74 -100 -83 118 -137 -294 71 82 329 -88 53 283 150 -46 -238 147 20
5091 20 -118 -187 291 169 -74 -11 135 272 -186 -113 8 -58 -273 115 208 -209 -114 -48 268 -47 59 47 175
5114 175 -39 10 2 136 -109 -180 -39 -3 115 -223 172 91 -8 -149 28 334 -61 -286 -26 276 76 -135
5136 -135 -105 378 -43 -116 -19 109 109 -6 34 321 93 -221 145 43 205 149 -35 114 37 -146 126 365 36
5159C6j60J96k66J26J12k66M64l72J4k8L62j20j06L3J35j63N7k3L67l22k95M97
5181B78k68j46J43J2j10Qr1K21j71J90M4k20L51m12N7K43K28m49OK27l9j15P9
5204F6K5Q6k88L3K67l3j37j43M22j12m63J70L34j54o9j97M75l99R3l4K12j15o2
5227b3J23M3o8l8j73J71k06L02j73l12M61M4m17M49k13j75L9K3n8J00K64l9K27
5250C51j39k51J38J44J1k15M3P0j35o5L27k6k92m9M1J60k29Q7J37k5j30J29QJ06
5274A96l74j36N96l82j24J81J72K16n15J11J90o6k43j7K79K94m12k89M20K71n16
5295a48J62J84j33k57J73K35k38J89j33j71K35m7j66K36j22k07J47J08j78k9J99
5316C9o9k85J57LJ00L51m73L66j10j85J85q8j2qo7K0J67J3l54L96n5j09l7p5P6
$$ plain form
5159 36 -124 72 -194 -68 44 -222 242 -130 -116 -144 218 98 -8 25 160 -3 54 31 398 76 -219 278
5181 278 10 -136 7 19 -91 -83 -174 47 -124 66 110 -110 241 -171 -114 129 357 -92 -86 141 102 -13 66
5204 66 91 177 -111 -78 189 156 19 -124 298 186 -277 -107 227 73 4 -193 282 -117 -24 -58 154 39 -23
5227 -23 100 143 75 37 -136 35 -171 131 -42 -354 107 151 -266 183 -30 -205 -166 -143 -201 -101 163 124 351
5250 351 212 -39 99 243 254 39 82 152 17 -48 279 253 -39 -88 -47 113 -116 -29 108 83 -47 82 90 196
5274 196 -178 -314 282 -100 -224 -43 129 345 -170 -59 131 65 -178 -195 84 378 -34 -323 97 368 -148
5295 -148 14 198 65 -192 -19 216 -22 167 34 -137 98 51 -115 121 -1 -208 -61 47 -131 -160 39
5316 39 -30 -315 -158 -155 -55 296 -177 189 79 -106 79 -9 -21 -29 -96 -76 91 104 -250 146 91 -18 -55 -130 -54
5341e4J00j41J11LJ68m37K43J85N0k43j75N82m02k44J99J85q8j42J76Q0J03l21
5363f2Q9Q2k06j08K01N7j08m9n7L59j10l85J31OK74p1j03K83K59l34j22Nm9j15
5387a33J01K24l71J40o7K25k5j10r8L11j11k34K48q3N7j10K42r9o5n8j30N3lk75
5411c71J09M80k87K21Jj18J9l70M78m7k27J98K07r1Lk79K33r0l3K1J7K07m24j48
5435b91J46L37K4l29P2J14K32n54J97J76k62J71o4K8N0KJ42P0l55K4J48L17j13
5458B82m52O0K61oj62j89M39j54j68o7J28P9k45K10K20l46M3o0L09j34j37m8J49
5481A2j50m4J31K36k11pK31R8j47j64lJ90o7p6%K07l35o8L85k29j2r2J76l8Q4
5506A07k36J87M4m6j51Q5K44j95n2R9K2R3k64o7K02J22k28j66K36m5k4oJ54oj19
$$ plain form
5341 -54 46 -95 16 19 187 -250 -7 178 228 -15 -190 392 -10 -254 -55 130 42 -100 76 156 259 -62
5363 -62 27 109 -97 -205 -4 53 -55 -104 -161 198 88 -297 -166 -160 114 43 -60 223 482 148 26 31 -18 -133
5387 -133 -32 192 -179 -39 -106 119 94 -16 -114 197 86 -148 100 17 74 -36 206 107 42 -16 -146 -93 -96 -371
5411 -371 -262 218 -69 152 153 35 54 -316 162 115 -112 86 293 202 205 -74 159 69 36 57 74 281 -143 -291
5435 -291 -145 192 216 -113 -41 73 305 -249 -52 124 -138 33 -31 -3 47 49 191 261 -94 -70 78 395 282
5458 282 -170 -110 151 145 -17 -206 233 79 -89 -156 -28 51 -194 16 236 -110 -67 -127 182 48 -89 -137 12
5481 12 -138 -182 -51 185 -26 -33 198 296 149 -15 -18 172 105 29 29 236 -99 -167 218 -11 -23 -115 61 23 107
5506 107 -129 58 102 56 -95 -10 234 39 -13 86 108 201 -63 -130 72 194 -34 -200 36 -9 -33 -39 115 109 -10
5531a0mLO0l83J11J45J46k63N32l49K07l22J54J34l01Q1J57J21j01k00J49J88
5553B55j83m08M94k2p7k12Q0K53l80m0L00l4j16k52J57M4J08L1j03J64k5j62K
5576a26M40l12k91N96l68J30j09J24p7R1k95K61J58m38L7k8N00l66j33J68L26
5597B88l43j3m6K46l25K10K23j55k22r1J45J62j88k1J67n4k72L5L09J40j18j63
5619h6K50k8l21J19K96K7l22%J37j12r0j90N45j16j16n8n6L49l67J10K56J4l13
5642g2k01K52oj01K20O0j62mJ06R2p0jl97K45K31m15J19M7J9j86j72M97k68k8
5666a95Q3O3J8M8j2K56r9k22N7nP1L29m91J60j06p2J13k0N0l22J78J71n0j34M7
5691h4J96J3l14K25n8j09p2J71Q1j09p8J61M8J5j28L02j62oj23j18J86J13l85
$$ plain form
5531 -10 -14 -11 49 -334 -223 -78 68 -195 337 -12 195 -127 27 161 -140 -59 98 219 118 -82 67 255
5553 255 72 -336 158 136 59 -153 -73 180 -200 -240 60 26 -90 -342 -185 -141 -33 -2 -105 59 34 -128 -126
5576 -126 314 2 -289 307 -61 69 -40 84 7 98 -197 64 222 -216 -179 -207 293 -73 -206 -38 288
5597 288 -55 -68 -114 132 -193 17 240 85 -137 -228 -83 79 -109 -130 37 -17 -289 -254 55 195 77 -86
5619 -86 164 136 -185 -66 230 257 -65 -65 72 -40 -130 -320 225 109 -7 -65 -121 228 -139 -29 227 241 -72
5642 -72 -273 -21 -27 -128 92 152 -10 -14 92 184 114 113 -284 -39 192 -223 -104 -57 -38 -224 -396 101 -167 -195
5666 -195 -112 -49 -31 17 5 261 162 -60 -3 -8 63 392 -99 61 -45 -117 -4 -24 26 -296 -118 53 3 -131 -84
5691 -84 112 125 -189 36 -22 -131 -203 -32 49 -60 -138 23 71 86 -42 260 98 92 -31 -149 37 150 -235
$$ [...]
8191a8
##END NTUPLES=NMR FID
##END=
