##TITLE=1H_SL94-Dau(X)
 CDCl3
 8 sc, 
 6.07.2022
##JCAMPDX= 6.0         $$ Bruker NMR JCAMP-DX V2.0
##DATA TYPE= NMR FID
##DATA CLASS= NTUPLES
##ORIGIN= UXNMR, Bruker Analytische Messtechnik GmbH
##OWNER= root
$$ XWIN-NMR		Version 3.5
$$ Wed Jul  6 13:47:42 2022 Russian Standard Time (UT+4h)  she@DPX200
##.OBSERVE FREQUENCY= 200.1313499994
##.OBSERVE NUCLEUS= ^1H
##.DELAY= (6, 6)
##.ACQUISITION MODE= SIMULTANEOUS
##.ACQUISITION SCHEME= undefined
##.AVERAGES= 8
##.DIGITISER RES= 18
##SPECTROMETER/DATA SYSTEM= spect
##.PULSE SEQUENCE= zg30
##.SOLVENT NAME= CDCl3
##.SHIFT REFERENCE= (INTERNAL, CDCl3, 0, 15.7039)
##AUDIT TRAIL= $$ (NUMBER, WHEN, WHO, WHERE, WHAT)
$$ ##TITLE= Audit trail, XWIN-NMR		Version 3.5
$$ ##JCAMPDX= 5.01
$$ ##ORIGIN= Bruker BioSpin GmbH
$$ ##OWNER= she
$$ F:/spectra/data/she/nmr/H-F/1/audita.txt
$$ ##AUDIT TRAIL=  $$ (NUMBER, WHEN, WHO, WHERE, WHAT)
(   1,<2022-07-06 13:46:24.70 +0400>,<she>,<DPX200>,
      <created by zg, POWCHK disabled, PULCHK disabled
       configuration hash MD5:
       00 E9 B6 7A A2 85 ED C7 34 08 36 98 17 FE 4E 26
       data hash MD5: 16K
       A1 BD A0 93 C3 4F 0A 52 1D 34 30 84 11 D7 E7 F5>)
$$ ##END=
$$ 
$$ hash MD5
$$ B2 BB A7 DB 7D 47 75 1C 34 57 46 5D 74 CA C4 26
##$RELAX= 
##$RELAX= 
##$RELAX= 
##$RELAX= 
##$RELAX= 
##$RELAX= 
$$ Bruker specific parameters
$$ --------------------------
##$DU= <F:/spectra>
##$EXPNO= 1
##$NAME= <H-F>
##$PROCNO= 1
##$TYPE= <nmr>
##$USER= <she>
##$AMP= (0..31)
100 100 100 100 100 100 100 100 100 100 100 100 100 100 100 100 100 100 
100 100 100 100 100 100 100 100 100 100 100 100 100 100 
##$AQSEQ= 0
##$AQ_mod= 1
##$AUNM= <au_zg>
##$AUTOPOS= <>
##$BF1= 200.13
##$BF2= 200.13
##$BF3= 200.13
##$BF4= 200.13
##$BF5= 200.13
##$BF6= 200.13
##$BF7= 200.13
##$BF8= 200.13
##$BYTORDA= 1
##$CFDGTYP= 0
##$CFRGTYP= 5
##$CHEMSTR= <none>
##$CNST= (0..31)
1 1 145 1 1 1 1 1 1 1 1 1 1 1 1 1 1 1 1 1 1 1 1 1 1 1 1 1 1 1 1 1 
##$CPDPRG= <>
##$CPDPRG1= <>
##$CPDPRG2= <>
##$CPDPRG3= <>
##$CPDPRG4= <mlev>
##$CPDPRG5= <mlev>
##$CPDPRG6= <mlev>
##$CPDPRG7= <mlev>
##$CPDPRG8= <mlev>
##$CPDPRGB= <>
##$CPDPRGT= <>
##$D= (0..31)
0 1.2 0 0 0 0 0 0 0 0.06 0 0.03 0 0 0 0 0.0002 0 0 0 0 0 0 0 0 0 0 0 0 
0 0 0 
##$DATE= 1657100784
##$DBL= (0..7)
120 120 120 120 120 120 120 120 
##$DBP= (0..7)
150 150 150 150 150 150 150 150 
##$DBP07= 0
##$DBPNAM0= <>
##$DBPNAM1= <>
##$DBPNAM2= <>
##$DBPNAM3= <>
##$DBPNAM4= <>
##$DBPNAM5= <>
##$DBPNAM6= <>
##$DBPNAM7= <>
##$DBPOAL= (0..7)
0.5 0.5 0.5 0.5 0.5 0.5 0.5 0.5 
##$DBPOFFS= (0..7)
0 0 0 0 0 0 0 0 
##$DE= 6
##$DECBNUC= <off>
##$DECIM= 32
##$DECNUC= <off>
##$DECSTAT= 4
##$DIGMOD= 1
##$DIGTYP= 9
##$DL= (0..7)
0 120 120 120 120 120 120 120 
##$DP= (0..7)
150 150 150 150 150 150 150 150 
##$DP07= 0
##$DPNAME0= <>
##$DPNAME1= <>
##$DPNAME2= <>
##$DPNAME3= <>
##$DPNAME4= <>
##$DPNAME5= <>
##$DPNAME6= <>
##$DPNAME7= <>
##$DPOAL= (0..7)
0.5 0.5 0.5 0.5 0.5 0.5 0.5 0.5 
##$DPOFFS= (0..7)
0 0 0 0 0 0 0 0 
##$DQDMODE= 0
##$DR= 18
##$DS= 0
##$DSLIST= <SSSSSSSSSSSSSSS>
$$ [...]
##$SUBNAM2= <"">
##$SUBNAM3= <"">
##$SUBNAM4= <"">
##$SUBNAM5= <"">
##$SUBNAM6= <"">
##$SUBNAM7= <"">
##$SUBNAM8= <"">
##$SUBNAM9= <"">
##$SW= 18.0517283424941
##$SWIBOX= (0..15)
0 0 2 0 0 0 0 0 0 0 0 0 0 0 0 0 
##$SW_h= 3612.71676300578
##$TD= 16384
##$TD0= 1
##$TE= 0
##$TE2= 300
##$TE3= 300
##$TEG= 300
##$TL= (0..7)
0 120 120 120 120 120 120 120 
##$TP= (0..7)
150 150 150 150 150 150 150 150 
##$TP07= 0
##$TPNAME0= <>
##$TPNAME1= <>
##$TPNAME2= <>
##$TPNAME3= <>
##$TPNAME4= <>
##$TPNAME5= <>
##$TPNAME6= <>
##$TPNAME7= <>
##$TPOAL= (0..7)
0.5 0.5 0.5 0.5 0.5 0.5 0.5 0.5 
##$TPOFFS= (0..7)
0 0 0 0 0 0 0 0 
##$TUNHIN= 0
##$TUNHOUT= 0
##$TUNXOUT= 0
##$USERA1= <user>
##$USERA2= <user>
##$USERA3= <user>
##$USERA4= <user>
##$USERA5= <user>
##$V9= 5
##$VALIST= <valist>
##$VCLIST= <CCCCCCCCCCCCCCC>
##$VD= 0
##$VDLIST= <DDDDDDDDDDDDDDD>
##$VPLIST= <PPPPPPPPPPPPPPP>
##$VTLIST= <TTTTTTTTTTTTTTT>
##$WBST= 1024
##$WBSW= 4
##$XGAIN= (0..3)
0 0 0 0 
##$XL= 0
##$YL= 0
##$YMAX_a= 109225
##$YMIN_a= -255775
##$ZGOPTNS= <>
##$ZL1= 120
##$ZL2= 120
##$ZL3= 120
##$ZL4= 120
##$ABSF1= 10
##$ABSF2= 0
##$ABSG= 5
##$ABSL= 3
##$ALPHA= 0
##$AQORDER= 0
##$ASSFAC= 0
##$ASSFACI= 0
##$ASSFACX= 0
##$ASSWID= 0
##$AUNMP= <proc_1d>
##$AZFE= 0.1
##$AZFW= 0.1
##$BCFW= 1
##$BC_mod= 2
##$BYTORDP= 1
##$COROFFS= 0
##$CY= 11.3945322036743
##$DATMOD= 1
##$DC= 2
##$DFILT= <>
##$DTYPP= 0
##$F1P= 2.36226072786647
##$F2P= -0.459571619588291
##$FCOR= 0.5
##$FTSIZE= 0
##$FT_mod= 4
##$GAMMA= 1
##$GB= 0.15
##$INTBC= 1
##$INTSCL= 1
##$ISEN= 128
##$LB= 0.24
##$LEV0= 0
##$LPBIN= 0
##$MAXI= 10000
##$MC2= 0
##$MEAN= 0
##$ME_mod= 0
##$MI= 1.114404
##$NCOEF= 0
##$NC_proc= 0
##$NLEV= 6
##$NOISF1= 3.799351
##$NOISF2= 2.8
##$NSP= 1
##$NTH_PI= 0
##$NZP= 0
##$OFFSET= 15.70392
##$PC= 1
##$PHC0= -18057.45
##$PHC1= 11.00069
##$PH_mod= 1
##$PKNL= yes
##$PPARMOD= 0
##$PSCAL= 0
##$PSIGN= 0
##$REVERSE= no
##$SF= 200.130013532006
##$SI= 16384
##$SIGF1= 3
##$SIGF2= 2
##$SINO= 400
##$SIOLD= 16384
##$SREGLST= <1H.CDCl3>
##$SSB= 0
##$STSI= 0
##$STSR= 0
##$SW_p= 3612.71676300578
##$SYMM= 0
##$S_DEV= 0
##$TDeff= 0
##$TDoff= 0
##$TI= <>
##$TILT= no
##$TM1= 0
##$TM2= 0
##$TOPLEV= 0
##$USERP1= <user>
##$USERP2= <user>
##$USERP3= <user>
##$USERP4= <user>
##$USERP5= <user>
##$WDW= 1
##$XDIM= 8192
##$YMAX_p= 0
##$YMIN_p= 0
$$ End of Bruker specific parameters
$$ ---------------------------------
##NTUPLES= NMR FID
##VAR_NAME=  TIME,          FID/REAL,        FID/IMAG
##SYMBOL=    X,             R,               I
##VAR_TYPE=  INDEPENDENT,   DEPENDENT,       DEPENDENT
##VAR_FORM=  AFFN,          ASDF,            ASDF
##VAR_DIM=   8192,          8192,            8192
##UNITS=     SECONDS,       ARBITRARY UNITS, ARBITRARY UNITS
##FACTOR=    0.0002768,     1,               1
##FIRST=     0,             0,               0
##LAST=      2.2672688,     0,               0
##MIN=       0,             -255775,         0
##MAX=       2.2672688,     109225,          0
$$ Real data points
##PAGE= N=1
##DATA TABLE= (X++(R..R)), XYDATA
$$ [...]
1983A194o10L5J72m14r54P52N36j105j440L76J216o63j104R04R75q50r11P51J124
$$ 1194 584 619 791 377 -577 175 711 -394 -1834 -1458 -242 -905 -2009 -1105 -130 -980 -1891 -1140 -16
2002a6K34n99N0J090mq62N21J188J79j071j1Q32n41k88K37N3n12o98j83RN6j19
$$ -16 218 -381 -331 759 755 -107 414 1602 1781 710 699 1531 990 702 939 992 480 -218 -401 -392 -336 -455
2024d55k89m70l60L08J92o2J9M45J73o37O8J075P18j043p3J401r3p27K70J354
$$ -455 -744 -1214 -1574 -1266 -1074 -1136 -1117 -672 -499 -1136 -1068 7 725 -318 -391 1010 917 190 460 1814
2044A814J64j012m47N82O11r42q86O31L49j433j104R10J001j125r45O73N56p84
$$ 1814 1978 966 519 1101 1712 770 -116 515 864 -569 -1673 -763 238 -887 -1832 -1159 -603 -1387
2062a387j77R50M43n35m14M07O64k06Q6O29P53n86l34N99O65m76M96j00q21j03
$$ -1387 -1564 -614 -171 -706 -1120 -713 -49 -255 -169 460 1213 627 293 892 1557 1081 1577 1477 656 553
2082E53K19j39o39JK68o14r51J04Q32k60n64l99Q50J75j029L12J424J88j592K78
$$ 553 772 633 -6 -5 263 -351 -1302 -1198 -366 -626 -1190 -1589 -739 -564 -1593 -1281 143 331 -1261 -983
2102i83J804M26j508M27J359l25q87K8J187J95j015n53O11J98j336j31J044O7
$$ -983 821 1247 -261 166 1525 1200 313 341 1528 1723 708 155 766 964 -372 -503 541 608
2120F08j501l81P60j4r16J97M49j38l41J86M67K65K62K5N63l44LN80L40j38M6
$$ 608 -893 -1274 -514 -528 -1444 -1247 -798 -936 -1277 -1091 -624 -359 -97 -72 491 147 150 730 1070 932 978
2141I78J17j0p87J61J044p26r09M22L09p91q34O31N75p98j236N02N43R7p87M70
$$ 978 1095 1085 298 459 1503 777 -132 290 599 -192 -1026 -395 180 -618 -1854 -1352 -809 -712 -1499 -1029
2161a029J147k02j229O73J474k27r58O40Q74m46p01O43R72j08j160M22K96l23
$$ -1029 118 -84 -1313 -640 834 607 -351 289 1163 717 16 659 1631 1523 363 785 1081 758
2179G58n03K25M11j015o60KM91l40j39J33j34p17L03K83J78P3M03M7l15k3P10
$$ 758 255 480 891 -124 -784 -782 -291 -631 -770 -637 -771 -1488 -1185 -902 -724 -651 -248 -201 -516 -539 171
2200A71P31m78k51O87O43r79j50R27N07j407n42Q03L75j049o26P58J58r62o45
$$ 171 902 424 173 860 1503 524 374 1301 1808 401 -141 662 1037 -12 -638 120 278 -684 -1329
2219a329P91O18p63p55L85P84j028o05J711L87n95k60P38M50k62j6O14N6j36j84
$$ -1329 -538 80 -683 -1438 -1053 -269 -1297 -1902 -191 196 -399 -659 79 529 267 251 865 921 785 601
2239F01J08P25l67n12K85k51o27%L96n62m36L59l99n98J30O18l3n90J32N42J42
$$ 601 709 1434 1067 555 840 589 -38 -38 358 -204 -640 -281 -680 -1278 -1148 -530 -563 -1153 -1021 -479 -337
2260c37o05O67P50K2n23k64J091N01q57l02J413k23j374L16R95q9j068k99Q56
$$ -337 -942 -275 475 497 -26 -290 801 1302 445 143 1556 1333 -41 275 1270 1181 113 -186 670
2279F70k15j128q6O19j7q36o08Q76J93r53M55P40m5m90J47Q56L90k21J06K53j88
$$ 670 455 -673 -759 -140 -157 -993 -1601 -725 -532 -1485 -1030 -290 -335 -825 -678 178 568 347 453 706 518
2300E18q1L87Q7q5P5l42p9M7r9L80l04m67m68M69l97o34R6R10o73j119N98J079
$$ 518 437 824 911 826 901 559 480 527 428 808 504 37 -431 38 -359 -993 -897 13 -660 -1779 -1181 -102
2322a02n60n41N67J125n38l94M22J247k83q16J66J184l60q21K93J111l40j468
$$ -102 -662 -1203 -636 489 -49 -443 -21 1226 943 127 293 1477 1117 296 589 1700 1360 -108
2340a08M02N01k95p81J52L61o24n68M7M53l51k50j74N80k37j14J92O93l27K54
$$ -108 294 795 500 -281 -129 232 -392 -960 -913 -460 -811 -1061 -1235 -655 -892 -1006 -814 -121 -448 -194
2360a94N35j83n6O03M25l03l52K39L23l78k79M03M68p80p34J74N06l90q21P50
$$ -194 341 158 102 705 1130 827 475 714 1037 659 380 783 1251 471 -263 -89 417 27 -794 -44
2380d4J10r92o58Q45M93p00k94N21P02o54k20R15Q38o95k70M32O34k05o07Q78
$$ -44 66 -926 -1584 -739 -246 -946 -1240 -719 -17 -671 -891 24 862 167 -103 329 963 758 151 1029
2400A029K19o11m53L12L32l02k71r7j13m56J20k75J4j79n7j5j93j01N87J30j28
$$ 1029 1248 637 184 496 828 526 255 158 45 -411 -291 -566 -552 -731 -788 -803 -996 -1097 -510 -380 -508
2421e08p2L67J71k53K48P86j05l61Q2N09L13o88J49N39J10j163K05L80r9q81l88
$$ -508 -580 -213 -42 -295 -47 739 634 273 355 864 1177 489 638 1177 1287 124 329 709 610 -271 -659
2442f59N06No54j99N44M30r43l31P84K02m41p5N74K82l59K29K87O52k02k37M52
$$ -659 -153 -148 -802 -1001 -457 -27 -970 -1301 -517 -315 -756 -831 -257 25 -334 -105 182 834 632 395 847
2463H47J19l81o0K65l9l09K05m49k98K54j74P5p07J55J71l58m36L00L15k8q48
$$ 847 966 585 525 790 751 442 647 198 -100 154 -20 55 -652 -497 -326 -684 -1120 -820 -505 -533 -1381
2484a381N42P55k03l90O94P22k36n94L64J022m34n24JQ29l53p65J56O50k01q45
$$ -1381 -839 -84 -287 -677 17 739 503 -91 273 1295 861 337 338 1167 814 49 205 855 654 -191
2504a91J01K87O7q56M19q9m27m93P5N21j68k60N26K11j39K9P1M01L61j99K2K64
$$ -191 -90 197 264 -592 -173 -262 -689 -1182 -1107 -586 -754 -1014 -488 -277 -416 -387 -316 85 446 247 269 533
2526E33L3J30K89j50k17K25j34l57mL12j75n81m72K03J09p9n97M04J55m49n43
$$ 533 566 696 985 835 618 843 709 352 348 660 485 -96 -568 -365 -256 -335 -932 -528 -373 -822 -1365
2547a365N36O90l63l73N06P07l84l86O51P60k71n82N76L36m12j15K36J12m09o80
$$ -1365 -829 -139 -502 -875 -369 338 -46 -432 219 979 708 126 702 1038 626 511 747 859 450 -230
2567b30L84L15k57m26J20j40k75j74j59M43j72L0j27j24L56n4K75j59K51J02J79
$$ -230 154 469 212 -214 -94 -234 -509 -683 -842 -399 -571 -541 -668 -792 -436 -490 -215 -374 -123 -21 158
2588A58m8M87L35j31k36j10N15k69l57m1M01o5p70l83O27J50n86l85O06r2n94
$$ 158 110 597 932 801 565 455 970 701 344 303 704 639 -131 -514 113 263 -323 -708 -102 -194 -788
2609g88l41Q30J95n30l60O09L57m90N5M97N14l98j76K76M96m6r1O8j13n2k64L02
$$ -788 -1129 -299 -104 -634 -994 -385 -28 -518 -463 34 548 150 -26 250 746 700 609 677 564 512 248 550
2631E50K04l35n02J40k69K01k86j82p8k04K40j02k24K97L45j71j80o0P05k09r
$$ 550 754 419 -83 57 -212 -11 -297 -479 -557 -761 -521 -623 -847 -550 -205 -376 -556 -616 89 -120 -129
2652a29L47O95m55l25L25O51l54m40K79L85l31q69M42L37l33n38j43J83K8p56
$$ -129 218 913 458 133 458 1109 755 315 594 979 648 -221 221 558 225 -313 -456 -273 -245 -1001
2672a001K28L22j30n40K25M28L22n45N3M92O5J36J00K64P0qr4L48q2J30j20Ol50
$$ -1001 -773 -451 -581 -1121 -896 -468 -146 -691 -638 -146 -81 55 155 419 489 481 387 735 653 783 663 669 319
2695C19J03j05l18l06M36K6q96j0M51O3n82m3M51j3n02j15M85M13Rj10K08J56
$$ 319 422 317 -1 -307 129 155 -741 -751 -300 -237 -819 -862 -411 -424 -926 -1041 -556 -143 -134 -244 -36 120
2717A20K04l87O64M67m90j53J00M92l31j98J62j87k76n70K14K19p9l14k42ol7
$$ 120 324 -63 601 1068 578 425 525 1017 686 488 650 463 187 -383 -169 50 -29 -343 -585 -591 -628
2738f28Rp8N31l44J55j94K86j96M42O6o3P9K41j80J45K43L29l4m18J95n1M8m90
$$ -628 -619 -697 -166 -510 -355 -549 -263 -459 -17 49 -14 65 306 126 271 514 843 809 391 586 535 583 93
2761I3K23J6k15m67n8M33j69m53k4J62q2n89L05M07L69n01j26P42l4p2K6N27J18
$$ 93 316 332 117 -350 -408 25 -144 -597 -621 -459 -541 -1130 -825 -418 -49 -550 -676 66 32 -40 -14 513 631
2784F31l56O6K12L36o4k39M2Q5l03l77J6Rj71m3k76j78J40Q1j92N0l7k92k0K93
$$ 631 275 341 553 889 825 586 628 713 410 33 49 58 -113 -156 -432 -610 -470 -389 -581 -531 -568 -860 -880 -587
2808e87M00J49k12k32N13J71q4q5O29L45k77k77K24N9Jl40J28k39k64j94o4K49
$$ -587 -187 -38 -250 -482 31 202 118 33 662 1007 730 453 677 736 737 397 525 286 22 -172 -236 13
2830A3k17p39L77L06m13K5k43P19l04l61M75J2K71L7R9J19J53j81L08L2L72q2
$$ 13 -204 -943 -566 -260 -673 -648 -891 -172 -476 -837 -362 -350 -79 -42 57 176 329 148 456 488 860 778
2852G78j74p2j82L34l46o0l2Q8m66l12J53M33k74n36J79k9J38k73mN05k25j54
$$ 778 604 532 350 684 338 278 246 334 -132 -444 -291 142 -132 -668 -489 -518 -380 -653 -657 -152 -377 -531
2874e31j13P97J53m06J48M50J9n02L10N21L7l50k45J78o9Kk34J43k6l93k20K12
$$ -531 -644 153 306 -100 48 498 517 15 325 846 883 533 288 466 397 399 165 308 282 -111 -331 -119
2896a19q1k89k76N27k99O1o0J3n5M42m1j09J66R4M83Jj18Q5k5K66k98l2M62m88
$$ -119 -200 -489 -765 -238 -537 -476 -536 -523 -578 -136 -177 -286 -120 -26 457 458 340 425 400 666 368 336 798 310
2920C10l93M10J83k73m68O9J42k34m29N4M83l32k41L20J03J3l41J14O85m28R4
$$ 310 -83 327 510 237 -231 -162 -20 -254 -683 -629 -146 -478 -719 -399 -296 -283 -624 -510 175 -253 -159
2941a59J68L60l0j59J21K72o6rj05L75q2j38k14m8k36J5k05j18P0l05K41p9j00
$$ -159 9 369 339 180 301 573 507 498 393 768 686 548 334 286 50 65 -140 -258 -188 -493 -252 -331 -431
2964d31J7Q5l03j69M44j45J04Q9L62M2l2j11L78K71j26k52J96K5l16J42L87j53
$$ -431 -414 -329 -632 -801 -357 -502 -398 -309 53 95 63 -48 330 601 475 223 419 444 128 270 657 504
2986E04m46j75M66j42l26k41K59l1l77J3k8K69j56k38J14K57K26j83M7K62pJ6
$$ 504 58 -117 349 207 -119 -360 -101 -132 -509 -496 -524 -255 -411 -649 -535 -278 -52 -235 -188 74 67 83
3008H3J48K33j58J56j75L34m3Q8j90o0p6p1J12k66k47L6j08j55j4J43k1k12k19
$$ 83 231 464 306 462 287 621 578 666 476 416 340 269 381 115 -132 -96 -204 -359 -373 -230 -251 -463 -682
3031f82K42M7k78M43K04j1l05L04K06K90k50k16P75o8l98j53L41L14n25j21J42
$$ -682 -440 -393 -671 -228 -24 -35 -340 -36 170 460 210 -6 769 701 303 150 491 805 280 159 301
3052C01J9k88j56K12j12l54J22j19Nq7N7j22Q7j44L25j21K28j08K39L41j55n7
$$ 301 320 32 -124 88 -24 -378 -256 -375 -370 -457 -400 -522 -435 -579 -254 -375 -147 -255 -16 325 170 113
3074A13O71k83j39K08O8r1l50N07p9j33o66J46K44k65k03QK7J34n71N0M36M3n15
$$ 113 784 501 362 570 638 547 197 704 625 492 -174 -28 216 -49 -252 -244 -217 -83 -654 -604 -168 -125 -640
3097f40J18M77l73j1L34jK13nl2M29pk15Q9M11m6m88q6M79l79n0k16Pl38K39l76
$$ -640 -522 -45 -418 -429 -95 -96 117 112 80 509 502 287 376 787 741 253 167 646 267 217 1 8 -330 -91 -467
3122d67K92l15K3j4P4j42J34j05l8J22L39l2kP9L07K75l52j4J45K47l40O1K77
$$ -467 -175 -490 -467 -481 -407 -549 -415 -520 -558 -436 -97 -129 -131 -52 255 530 178 164 309 556 216 277 554
3145E54J81l99j16J6J71l40j90K7J93o02j92M25K6l73l30L53N42l04K9K06K38
$$ 554 735 336 220 236 407 67 -123 -96 97 -505 -697 -272 -246 -619 -949 -596 -54 -358 -329 -123 115
3166A15j89l2N13o5J81j59j9J90k80m6R2J89l29p2L35l57n7J58r9l10Q5N5k42
$$ 115 -74 -106 407 342 523 364 345 535 255 209 301 490 161 89 424 67 10 168 69 -241 -156 -101 -343
3189c43k63Q6K66k49O7l33N38Q3k50J44L71K02m89M8N73R7m42R5M54j80m16J16
$$ -343 -606 -520 -254 -503 -436 -769 -231 -148 -398 -254 117 319 -170 -122 451 548 106 201 655 475 59 175
3211A75M73J3o51l7K09l11l4m02N35q3n34J86L2J74j43J4L7o6q9M39j53L72J68
$$ 175 648 661 10 -27 182 -129 -163 -565 -30 -113 -647 -461 -429 -255 -398 -384 -347 -413 -502 -63 -216 156 324
3234C24p5J12j2j12L57J41k56j89J21l73R8k2K44j59k95JK8j64l71o6O79l69n85
$$ 324 249 361 349 237 594 735 479 290 411 38 136 114 358 199 -96 -95 -67 -231 -602 -668 11 -358 -943
3257i43M54J15K66k61K21M47k90m94M41M93l54O4K49J28j04j33k7K56q4m48L01
$$ -943 -489 -374 -108 -369 -148 299 9 -485 -44 449 95 159 408 536 432 299 272 528 444 -4 297
3278B97O0n4o08R6K89l27q4J23J03m31Q7L9N6p3K80K11n3k23K29o0k6L30J3J90
$$ 297 357 303 -305 -209 80 -247 -331 -208 -105 -536 -449 -410 -354 -427 -147 64 11 -212 17 -43 -69 261 274 464
3302D64Jj88J66K53k90l12L94P8l62l65K22N6p2l86l4J45j86l94L07L80j99l91
$$ 464 465 277 443 696 406 94 488 566 204 -161 61 117 45 -341 -375 -230 -416 -810 -503 -123 -322 -713
3324g13L39K91M3k90J94M29k84q1K34L14p8j06O1k7mmJ31J0k15j13J9q7k15j23
$$ -713 -374 -83 -40 -330 -136 293 9 -72 162 476 398 292 353 326 322 318 449 459 244 131 150 63 -152 -275
3348b75K09r7j92J90j11j84q7L76p3j32o2N34k66J00M6L23K20k12k04L90L33n56
$$ -275 -66 -163 -355 -165 -276 -460 -547 -171 -244 -376 -438 96 -170 -70 -24 299 519 307 103 493 826 270
3370B70QK67k27l41M6K88K2n92j05J8J98k75j0J93J03n50K05L49p5j43l6L39N0
$$ 270 278 545 318 -23 23 311 333 -259 -364 -346 -148 -423 -433 -240 -137 -687 -482 -133 -208 -351 -387 -48 2
3393Bk15J08N65j42j3j11J56K9J10K6k14n8k4J52n6l74O4J21j56k84M1k01J64
$$ 2 -213 -105 460 318 305 194 350 379 489 515 301 243 219 371 315 -59 5 126 -30 -314 -273 -474 -310
3416c10j33R8L18l69L1pK61J05k50N5M13L7j44k39N17K9j02l4L66r9l31lK74m74
$$ -310 -443 -345 -27 -396 -365 -372 -111 -6 -256 -201 212 249 105 -134 383 412 310 276 642 543 212 209 483 9
3440Ij14k0J31j11l55L23j30r1q1J35J38k12M1K52m11L65j48L08J5k4O7R1k4J09
$$ 9 -105 -125 6 -105 -460 -137 -267 -358 -439 -304 -166 -378 -337 -85 -496 -131 -279 29 44 20 87 178 154 263
3464B63J52R3o9j78J42R8l40r4k32L11q4k56J40n1j44j62J54J60k89j25L70K29
$$ 263 415 508 439 261 403 501 161 67 -165 146 62 -194 -54 -105 -249 -411 -257 -97 -386 -511 -141 88
3486H8l21PJ83MJ78j23L67J07k30k9K06L7j32n9J98j59l73p3L05J4k70l74M15
$$ 88 -233 -226 -43 -39 139 16 383 490 260 231 437 474 342 283 481 322 -51 -124 181 195 -75 -449 -34
3509c4k50j8j35J54J67k69N0K82k58K7J86k00K64J66n3l8n1J61K25J16j24qJ25
$$ -34 -284 -302 -437 -283 -116 -385 -335 -53 -311 -284 -98 -298 -34 132 79 41 -10 151 376 492 368 360 485
3532D85m7k43p0K60k31j77m95Q38l72k77o6J09J93m06KK2L70l54K26J64J60j19
$$ 485 438 195 125 385 154 -23 -518 320 -52 -329 -395 -286 -93 -499 -497 -475 -105 -459 -233 -69 91 -28
3554b8j34L32j39Qk18O37Q1k33m3N5J76k83q8K20k05N1k55J14r0k40Q8q0j57J3
$$ -28 -162 170 31 39 -179 458 539 306 263 318 494 211 123 343 138 189 -66 48 -42 -282 -194 -274 -431 -418
3578d18J54j48J49Q6n4K25l47J15K74J33k71J09M15j13k11N4L95j85j44j19J49
$$ -418 -264 -412 -263 -177 -231 -6 -353 -238 36 169 -102 7 422 309 98 152 547 362 218 99 248
3599B48K4j69O2Q3k63p6k84M52j26k84q6L68l88o9O4K87K06l48RM11l1k07K56
$$ 248 272 103 165 248 -15 -91 -375 77 -49 -333 -419 -51 -439 -508 -444 -157 49 -299 -290 121 90 -117 139
3622A39j01M77m46J64Q4J96l83M28k64L6j50k03M3k40Q4N2j80Oj37J73k65J47
$$ 139 38 515 69 233 317 513 130 558 294 330 180 -23 20 -220 -136 -84 -264 -258 -395 -222 -487 -340
3644c40j08L13k04j2J75K57j08j92L83K4j13N1Q9L05k56j98K33J16j15j86j64
$$ -340 -448 -135 -339 -351 -176 81 -27 -219 164 188 75 126 215 520 264 66 299 415 300 114 -50
3665e0J11O0m10K21R1j64j75R3j71J15m2j02N7K58r7M7j40K09r0L90j61nL33j64
$$ -50 61 121 -289 -68 23 -141 -316 -223 -394 -279 -321 -423 -366 -108 -205 -158 -298 -89 -179 211 50 45 378 214
3689B14K58k39Q2O2l22L19J09j04k65j09J39n7j86m3k30K77q7j89J51J06k08k68
$$ 214 472 233 315 377 55 374 483 379 114 5 144 87 -99 -142 -372 -95 -182 -371 -220 -114 -322 -590
3711e90M21J1j56J07O7P3Q9Q1L68p5r1O4M4r5J6j8k18J27o8j24j6J1P3j92j26
$$ -590 -169 -158 -314 -207 -140 -67 22 103 471 396 305 369 413 318 334 316 98 225 157 33 17 28 101 -91 -217
3736b17M1j85k5J54l8m6J40L2j76L28l2L4k6L19J22j43r8k26L89p8O5J1K7j35
$$ -217 -176 -361 -386 -232 -270 -316 -176 -144 -320 8 -24 10 -16 303 425 282 184 -42 347 269 334 345 372 237
3760B37m8m6J82m89J51j40j80K90n00L72o8j01N2j35J95J64j57K14N0P7o1j59
$$ 237 189 143 325 -164 -13 -153 -333 -43 -543 -171 -239 -340 -288 -423 -228 -64 -221 -7 43 120 59 -100
3782a00L90j6k25J69K5J53M2Ok81M15m07J14j35q4k8l7j30j69K20l7j28o3k7J60
$$ -100 290 274 49 218 243 396 438 444 163 578 171 285 150 66 38 1 -129 -298 -78 -115 -243 -306 -333 -173
3806a73j32o5O4J96j66o3N77Lk47q5M05K0N6m8j8K2k1k6K8j2K2k64R6K1j55m1
$$ -173 -305 -370 -306 -110 -276 -339 238 241 -6 -91 314 334 390 342 324 346 325 299 327 315 337 73 169 190 35 -6
3832fk45K5J5j3mm1J10k3J31j47J45q7Q7K83j32J65j40P7J26J37k90q9J17J95
$$ -6 -251 -226 -211 -224 -228 -269 -159 -182 -51 -198 -53 -140 -53 230 98 263 123 200 326 463 173 84 201 396
3856C96j40k34Q5J21p8j35km0M3k75j39K78l58J57j15M57l36k9R6K15J65j17j66
$$ 396 256 22 107 228 150 15 13 -27 16 -259 -398 -120 -478 -321 -436 21 -315 -344 -248 -33 132 15 -151
3879a51K91K10p4OOm8j63J43M4P6l29P6o0O9j62q8r1pj2R9J1j36N3j26O8K50j07
$$ -151 140 350 276 282 288 240 77 220 264 340 11 87 27 96 -66 -154 -245 -252 -264 -165 -154 -290 -237 -363 -295 -45 -152
3906a52J4RjM06k2j08J3Q7Pn0o3K64q5J37j94J63j41k10R1j6o9j03j76J2j80J64
$$ -152 -138 -129 -130 276 254 146 159 246 253 203 140 404 319 456 262 425 284 74 165 149 80 -23 -199 -187 -367 -203
3932b03Q4k18L5K7j03K81M3J52l36M1L88j85RL23k24N5K01k0q5N1o0j90Q8rn8
$$ -203 -119 -337 -302 -275 -378 -97 -54 98 -238 -197 191 6 15 338 114 169 370 350 265 316 256 66 154 145 87
3957H7Jj51j66J75p7l19L26j18J2Nr1J92r4m5j9N5L97l03J92K89k24Q9j73N0K56
$$ 87 88 -63 -229 -54 -131 -450 -124 -242 -230 -225 -316 -124 -218 -263 -282 -227 170 -133 59 348 124 213 40 90 346
3982C46p8j11J17l8r3j28%P9j12o7J03j99k21K8J84n7j64K37j5j11J03K01l0k42
$$ 346 268 157 274 236 143 15 15 94 -18 -85 18 -181 -402 -374 -190 -247 -411 -174 -189 -300 -197 4 -26 -268
4006b68K82n2K70J24k1l1J7J00j81k3J22k80J25j42J99l94N2L48l38j96M0M0J13
$$ -268 14 -38 232 356 335 304 321 421 240 217 339 59 184 42 241 -153 -101 247 -91 -287 -247 -207 -94
4029i4j86J05RK11m28J64J89k59R6J7L01j7j05J68J22K1j49R3J00l53Q7J91l01
$$ -94 -280 -175 -166 45 -383 -219 -30 -289 -193 -176 125 108 3 171 293 314 165 258 358 5 92 283 -18
4052a8K05q8n0j1N1l00O6r2l2Qk4J5J72j76N1j6k8L04jj71KJ80J20K07m08J48
$$ -18 187 99 49 38 89 -211 -145 -237 -269 -261 -285 -270 -98 -274 -223 -239 -267 37 36 -135 -133 47 167 374 -34 114
4078A14J57m2oJ05l2Q8m39K48o6k85L0kO8j27r5K07Nk36K48m58K49K20j40J13
$$ 114 271 229 223 328 296 384 -55 193 127 -158 -128 -130 -62 -189 -284 -77 -72 -308 -60 -518 -269 -49 -189 -76
4102g6Q0j0L6K42j54K66M3k11O8n2k48Q6Q7o4LK3j30Kr6n6r5J57m1j23K9Q0Rj12
$$ -76 4 -6 30 272 118 384 427 216 284 232 -16 70 157 93 96 119 -11 -9 -105 -161 -256 -99 -140 -263 -234 -154 -145 -257
4130b57l07M12J42j43O0j90L56P5l9J75k4K4k06K47J05k45j14K20L8O2m43o5K5
$$ -257 -564 -152 -10 -153 -93 -283 73 148 109 284 260 284 78 325 430 185 71 291 329 391 -52 -117 -92
4153i2J56k96M8J40j93k89K16L7Q2j48J31j59J33p0K66N9K0p6P0J79k06K91J0
$$ -92 64 -232 -184 -44 -237 -526 -310 -273 -191 -339 -208 -367 -234 -304 -38 21 41 -35 35 214 8 299 309
4176C09p7O6j09K61j06k32j40j17j1j34J32J85p6k23J22K36k75p4j74L17Q2j27
$$ 309 232 298 189 450 344 112 -28 -145 -156 -290 -158 27 -49 -272 -150 86 -189 -263 -437 -120 -38 -165
4198a65K02J0L4l34L29L66k96N5M0J74N5l33K23j8j83j88r1M28k48l28J38j07
$$ -165 37 47 81 -253 76 442 146 201 241 415 470 137 360 342 159 -29 -120 308 60 -268 -130 -237
4220b37L8jk40J81K5j82J40L87j94q0K49j36p8L04j0p3R8R8J63p4j76N6o4q7J8
$$ -237 -199 -200 -440 -259 -234 -416 -276 111 -83 -163 86 -50 -128 176 166 93 191 289 452 378 202 258 194 107 125
4245A25k4p2J15q1mj77k8J00n5q8J82l27N8M83o66K1M04m7J75k25J45J17m4J1
$$ 125 101 29 144 63 59 -118 -146 -46 -101 -189 -7 -334 -276 207 -459 -438 -34 -81 94 -131 14 131 87 98
4269I8M5J59J02k96N6J64j51K6k9j53M04m75J26n7p9M3l65K58k89L12k10K55j41
$$ 98 143 302 404 108 164 328 177 203 174 21 425 -50 76 19 -60 -17 -382 -124 -413 -101 -311 -56 -197
4292a97J53k31J60L6j9R9K44k54L22j72j67J09K23j9j44l4J81k24Q7j93K14j00
$$ -197 -44 -275 -115 -79 -98 1 245 -9 313 141 -26 83 306 287 143 109 290 66 153 -40 174 74
4314G4k61J29j26L10m47J06J73j04j98J9J33M1p6J61m1J46n5m8J02K47j16L9j28
$$ 74 -187 -58 -184 126 -321 -215 -42 -146 -344 -325 -192 -151 -227 -66 -107 39 -16 -64 38 285 169 208 80
4337H0j30K93j71O1Q7j59K3R0k77L1p1J46m81M03j36k05Q0J37J08k67L32p5M38
$$ 80 -50 243 72 133 220 61 84 174 -103 -72 -143 3 -478 -75 -211 -416 -336 -199 -91 -358 -26 -101 337
4360C37m67rJ68K19k37O3qJ81j2j67R0qO4j9j37K0p6k66L41o0j50m20L15m3J53
$$ 337 -130 -139 29 248 11 74 66 247 235 68 158 150 214 195 58 78 2 -264 77 17 -133 -553 -238 -281 -128
4385a28k81O2Q1o4L95j13l9q4K12k4N3N5J08j26K46k23R6J10j01j62j06K34L0
$$ -128 -409 -347 -266 -330 65 -48 -87 -171 41 17 70 125 233 107 353 130 226 336 235 73 -33 201 231
4408B31k55q7J66j50j38J29N2j57Jj16J89Q4m83M35j22J46q7M7J46K20j76J09
$$ 231 -24 -111 55 -95 -233 -104 -52 -209 -208 -324 -135 -51 -534 -99 -221 -75 -162 -115 31 251 75 184
4430A84Jj4N0J16N2j97p1o6J22r7j01J66k09r9R6m5r3j04J02l7J39j62j3J38j83
$$ 184 185 171 221 337 389 192 121 55 177 80 -21 145 -64 -163 -67 -112 -205 -309 -207 -244 -105 -267 -280 -142 -325
4455c25K46l1M3J02J51J08o1j1l33L85J15l12j58K48j20P1q1K55l2k7m75K46M1
$$ -325 -79 -110 -67 35 186 294 233 222 -111 274 389 77 -81 167 47 118 37 292 260 233 -242 4 45
4478D5r7l9k58l9L07k02l5K03R1o7j83J80R8p2J83l20M11l3j40J87k21K53k08
$$ 45 -52 -91 -349 -388 -81 -283 -318 -115 -24 -91 -274 -94 4 -68 115 -205 206 173 33 220 -1 252 44
4501D4K79k26J41J1l44M38l47l39J25J55L8j8k27J17N5m17L30k67L34O3L0o9M10
$$ 44 323 97 238 249 -95 343 -4 -343 -218 -63 -25 -43 -270 -153 -98 -515 -185 -452 -118 -55 -25 -94 316
4524C16m00J06q6K10P8J7J3O3Nk29j11K90r4j51J58j13l3j50k31Q7J30j81q7K20
$$ 316 -84 22 -64 146 224 241 254 317 322 93 -18 272 178 27 185 72 39 -111 -342 -255 -125 -306 -393 -173
4548a73j12K27j01O5k25J01P1P7J95j4l5J22Q2j61J15p3k9N5O7j84p4J67j10j04
$$ -173 -285 -58 -159 -94 -319 -218 -147 -70 125 111 76 198 280 119 234 161 132 187 254 70 -4 163 53 -51
4572e1J97k5j87q6j3K59j72k34R1Pl8K02n3oK07k01J3L8R6J10j66L34O3J49l55
$$ -51 146 121 -66 -152 -165 94 -78 -312 -221 -214 -252 -50 -103 -109 98 -103 -90 -52 44 154 -12 322 385 534 179
4597A79JJ11j28K06k88j09o3J71j48l1o2j98J97J04k33j6O3M2O5l1m1J66j19K18
$$ 179 180 291 163 369 81 -28 -91 80 -68 -99 -161 -359 -162 -58 -291 -307 -244 -202 -137 -168 -209 -43 -162 56
4621E6J98r5K9q3Q4j6j50J28Q4l3j62M01q7k21j21Jm6J13l79L60R5l77j09j22
$$ 56 254 159 188 105 189 173 23 151 235 202 40 441 354 133 12 13 -33 80 -299 61 156 -221 -330 -452
4645d52J96kj84L69J00k96P1N3P5O1JL07j31Pk01K74O4j37P9n0O6j87j72J75m7
$$ -452 -256 -258 -442 -73 27 -269 -198 -145 -70 -9 -8 299 168 175 -26 248 312 175 254 204 270 83 -89 86 39
4670C9p6Mj42k05M39r4j05n7n7q0J47L79k66J06mL5K06r6O1k62K84j17J60r3r2
$$ 39 -37 -33 -175 -380 59 -35 -140 -197 -254 -334 -187 192 -74 32 28 63 269 173 234 -28 256 139 299 206 114
4695A14K35Rm44K22J15j83j10q7K57q7n50K35L0J28j94R2J52j28r6M4J08K70m9
$$ 114 349 358 -86 136 251 68 -42 -129 128 41 -509 -274 -244 -116 -310 -218 -66 -194 -290 -246 -138 132 83
4718H3n6k2M3J68PO3k80N2J36r6p6L2j7R6k64Q9n0k7n2j1J36k77r8K05r4J65N
$$ 83 27 5 48 216 223 286 6 58 194 98 22 54 37 133 -131 -42 -92 -119 -171 -182 -46 -323 -421 -216 -310 -145 -140
4745a40J8L00k85Q4J05M6K22l72J55J41k89P9P4J62N8j55k7K59k78n6l14K37O
$$ -140 -122 178 -107 -23 82 128 350 -22 133 274 -15 64 138 300 358 203 176 435 157 101 -213 24 30
4768C0k6j63J26j45m2q0K46j41k13N1J94J44j6K88l31K41j68K51j84k0J2J20J12
$$ 30 4 -159 -33 -178 -220 -300 -54 -195 -408 -357 -163 -19 -35 253 -78 163 -5 246 62 42 54 174 286
4791B86j26kK5N4k61P8K79k42k05k3p1K69l94K01l7j21q2O3K80j33M6P3L8J0r3
$$ 286 160 158 183 237 -24 54 333 91 -114 -137 -208 61 -333 -132 -169 -290 -372 -309 -29 -162 -116 -43 -5 5 -88
4816h8J58J63k12N6J6K10r2q4q7J33j46P4k9J24j13k13j07L11o6q7nk63L38r1
$$ -88 70 233 21 77 93 303 211 127 40 173 27 101 72 196 83 -130 -237 74 8 -79 -84 -347 -9 -100
4840a00j44J64j68M05k14j3J31L0o3r3J06j8O1P4Q0J07k79J3J13J9q4k02O6k39
$$ -100 -244 -80 -248 157 -57 -70 61 91 28 -65 41 23 84 158 238 345 66 79 192 211 127 -75 -9 -248
4864b48J41k10l5J82Q5j63m1L96q8k66P0J95j29K46j89J15j0P4r2L12k67j54K09
$$ -248 -107 -317 -352 -170 -85 -248 -289 107 19 -247 -177 18 -111 135 -54 61 51 125 33 345 78 -76 133
4887A33N3N6j33Q0j8j18L4j49oJ23n8q9j81j2m8L33k26M4P5n2K5q3J98O6p9J17
$$ 133 186 242 109 189 171 53 87 -62 -68 55 -3 -92 -273 -285 -333 0 -226 -182 -107 -159 -134 -217 -19 47 -32 85
4913H5r2J15K05l8n4r7J82k66J03P0M0j42j51O5J60k33n2qj60L9l2p5K74k57Q1
$$ 85 -7 108 313 275 221 124 306 40 143 213 253 111 -40 25 185 -48 -100 -108 -268 -229 -261 -336 -62 -319 -238
4938b38j09L01j51P3J49j38J69j1P6J2j60q8R1K37m2J63M1k38j18j42k9J85Q8
$$ -238 -347 -46 -197 -124 25 -113 56 45 121 133 -27 -115 -24 213 171 334 375 137 19 -123 -152 33 121
4961A21j55p9J77k21l1p9j1K63j70N5n2P1K1J5o8M44Nl18M8m3L79j78N0p5M9K0
$$ 121 -34 -113 64 -157 -188 -267 -278 -15 -185 -130 -182 -111 -90 -75 -143 301 306 -12 36 -7 372 194 244 169 218 238
4987B38l05K51pl05K20j1l33K23n3q1j97j08J71J00R5K2o8r2k5J95p7K41k27K0
$$ 238 -67 184 177 -128 92 81 -252 -29 -82 -163 -360 -468 -297 -197 -102 -80 -148 -240 -265 -70 -147 94 -133 -113
5011a13K39Q4q4J5K2n1j2N4L1j04k97J95J18p2k4k5J16r4m11J81j9K10k52K28
$$ -113 126 210 126 141 163 112 100 154 185 81 -216 -21 97 25 1 -24 92 -2 -413 -232 -251 -41 -293 -65
5035f5j90J88J26J23k12J96M1q9p7K02j69J96j9r0K01k30R3j42J20l47L7J42N5
$$ -65 -255 -67 59 182 -30 166 207 118 41 243 74 270 251 161 362 132 225 83 203 -144 -107 35 90
5058I0l9k72O4m3j69J55l0J17J00p6n0O0k7L01j54O7j28J36J40k6J1K43m46J08
$$ 90 51 -221 -157 -200 -369 -214 -244 -127 -27 -103 -153 -93 -120 181 27 94 -34 102 242 216 227 470 24 132
5082A32K15j26n1J67q8o6m4l09K78j15R0k32K2j06K4P8M2k45J70J18N3j07R3O8
$$ 132 347 221 170 337 249 183 139 -170 108 -7 83 -149 -127 -233 -209 -131 -89 -334 -164 -46 7 -100 -7 61
5106F1K84j71oqJ90k28o9K63l04J98M8l92Q1K79k49j53l7J81p6l8n6O6R1J16k69
$$ 61 345 174 168 160 350 122 53 316 12 210 258 -134 -53 226 -23 -176 -213 -32 -108 -146 -202 -136 -45 71 -198
5131a98O4P6j5l13J85J98j06J97q5J24qR8j67J82J35j51j69K39j54km7j7r9k84
$$ -198 -134 -58 -73 -386 -201 -3 -109 88 3 127 119 217 50 232 367 216 47 286 132 130 83 66 -33 -317
5155c17L05j52P9m3J76k66J53k12q8R8J36O7j01K7J27k05K39o1J46J31N0n8J0
$$ -317 -12 -164 -85 -128 48 -218 -65 -277 -365 -267 -131 -64 -165 -138 -11 -216 23 -38 108 239 289 231 241
5178B41J24j34N8n4j63l1nO7M0j19J42k21k8J86k39l2o8o3K03N2k58K85j60j68
$$ 241 365 231 289 235 72 41 36 103 143 24 166 -55 -83 103 -136 -168 -236 -299 -96 -44 -302 -17 -177 -345
5202c45L03L27k43Q4N1p6N7j41P6J09q0nN6l91J91J1R4k65R0J01k89K32l0Pn4
$$ -345 -42 285 42 126 177 101 158 17 93 202 122 117 173 -218 -27 -16 78 -187 -97 4 -285 -53 -83 -76 -130
5227a30j77L56j16o6J17R3o9N5j80J60K64j37j06L9k07N65l66L44j61j35k67P3
$$ -130 -307 49 -67 -133 -16 77 8 63 -117 43 307 170 64 103 -104 461 95 439 278 143 -124 -51
5249e1K74m10P3j1n0k2J16J4k18k2J69j74K53K0n5NK80l30K59P5j15K18n1l20
$$ -51 223 -187 -114 -125 -175 -197 -81 -67 -285 -307 -138 -312 -59 -39 -94 -89 191 -139 120 195 80 298 247 -73
5273g3O57l09k65jm0K25r9J2j9j36j70L83k98j51J98r1M1k33K48k13K67k42j72
$$ -73 584 275 10 9 -31 194 95 107 88 -48 -218 165 -133 -284 -86 -177 -136 -369 -121 -334 -67 -309 -481
5296d81M06p2o7K48O0O9o1j02R9k14J91j31L97j18q7q5K44k76J12k30L18m78J57
$$ -481 -75 -147 -214 34 94 163 102 0 99 -115 76 -55 342 224 137 52 296 20 132 -98 220 -258 -101
5319a01j23K19L0l55K52J46m9r7j73J44J8N5K21l06J73p5J30J81j52m0R0P4j04
$$ -101 -224 -5 25 -330 -78 68 19 -78 -251 -107 -89 -34 187 -119 54 -21 109 290 138 98 188 262 158
5342A58j43K02j15j9K17m70J64j21J07j75J94k6j91K44R8l58L21k53J22P3j36
$$ 158 15 217 102 83 300 -170 -6 -127 -20 -195 -1 -27 -218 26 124 -234 87 -166 -44 29 -107
5363a07J90m3l1m6K36L5j1l0J40M5k10j31L42l97J31j55l8N5k96J54L7j24Q1J76
$$ -107 83 40 9 -37 199 234 223 193 333 378 168 37 379 -18 113 -42 -80 -25 -321 -167 -130 -254 -173 3
5387Ck12k6K20j30r3K29Q6J05k73J98N5q4n5J10K3m7J65j94K23j08o2j63J45J50
$$ 3 -209 -235 -15 -145 -238 -9 77 182 -91 107 162 78 23 133 156 109 274 80 303 195 133 -30 115 265
5411B65l09K7j7m3l9J4p2o5K82l43J10P6J21o8jJ28n4n0L32k89q8j6L61m6P1j60
$$ 265 -44 -17 -34 -77 -116 -102 -174 -239 43 -300 -190 -114 7 -61 -62 66 12 -38 294 5 -83 -99 262 216 287 127
5437A27J07j5r3j63K65p4p7k96j21K77l2P9j43L7k32L32j02j00J82k01j7K39l4
$$ 127 234 219 126 -37 228 154 77 -219 -340 -63 -95 -16 -159 -122 -354 -22 -124 -224 -42 -243 -260 -21 -55
5460e5n4Q0J64k15K98k72P8J57j72J46m1n3L90m49J3N5j48P4k25K03j6j36O0N0
$$ -55 -109 -29 135 -80 218 -54 24 181 9 155 114 61 451 2 15 70 -78 -4 -229 -26 -42 -178 -118 -68
5484f8q5J14L0po3J2r9K16j2L7L6l3%J71l9j63K6J48J24l61J28j34j6J80j16J3
$$ -68 -153 -39 -9 -16 -79 -67 -166 50 38 75 111 78 78 249 210 47 73 221 345 -16 112 -22 -38 142 26 39
5510C9j53L16o21R8K21R2p8k69K15K2J55l10K80pr5L07j58L98m86P3KM1r1j25
$$ 39 -114 202 -419 -321 -100 -8 -86 -355 -140 -118 37 -273 7 0 -95 212 54 452 -34 39 41 82 -9 -134
5534a34L86j47J97j12n8Pm9k33R1M5r2j54J9K00J66l82J48r1K02j91J83l10K67
$$ -134 252 105 302 190 132 139 90 -143 -52 -7 -99 -253 -234 -34 132 -250 -102 -193 9 -182 1 -309 -42
5557d2Qj71K46j1q5J61o9Rl2J74j04j01J28R2m2k16l7K53j89k32J83j03o4m6L4
$$ -42 -34 -205 41 30 -55 106 37 46 14 188 84 -17 111 203 161 -55 -92 161 -28 -260 -77 -180 -244 -290 -256
5582b56J7L11j95q6K92k59k2K31l05K48P4O6J35k51K15J05j87O1k93J54J39j35
$$ -256 -239 72 -123 -209 83 -176 -198 33 -272 -24 50 116 251 0 215 320 133 194 -99 55 194 59
5604E9k14qL34k60l2j45N9j15J28K23k22J56j64K97l56K14l6J03l3m1L74k00l4
$$ 59 -155 -163 171 -89 -121 -266 -207 -322 -194 29 -193 -37 -201 96 -260 -46 -82 21 -12 -53 321 121 87
5627H7J28J01p0l04K63J18j28J65m44J60L5k74J22OP4m65L42M7k60J15L3K32l01
$$ 87 215 316 246 -58 205 323 195 360 -84 76 111 -163 -41 -35 39 -426 -84 -37 -297 -182 -149 83 -218
5650b18J89j27N6N0j17R4J21m3k3M9J6P1j09n3J58j8M7o6L9J27j64lr0k14J67
$$ -218 -29 -156 -100 -50 -167 -73 48 5 -18 31 47 118 9 -44 114 96 143 77 116 243 79 76 -14 -228 -61
5675f1n3o4m7J16L8j67J09Q5o4J76j66Q8P3K75l63l8J16J48J21m34L23k90J77
$$ -61 -114 -178 -225 -109 -71 -238 -129 -44 -108 68 -98 -10 63 338 -25 -63 53 201 322 -112 211 -79 98
5698I8p4K32k81q3Q6O5j18K3q7J29p2j20J58j66J67k7K4jo1JJ77jj22k6L51j52
$$ 98 24 256 -25 -108 -22 43 -75 -52 -139 -10 -82 -202 -44 -210 -43 -70 -46 -47 -108 -107 70 69 -53 -79 272 120
5724A20R0k48K56pj85J02K31k11j50L0J32k79J74n1j53r0J89n4q0J99l00N3J74
$$ 120 210 -38 218 211 26 128 359 148 -2 28 160 -119 55 4 -149 -239 -50 -104 -184 15 -285 -232 -58
5747e8n5N1K5O0j19m0L00j78L64k76l6K09j82J0Q9mPn7k22O0Oj70K17o9P3k10
$$ -58 -113 -62 -37 23 -96 -136 164 -14 350 74 38 247 65 75 164 160 167 110 -112 -52 -46 -216 1 -68 5 -205
5773b05k66M39o5p2M9j77J02K06J32j21l3L0J42k89J44J68P9k12J92r1j74K59
$$ -205 -471 -32 -97 -169 -120 -297 -195 11 143 22 -11 19 161 -128 16 184 263 51 243 152 -22 237
5795B37k9J52l63N4p8l18K92Q2PJ0k98j03J51J65j19q3K34j6J08k46J98o1J40
$$ 237 208 360 -3 51 -27 -345 -53 29 36 46 -252 -355 -204 -39 -158 -241 -7 -23 85 -161 37 -24 116
5818A16k18R3k5L31k74R6j09J90n2q7p0J58j65p0J22j01J14j68n8q5O6j96K32
$$ 116 -102 -9 -34 297 23 119 10 200 148 61 -9 149 -16 -86 36 -65 49 -119 -177 -262 -196 -392 -160
5841a60l2J06o8J92J4j50R0N3k7o8O7J92j43P2Jk1J23l94L94j34q3o3J13K6r6
$$ -160 -192 -86 -154 38 52 -98 -8 45 18 -50 17 209 66 138 139 118 241 -153 241 107 24 -39 74 100 4
5866Dk54K03p4J17k17K53j0k14J50k70L05j07J32J41J06l65R3N8k18K61m7M0j0
$$ 4 -250 -47 -121 -4 -221 32 22 -192 -42 -312 -7 -114 18 159 265 -100 -7 51 -167 94 47 87 77
5889G7K84k11k09K61k73L54k44O1k25J56l4J03j83P5j79l30M70jl6j47P0L8K14
$$ 77 361 150 -59 202 -71 283 39 100 -125 31 -3 100 -83 -8 -187 -517 -47 -48 -84 -231 -161 -123 91
5912I1j6M7M5j10Q5j31K3O6J89j59Q3j78mL6j4R4k62K88m6j00n6Q8k91K91p8K10
$$ 91 75 122 167 57 142 11 34 100 289 130 213 35 31 67 53 147 -115 173 127 27 -29 59 -232 59 -19 191
5938A91m21K55j96j6J12j98J93o1J00J45k45J62m3J80p4M8j87K59oj17j43O5J06
$$ 191 -230 25 -171 -187 -75 -273 -80 -141 -41 104 -141 21 -22 158 84 132 -55 204 198 81 -62 3 109
5961A09q5k34P0J48Ok30m5K76l26K25M6j2mm6j2M7m5K03n8k03K68k62K32P8L6
$$ 109 24 -210 -140 8 14 -216 -261 15 -311 -86 -40 -52 -56 -102 -114 -67 -112 91 33 -170 98 -164 68 146 182
5986A82k35K90r2L4m9p1p2J30j00O1m3j0k81Q1K25k34J86k5m6p0rj91K84J29O5
$$ 182 -53 237 145 179 130 59 -13 117 17 78 35 25 -256 -175 50 -184 2 -23 -69 -139 -148 -339 -55 74 139
6011A39j41N4J25j46J48M1j19j2R7j33K9j51J52J14k26J53k24K28K36m05J2Mk80
$$ 139 -2 52 177 31 179 220 101 89 186 53 82 -69 83 197 -29 124 -100 128 364 -41 -29 -25 -305
6034c05J64r3K78l12K54j07K53j27l6J05Jj9r4J10Oj72k7J82J01j00K32l71J28
$$ -305 -141 -234 44 -268 -14 -121 132 5 -31 74 75 56 -38 72 78 -94 -121 61 162 62 294 -77 51
6057E1j02O6j05j9o5Q1N5O4j47K18k50K7K6l55M36k81M63j25L08n52J66J76O3
$$ 51 -51 15 -90 -109 -174 -93 -38 26 -121 97 -153 -126 -100 -455 -19 -300 163 38 346 -206 -40 136 199
6080A99l83M14j06J86l31K19q4N8k00q6K35k66L21k04M3k52K76J22k06j66R0K8
$$ 199 -184 230 124 310 -21 198 114 172 -28 -114 121 -145 176 -28 15 -237 39 161 -45 -211 -121 -93
6102i3M2L6j02J98o5J16j17p1J62k47J83J22j83J62m7l12M05j67OL61n24j7M5
$$ -93 -51 -15 -117 81 16 132 15 -56 106 -141 42 164 -19 143 96 -216 189 22 28 389 -135 -152 -107
6125a07J39k12m6K22k19K91k36P9J0J17p0n5L9m2J39M5M1r0J0J04Nq0j4r2J48
$$ -107 32 -180 -226 -4 -223 68 -168 -89 -79 38 -32 -87 -48 -90 49 94 135 45 55 159 164 84 70 -22 126
6150A26j57J83qj73j28K80k14Q6l1m8n5J06J40k10K9k7N3J03p5J7j14J60K9p7
$$ 126 -31 152 144 -29 -157 123 -91 -5 -36 -84 -139 -33 107 -103 -74 -101 -48 55 -20 -3 -117 43 72 -5
6174eK00j00J59j71Q7J00r5j18K17j10j97rP4L7j17k58L51k5j98J6k0r0J86l0
$$ -5 195 95 254 83 170 270 175 57 274 164 -33 -42 32 69 -48 -306 45 20 -178 -162 -182 -272 -86 -116
6198a16N8n0J73k19K31l47J93J24J48l46K24M9J0O1J16l97J99Rl22K49j2R7j38
$$ -116 -58 -108 65 -154 77 -270 -77 47 195 -151 73 122 132 193 309 -88 111 120 -202 47 35 132 -6
6221fk8o8n9J29j60M9K33k52J43L3P0j82K84j88J47j79L6p1L27n2k17O2j07Q8
$$ -6 -34 -102 -161 -32 -192 -143 90 -162 -19 14 84 -98 186 -2 145 -34 2 -69 258 206 -11 51 -56 32
6245C2l3K78l43K27m4j63k6j34Q2R7J9j35RR6j37K26j28j42K06p2K33k35N2J43
$$ 32 -1 277 -66 161 117 -46 -72 -206 -124 -27 -8 -143 -134 -38 -175 51 -77 -219 -13 -85 148 -87 -35 108
6269A08p6k11L07Jk42Q8j6J75k3J32k07q3J55J06j80m3K04j63j54K47k17l41L10
$$ 108 32 -179 128 129 -113 -25 -41 134 111 243 36 -47 108 214 34 -9 195 32 -122 125 -92 -433 -123
6292a23m2J34L8j62r4J26J25j13R3M9l6J45k7k5l18K32qJ2j9M3P3r4Nq8K3J6j10
$$ -123 -165 -31 7 -155 -249 -123 2 -111 -18 31 -5 140 113 88 -230 2 -6 6 -13 30 103 9 14 -74 -51 -35 -145
6319a45nJ4J13k0j68J22K5K9j0L5j13R4J39j84j33J40K65k82KJ33O7j42K13L4
$$ -145 -150 -136 -23 -43 -211 -89 -64 -35 -45 -10 -123 -29 110 -74 -207 -67 198 -84 -82 51 118 -24 189 223
6343B23j88K13k13K88j37Q0J01k20j73p3m4K15l89J23kJ01k6N6n0n9J43K0J16
$$ 223 35 248 35 323 186 266 367 147 -26 -99 -143 72 -317 -194 -196 -95 -121 -65 -115 -174 -31 -11 105
6366A05j45K57k42M4J37j18l8J03qq0k17L41r0J40k63r6O2K50m3j24J87m33K25
$$ 105 -40 217 -25 19 156 38 0 103 95 15 -202 139 49 189 -74 -170 -108 142 99 -25 162 -271 -46
6389d6J1j25j09K94K7k94J10K86k05J9j00K15p2j36J42M5Nl9Q6j33J86J12n25
$$ -46 -35 -160 -269 25 52 -242 -132 154 -51 -32 -132 83 11 -125 17 62 67 28 114 -19 167 279 -246
6412b46K22R6j60lN5j3Q7j60P5n5K42j21k65K90j8j65K49k48J55q4J41K26l16
$$ -246 -24 72 -88 -91 -36 -49 38 -122 -47 -102 140 19 -246 44 26 -139 110 -138 17 -67 74 300 -16
6435a6j04R0K05O8L8k62j7n2K45m4k71J32Q9pj52RJ19k03R5o2j7j50J22M0L1O7
$$ -16 -120 -30 175 243 281 19 2 -50 195 151 -120 12 101 94 -58 -49 70 -133 -38 -100 -117 -267 -145 -105 -74 -7
6461gj15J25j94K41r7J46j02j52K1J06R0M1om3N9oL0qk57p2K88p2o0P0j68K44
$$ -7 -122 3 -191 50 -47 99 -3 -155 -134 -28 62 103 97 54 113 107 137 129 -128 -200 88 16 -44 26 -142 102
6487A02j32P6j47R2N0j10J70r3L3L1k07J97j91J87P2n8J2j74K91P5l32m9L01n4
$$ 102 -30 46 -101 -9 41 -69 101 8 41 72 -135 62 -129 58 130 72 84 -90 201 276 -56 -105 196 142
6511A42j50k57L00n8J48k40r8J87m7R7n2J48l08j08L37O0j28L1j2J5Q2J95j34
$$ 142 -8 -265 35 -23 125 -115 -213 -26 -73 24 -28 120 -188 -296 41 101 -27 4 -8 7 89 284 150
6534A50K7j81J00j6k23K10J19j07j9p4L1J01l08R7r8J64Ok51OJ75l2K9N6Q9L9
$$ 150 177 -4 96 80 -143 67 186 79 60 -14 17 118 -190 -93 -191 -27 -21 -272 -266 -91 -123 -94 -38 51 90
6559I0K5q8J6J4k7k8J03j66K60q4J32J0j93j5J57j02k52J12K29j31k27J62O7j47
$$ 90 115 27 43 57 30 2 105 -61 199 115 247 257 64 49 206 104 -148 -36 193 62 -165 -3 64 -83
6583h3k29L11k4j16Q2N2N9j61K73j00L5P2j03q8Q6m7n2P2r1Q1n6K45j48p0p2J2
$$ -83 -312 -1 -25 -141 -59 -7 52 -109 164 64 99 171 68 -20 66 19 -33 39 -52 29 -27 218 70 0 -72 -60
6609f0j8j3J96k03J51j29j22J31j5%nO8p6J13K0j19L0N7j08K28k9N0j39J38j27
$$ -60 -78 -91 105 -98 53 -76 -198 -67 -82 -82 -87 -19 -95 18 38 -81 -51 6 -102 126 97 147 8 146 19
6634A9j6K1J30j00m5J48l35R8K82k21J29q7j50n9Q0R1j68n5J62J58J61l60J45
$$ 19 3 24 154 54 9 157 -178 -80 202 -19 110 23 -127 -186 -106 -15 -183 -238 -76 82 243 -117 28
6657B8J21o5L0K1j14J00jJRj27j24J44J27O8J11j39k40n2j29O1J20lmN5p0k3R
$$ 28 149 84 114 135 21 121 120 121 130 3 -121 23 150 218 329 190 -50 -102 -231 -170 -50 -53 -57 -2 -72 -95 -86
6684h6r0J95k43J3J57o0L11j93j80L32oq0l3j79R8Mj8J19p5J5J19l1k93L76j89
$$ -86 -176 19 -224 -211 -54 -114 197 4 -176 156 150 70 37 -142 -44 -40 -58 61 -14 1 120 89 -204 172 -17
6709a7j79QJ59Q5j40j07Qj74L96n9O0j49K42k55j5K98o7j67J72R8q4m2P9J3j97
$$ -17 -196 -188 -29 56 -84 -191 -183 -357 39 -20 40 -109 133 -122 -137 161 94 -73 99 197 113 71 150 163 -34
6734c4k01K11j11Q9M1j57M9l1q0r2K21J09j40O9j73J86l9M6K35j88K00l17J31
$$ -34 -235 -24 -135 -46 -5 -162 -113 -144 -224 -316 -95 14 -126 -57 -230 -44 -83 -37 198 10 210 -107 24
6757B4K2L0J4J77l70L84l05K4R4R5k13P1p3lR3k50L36P0l09k1P5O2n6K66l78J95
$$ 24 46 76 90 267 -103 281 -24 0 94 189 -24 47 -26 -29 64 -186 150 220 -89 -110 -35 27 -29 237 -141 54
6783E4n8K51j18k20L09k25N7P3j14L41m59J61M4j53J95k22K40j67J8K12m6k45
$$ 54 -4 247 129 -91 218 -7 50 123 9 350 -109 52 96 -57 138 -84 156 -11 7 219 173 -72
6805g2J2p1j1k7J02o0K5R7q5k5j3q9K58j14N9J21j9j11p7L02q3j56Q4j44J57j41
$$ -72 -60 -131 -142 -169 -67 -127 -102 -5 -90 -115 -128 -217 41 -73 -14 107 88 -23 -100 202 119 -37 47 -97 60 -81
6831h1L83l01k9n1K62j56r3R0L3k69K95o8r7M5M1j20J27j34L7J99o4j69q8K55
$$ -81 302 1 -28 -79 183 27 -66 24 57 -212 83 15 -82 -37 4 -116 11 -123 -86 113 49 -120 -208 47
6855D7k8j5j3K42r0j20J94k08jJ33j11L6J22q8j0k18K47q2j88J28J57j34k69L23
$$ 47 19 4 -9 233 143 23 217 9 8 141 30 66 188 100 90 -128 119 37 -151 -23 134 0 -269 54
6879E4k05K22j53J74Oj26J73rM4j45L7J10p9mK2ln0r8O8J28j79K23k21K8k93J49
$$ 54 -151 71 -82 92 98 -28 145 136 180 35 72 182 103 99 121 118 68 -30 38 166 -13 210 -11 17 -276 -127
6905a27j2J24l00K02L2k61M84j24J04l4N0k39j6K33n0O5J95j42j06m5K51j71j33
$$ -127 -139 -15 -315 -113 -81 -342 142 18 122 88 138 -101 -117 116 66 131 326 184 78 33 284 113 -20
6928b0K32k22K1j93M28j47j19j97L03k34K56l83L96k17J5K05n26L81m2J18o9L
$$ -20 212 -10 11 -182 246 99 -20 -217 86 -148 108 -275 121 -96 -81 124 -402 -21 -63 55 -14 -11
6950a1j20J87P0R6j43k3J25J17m64L67j15j63J22K72l23R1J0k20j99L15J04k70
$$ -11 -131 56 126 222 79 56 181 298 -166 201 86 -77 45 317 -6 85 95 -125 -324 -9 95 -175
6972a75K47k04p7K47j74K08l7k01L65k53J54j60P4j58K22j06l0K12j60Q9J26k09
$$ -175 72 -132 -209 38 -136 72 35 -166 199 -54 100 -60 14 -144 78 -28 -58 154 -6 83 209 0
6994@J15q9r1K5j15K58O4k02J20j50k45K57l4N1j29L47k27J26k77K98K8JK1m15
$$ 0 115 26 -65 -40 -155 103 167 -35 85 -65 -310 -53 -87 -36 -165 182 -45 81 -196 102 130 131 152 -263
7018b63M16k6LM7R2j00J62j83K3j31o0J41q7J7j25J88k55n0qN9J25r3QQ0K0K37
$$ -263 153 127 130 177 269 169 331 148 171 40 -20 121 34 51 -74 114 -141 -191 -199 -140 -15 -108 -100 -20 0 237
7044B37m5q3J68p3k36J12j93J80p2k30M37j97J57o5j32L15k79J57j16j45J23j18
$$ 237 192 109 277 204 -32 80 -113 67 -5 -235 202 5 162 97 -35 280 1 158 42 -103 20 -98
7066i8L41k45j03n7K61L3k32K37l39K34j28Q3N6j26J31J50j82K7m9J47j06l9O0
$$ -98 243 -2 -105 -162 99 132 -100 137 -202 32 -96 -13 43 -83 48 198 16 43 -6 141 35 -4 56
7089E6j59K75j33M5j62l8K05j90J56j25r3K6K61k21L7O8n8j8q6J16J8L1j2LK12
$$ 56 -103 172 39 84 -78 -116 89 -101 55 -70 -163 -137 124 -97 -60 8 -50 -68 -154 -38 -20 11 -1 2 214
7114B14p6l1l15L28O1j8j39rR6j80J68j72l2R9J45l32J81J3j30J14j93J42L11
$$ 214 138 107 -208 120 181 163 24 15 111 -69 99 -73 -105 -6 139 -193 -12 1 -129 -15 -208 -66 245
7137B45j65k51J38N9K9k61L00NJ29l1k60K59j38L7K6j67j92L84q9O1j0p8J38n
$$ 245 80 -171 -33 26 55 -206 94 99 228 197 -63 196 58 95 121 -46 -238 146 57 118 108 30 168 163
7161A63m8l12K54j92L9Q5J9P8j25N3o2o1kK62j16Kk7N6M3R2l19K73m6j57J04j8
$$ 163 115 -197 57 -135 -96 -11 8 86 -39 14 -48 -109 -111 151 35 37 10 66 109 201 -118 155 109 -48 56 38
7187C8J06Om5n3j33J75O5k02K14k56J28r6J13l1p2m6P9R6M8k14L36k47k90L59
$$ 38 144 150 105 52 -81 94 159 -43 171 -85 43 -53 60 29 -43 -89 -10 86 134 -80 256 9 -281 78
7211G8j37J40r6k7J50r5j13J66J07j85l4R4O0j46j42J83r2l7K60P5j66j26N5o3
$$ 78 -59 81 -15 -42 108 13 -100 66 173 -12 -46 48 108 -38 -180 3 -89 -126 134 209 43 -83 -28 -91
7235i1J00R1k69j10J76K4K64k61R1p8J08J75j1k82J93J57k72L04n16J56J40j64
$$ -91 9 100 -169 -279 -103 -79 185 -76 15 -63 45 220 209 -73 120 277 5 309 -207 -51 89 -75
7257g5j04J2J29n0n0Q7q0J83M8q3L9k14K47j33J06j00qM7J97k14K50k37J69j16
$$ -75 -179 -167 -38 -88 -138 -51 -131 52 100 17 56 -158 89 -44 62 -38 -46 1 198 -16 234 -3 166 50
7281E0R6O1k80q6K66l53M52j15o4p7j40K76k44J59J54k34K2j97L50j23j15K31
$$ 50 146 207 -73 -159 107 -246 206 91 27 -50 -190 86 -158 1 155 -79 -57 -254 96 -27 -142 89
7303H9M1o5l32L26O7Q4j39L3p4J26k49L4N4p9R7P6J06n50L09J32m3k47J69q8L8
$$ 89 130 65 -267 59 126 210 71 104 30 156 -93 -59 -5 -84 13 89 195 -355 -46 86 43 -204 -35 -123 -85
7328h5K16k99J16Mo9K49r3jpk43J96R5j55L7J92q8K7q6j32Q5O9J7r3qQ3j85J71
$$ -85 131 -168 -52 -48 -117 132 39 38 31 -212 -16 79 -76 -39 153 65 92 6 -126 -41 28 45 -48 -56 27 -158 13
7355A3O1j94JJ55L6l9j71j57L53j48j38R0L1N9L6m6J61P3r4j9L1p7LK19k2l77
$$ 13 74 -120 -119 36 72 33 -138 -295 58 -90 -228 -138 -107 -48 -12 -58 103 176 82 63 94 17 20 239 217 -160
7381a60K64Oj90J94k98J93k77J90K10Pl65M87k30k36O8J91J2k8j28M06k02j29
$$ -160 104 110 -80 114 -184 9 -268 -78 132 139 -226 261 31 -205 -137 54 66 38 -90 316 114 -15
7403a5N0oM3m7L4q2P0j41K38p4q6J08j23j90M30j00k10J3J91k91J53J89jj17q
$$ -15 35 29 72 25 59 -23 47 -94 144 70 -16 92 -31 -221 209 109 -101 -88 103 -188 -35 154 153 36 28
7428B8q1Q0L6k02K6P8J32J31k5k44J82j50J65j48K72k18l06K04L4Q2q6p2J52R3
$$ 28 -53 27 63 -139 -113 -35 97 228 203 -41 141 -9 156 8 280 62 -244 -40 -6 76 -10 -82 70 163
7452A63P3p9r3N0k21P0J46j30K35k20j03J98j12J50j02J97j04j56J46J24k29J93
$$ 163 236 157 64 114 -107 -37 109 -21 214 -6 -109 89 -23 127 25 222 118 -38 108 232 3 196
7474A96j53J81l59L7K44k94K29j85J75J9j08O8k02J50r1L4j4L8Nj31J86m4j05
$$ 196 43 224 -135 -98 146 -148 81 -104 71 90 -18 50 -152 -2 -93 -59 -73 -35 -30 -161 25 -19 -124
7497a24L6q5L19l02K15p6K08p2j8J64j19l21L44Qj63J19k11J61j6N3j50n7q8J18
$$ -124 -88 -173 146 -156 59 -17 191 119 101 265 146 -175 169 177 14 133 -78 83 67 120 -30 -87 -175 -57
7521e7P5J22lk14P5J9j01j37M74j71k02J87j37j06K46J30J56k74j14J3K23k42
$$ -57 18 140 137 -77 -2 17 -84 -221 253 82 -120 67 -70 -176 70 200 356 82 -32 -19 204 -38
7543c8K6K64k04kLmmM0l45L30j10K2K0L3j07J02o9M8p1K98k48j09J79k27K28J68
$$ -38 -12 252 48 46 49 45 41 81 -264 66 -44 -22 -2 31 -76 26 -43 5 -66 232 -16 -125 54 -173 55 223
7569B23j43qqk6k82L31p9p9L1l9k0J66J54k01m9k17J38K59m45K10K35k28J4P0
$$ 223 80 72 64 38 -244 87 8 -71 -40 -79 -99 67 221 20 -29 -246 -108 151 -294 -84 151 -77 -63 7
7593GL16j00j10n5J2j16oK06j50j7J26n9l8N4P3k31k9J86r3J84j9j64l4O6Qn8
$$ 7 323 223 113 58 70 -46 -52 154 4 -13 113 54 16 70 143 -88 -117 69 -24 160 141 -23 -57 9 17 -41
7619d1J25j25o2J47l9J03k20P1k0J28P3J79k85j8Q2J55j94K8p9K82k85K00N4m87
$$ -41 84 -41 -103 44 5 108 -112 -41 -61 67 140 319 34 16 98 253 59 87 8 290 5 205 259 -228
7643b28M19l14L27k53N8JK02k95oJ07k9m2j67J43J23r0k15J65J28P6J08Kj32M0
$$ -228 191 -123 204 -49 9 10 212 -83 -89 18 -11 -53 -220 -77 46 -44 -259 -94 34 110 218 220 88 128
7667A28k7k05J08J20o1o1k25L11j59R3Q0j63l5K38K0l12J95o4j40J15L8l6J5M5
$$ 128 101 -104 4 124 63 2 -223 88 -71 22 102 -61 -96 142 162 -150 45 -19 -159 -44 -6 -42 -27 18
7691A8j29j8J21J11L2j2M1m8mJ04j75O8j72N2J48j69k8J34j69P3K40k10j49J23
$$ 18 -111 -129 -8 103 135 123 164 116 112 216 41 109 -63 -11 137 -32 -60 74 -95 -22 218 8 -141 -18
7715a8J12l1r9j0p8K61k62L20l22K09j5l43J39J86m4N2Qm3J28j80k1J11J91k43
$$ -18 94 63 -36 -46 -124 137 -125 195 -127 82 67 -276 -137 49 5 57 65 22 150 -30 -51 60 251 8
7739HR9n1k19J49J19k17J62j32r9K01Q9p2K5p2RR8o7Q1qJ9jj13J39j53j49R9N7
$$ 8 107 56 -163 -14 105 -112 50 -82 -181 20 109 37 62 -10 -1 97 30 111 103 122 121 8 147 -6 -155 -56 1
7766Ak4J53k40M7N8j05J51m1K6j75K60K9l41J31j10j90K88M7n9K47k33K6J86j09
$$ 1 -23 130 -110 -63 -5 -110 41 0 26 -149 111 140 -201 -70 -180 -370 -82 -35 -94 153 -80 -54 132 23
7790B3j31J58j64L7j0R8M7j22J06k03K78N1j74L9J27P4M1k66R4k8k6J05k18k5
$$ 23 -108 50 -114 -77 -87 11 58 -64 42 -161 117 168 -6 33 160 234 275 9 103 75 49 154 -64 -89
7814h9J78j75m8J93j61j91K78O7%Q7K2J30m5l36J96p1K8PM4M6l3p0j77l3J39J07
$$ -89 89 -86 -134 59 -102 -293 -15 52 52 139 161 291 246 -90 106 35 63 70 114 160 127 57 -120 -153 -14 93
7840I3j65j26K93j87L5O9j92K63l31L21k0j59K2J53k95J03J50J48j87j32L03p4
$$ 93 -72 -198 95 -92 -57 12 -180 83 -248 73 53 -106 -84 69 -226 -123 27 175 -12 -144 159 85
7862H5o1J7O3j04n7k16M43k80N1k4J28K93k46o1J5n5J12k9p2J96k43PJ86o8l01
$$ 85 24 41 104 0 -57 -273 170 -110 -59 -83 45 338 92 31 46 -9 103 74 2 198 -45 -38 148 80 -221
7887b21M8j03M25j15L1L26o15J6p3L90J95j09r5j23K57l50nn4R9J38r3k8jJ22
$$ -221 -173 -276 149 34 65 391 -224 -208 -281 109 304 195 100 -23 234 -116 -121 -175 -76 62 -31 -59 -60 62
7911F2j62J82j61j23O2K71k25k0K30K27k67Nj69j7J66r7J24K6J37q2j66j91K59
$$ 62 -100 82 -79 -202 -140 131 -94 -114 116 343 76 81 -88 -105 61 -36 88 114 251 169 3 -188 71
7934G1j87J58l75L14P2j07L0j42J05J63O5j69L70m38o0J37J75j86kP5PK16k30
$$ 71 -116 42 -333 -19 53 -54 -24 -166 -61 102 167 -2 368 -70 -130 7 182 -4 -6 69 76 292 62
7957F2N7JR1k63j21K69l7m5J56k81r1q2J94N5J51j62o2P7j52K34M8o1j3j6kk2
$$ 62 119 120 211 -52 -173 96 59 14 170 -111 -202 -284 -90 -35 116 -46 -108 -31 -183 51 99 38 25 9 7 -15
7983a5J77r6j67L10k74J41k21K07Q8K4k26K28j41q2q5K17m7q1K07l11J31j77j09
$$ -15 162 66 -101 209 -65 76 -145 62 150 174 -52 176 35 -47 -132 85 38 -43 164 -147 -16 -193 -302
8006c02L35K7L5k90r7L68r0K25j21J94m23J12K03j72JN9j74kK36O7q1l2j61r4
$$ -302 33 60 95 -195 -292 76 -14 211 90 284 -139 -27 176 4 5 64 -110 -112 124 191 110 78 -83 -177
8030a77O7K14k27N6N1j16J59k45nJ81m9j39N2J93j0n3q4R7J78m1J49l19KO0J87
$$ -177 -110 104 -123 -67 -16 -132 27 -218 -223 -42 -91 -230 -178 15 5 -48 -132 -35 143 102 251 -68 -66 -6 181
8055A81m7q0j13l0J39p4p9L00j82k1L06k41j00j9J02k24L12l02K58m50K92R5l8
$$ 181 134 54 -59 -89 50 -24 -103 197 15 -6 300 59 -41 -60 42 -182 130 -172 86 -364 -72 23 -15
8078a5J47j16Rk14J84J55j52k52K07J91o1J36k88Q7J65j16j70K75k69L7N0m3K31
$$ -15 132 16 25 -189 -5 150 -2 -254 -47 144 83 219 -69 18 183 67 -103 172 -97 -60 -10 -53 178
8101A78k21rN7K08k39j68J06O7j1L00k33J2l19L14j46O6J83p4j67M3O7J25j57
$$ 178 -43 -52 5 213 -26 -194 -88 -21 -32 268 35 47 -272 42 -104 -38 145 71 -96 -53 14 139 -18
8124a8J2O4j09J50l03kJ97l63K64K50j26j13J51M4lk18K22p9m8L0N4j38p0J80
$$ -18 -6 58 -51 99 -204 -206 -9 -372 -108 142 16 -97 54 98 95 -123 99 20 -28 2 56 -82 -152 28
8148B8JK1j5j40J54j48L52j69P8j72j2R8p5k10O3K04j05Q0K17j72j7j8K6j78J45
$$ 28 29 50 35 -105 49 -99 253 84 162 -10 -22 76 1 -209 -146 58 -47 33 250 78 61 43 69 -109 36
8173C6lk96K65j05j5J13J66k5q0P6O0q3l2k1l7l49M28j4
$$ 36 33 -263 2 -103 -118 -5 161 136 56 132 192 109 77 56 19 -330 98 84
8191H4
$$ Imaginary data points
##PAGE= N=2
##DATA TABLE= (X++(I..I)), XYDATA
0@%%%%%%%%%%%qJ6j6J6j6K4l2L2m0N2o0P2q8J04j20J36j60J85k09K40k74L14l57
$$ 0 0 0 0 0 0 0 0 0 0 0 0 -8 8 -8 8 -8 16 -16 16 -24 28 -32 40 -48 56 -64 72 -88 97 -112 128 -146 168 -189
34a89M03m55N11n72O40p15P95q84R82j087J202j328J466j617J784j966K163k383
$$ -189 214 -241 270 -302 338 -377 418 -466 516 -571 631 -697 769 -848 936 -1030 1133 -1250
52a250K628k900L203l544L931m373M887n492O213p093Q196r625J1558j4330J8671
$$ -1250 1378 -1522 1681 -1863 2068 -2305 2582 -2910 3303 -3790 4406 -5219 6339 -7991 10680
67A0680k6477M4839j68825j15992L18361L1721j54527l860J73305l0315r2670
$$ 10680 -15797 29042 -139783 -255775 62586 94307 -60220 -64080 109225 78910 -13760
78a3760J51O7856K6924n0968o7785K6239M3354l5496l5837Q1606M150j00205j1222
$$ -13760 -13609 54247 81171 30203 -37582 -11343 32011 -3485 -39322 42284 46434 -53771 -64993
91f4993Q1169J6841n3792J6802M6071n6498l7954J0027J2641L3066J7717j9832
$$ -64993 16176 33017 -20775 -3973 42098 -14400 -52354 -42327 -29686 3380 21097 1265
103A265k0788J3086J1301j3717K7103J5963l2678p236O752j3212J4659O3961j0724
$$ 1265 -19523 -6437 4864 -8853 18250 34213 1535 -5701 1051 -12161 2498 66459 55735
116E5735q9718J0530N5549k8637l2360L8535L0756n8383m0166M1772K2290j1294
$$ 55735 -33983 -23453 32096 3459 -28901 9634 40390 -17993 -58159 -16387 5903 -5391
128e391m401J2176P530k6512j7472J9075L4655J848l3320M247K0289j3984j1531
$$ -5391 -9792 2384 9914 -16598 -34070 -14995 19660 21508 -11812 -7565 12724 -1260 -12791
141a2791K2979K4391k4369k3504J1963K619M765J5088O290j2553k5360o425O352
$$ -12791 10188 34579 10210 -13294 -1331 1288 6053 21141 27431 14878 -10482 -16907 -10555
154a0555J1578J2380q571r638q949p546J1433J2757l75j2717L123J0629k1440
$$ -10555 1023 13403 4832 -4806 -13755 -21301 -9868 2889 2514 -10203 -7080 3549 -17891
167a7891p759L4882J9515l4077k9186L3880J9928k6635J542L5404Q157l3026j7577
$$ -17891 -25650 9232 28747 -5330 -34516 -636 19292 -7343 -5801 29603 37760 4734 -12843
180a2843J5289O746j752j531L725M600j8627j2599J9558K1106j7776l2921Q582
$$ -12843 2446 9192 7440 5909 9634 14234 -4393 -16992 2566 23672 5896 -27025 -18443
193a8443J2660j6029L98K2914R257j6698j0572O450M946J3572O940j1394n697
$$ -18443 -5783 -21812 -21414 1500 10757 -5941 -16513 -10063 -5117 8455 15395 4001 -1696
206a696r9n24J361Q222L426n453P347l16j0791J1323J2318j3516j4406P117p063
$$ -1696 -1795 -2319 -958 7264 10690 5237 12584 12268 1477 12800 25118 11602 -2804 4313 -2750
221b750k9018J1447L1695q290k0844N877J2346j0373o579J5381J0588n523k0125
$$ -2750 -31768 -20321 11374 3084 -17760 -11883 463 -9910 -16489 -1108 9480 3957 -16168
234a6168p701K6536J8204j7825j1811K3015R276l0212k000L2141N705k3075j2933
$$ -16168 -23869 2667 20871 3046 -8765 14250 23526 -6686 -8686 23455 29160 6085 -6848
247f848N976J498k080J488j2L316l949j0952M895R625n741p564Q255K954j8704
$$ -6848 -872 626 -1454 34 22 3338 -611 -11563 -6668 2957 -2784 -10348 -2093 861 -17843
262a7843m104J5152P634K489Q45o904n598J3706J3225j0127m645R787k258j3873
$$ -17843 -21947 -6795 839 3328 4173 -2731 -8329 5377 18602 8475 3830 13617 11359 -2514
276b514l201J4115Q362q872j3715m579R876K553o456Q471J0177j2364j9110P093
$$ -2514 -5715 8400 16762 7890 -5825 -10404 -528 2025 -4431 4040 14217 1853 -17257 -10164
290a0164J6204j1854j6002Q089J2433o159j1130J2288K1505o9j6084l311J3544
$$ -10164 6040 -5814 -21816 -13727 -1294 -7453 -18583 -6295 15210 15141 -943 -4254 9290
303I290p1j2524O659J6036l846j8098n303R478M273L35k7j793j735k632m56J708
$$ 9290 9219 -3305 3354 19390 15544 -2554 -7857 1621 5894 6229 6202 4409 2674 42 -414 1294
319A294n71m955p613n126K97P052J0288P32l580k50k070n264K695J2819K991q975
$$ 1294 723 -4232 -11845 -16971 -16674 -9622 666 1398 -2182 -2432 -4502 -9766 -7071 5748 8739 -236
335b36l50Q782L589n929k920R138M465j1395j3357P226J4943o880j2277M700K808
$$ -236 -586 8196 11785 5856 2936 12074 16539 5144 -8213 -987 13956 7076 -5201 -501 2307
350B307j3859o912J6071R992j0096p795L627K625m946j70R598N993p710j1034
$$ 2307 -11552 -18464 -2393 7599 -2497 -10292 -6665 -4040 -8986 -9156 442 6435 -1275 -12309
364a2309N283J4969J660n999O39K352l091j445M265K366O76J157p447q368K720
$$ -12309 -7026 7943 9603 3604 4243 6595 3504 2059 6324 8690 9366 10523 3076 -5292 -2572
379b572O417o18n036j199j525n757j863N000Q643K312p546l213N418R37o975L072
$$ -2572 3845 3227 -1809 -3008 -4533 -10290 -12153 -7153 1490 3802 -3744 -6957 -1539 -602 -7577 -4505
395d505J3246l031j7130o8J8235P764r171l734O105j052r339L37J3440M867j1727
$$ -4505 8741 5710 -11420 -11488 6747 14511 5340 1606 7711 6659 -2680 -2343 11097 15964 4237
410D237q273K301P58n958J77Q499P78p805k939M663M856j515k144o3k170m264
$$ 4237 -4036 -1735 -977 -6935 -6758 1741 2519 -5286 -8225 -3562 1294 -221 -2365 -2428 -4598 -8862
426h862j05O991O012Q26j585n564l831N260P253J134m64M847j490j1573k695R634
$$ -8862 -8967 -1976 4036 4862 3277 -2287 -6118 -858 6395 7529 7065 11912 10422 -1151 -3846 5788
442E788N656q155j0015M73O365J185m358K531O301q594j4373M728J2730l458o374
$$ 5788 11444 3289 -6726 -6253 112 1297 -3061 -530 5771 -2823 -17196 -12468 262 -3196 -9570
457i570J0094N432j4029o363J3501J2039l798q496Q03P344Q27q085O87J3535M6
$$ -9570 524 5956 -8073 -14436 -935 11104 7306 -1190 -387 6957 7784 -301 386 13921 13967
472A3967j6236l585J0912L643m525K241r75j0787m960K344Q99K210L684m409p069
$$ 13967 -2269 -5854 5058 8701 4176 6417 5442 -5345 -10305 -7961 -7062 -4852 -1168 -5577 -12646
487a2646L010O159J088K623K798k234k675p13L61N501P815l970r331N288N847
$$ -12646 -9636 -3477 -2389 234 3032 798 -1877 -2590 -2229 3272 11087 7117 -2214 3074 8921
502H921o893j05J3688L12j6933n622P673J316n131j248J534n19o321n912O660
$$ 8921 2028 1923 15611 15923 -1010 -6632 1041 2357 -2774 -4022 -2488 -3007 -9328 -15240 -8580
517h580J3715j022j1773J470O994n536l808J0835O050q794m920M663M573K063
$$ -8580 5135 4113 -7660 -6190 804 -4732 -8540 2295 8345 -449 -5369 -706 3867 5930
531E930J940k27j243q82l896l254N933O040n165p484j491q58n62K029J567J23
$$ 5930 7870 7643 6400 5518 1622 -1632 4301 10341 5176 -2308 -3799 -4657 -5219 -3190 -1623 -1500
547a500N11l535n958L874R403j999q027K065M476l967O1J0793N878o429p972L58
$$ -1500 -989 -4524 -10482 -6608 2795 796 -7231 -5166 -690 -4657 -4596 6197 12075 5646 -2326 -1968
563a968N463O77j989O07M920j572r728p47J0824L170r304l516N071j719o034K253
$$ -1968 3495 4172 2183 2790 7710 6138 -3590 -4337 6487 9657 353 -3163 1908 189 -5845 -3592
579c592M856k570n643k838N38K738M921J974J99J297j207l576M59O110K947l082
$$ -3592 1264 -1306 -6949 -9787 -9249 -6511 -1590 384 583 1880 673 -2903 -2444 3666 6613 3531
595C531l744j493K964M050L58j570K103K46p234l491Q152M324p697m959L295j505
$$ 3531 -213 -1706 1258 5308 5666 4096 6199 6445 -789 -4280 3872 8196 499 -4460 -1165 -2670
611b670n706J648P152P18o147m253L128N997m48m090L081O401n657q059P687J1128
$$ -2670 -8376 -6728 424 1142 -5005 -9258 -6130 -133 -581 -4671 -1590 4811 -846 -8905 -1218 9910
627I910l516n681M766L311n295k400M253J894k645n465m606J612O206k1l825N65
$$ 9910 6394 713 5479 8790 3495 1095 5348 7242 4597 -868 -5474 -3862 2344 2323 -1502 -937
643i37l9n302j515M276J325l74Q00l105l261M780M213k504J322M412l037l615
$$ -937 -976 -6278 -7793 -3517 -2192 -2566 -1766 -4871 -8132 -3352 861 -1643 -321 4091 1054 -2561
659b561P050O932l595m983M68j88k040k330J046O432K444q871p195P065M624q285
$$ -2561 4489 11421 7826 2843 3311 3123 1083 -1247 -201 6231 8675 -196 -7391 -326 4298 -3987
675c987l994P921r4r536k02R115K081l716k024M06J572J554J71K983N216k637
$$ -3987 -7981 -60 -154 -9690 -9892 -777 1304 -2412 -4436 -4030 -2458 -904 -733 2250 7466 4829
691D829p017J197N271r31o13M039l53m673n27K365r0m29q02n456l426L031J621
$$ 4829 -2188 -991 4280 3349 2736 6775 6422 1749 1222 3587 3497 3068 2266 -3190 -6616 -3585 -1964
708a964k142Q90K600k255m234q9M107N386O5m908j313M796O1m713L899Q120l343
$$ -1964 -4106 -3216 -616 -2871 -7105 -7194 -3087 2299 2364 -2544 -3857 939 1000 -3713 186 8306 4963
725D963p792K710P854q63l944J837K123m030n904Q99N950P54o294l664K801K16
$$ 4963 -2829 -119 7735 6872 2928 4765 6888 2858 -3046 -2147 3803 4557 -1737 -5401 -2600 -2384
741b384l810P41N560O20o074k195L399K567K51P27J741p59j211M86K636L057Q59
$$ -2384 -6194 -5453 107 727 -5347 -7542 -4143 -1576 -1325 -598 1143 384 -827 -341 2295 5352 6211
758F211k192k931k22K740P00j210L42N19k532m724j65M750K447m326m788J121
$$ 6211 4019 1088 866 3606 4306 3096 3438 3957 1425 -3299 -3464 1286 3733 -593 -5381 -4260
774d260K076l416j821N528L738n775l826N709N081k871p85M569J45m825j645N627
$$ -4260 -2184 -5600 -7421 -1893 1845 -3930 -7756 -2047 3034 163 -622 3947 4092 -733 -2378 3249
790C249M875j866m901KK862k259l915L428N283l915o828N87K929j335p41O74j200
$$ 3249 8124 6258 1357 1359 4221 1962 -1953 1475 6758 2843 -3985 -3398 -469 -1804 -2545 -1871 -3071
807c071j214J60l89J950L460K94l630k132J944K446J793J163L84R42j359l451
$$ -3071 -4285 -4125 -4514 -2564 896 1190 -2440 -4572 -2628 -182 1611 2774 3158 4100 2741 -710
823g10N08O429R23o035j219M509j553n131K661N739l797q077n47M913J559l344
$$ -710 -202 6227 7150 1115 -104 4405 2852 -2279 382 6121 2324 -5753 -6300 -1387 172 -3172
839c172q66L937j83o858j765Q175M175n224k184M990O20l948J587N973N64m287
$$ -3172 -4038 -101 -284 -7142 -8907 -732 3443 -1781 -3965 1025 1645 -2303 -716 5257 5821 1534
855A534k779K276K849Q22r74Q42J53l346k946J175K380m49j303k110l211r1K881
$$ 1534 -1245 1031 3880 4702 3728 4570 4723 1377 -1569 -394 1986 1537 234 -1876 -5087 -5178 -2297
872b297N54j619J191O92l604j534M828M211j112k531Q79J722j086j249L748M983
$$ -2297 -1743 -3362 -2171 -1479 -5083 -6617 -1789 2422 1310 -1221 -342 1380 294 -955 2793 7776
888G776l181n557J823N776k019l886K582K596n891n773K773N532q37m763p08K265
$$ 7776 4595 -962 861 6637 4618 732 3314 5910 19 -5754 -2981 2551 1714 -3049 -3757 -1492
904a492j781m031J912N757qn379k50M277J278m80K091J320j419j042N75J146K212
$$ -1492 -3273 -7304 -5392 365 357 -5022 -5272 -995 283 -197 1894 3214 1795 753 1328 2474 4686
921D686J613j834l378j050J8J285K15k37L96n50l209k295L609K191l836l463K471
$$ 4686 6299 4465 1087 37 55 1340 1555 1318 1714 1164 -2045 -4340 -731 1460 -2376 -5839 -3368
938c368N59l680R03O341J481m405j938M013L222j293l42L610J769n129m221M402
$$ -3368 -2809 -6489 -5586 755 2236 -2169 -4107 -94 3128 1835 1493 5103 6872 1743 -2478 1924
954A924M875m394l737L385J364m394j786M632K196l859l564q3J076J92r33O29
$$ 1924 6799 2405 -1332 2053 3417 -977 -2763 1869 4065 206 -3358 -3441 -2365 -2173 -3106 -2477
970b477R74j442k273J298K960Q79P94K47j358o60K309J452k33R07J803k183l435
$$ -2477 -1503 -2945 -5218 -3920 -960 -81 713 960 -398 -1058 1251 2703 2470 3377 5180 2997 -438
987d38J706L665m00l710p52J509j322l278J101M220j015n823r46M793O63m244
$$ -438 1268 4933 4533 823 71 1580 258 -3020 -1919 2301 1286 -4537 -5483 -690 -27 -4271
1003d271R03M611j344n843j43N871K070l643k75L948J386l164M07M653J294m053
$$ -4271 -3368 1243 -101 -5944 -6087 -216 1854 -1789 -2064 1884 3270 106 513 5166 6460 2407
1019B407j744J609O13j561J60P32r66k094j727P02J993L74j287j007q83p42O63
$$ 2407 663 2272 2885 1324 1484 2216 1250 -844 -2571 -1869 124 498 -789 -1796 -2679 -3421 -2758
1036b758J10p21Q57J397k022j496M402M014k140k526K793K058k799q83L439K447
$$ -2758 -2648 -3369 -2512 -1115 -3137 -4633 -231 3783 1643 -883 1910 3968 1169 286 3725 6172
1052F172k926l938R50L328j467m027K064M155m113o030L284N244l643m861K380
$$ 6172 3246 -692 258 3586 2119 -1908 156 4311 198 -5832 -2548 2696 -947 -5808 -3428
1067c428K333k427j928L138L971n23l281r34L391J779j942N54L697j077l605J425
$$ -3428 -1095 -3522 -5450 -2312 1659 1136 -2145 -3079 312 2091 149 703 4400 3323 -282 1143
1083A143K927r05r01J089j868k134J421J073j969m13N74k435j976M88K051J049
$$ 1143 4070 3165 2264 3353 1485 -649 772 1845 -124 -537 37 -2398 -4374 -3886 -1835 -786
1099g86r84j628P87J895j497j575M062L447m483l137M858L407l542n94M582M18
$$ -786 -1770 -3398 -2611 -716 -2213 -3788 274 3721 -762 -3899 959 4366 824 230 4812 5230
1115E230m542j332L490K266k173l153N17J728k880l169L215L661m162m323K266
$$ 5230 688 -644 2846 5112 2939 -214 303 2031 -849 -4018 -803 2858 -1304 -5627 -3361
1130c361K418k050n32K528L71k098o23J207J901J124J29j95LO63K54J014Q97p21
$$ -3361 -943 -2993 -3525 -997 -626 -2724 -3347 -2140 -239 885 1014 819 822 1485 1739 2753 3650 2929
1148B929r6p13j582J86K419O57l435j603K097j204l405J227L672j126m592n63
$$ 2929 2833 2120 538 724 3143 3800 365 -1238 859 -345 -3750 -2523 1149 23 -4569 -5132
1164e132L755O65l016J72L894L9l855L20N527J646l295j069L044K63k829K60M139
$$ -5132 -1377 -712 -3728 -3556 338 377 -3478 -3158 2369 4015 720 -349 2695 2958 129 389 4528
1181D528R16l895j996K496N19k479j10J652p55l126j087J875O08p37m38q89j1
$$ 4528 5444 1549 -447 2049 2568 89 -21 1631 876 -2250 -3337 -1462 -854 -1591 -2029 -2918 -2929
1198b929R0M48J156R98K44k38k53m88J305K653l28j989M75K174j443j931K729
$$ -2929 -2839 -2391 -1235 -237 7 -231 -484 -972 333 2986 2658 669 1144 3318 1875 -56 2673
1215B673K866l820l520J948K024j895k063J237J533k318l657J010M269k64m045
$$ 2673 5539 1719 -1801 147 2171 276 -1787 -550 983 -1335 -4992 -3982 287 23 -4022
1230d022M20M129j541l480L329M664j815l690J509K138k12k30R29J138l02k219
$$ -4022 -3602 527 -1014 -4494 -1165 3499 1684 -2006 -497 1641 1429 1199 2128 3266 2964 745
1246G45n76K268O95j923q42P30j488j439J596O09j651j97K05k297r21L232J486
$$ 745 169 2437 3132 1209 367 1097 -391 -1830 -234 375 -1276 -1473 -1268 -3565 -4486 -1254 232
1263B32k216p40J989L29j690O12K862J487k093j764K131L004j730k074K777K044
$$ 232 -1984 -2724 -735 -406 -2096 -1484 1378 2865 772 -992 1139 4143 2413 339 3116 5160
1279E160m468l129M112K812l590k433J839N10k868j462K346J954j744l234P05
$$ 5160 692 -2437 1675 4487 897 -1536 303 813 -2055 -3517 -1171 783 -961 -4195 -3490
1294c490K776j005j893K337K049k169j911K500K872m12k22Q79k05q66L95P56M78
$$ -3490 -714 -1719 -3612 -1275 774 -1395 -3306 -806 2066 1654 1432 2311 2106 1240 1635 2391 2869
1311B869N08p91j148j304N6J103k49j656q35M46l06k042M12L307n71l276j004
$$ 2869 3377 2586 1438 134 190 1293 1044 -612 -1447 -1001 -1307 -3349 -2937 370 -201 -3477 -4481
1328d481L592N87k017N17L105M1l224j94L970J699k552p30L234J86l297O1L318
$$ -4481 -889 -302 -2319 -1802 1303 1344 -1880 -2074 1896 3595 1043 313 3547 3733 436 497 3815
1345C815M59l867j451J749K46k355m12J990l28k536j436K184J358r68m73J097
$$ 3815 4274 407 -1044 705 951 -1404 -1816 174 -154 -2690 -4126 -1942 -584 -1552 -2025 -928
1361i28q1j148N03J250O88J69K31m82l30J660J322R1r43J29N40o95j482O06J765
$$ -928 -1009 -2157 -1654 -404 284 453 684 202 -128 1532 2854 2945 2002 2131 2671 1976 494 1100 2865
1380B865j585k922m17K393j005k063J189K011k175k564J424L094n89j963Q99K229
$$ 2865 1280 -1642 -2059 334 -671 -2734 -1545 466 -1709 -4273 -2849 245 -344 -2307 -1408 821
1396H21r29k143R30L639L59l397j91L370L73j960P12K142r71k294l9J250k33q07
$$ 821 -108 -2251 -1321 2318 2677 -720 -911 2459 2832 872 1584 3726 2755 461 422 1672 1439 632
1414F32m86o91n38r91lL96K22l67n73J96L45O03J152k17q05J199K92j188O07K158
$$ 632 146 -545 -1083 -2074 -2077 -1681 -1459 -1826 -2399 -2203 -1858 -1255 -103 -320 -1125 74 366 -822 -215 1943
1434A943Q47k088r95K219P47j350j91J579M79k460k056K071J853k406k434J354
$$ 1943 2790 702 -293 1926 2673 1323 1132 2711 3190 730 -1326 745 2598 192 -2242 -888
1450h88R99k581j421K483J723k346j383J534J340p47m35J469J838j062j873J521
$$ -888 111 -2470 -3891 -1408 315 -2031 -3414 -1880 -540 -1287 -1722 -253 1585 523 -1350 171
1466A71J959K18j340N32L16n39k34P85O6l64k38j070q90N43O78n94j014m39m4
$$ 171 2130 2348 1008 1540 1856 1317 1083 1868 1934 1570 1332 262 -628 -85 593 -1 -1015 -1454 -1498
1485a498k93r49L56J695k87j791k10K835K10j077O71K675k75k595N22K899M82
$$ -1498 -1791 -2740 -2384 -689 -976 -2767 -2977 -142 68 -1009 -338 2337 2062 -533 -11 2888 3370
1502C370k081o73J404L07k057n40K457O31k910j727J614P24j919q5J238k72k231
$$ 3370 1289 616 2020 2327 270 -270 2187 2818 -92 -1819 -205 519 -1400 -1485 -247 -519 -2750
1519b750n22J296Q62j93m43N57M43j78M47J005J401l17p11K44K71K94O79Q9j391
$$ -2750 -3272 -1976 -1114 -1307 -1750 -1193 -750 -928 -481 524 1925 1608 897 1141 1412 1706 2385 2474 1083
1538A083K33m3q62q53J224Q55j407j748L56P35n03q43N95Q96j377k054J175K689
$$ 1083 1316 1273 411 -442 782 1637 230 -1518 -1162 -427 -930 -1773 -1178 -282 -1659 -3713 -2538 151
1556A51l7k036P39K021o22j381J786K578p68j748j48J606J9q55o6J184o44j980
$$ 151 114 -1922 -1183 838 216 -1165 621 3199 2431 683 535 2141 2160 1305 1239 2423 1779 -201
1574b01p98J484K83j145o04qk18p58m4Q44L15q58k45j3P31N41O96k84N30M36q3
$$ -201 -999 485 768 -377 -981 -989 -1207 -1965 -2009 -1165 -850 -1708 -1953 -1966 -1235 -694 2 -282 248 684 601
1595F01l41N52J628K49j400j137J792J17j145j03J275l07k419j128J514R33j518
$$ 601 260 812 2440 2689 1289 152 1944 2061 916 813 2088 1781 -638 -1766 -252 681 -837
1612h37j237Q51N45j598p44K172J225j564j377J354J205m32k48J426O09n94p06
$$ -837 -2074 -1223 -678 -2276 -3020 -848 377 -1187 -2564 -1210 -5 -437 -685 741 1350 756 50
1629E0R00J314J01p94j97M51o19q19L87L70k42r64n27n79k67J228n89o97M0O01
$$ 50 950 2264 2365 1571 1374 1825 1206 387 774 1144 902 -62 -589 -1168 -1435 -207 -796 -1493 -1453 -852
1649h52j271l44J191J253o29j190P16J333J01k01O89J370k59k015L87K450J93
$$ -852 -2123 -2467 -1276 -23 -652 -1842 -1126 207 308 107 796 2166 1907 -108 279 2729 2922
1666B922j923l99J425p22j775N77J501p30j698o40N27J70r88l97J332q3j338m25
$$ 2922 999 600 2025 1303 -472 105 1606 876 -822 -1462 -935 -765 -1753 -2150 -818 -901 -2239 -2664
1684b664J451J263n40MP42j92n24O51Q78L61K82l35j104M77R73j7m00Q6l6n05
$$ -2664 -1213 50 -490 -486 256 64 -460 191 1069 1430 1712 1377 273 750 1723 1706 1306 1392 1356 851
1704H51q16m02O07J92j068j526K07J128p91p77J612Q38j765r66J809J231m61j88
$$ 851 35 -367 240 432 -636 -2162 -1955 -827 -1618 -2395 -783 55 -1710 -2676 -867 364 -97 -285
1722b85L97Q53n63n72J099J595m77j562L76J070l54j067N20R04j099j652k6N74
$$ -285 112 965 402 -170 929 2524 2047 485 861 1931 1577 510 1030 1934 835 -817 -843 -269
1740b69no16k20l47j11j76j34P46Q51m48n14RM05J015L10J5L55K94j81p69R22
$$ -269 -274 -890 -1110 -1457 -1568 -1744 -1878 -1132 -281 -729 -1243 -1234 -829 186 496 511 866 1160 979 210 1132
1761A132J267m78j267p7P34j20q52J22P13m11k008n13J269J38j166p02J304j38
$$ 1132 2399 1921 654 577 1311 1191 339 461 1174 763 -1245 -1758 -489 -351 -1517 -2219 -915 -1053
1779a053j187J19J408O95o65l93J025N36j66p9R54J126j275r56Q40R15j25o69
$$ -1053 -2240 -2121 -713 -18 -683 -1076 -51 485 319 240 1194 2320 1045 89 929 1844 1719 1050
1797A050J68k61k00l36m24L41J34p15j081K3L70O9o89j13K37K52n28j41P25J425
$$ 1050 1218 957 757 421 -3 338 472 -243 -1324 -1301 -931 -862 -1551 -1664 -1427 -1175 -1703 -1844 -1119 306
1817C06m15p69J068J075m49n75J221Q54p31j178O98R24n44j250K34N30n98j485
$$ 306 -109 -878 190 1265 816 241 1462 2316 1585 407 1105 2029 1485 235 469 999 401 -1084
1835a084L64J528k98k297L90O62p1r62L54O12l57n43k5Q25R43M4k47L66R09j47
$$ -1084 -720 808 510 -1787 -1397 -735 -806 -1768 -1414 -802 -1159 -1702 -1727 -902 41 85 -162 204 1113 966
1855I66j34O71M50m12k96k65n40O48J3o08m59N58j48j252J91R64n57j181k91M71
$$ 966 832 1503 1953 1541 1245 980 440 1088 1101 493 34 592 444 -808 -617 347 -210 -1391 -1682 -1211
1875a211L32p05j63J052O10r80m32J608J222j016p92J671N16j446j42J526O23
$$ -1211 -879 -1584 -1747 -695 -85 -1065 -1497 111 1333 317 -475 1196 1712 266 124 1650 2273
1892B273r59j015N60J83l55o16M61L97j304j230O16N13n07l15M42r1m02O0O79
$$ 2273 1314 299 859 1042 687 71 532 929 -375 -1605 -989 -476 -983 -1298 -856 -947 -1349 -1289 -610
1911f10j77N5N32k70k10P14O94J21l7J31L71J26p96O45R15m10j454m75J123o47
$$ -610 -787 -732 -200 -470 -680 34 728 849 812 943 1314 1440 644 1289 2204 1794 340 -135 988 341
1931C41j367L23J073o79j705K13J280K13r93k30R85K4j246K04J787L31j015k98
$$ 341 -1026 -703 370 -309 -2014 -1801 -521 -308 -1301 -1531 -546 -522 -1768 -1564 223 554 -461 -759
1949g59J662J67q96N44J094j34r96n6O76K87l13n97O6j66r22j07J4L65l68n02
$$ -759 903 1070 174 718 1812 1678 682 626 1302 1589 1276 679 745 579 -343 -450 -436 -71 -439 -941
1969i41j90m93j14P59N0o01M43P93n97j44J284N82m73l24K80Q89j90l03N42Q79
$$ -941 -1131 -1624 -1738 -979 -929 -1530 -1087 -294 -891 -1035 249 831 358 34 314 1203 1013 710 1252 2131
1989B131q48j354P38J278q96j301M39P44j207j171N84J004n88j299L13N39m8o35
$$ 2131 1283 -71 667 1945 1049 -252 187 931 -276 -1447 -863 141 -447 -1746 -1433 -894 -942 -1577
2007a577O23R33j02j016L66J096j79n4O05L54k98k01N39K6J61K9j98o61r3K4L01
$$ -1577 -954 -21 -123 -1139 -773 323 144 90 695 1049 751 550 1089 1115 1276 1305 1107 446 353 377 678
2028F78n18m44k4k70m75r2N28M09j192m19Q91M18p23R4J158M87j130k52J446N26
$$ 678 160 -284 -308 -578 -1053 -1145 -617 -208 -1400 -1819 -928 -510 -1233 -1139 19 506 -624 -876 570 1096
2048A096k42p13J034N04j317l52J371N74j064r85O56K54q37p94J041q1q05p79
$$ 1096 854 141 1175 1679 362 10 1381 1955 891 -94 562 816 -21 -815 226 145 -660 -1439
2066a439M95R1k37j04J15K81k14n5M55P54j56K57P3p6PP92M18q43M41L38p58k17
$$ -1439 -944 -853 -1090 -1194 -1079 -798 -1012 -1067 -612 142 -14 243 316 240 247 1039 1457 614 1055 1393 635 418
2088D18L62N95n21q44k91J41J95j159j34J239k22j811k0J693j24q53Q4J302k72
$$ 418 780 1375 854 10 -281 -140 55 -1104 -1238 1 -221 -2032 -2052 -359 -483 -1336 -1252 50 -222
2107b22j077O05J160N76j109r5J115M61o47k31J476J48j656j25Q62q9j370J3P05
$$ -222 -1299 -694 466 1042 -67 -162 953 1414 767 536 2012 2160 504 379 1241 1152 -218 -205 500
2126E00p18p71l5N14J5l27j86j95J75j32R4O16j2k25M48j1r4O94N82l7q34O67
$$ 500 -218 -989 -1024 -510 -495 -822 -1008 -1203 -1028 -1160 -1066 -450 -462 -687 -239 -250 -344 350 932 895 61 728
2148G28R26p73n18P31L95q55p75M22O58k72j230K51O78p31j330N88R13n38j217
$$ 728 1654 881 363 1094 1489 634 -141 281 939 667 -563 -312 366 -365 -1695 -1107 -194 -732 -1949
2167a949N64J035k94n92O65Q92l94m23K41Q78J81n13K94P55l93o12N39N33n96
$$ -1949 -1385 -350 -644 -1236 -571 321 -73 -496 -255 623 804 291 585 1340 947 335 874 1407 811
2186H11l61P3m5o55q7J22l71l14K28j52m28M5N15L63o95n23P16Q62p29k34R60
$$ 811 450 523 478 -177 -264 -142 -513 -827 -599 -751 -1179 -1134 -619 -256 -951 -1474 -758 104 -625 -859 101
2207A01N68r44j98J314P33o97k68P05K78j000n96P60O20p90j203N67N75j009q14
$$ 101 669 -275 -473 841 1574 877 609 1314 1592 592 -4 756 1376 586 -617 -50 525 -484 -1298
2226a298R04L44j004p10R00L89m13j10K49N65n44M7K68Q73Q5l23M91M3m1J21L72
$$ -1298 -394 -50 -1054 -1764 -864 -475 -888 -998 -749 -184 -728 -681 -413 460 545 222 713 756 715 836 1208
2247A208m8l48M54m77l74k36M05q8q40j94M17m46m54NN66j55p48r8R94J86p00
$$ 1208 1160 812 1266 789 415 179 584 496 -344 -538 -121 -567 -1021 -1016 -450 -605 -1353 -1451 -457 -271 -971
2268i71K5J063K62r12K18J378m2p67K0Q48J18m75j11N95j7r36p57Q94M96j097
$$ -971 -946 117 379 -533 -315 1063 1021 254 274 1122 1240 765 654 1249 1232 296 -461 433 929 -168
2288a68o35P01k21r12m2Q53k14l45P2J69N2OM56N4j23L24J34j33J34O68K07O1
$$ -168 -803 -102 -323 -1235 -1277 -424 -638 -983 -911 -742 -690 -684 -228 -174 -297 27 161 28 162 830 1037 1098
2310A098k02q2L81j00n79K00L01m88j326N96O25o34o98M26J70m49n73K21J022
$$ 1098 896 814 1195 1095 516 716 1017 529 -797 -201 424 -210 -908 -482 -312 -761 -1334 -1113 -91
2329i1k52r07J36J033l3q05Q05J089l72q72M19J020j79l76J63N93j062l03K71
$$ -91 -343 -1250 -1114 -81 -114 -919 -114 975 603 -269 150 1170 991 615 778 1371 309 6 277
2348B77N81J6p35j34M0l50l27J83L94q53L3j0j80M8K00N29k30j37L69M65pM3O27
$$ 277 858 874 139 5 45 -305 -632 -449 -55 -908 -875 -885 -1065 -1017 -817 -288 -518 -655 -286 179 172 215 842
2371H42K33m67m85P13O05n40p12Q47J73q05n45O60M73q57r64L99L78p07o27J057
$$ 842 1075 608 123 836 1441 901 189 1036 1209 404 -141 519 992 135 -829 -430 -52 -759 -1386 -329
2391c29M24q72q70P74O25k99m76Q53N50n61k15O83O13l78P7K71J15k97J94kJ86
$$ -329 95 -777 -1647 -873 -248 -547 -1023 -170 380 -181 -396 287 900 522 599 870 985 688 882 880 1066
2412A066l81l85k0Q8m28L5j13k03n10L49p9k94k79Q34o9q36J97P11J57l43K81
$$ 1066 685 300 280 368 -60 -25 -138 -341 -851 -502 -581 -875 -1154 -320 -389 -1225 -1028 -317 -160 -503 -222
2433b22O63P1o06J61R08K47o96k60Q15L6r58j70J003k23j124k90O55N7n50l1R2
$$ -222 441 512 -94 67 975 1222 526 266 1081 1117 159 -11 992 769 -355 -645 10 67 -483 -514 -422
2454d22J61p20m91Q74J13m56p4M83K26k34L15L75K20j71O79l86K17N5K87j51k64
$$ -422 -261 -981 -1472 -598 -485 -941 -1015 -532 -306 -540 -225 150 370 199 878 492 709 764 1051 900 636
2475F36m0J76k37k65K24M9p14k51k36O09l46p86L11M47m11m73N33P70Mq61N09
$$ 636 596 772 535 270 494 543 -171 -422 -658 -49 -395 -1181 -870 -423 -834 -1307 -774 -4 0 -861 -352
2496c52M70j57l07L19P99m8o36nR26J96o13l9L90l47n01j07N89l32m38p9j52j90
$$ -352 118 -39 -346 -27 772 724 88 83 1009 1205 592 553 943 596 95 -12 577 245 -193 -272 -424 -614
2518f14k67K20J42j66l13P3K78J7J07O17k31n8L61L15K7oJ64M60o16l65O96lk15
$$ -614 -881 -661 -519 -685 -998 -925 -647 -630 -523 94 -137 -195 166 481 508 502 666 1126 510 145 841 838 623
2541F23l19L24L7m19o42M59J72n93p77N09N38p53m77P62L78m51l77N52N18j4l60
$$ 623 304 628 665 246 -396 63 235 -358 -1135 -626 -88 -841 -1318 -556 -178 -629 -1006 -454 64 50 -310
2562c10M16N17m43O0K82L60m1l41J05J60l74j44L31k8j66m99k10K11N2m52J97
$$ -310 106 623 180 240 522 882 841 500 605 765 391 247 578 550 384 -115 -325 -114 -62 -514 -317
2583c17l57r4N4j05O9j11L90K88n48K82P56o8k37J36M95K63q72L75L30L55o91
$$ -317 -674 -768 -714 -819 -750 -861 -471 -183 -731 -449 307 239 2 138 633 896 24 399 729 1084 393
2604C93j89K77L5m76k42N62K83r05k65K38j19l36l09N01K1m21N9O68N7k85J3K12
$$ 393 204 481 516 40 -202 360 643 -262 -527 -289 -408 -744 -1053 -552 -531 -952 -893 -225 -168 -453 -440 -228
2626b28J49K48J69J4P0O4K70j25J42K74k86m29m8j1MMm62L99l16m26j89m3L40
$$ -228 -79 169 338 352 422 486 756 631 773 1047 761 332 284 273 277 281 -181 218 -98 -524 -713 -756 -416
2649d16j77l44M05J87j77n13L96Q14j98k69J8O56q1j55L28M96j97l57K9N27l28
$$ -416 -593 -937 -532 -345 -522 -1035 -639 175 -23 -292 -274 382 301 146 474 970 773 416 445 972 644
2670F44k55j37L78k06q01K49M1N5o86Q1J73j24o9J9k2rJ38k8M7L36R3m9P4M39
$$ 644 389 252 630 424 -377 -128 -87 -32 -718 -637 -464 -588 -657 -638 -660 -669 -531 -559 -512 -176 -83 -132 -58 381
2694C81n9J04j06J44N37p4l73j08J61j61l16R6J41m18l40k11N10L7o06j90K89
$$ 381 322 426 320 464 1001 927 554 446 607 446 130 226 367 -51 -391 -602 -92 -55 -661 -851 -562
2715e62J71m94J2M11M20o51N6M65P14j67j86L73K33m36J25n7N32l65k14j55K62
$$ -562 -391 -885 -873 -462 -42 -693 -637 -172 542 375 189 562 795 359 484 427 959 594 380 225 487
2736D87j63l07L3r3J62m70Q0k38m9Kj99J50j13L69k00j43K86N22k01n55M94N28
$$ 487 324 17 50 -43 119 -351 -271 -509 -558 -556 -755 -605 -718 -349 -549 -692 -406 116 -85 -640 -146 382
2758C82J3l01L02M11j42j57m3L72q0n30m6L01k49l68j03K91Op32K4L10k41j26
$$ 382 395 94 396 807 665 508 465 837 757 227 181 482 233 -135 -238 53 59 -673 -649 -339 -580 -706
2780g06KL83N9m68J6M80K01j69P5K95J92K9N0K45J20j29P4j66M7M6j75j14k83
$$ -706 -704 -321 -262 -730 -714 -234 -33 -202 -127 168 360 389 439 684 804 675 749 583 630 676 501 387 104
2803A04j59Q5k44L3K0q3l65j18M25j08o5q4K28J08j47l21P66J39j10pL30L05j25
$$ 104 -55 30 -214 -181 -161 -244 -609 -727 -302 -410 -475 -559 -331 -223 -370 -691 75 214 104 97 427 732 607
2826F07qq0L80l62p8k23J91lm54j31N32k93l18m24N33j6n65j74L91P5k89J33K75
$$ 607 599 519 899 537 459 236 427 424 -30 -161 371 78 -240 -664 -131 -147 -712 -886 -495 -420 -709 -576 -301
2849c01J42j52J60J32L4P12j64k70K39k79M08l62K02K66L6p75K87K21j89j99l91
$$ -301 -159 -311 -151 -19 15 727 563 293 532 253 661 299 501 767 803 28 315 536 347 148 -243
2870b43K70l20j68n39Q35r4m77q3N26L3m18K48M56l7k72m2O66J42k67PL44K67
$$ -243 27 -293 -461 -1000 -165 -259 -736 -819 -293 -260 -678 -430 26 -11 -283 -325 341 483 216 223 567 834
2892H34l71N7L52k16j35l65j69J27K6k78k4k5j69n0j24rK0L9N9j53J04J93J60
$$ 834 463 520 872 656 521 156 -13 114 140 -138 -162 -187 -356 -406 -530 -539 -519 -480 -421 -574 -470 -277 -117
2915a17k16J82M00j53%L36K84j40J10p2L54l75m45K02J97k67n23K1L39j62m31
$$ -117 -333 -151 249 96 96 432 716 576 686 614 968 593 148 350 547 280 -243 -222 117 -45 -476
2936d76J66Q5m5o30nM87k36j50K62J20mK3K27L53p8J95k27M17lN2J66J35o9m84
$$ -476 -310 -225 -270 -900 -905 -418 -654 -804 -542 -422 -426 -403 -176 177 99 294 67 484 481 533 699 834 765 281
2960B81J08J38k58J6m0l82k61N2J53l09j19K32Q5o02j07P16P7r5J8K10O7r4J03
$$ 281 389 527 269 285 245 -137 -398 -346 -193 -502 -621 -389 -304 -906 -1013 -297 -220 -315 -297 -87 -20 -114 -11
2983a1K69J70j62k76O75j27J1k81K16M08m99k71l8M00n57l5l8Ml56j20p5M50j16
$$ -11 258 428 266 -10 665 538 549 268 484 892 393 122 84 484 -73 -108 -146 -142 -498 -618 -693 -243 -359
3006c59k67k5K68k38K17J73K24n3J29J9j07L84R8j22J00k4o2R8l40L94kk41m80
$$ -359 -626 -651 -383 -621 -404 -231 -7 -60 69 88 -19 365 463 341 441 417 355 453 113 507 505 264 -216
3029b16j9M34j11n15JL58m86j23N6K11K49m51J93K51p5l23L84L66N17o53n0M57
$$ -216 -235 199 88 -427 -426 -68 -554 -677 -621 -410 -161 -612 -419 -168 -243 -566 -182 184 701 48 -2 455
3051D55L95n37R1K36n1l07k83K95J11k02j88k99K07mk75J58k32j20R8l1l02L09
$$ 455 850 313 404 640 589 282 -1 294 405 203 15 -284 -77 -81 -356 -198 -430 -550 -452 -483 -785 -476
3073d76m6J3J67K85M7r1q5K91M01j48j32L06J74k82M1N4K45m84l51K19K79k49
$$ -476 -522 -509 -342 -57 -10 -101 -186 105 506 358 226 532 706 424 465 519 764 280 -71 148 427 178
3095A78m47J62P2j65n10L78J36j12m03N7M43j5l87K56N55n8k55J32L22J52m80
$$ 178 -269 -107 -35 -200 -710 -332 -196 -308 -711 -654 -211 -226 -613 -357 198 140 -115 17 339 491 11
3116A1L13M08k32j5K58r3l58Q9j54O4m65J53Mj60P2j99r5j05L5K8J06r9j09J69
$$ 11 324 732 500 485 743 650 292 381 227 291 -174 -21 -17 -177 -105 -304 -399 -504 -469 -441 -335 -434 -543 -374
3140c74K78l9j52O01pl37J10K87M43l39l48K56Q0K6o22M88L20m37l48Q7K45m07
$$ -374 -96 -135 -287 314 307 -30 80 367 810 471 123 379 459 485 -137 351 671 234 -114 -27 218 -189
3162a89l51L64L4m16k05J47K06M6N5J53K91k14r5K54J12J34m08M18k2N3J50J25
$$ -189 -540 -176 -142 -558 -763 -616 -410 -364 -309 -156 135 -79 -174 80 192 326 -82 336 314 367 517 642
3184F42m18KK22k24j07m0J92k85k95J07l9J6l60J62K00M3n44J44L55K11k17k14
$$ 642 224 226 448 224 117 77 269 -16 -311 -204 -243 -227 -587 -425 -225 -182 -726 -582 -227 -16 -233 -447
3206d47P11j84j60J89L38M14m54r3J89K87m82j62N65k49k27l03L18k9k52j09p0
$$ -447 264 80 -80 109 447 861 407 314 503 790 308 146 711 462 235 -68 250 221 -31 -140 -210
3227b10j27j9m33K73L0J59j36N4R6j98L63MK97l01K67O3j51K93K66O2l95J07J91
$$ -210 -337 -356 -789 -516 -486 -327 -463 -409 -313 -511 -148 -144 153 -148 119 182 31 324 590 652 257 364 555
3250E55k24j6J21L4k99j45N0O7k42m37K26J54k38l71L64K00p5l99J86P11l44k65
$$ 555 331 315 436 470 171 26 76 143 -99 -536 -310 -156 -394 -765 -401 -201 -276 -675 -489 222 -122 -387
3272c87N12J79j98p5K13J39J39k24N1K71k75n9p8J24p9k03j1J44l72p0m1k47J31
$$ -387 125 304 106 31 244 383 522 298 349 620 345 286 208 332 253 50 39 183 -189 -259 -300 -547 -416
3295d16k61M00k6q6M5L9j07J18L55p7J20l9M06R9j73k99N72K1l35k29K6K73l91
$$ -416 -677 -277 -303 -389 -344 -305 -412 -294 61 -16 104 65 471 570 397 98 670 691 356 127 153 426 35
3318C5k8N8J14k14k11P2J8o8m72L01L03m68j65M27J74k44m2M56l6P7r3R9L20j97
$$ 35 7 65 179 -35 -246 -174 -156 -224 -696 -395 -92 -560 -725 -298 -124 -368 -410 46 10 87 -6 93 413 216
3342B16mM5K44j03J49j36l1m9j27K18j57k41j9n3l39k74M07k13k18M40p1r8R7
$$ 216 212 257 501 398 547 411 380 331 204 422 265 24 5 -48 -387 -661 -254 -467 -685 -245 -316 -414 -317
3365c17M9M55p9l38M9L77J61m91K53N35j44k84K2K48n0l12lK09K13o88k4M5J8
$$ -317 -268 187 108 -230 -181 196 357 -134 119 654 510 226 248 496 446 134 131 340 553 -135 -159 -114 -96
3388i6l71o9L96o8j72k8JK30k03R6K03j16j56L30L39j05L5k69L58P6j68L53p6
$$ -96 -467 -536 -140 -208 -380 -408 -407 -177 -380 -284 -81 -197 -353 -23 316 211 246 -23 335 411 243 596 520
3411E20k56k48K23j49j37j00K93n1m15O0L56l08l43PK13n1j58J32K99J05l21K59
$$ 520 264 16 239 90 -47 -147 146 95 -320 -260 96 -212 -555 -548 -335 -386 -544 -412 -113 -8 -329 -70
3433g0L05k4k21OM71j23l98L51L62k37l65J31J63m54K06j10M5Lj60r3ok38PJ34
$$ -70 235 211 -10 -4 467 344 -54 297 659 422 57 188 351 -103 103 -7 38 41 -119 -212 -218 -456 -449 -315
3457c15K45l80J33l4R5%J71J56o3lQK97J30l18K58K71l40j89J10K38J7n75L14
$$ -315 -70 -450 -317 -351 -256 -256 -85 71 8 5 13 310 440 122 380 651 311 122 232 470 487 -88 226
3480B26lk24j60N5K83m16m19M19j02j22j68L30J24j13l60L27K69K43k05O9J78
$$ 226 223 -1 -161 -106 177 -239 -658 -239 -341 -463 -631 -301 -177 -290 -650 -323 -54 189 -16 53 231
3501B31q3k70L50L34k08j0LL31k78m00L74j61J53o10J20k35Q6j26K68k61L9p2
$$ 231 148 -122 228 562 354 344 347 678 400 0 374 213 366 -244 -124 -359 -273 -399 -131 -392 -353 -425
3523d25j05K89J81k41r6R0R2J64N5q2J75L93k4l46K4K34P1j34j79O05m34j88j30
$$ -425 -530 -241 -60 -301 -397 -307 -215 -51 4 -78 97 490 466 120 144 378 449 315 136 741 307 119 -11
3546a1%J29k82k84J57m3o2j80J11M08l04K4J47L9n7R1K94J3Q1l9jk0l5p3K86j02
$$ -11 -11 118 -164 -448 -291 -334 -396 -576 -465 -57 -361 -337 -190 -151 -208 -117 177 190 271 232 231 211 176 103 389 287
3572B87pM7j47J59k65k22L23l01L4O3M5l34P9J17J2m76LM74j47q2M0L27J38l75
$$ 287 280 327 180 339 74 -148 175 -126 -92 -29 16 -318 -239 -122 -110 -586 -583 -109 -256 -338 -298 29 167 -208
3596b08J24L25O5k32J61K28J36l78k9P3K48l54j38K21q7l09K39k11q9k42J48J29
$$ -208 -84 241 306 74 235 463 599 221 192 265 513 159 21 242 155 -154 85 -126 -215 -457 -309 -180
3618a80k00J46J86l67P3K52r9J77m9R8Q0l0J14p2J83j46J85O9jk20j3N3J43k85
$$ -180 -380 -234 -48 -415 -342 -90 -189 -12 -61 37 117 87 201 129 312 166 351 420 419 199 186 239 382 97
3642I7k79O3K57k93j32K5Q7k7k70K05O6j76N4K43Q1j39m5J38L22k09k70M28L05
$$ 97 -182 -119 138 -155 -287 -262 -175 -202 -472 -267 -201 -377 -323 -80 1 -138 -183 -45 277 68 -202 226 531
3665E31j64j75K11J52k75r0j1j54J4K4l3k56J70m9j34R0p5l6Q1j68J51Lk1n8M5
$$ 531 367 192 403 555 280 190 179 25 39 63 30 -226 -56 -105 -239 -149 -224 -260 -179 -347 -196 -193 -214 -272 -227
3690b27K32J3m2J35K08Qk6j67K54j38k50M69k90P0Q2k90J75j62j29p2J8K27m42
$$ -227 5 18 -24 111 319 327 301 134 388 250 0 469 179 249 331 41 216 54 -75 -147 -129 98 -344
3713c44j76J24J84k08Q6lJ43o8oJ05NJ75P6K81j67r8J87j6k5N1p6j19J73j73N5
$$ -344 -520 -396 -212 -420 -334 -337 -194 -262 -268 -163 -158 17 93 374 207 109 296 280 255 306 230 111 284 111 166
3738A66j77J55n4k10k4p8L3M1j36M1j02J17n3K9K32k18K57k52K77M8K09m61J67
$$ 166 -11 144 90 -120 -144 -222 -189 -148 -284 -243 -345 -228 -281 -252 -20 -238 19 -233 44 92 301 -160 7
3761GK01J27O4m6N4n0k26R7N1j51j16n1K63l74k86J95j8N8q1j99K52J37j06jK90
$$ 7 208 335 399 353 407 357 131 228 279 128 12 -39 224 -150 -436 -241 -259 -201 -282 -481 -229 -92 -198 -199 91
3786I1J9l85MK86K15j0L2j62K33k52L14L12k35O9l07j75j1J79q2k52q9L7J14j54
$$ 91 110 -275 -271 15 230 220 252 90 323 71 385 697 462 531 224 49 38 217 135 -117 -206 -169 -55 -209
3810b09j21N5j3Q7k66J16N8K96k32L10J09j32K8J38J06j85J84k1J16R2j91j90
$$ -209 -330 -275 -288 -201 -467 -351 -293 3 -229 81 190 58 86 224 330 145 329 308 424 516 325 135
3832A35M75m84q1k9R0k02j80J67m6K7o6j10j45K46j18q8J09R6J81j90K06J21K5
$$ 135 610 126 45 16 106 -96 -276 -109 -155 -128 -194 -304 -449 -203 -321 -409 -300 -204 -23 -213 -7 114 139
3855A39k75m7K77K46Q7r7n8J31J5M1k42L6k4j52k82K92j79k93N6m4J04j14j68
$$ 139 -136 -183 94 340 427 330 272 403 418 459 217 253 229 77 -205 87 -92 -385 -329 -373 -269 -383 -551
3878e51L47L25k66q9K56K23m73J02J03J36j85M07j26J16j62k3J5J94n0Ok16K01
$$ -551 -204 121 -145 -234 22 245 -228 -126 -23 113 -72 335 209 325 163 140 155 349 299 305 89 290
3900B90j95l7j88j95J44J40j65j26R6m8j44l3K99k24PQ0J11M70k73l5K61J21k08
$$ 290 95 58 -130 -325 -181 -41 -206 -332 -236 -284 -428 -461 -162 -386 -379 -299 -188 282 9 -26 235 356 148
3923A48j99M67k02L41l36j47L00j77k02J68K5k37k2j61K80p5l04P2o9J5r1J70
$$ 148 -51 416 214 555 219 72 372 195 -7 161 186 -51 -73 -234 46 -29 -333 -261 -330 -315 -406 -236
3945b36j86L59j6P6j04P1N9J99L6o1K70mj02n5P4r8r7j24N0N4q2j46P0j44j71
$$ -236 -422 -63 -79 -3 -107 -36 23 222 258 197 467 463 361 306 380 282 185 61 111 165 83 -63 7 -137 -308
3970c08QL4J9l28K47K62k08k08J83J17L41k85J93K6O3m0J27Q2N7l1j56L8K19q3
$$ -308 -300 -266 -247 -575 -328 -66 -274 -482 -299 -182 159 -126 67 93 156 116 243 325 382 351 195 233 452 369
3994C69k45J05K03k53j32j34M9K4l22J30j65M4q1Q7K20o0J35j63k0K09j9J50o2
$$ 369 124 229 432 179 47 -87 -38 -14 -336 -206 -371 -327 -408 -321 -101 -161 -26 -189 -209 0 -19 131 69
4017F9K08J19l44QL96j90j91K16j05k1o1M0q0J02L4k96P4m6j08l40Q2L49k22m4
$$ 69 277 396 52 60 456 266 75 291 186 165 104 144 64 166 200 -96 -22 -68 -176 -516 -434 -85 -307 -351
4041c51K74O0k86J23P6J47J9j26j45L35Jm6K04J58k4j08p0m8j32k71M30l19M07
$$ -351 -77 -17 -303 -180 -104 43 62 -64 -209 126 127 81 285 443 419 311 241 193 61 -210 220 -99 308
4064C08l41o6k57J33N4P3k25L3Q7J7KJ1M2Q4J12k09K45Oj14K01q6L64k99N1J9
$$ 308 -33 -99 -356 -223 -169 -96 -321 -288 -201 -184 -182 -171 -129 -45 67 -142 103 109 -5 196 110 474 175 226 245
4089B45k8k95J05Q6q3J37l06J11L3%l92K58r2j96M5K00%p1lK50K4Lp2K6J08N6
$$ 245 217 -78 27 113 30 167 -139 -28 5 5 -387 -129 -221 -417 -372 -172 -172 -243 -246 4 28 31 -41 -15 93 149
4115A49J17j63q3O0J66p1p7J26rq7r5k3J42j53l04J69J07k12q9j00L57n6j41J89
$$ 149 266 103 20 80 246 175 98 224 215 128 33 10 152 -1 -305 -136 -29 -241 -330 -430 -73 -129 -270 -81
4139h1M5j24J34r1J40l7M2L9j8J90J5j33JM3J00k07J32l7k8j73r0K39p8j49m1
$$ -81 -36 -160 -26 -117 23 -14 28 67 49 239 254 121 122 165 265 58 190 153 125 -48 -138 101 23 -126 -167
4164a67R8m29L02l45L54O8r4k5O0J30l09L56J31j16K00J64l43J41K63j76K4K7
$$ -167 -69 -498 -196 -541 -187 -119 -213 -238 -178 -48 -357 -1 130 14 214 378 35 176 439 263 287 314
4186C14Rr6j28r3K71j55r8M5k31M9j03l9K0J29k37j06L22R3l23K46l8J92o8NK07
$$ 314 323 227 99 6 277 122 24 69 -162 -113 -216 -255 -235 -106 -343 -449 -127 -34 -357 -111 -149 43 -25 -20 187
4211A87K1j83J03J59R6k29OJ46j18J07J13m02J60l23L26j81n4K1j4J4l02M7K04
$$ 187 208 25 128 287 383 154 160 306 188 295 408 6 166 -157 169 -12 -66 -45 -59 -45 -347 -300 -96
4234i6l5l31K59J80j94L18j09P0k64L26O6L8lj56n6K45L8j87J21J08j39k72J83
$$ -96 -131 -462 -203 -23 -217 101 -8 62 -202 124 190 228 225 69 13 258 296 109 230 338 199 -73 110
4257A10K3p5m25J07K32j48k26O5J73k63m3K89J49p9j08J09N3m1m9K97j73L04l
$$ 110 133 58 -367 -260 -28 -176 -402 -337 -164 -427 -470 -181 -32 -111 -219 -110 -57 -98 -147 150 -23 281 278
4280B78J33L1j28j00K7j10m5n8J44j5k87K5K1l02P6pL75l81JJ9J76r2J6L75J4
$$ 278 411 442 314 214 241 131 86 28 172 157 -130 -105 -84 -386 -310 -317 58 -323 -322 -303 -127 -219 -203 172 186
4305A86l30J8M20q4j78L01kl1N1k36J04J45k28n5L2m7n5p3QJ66o31K08K08j46
$$ 186 -144 -126 294 210 32 333 331 300 351 115 219 364 136 81 113 66 11 -62 -54 112 -519 -311 -103 -249
4329b49J46l97L17q7L2K94k92K13K05k34L10j59P3n6pQ7j40M62k10j27K2K7l5
$$ -249 -103 -500 -183 -270 -238 56 -236 -23 182 -52 258 99 172 116 109 196 56 518 308 181 203 230 195
4352A95k90q7Nk6o1N1J93J2k16L5j87j5J41p5L08o6J1J6L0m3J92rJ56k09K66k10
$$ 195 -95 -182 -177 -203 -264 -213 -20 -8 -224 -189 -376 -391 -250 -325 -17 -83 -72 -56 -26 -69 123 114 270 61 327 117
4378A17K19j10m3k3J36j19k42j9M9j36P3j18k9k3o9K5J64k58J18L32k00k80K03
$$ 117 336 226 183 160 296 177 -65 -84 -35 -171 -98 -216 -245 -268 -337 -312 -148 -406 -288 44 -156 -436 -233
4401b33L00o8J11j38J9N3J55M2L10k09k11R0r8J2j70K39j34r1J0q3P6q6q6q1K44
$$ -233 67 -1 110 -28 -9 44 199 241 551 342 131 221 123 135 -35 204 70 -21 -11 -94 -18 -104 -190 -271 -27
4426b7J04k77L6Q9R4m55K82J73P0k67K10J49j50K18J00o8n0oq1K31k12qn7j61
$$ -27 77 -200 -164 -75 19 -436 -154 19 89 -178 32 181 31 249 349 281 231 225 144 375 163 155 98 -63
4450f3k8p0K17o8l89K27K1K09j73l6R5j50rN6K56j40j51M59M7q9j88K75j12N9
$$ -63 -91 -161 56 -12 -401 -174 -153 56 -117 -153 -58 -208 -217 -161 95 -45 -196 263 310 221 33 308 196 255
4474B55M2lr4R7l37J16n0R9j96n5J35l12J07L04j05k86J30J02k32j8KJ01J49R
$$ 255 297 294 200 297 -40 76 26 125 -71 -126 9 -303 -196 108 3 -283 -153 -51 -283 -301 -299 -198 -49 -40
4498d0k45N8M72j50n6M3M4k27M32j76oN2Kq6j0Q1j77P0j09r0M2J03k89j86K08
$$ -40 -285 -227 245 95 39 82 126 -101 331 155 149 201 203 117 107 188 11 81 -28 -118 -76 27 -262 -448 -240
4523b40J37l4j78m0K16rK14O8j73o2m5N52j37n9J42k11L36l86LJ55J12m48Q2K63
$$ -240 -103 -137 -315 -355 -139 -148 66 134 -39 -101 -146 406 269 210 352 141 477 91 94 249 361 -87 -5 258
4547B58l21k02m1K92m7pj95j48L19J33l15L8p2O0J88J75K5j41J00K40l58q6L01
$$ 258 -63 -265 -306 -14 -61 -68 -263 -411 -92 41 -274 -236 -308 -248 -60 115 140 -1 99 339 -19 -105 196
4570A96rp6J08j2p0L3j25J84k34L9j02L2O6m03K65k1l01J13P5L72l59J92q2m4
$$ 196 187 111 219 207 137 170 45 229 -5 34 -68 -36 30 -373 -108 -129 -430 -317 -242 130 -229 -37 -119 -163
4594a63O3j7K02M4o5j31J69L7O5l3k6m3P9n2O6j57K71m36k4J17j2j22J19j13k61
$$ -163 -100 -117 85 129 64 -67 102 139 204 171 145 102 181 129 195 38 309 -127 -151 -34 -46 -168 -49 -162 -423
4619d23J83m7l4p7L05j75J45L6J23pj95r6L87l1J43r7K14k15J36j03J75Q6l37
$$ -423 -240 -287 -321 -398 -93 -268 -123 -87 36 29 -166 -262 125 94 237 140 354 139 275 172 347 433 96
4642I6r4j12k4J87j33l5J33l18j51K42o0k3J58l11M87q9l6K57j45p7J42J04J25
$$ 96 2 -110 -134 53 -80 -115 18 -300 -451 -209 -269 -292 -134 -445 42 -47 -83 174 29 -48 94 198 323
4665C23l05j7O0Q7N2p1J82j80m7oQ7l05lO5k0j76R7J00j54k3P7R3n7N1q3J73m5
$$ 323 18 1 61 148 200 129 311 131 84 78 165 -140 -143 -78 -98 -274 -177 -77 -231 -254 -177 -84 -141 -90 -173 0 -45
4692d5k5n8K39n8k6J46m2K20n3p3J8n3q5j3R6j03n2l3j57p5M5l2K72l76K10o8
$$ -45 -70 -128 111 53 27 173 131 351 298 225 243 190 105 92 188 85 33 0 -157 -232 -187 -219 53 -323 -113 -181
4718a81q6p1J87j33J44J5O0J2Q2m2lK18J5Q6Pj92l6K67k27j3O0j34l2P4k91K26
$$ -181 -267 -338 -151 -284 -140 -125 -65 -53 29 -13 -16 202 217 303 310 118 82 349 122 109 169 35 3 77 -214 12
4744A2j89J89j11o2o6K33j63j92J0L67q4j06J10K33rk74O0L40k47J27m5J01j17
$$ 12 -177 12 -99 -161 -227 6 -157 -349 -339 28 -56 -162 -52 181 172 -102 -42 298 51 178 133 234 117
4767A17mJ7m6K18l31R6j1q0j04J61j02R3j72jk3k17K55j3K64m18J25N6J59J87
$$ 117 113 130 84 302 -29 67 56 -24 -128 33 -69 24 -148 -149 -172 -389 -134 -147 117 -301 -176 -120 39 226
4791B26k19kj40P5J17K76k07K14j71O8l90K73o9ll4j33J55P0l71J1J79j31j01
$$ 226 7 5 -135 -60 57 333 126 340 169 237 -153 120 51 48 14 -119 36 106 -265 -254 -75 -206 -307
4814c07m8K54k10K21m3M3P7J00k81J39J97K01l89L31k2J23j59Q0j12p7j62o9J04
$$ -307 -355 -101 -311 -90 -133 -90 -13 87 -194 -55 142 343 -46 285 263 386 227 307 195 118 -44 -113 -9
4837ik3l78N83k89n4J34l46K18j61j5J89k55Q5L36j40lj8L23k13n6L7j0M74l09
$$ -9 -32 -410 173 -116 -170 -36 -382 -164 -325 -340 -151 -406 -321 15 -125 -128 -146 177 -36 -92 -55 -65 409 100
4861A00q8K61r9j3j01J36o4n9p3K49j52l95K10K7L0k46k4K78j48j2j28j4L30l47
$$ 100 12 273 174 161 60 196 132 73 0 249 97 -298 -88 -61 -31 -277 -301 -23 -171 -183 -311 -325 5 -342
4885c42K53L02j74Lj20J98J61k27K01J12k05j19J62M3k48J8J31q7n4j28r7K32
$$ -342 -89 213 39 42 -78 120 281 54 255 367 162 43 205 248 0 18 149 62 8 -120 -217 15
4907A5k2l7l1k12M8K11k71q2J5K48O3lK20R4j58J19pl4K22j08j85J8k59M19j36
$$ 15 -7 -44 -75 -287 -239 -28 -299 -381 -366 -118 -55 -58 162 256 98 217 210 176 398 290 105 123 -136 283 147
4932A47J15k46K3j04j97L69j91k11J3Q1j31K05m5J61rj28L4m4J66J2j42L53k48
$$ 147 262 16 39 -65 -262 107 -84 -295 -282 -201 -332 -127 -172 -11 -20 -148 -114 -158 8 20 -122 231 -17
4955a7LQ7J45J24K5Rr2j74m1J72L4k23p7pjj4K61r7k74NM8j58M2J09O0o2k72K53
$$ -17 -14 73 218 342 367 376 284 110 69 241 275 52 -25 -32 -33 -47 214 117 -157 -152 -104 -262 -220 -111 -51 -113 -385 -132
4983a32P1L53l12J46J31j94NJ63o4j9R2K8j24l6J53k14p5M1j8m97K52O0j15J06
$$ -132 -61 292 -20 126 257 63 68 231 167 148 240 268 144 108 261 47 -28 13 -5 -502 -250 -190 -305 -199
5007a99j79J12K09j04Q5k9j32K96mj80L10k91P9K8J04J92k08K31j03l5j62J88
$$ -199 -378 -266 -57 -161 -76 -105 -237 59 55 -125 185 -106 -27 1 105 297 89 320 217 182 20 208
5029B08l31J25K05l47P4J51r4l26K4L32k79J40Q3j34K06j00j7j55K61j10J91M7
$$ 208 -123 2 207 -140 -66 85 -9 -335 -311 21 -258 -118 -35 -169 37 -63 -80 -235 26 -84 107 154
5051A54nm9j60K59l5Q9R9k13P8M8r0j58nk84K59j39Q9L5j7k71K63k19J81o3r3
$$ 154 149 100 -60 199 164 253 352 139 217 265 175 17 12 -272 -13 -152 -63 -28 -45 -316 -53 -272 -91 -154 -247
5076b47M1O1J24j98J42m6J72Q5m9j14J9K86j35J40J3k43J48j74k5Q0m7Oj91J74
$$ -247 -206 -145 -21 -219 -77 -123 49 134 85 -29 -10 276 141 281 294 51 199 25 0 80 33 39 -152 22
5100B2j47j72n0L32k55O9R6q0N3m1Q3J9j61K8L02j45J71J26P4J4k70J83j27K35
$$ 22 -125 -297 -347 -15 -270 -201 -105 -185 -132 -173 -90 -71 -232 -204 98 -47 124 250 324 338 68 251 124 359
5124C59k83J22k53M00k58q9K79l59J28k72j63K22Kj23K15k48L42k73J8J67J71
$$ 359 76 198 -55 345 87 -2 277 -82 46 -226 -389 -167 -165 -288 -73 -321 21 -252 -234 -67 104
5145A04j30K11o8m8J67j31K18m0k76J55Q4l28K71o9Nj05J58n9k96J54N1j63Q6
$$ 104 -26 185 117 69 236 105 323 283 7 162 246 -82 189 120 125 20 178 119 -177 -23 28 -135 -49
5168d9j92J84j5j93r4J15J77r1Ro8L24k25K69l7J30k13P1J55P2j47k19K1K23j14
$$ -49 -241 -57 -72 -265 -359 -244 -67 -158 -149 -217 107 -118 151 114 244 31 102 257 329 182 -37 -16 207 93
5192I3j17oK08j65l45M25l07K72l29lP0o3M2J02n0K82m2k09J69j92M02k24J74
$$ 93 -24 -30 178 13 -332 93 -214 58 -271 -274 -204 -267 -225 -123 -173 109 67 -142 27 -165 237 13 187
5215A87p8Q6k52K11j3P0j91R9Q5j38J14k70K35l26nN3J66k1j78k54J08J9J22p4
$$ 187 109 195 -57 154 141 211 20 119 204 66 180 -90 145 -181 -186 -133 33 12 -166 -420 -312 -293 -171 -245
5239b45J50l1J2j14J30J16J79j15JJ21j37L89j35l29J20j4j61J57r4Q7p7j14q2
$$ -245 -95 -126 -114 -228 -98 18 197 82 83 204 67 456 321 -8 112 98 -63 94 0 87 10 -104 -186
5262a86J40R6k99M3N0J49j88j77L27j91K40k1N2j3J8K87k40J48N4q9J01p7J1j70
$$ -186 -46 50 -249 -206 -156 -7 -195 -372 -45 -236 4 -17 35 22 40 327 87 235 289 200 301 224 235 65
5286F5OK28l94K2o7R8N3l32L15j2k52K44k23J08j74J22L40k31J32n6l5O1J36l1
$$ 65 71 299 -95 -73 -140 -42 11 -321 -6 -18 -270 -26 -249 -141 -315 -193 147 -84 48 -8 -43 18 154 123
5310A23l59L13j03K06R5k1j66k31L04j16L69l12j12o2j05J2N4k5J46j72j01J61
$$ 123 -236 77 -26 180 275 254 88 -143 161 45 414 102 -10 -72 -177 -165 -111 -136 10 -162 -263 -102
5332a02j18m9K92k21RL0J11j46R7L33m8j42J29j49L11j09p4R2q3j24R1j09J91
$$ -102 -220 -269 23 -198 -189 -159 -48 -194 -97 236 188 46 175 26 337 228 154 246 163 39 130 21 212
5355B12q0l08J72L4k59R4j15qK82k71N1J95l39J99O2J47k26k3J39L59l9l41L08
$$ 212 132 -176 -4 30 -229 -135 -250 -258 24 -247 -196 -1 -340 -141 -79 68 -158 -181 -42 317 278 -63 245
5378B45j51J38r5p2J27j78L70l03k8J01M8m3j49j09j02J79n2k19K16k40J93P2
$$ 245 94 232 137 65 192 14 384 81 53 154 202 159 10 -99 -201 -22 -74 -293 -77 -317 -124 -52
5400e2j67K26J33m21M16r2J18j46J23m4N7j84N00k50j49q9P7oo4k37J13L4K4k6
$$ -52 -219 7 140 -281 135 43 161 15 138 94 151 -33 467 217 68 -21 56 50 -14 -251 -138 -104 -80 -106
5424a06J30j11l40K52N8M9j79m9L45l11J66J62J5j09k3pK54l7k8k6J42n4PJ40
$$ -106 24 -87 -427 -175 -117 -68 -247 -296 49 -262 -96 66 81 -28 -51 -58 196 159 131 105 247 193 200 340
5448C40k95J01k61J70j89k1k8K51j61n2r2r6L01j22J16j25N1R1k02M71l61R0Q5
$$ 340 45 146 -115 55 -134 -155 -183 68 -93 -145 -237 -333 -32 -154 -38 -163 -112 -21 -223 248 -113 -23 62
5471F2LL00j87L3j83K73k55lR3j37K35k95o0J76j83R4L9j69p8j38K17m6oM5n6
$$ 62 65 365 178 211 28 301 46 43 136 -1 234 -61 -121 55 -128 -34 5 -164 -242 -380 -163 -209 -215 -170 -226
5496b26j74L10N5k09K45j1M0Q9r3R1Pq4j10K1J32J50j48o1%p2P5J29l23M6mK13
$$ -226 -400 -90 -35 -244 1 -10 30 119 26 117 124 40 -70 -49 83 233 85 24 24 -48 27 156 -167 -121 -125 88
5522H8k60K26k72Q4m7J45k23L08J7l26J57J48J4J56Lk55M75j90K5k6j86Q1k9N8
$$ 88 -172 54 -218 -134 -181 -36 -259 49 66 -260 -103 45 59 215 218 -37 438 248 273 247 61 142 113 171
5546A71k92L17l5m5n9r6o2M3p0k46J32L2J55j51M7J16j87K35k1Q5k49K09K50j10
$$ 171 -121 196 161 116 57 -39 -101 -58 -128 -374 -242 -210 -55 -206 -159 -43 -230 5 -16 69 -180 29 279 169
5570A69j86K61j91K00k48J39q1J44j95j30M24k44O4o9n6r3l6j23N32m89J57r6
$$ 169 -17 244 53 253 5 144 63 207 12 -118 306 62 126 57 1 -92 -128 -251 281 -208 -51 -147
5592a47L5m9k2J2J94J27k65J40L99m91J26K4K7K1J56n2k4j91J18N4j96M9k04K98
$$ -147 -112 -161 -183 -171 23 150 -115 25 424 -67 59 83 110 131 287 235 211 20 138 192 -4 45 -159 139
5616A39m16Q7J7M16m34J1j19M05j49k5n2J57j61J05j37jO7K6L29k00J02j83J63
$$ 139 -277 -190 -173 243 -191 -180 -299 106 -43 -68 -120 37 -124 -19 -156 -157 -90 -64 265 65 167 -16 147
5639A47qJ97k77J3j98K78j12o4j40o7J19j33JK83l83L68l55J68J64J34k00kJ39
$$ 147 139 336 59 72 -126 152 40 -24 -164 -231 -112 -245 -244 39 -344 24 -331 -163 1 135 -65 -67 72
$$ [...]
8191A32
##END NTUPLES=NMR FID
##END=
