##TITLE=1H_SL92-Dau(A)
 CDCl3,8 sc, 
 3.9.2021
##JCAMPDX= 6.0         $$ Bruker NMR JCAMP-DX V2.0
##DATA TYPE= NMR FID
##DATA CLASS= NTUPLES
##ORIGIN= UXNMR, Bruker Analytische Messtechnik GmbH
##OWNER= root
$$ XWIN-NMR		Version 3.5
$$ Fri Sep  3 09:02:57 2021 Russian Standard Time (UT+4h)  she@DPX200
##.OBSERVE FREQUENCY= 200.1313
##.OBSERVE NUCLEUS= ^1H
##.DELAY= (6, 6)
##.ACQUISITION MODE= SIMULTANEOUS
##.ACQUISITION SCHEME= undefined
##.AVERAGES= 8
##.DIGITISER RES= 18
##SPECTROMETER/DATA SYSTEM= spect
##.PULSE SEQUENCE= zg30
##.SOLVENT NAME= CDCl3
##.SHIFT REFERENCE= (INTERNAL, CDCl3, 0, 15.7039)
##AUDIT TRAIL= $$ (NUMBER, WHEN, WHO, WHERE, WHAT)
$$ ##TITLE= Audit trail, XWIN-NMR		Version 3.5
$$ ##JCAMPDX= 5.01
$$ ##ORIGIN= Bruker BioSpin GmbH
$$ ##OWNER= she
$$ F:/spectra/data/she/nmr/H-F/1/audita.txt
$$ ##AUDIT TRAIL=  $$ (NUMBER, WHEN, WHO, WHERE, WHAT)
(   1,<2021-09-03 09:01:51.65 +0400>,<she>,<DPX200>,
      <created by zg, POWCHK disabled, PULCHK disabled
       configuration hash MD5:
       00 E9 B6 7A A2 85 ED C7 34 08 36 98 17 FE 4E 26
       data hash MD5: 16K
       0F 9B AD 41 07 AB B6 D6 08 D4 6A F6 B1 69 61 FF>)
$$ ##END=
$$ 
$$ hash MD5
$$ 21 8D 7C 04 ED 1A 9E 2C 86 9F A6 6B E8 7E A2 98
##$RELAX= 
##$RELAX= 
##$RELAX= 
##$RELAX= 
##$RELAX= 
##$RELAX= 
$$ Bruker specific parameters
$$ --------------------------
##$DU= <F:/spectra>
##$EXPNO= 1
##$NAME= <H-F>
##$PROCNO= 1
##$TYPE= <nmr>
##$USER= <she>
##$AMP= (0..31)
100 100 100 100 100 100 100 100 100 100 100 100 100 100 100 100 100 100 
100 100 100 100 100 100 100 100 100 100 100 100 100 100 
##$AQSEQ= 0
##$AQ_mod= 1
##$AUNM= <au_zg>
##$AUTOPOS= <>
##$BF1= 200.13
##$BF2= 200.13
##$BF3= 200.13
##$BF4= 200.13
##$BF5= 200.13
##$BF6= 200.13
##$BF7= 200.13
##$BF8= 200.13
##$BYTORDA= 1
##$CFDGTYP= 0
##$CFRGTYP= 5
##$CHEMSTR= <none>
##$CNST= (0..31)
1 1 145 1 1 1 1 1 1 1 1 1 1 1 1 1 1 1 1 1 1 1 1 1 1 1 1 1 1 1 1 1 
##$CPDPRG= <>
##$CPDPRG1= <>
##$CPDPRG2= <>
##$CPDPRG3= <>
##$CPDPRG4= <mlev>
##$CPDPRG5= <mlev>
##$CPDPRG6= <mlev>
##$CPDPRG7= <mlev>
##$CPDPRG8= <mlev>
##$CPDPRGB= <>
##$CPDPRGT= <>
##$D= (0..31)
0 1.2 0 0 0 0 0 0 0 0.06 0 0.03 0 0 0 0 0.0002 0 0 0 0 0 0 0 0 0 0 0 0 
0 0 0 
##$DATE= 1630645311
##$DBL= (0..7)
120 120 120 120 120 120 120 120 
##$DBP= (0..7)
150 150 150 150 150 150 150 150 
##$DBP07= 0
##$DBPNAM0= <>
##$DBPNAM1= <>
##$DBPNAM2= <>
##$DBPNAM3= <>
##$DBPNAM4= <>
##$DBPNAM5= <>
##$DBPNAM6= <>
##$DBPNAM7= <>
##$DBPOAL= (0..7)
0.5 0.5 0.5 0.5 0.5 0.5 0.5 0.5 
##$DBPOFFS= (0..7)
0 0 0 0 0 0 0 0 
##$DE= 6
##$DECBNUC= <off>
##$DECIM= 32
##$DECNUC= <off>
##$DECSTAT= 4
##$DIGMOD= 1
##$DIGTYP= 9
##$DL= (0..7)
0 120 120 120 120 120 120 120 
##$DP= (0..7)
150 150 150 150 150 150 150 150 
##$DP07= 0
##$DPNAME0= <>
##$DPNAME1= <>
##$DPNAME2= <>
##$DPNAME3= <>
##$DPNAME4= <>
##$DPNAME5= <>
##$DPNAME6= <>
##$DPNAME7= <>
##$DPOAL= (0..7)
0.5 0.5 0.5 0.5 0.5 0.5 0.5 0.5 
##$DPOFFS= (0..7)
0 0 0 0 0 0 0 0 
##$DQDMODE= 0
##$DR= 18
##$DS= 0
##$DSLIST= <SSSSSSSSSSSSSSS>
$$ [...]
##$SUBNAM2= <"">
##$SUBNAM3= <"">
##$SUBNAM4= <"">
##$SUBNAM5= <"">
##$SUBNAM6= <"">
##$SUBNAM7= <"">
##$SUBNAM8= <"">
##$SUBNAM9= <"">
##$SW= 20.0189088683792
##$SWIBOX= (0..15)
0 0 2 0 0 0 0 0 0 0 0 0 0 0 0 0 
##$SW_h= 4006.41025641026
##$TD= 16384
##$TD0= 1
##$TE= 0
##$TE2= 300
##$TE3= 300
##$TEG= 300
##$TL= (0..7)
0 120 120 120 120 120 120 120 
##$TP= (0..7)
150 150 150 150 150 150 150 150 
##$TP07= 0
##$TPNAME0= <>
##$TPNAME1= <>
##$TPNAME2= <>
##$TPNAME3= <>
##$TPNAME4= <>
##$TPNAME5= <>
##$TPNAME6= <>
##$TPNAME7= <>
##$TPOAL= (0..7)
0.5 0.5 0.5 0.5 0.5 0.5 0.5 0.5 
##$TPOFFS= (0..7)
0 0 0 0 0 0 0 0 
##$TUNHIN= 0
##$TUNHOUT= 0
##$TUNXOUT= 0
##$USERA1= <user>
##$USERA2= <user>
##$USERA3= <user>
##$USERA4= <user>
##$USERA5= <user>
##$V9= 5
##$VALIST= <valist>
##$VCLIST= <CCCCCCCCCCCCCCC>
##$VD= 0
##$VDLIST= <DDDDDDDDDDDDDDD>
##$VPLIST= <PPPPPPPPPPPPPPP>
##$VTLIST= <TTTTTTTTTTTTTTT>
##$WBST= 1024
##$WBSW= 4
##$XGAIN= (0..3)
0 0 0 0 
##$XL= 0
##$YL= 0
##$YMAX_a= 178763
##$YMIN_a= -328447
##$ZGOPTNS= <>
##$ZL1= 120
##$ZL2= 120
##$ZL3= 120
##$ZL4= 120
##$ABSF1= 10
##$ABSF2= 0
##$ABSG= 5
##$ABSL= 3
##$ALPHA= 0
##$AQORDER= 0
##$ASSFAC= 0
##$ASSFACI= 0
##$ASSFACX= 0
##$ASSWID= 0
##$AUNMP= <proc_1d>
##$AZFE= 0.1
##$AZFW= 0.1
##$BCFW= 1
##$BC_mod= 2
##$BYTORDP= 1
##$COROFFS= 0
##$CY= 11.3945322036743
##$DATMOD= 1
##$DC= 2
##$DFILT= <>
##$DTYPP= 0
##$F1P= 2.36226072786647
##$F2P= -0.459571619588291
##$FCOR= 0.5
##$FTSIZE= 0
##$FT_mod= 4
##$GAMMA= 1
##$GB= 0.15
##$INTBC= 1
##$INTSCL= 1
##$ISEN= 128
##$LB= 0.24
##$LEV0= 0
##$LPBIN= 0
##$MAXI= 10000
##$MC2= 0
##$MEAN= 0
##$ME_mod= 0
##$MI= 1.114404
##$NCOEF= 0
##$NC_proc= 0
##$NLEV= 6
##$NOISF1= 3.799351
##$NOISF2= 2.8
##$NSP= 1
##$NTH_PI= 0
##$NZP= 0
##$OFFSET= 15.70392
##$PC= 1
##$PHC0= -13358.16
##$PHC1= 14.20097
##$PH_mod= 1
##$PKNL= yes
##$PPARMOD= 0
##$PSCAL= 0
##$PSIGN= 0
##$REVERSE= no
##$SF= 200.130013532006
##$SI= 16384
##$SIGF1= 3
##$SIGF2= 2
##$SINO= 400
##$SIOLD= 16384
##$SREGLST= <1H.CDCl3>
##$SSB= 0
##$STSI= 0
##$STSR= 0
##$SW_p= 3612.71676300578
##$SYMM= 0
##$S_DEV= 0
##$TDeff= 0
##$TDoff= 0
##$TI= <>
##$TILT= no
##$TM1= 0
##$TM2= 0
##$TOPLEV= 0
##$USERP1= <user>
##$USERP2= <user>
##$USERP3= <user>
##$USERP4= <user>
##$USERP5= <user>
##$WDW= 1
##$XDIM= 8192
##$YMAX_p= 0
##$YMIN_p= 0
$$ End of Bruker specific parameters
$$ ---------------------------------
##NTUPLES= NMR FID
##VAR_NAME=  TIME,          FID/REAL,        FID/IMAG
##SYMBOL=    X,             R,               I
##VAR_TYPE=  INDEPENDENT,   DEPENDENT,       DEPENDENT
##VAR_FORM=  AFFN,          ASDF,            ASDF
##VAR_DIM=   8192,          8192,            8192
##UNITS=     SECONDS,       ARBITRARY UNITS, ARBITRARY UNITS
##FACTOR=    0.0002496,     1,               1
##FIRST=     0,             0,               0
##LAST=      2.0444736,     0,               0
##MIN=       0,             -328447,         0
##MAX=       2.0444736,     178763,          0
$$ Real data points
##PAGE= N=1
##DATA TABLE= (X++(R..R)), XYDATA
0@%%%%%%%%%%oJ4j6J6j6K4l2M0m8N6p2Q6j02J20j36J60j84K08k45K85l27L74m23
$$ 0 0 0 0 0 0 0 0 0 0 0 -6 8 -8 8 -8 16 -16 24 -24 32 -40 46 -56 64 -72 88 -96 112 -133 152 -175 199 -224
33b24M80n44O13o90P72q62R64j075J196j328J472j629J800j986K191k417K663
$$ -224 256 -288 325 -365 407 -455 509 -566 630 -698 774 -855 945 -1041 1150 -1267 1396
50A396k932L231l562L926m336M796n315N912o599P401q356R514j0956J2802j5263
$$ 1396 -1536 1695 -1867 2059 -2277 2519 -2796 3116 -3483 3918 -4438 5076 -5880 6922 -8341
65h341J8737k4046L3248n3642J81394r8775l05600K23250J53911o9253j47688
$$ -8341 10396 -13650 19598 -34044 147350 48575 -257025 -33775 120136 50883 -96805
76i6805M5211Q3529j5196o2285K3633q462M688L9897L0427l6446k9927L2303K5575
$$ -96805 -51594 31935 16739 -45546 -21913 -30375 -25687 14210 44637 8191 -21736 10567 36142
89C6142p4419k4953P1534N6370k8007m7201J6022L3426m8214l4073K9667K3745
$$ 36142 -38277 -63230 8304 64674 36667 -10534 5488 38914 -9300 -43373 -13706 10039
101A0039j201L182J2245k0821o3528O502O4964O053k8272J0606L0675j1764m5500
$$ 10039 8838 12020 24265 3444 -60084 -53582 11382 17435 -10837 -231 30444 18680 -26820
114b6820R249K6655k3046J1015O6490R364q1093o2675N3396O5301l9966n4854
$$ -26820 -17571 9084 -13962 -2947 63543 72907 -8186 -70861 -17465 47836 7870 -46984
126d6984J2246L7974J2359k2975j4404P439J0791K4617J3387j1715l695n148j8567
$$ -46984 -34738 3236 15595 -7380 -21784 -14345 -3554 21063 34450 22735 19040 13892 -4675
139d675k1760j3294K0120K8329N282n066r697K157J3785q224j4784P03J1725J3915
$$ -4675 -26435 -39729 -19609 8720 14002 8936 -761 1396 15181 6957 -7827 -7124 4601 18516
153A8516j3145k5747m482R595J5486P759n634O264R001m118j1371j7682n138J2662
$$ 18516 5371 -20376 -24858 -15263 223 7982 2348 8612 17613 13495 2124 -15558 -20696 -8034
167h034J3905J2756l164j4847l215k168k608K8j786O565J1088N004p954k4261
$$ -8034 5871 18627 15463 616 -2599 -4767 -7375 -7347 -9133 -2568 8520 13524 5570 -18691
181a8691j872K9720R854j8945r574J9126J6167k2633k4222N791N377N49J3340
$$ -18691 -20563 9157 19011 66 -9508 9618 25785 3152 -21070 -15279 -9902 -9353 3987
194C987J5803n042k3861n225J5560k565n535J7040J4750j2489k8114l658J9470
$$ 3987 19790 14748 -9113 -14338 1222 -1343 -6878 10162 24912 12423 -15691 -19349 121
207A21K042r913K669J0314R091p66r573j3317j3487R467K4818J901j8423o611
$$ 121 2163 -7750 -5081 5233 14324 13558 3985 -9332 -22819 -13352 11466 13367 -5056 -11667
221a1667J5247J0955j7627j4015J5496J7106q7r132o534m093n821L385Q468m888
$$ -11667 3580 14535 -3092 -17107 -1611 15495 15408 6276 -258 -4351 -10172 -6787 1681 -3207
235c207K23J8851P350k3070l0378M206K6391M407r289M748J0436k071j2145p35
$$ -3207 -2984 15867 23217 147 -30231 -26025 366 4773 -4516 232 10668 8597 -3548 -4283
249d283J1528L972N34M07r863j1897J224J1238p54k0683n991K3605K0703o558
$$ -4283 7245 11217 11751 12158 2295 -9602 -8378 2860 2106 -18577 -24568 -963 19740 13182
263A3182k1310r611P543Q263P345M895l952k528O292J875j1520j3773Q248J9168
$$ 13182 -8128 -17739 -10196 -1933 5412 10307 6355 3827 10119 11994 474 -13299 -5051 14117
277A4117k099j4667k958M797l710j1097J90J2700P541L105j241j0277q281N264
$$ 14117 12018 -2649 -5607 -810 -4520 -15617 -15427 -2727 4814 7919 6678 -3599 -11880 -6616
291f616J3837J286j1912J914J6347K297j4417j1046M804R206k22l818k723l879
$$ -6616 7221 8507 -3405 -1491 14856 17153 2736 -8310 -3506 5700 5478 1660 -1063 -4942
305d942n3j40p015q503M418K1295J5916q634j4815l99P649J383o063k15O307J831
$$ -4942 -4995 -5135 -12150 -20653 -16235 5060 20976 12342 -2473 -2872 4777 6160 97 -118 6189 8020
321H020k481p454q726N06J0828Q484n337j0626L119P945p014j2731Q4J3874J2807
$$ 8020 5539 -1915 -10641 -10135 693 9177 3840 -6786 -3667 4278 -2736 -15467 -15383 -1509 11298
336A1298q39o352m482P53N556r03j0624m185J1068J3451m943j6099l744Q425M534
$$ 11298 10459 4107 -375 378 5934 5031 -5593 -9778 1290 14741 9798 -6301 -10045 -1620 2914
351B914j948j405K632Q57l550n027o742k733R636J3415K915n938l504M184N44
$$ 2914 966 -439 2193 3050 -500 -5527 -12269 -15002 -5366 8049 10964 5026 1522 5706 6250
366F250p827l212M673O868K56o661p053l709L495R007K887o250j475P970N040
$$ 6250 -1577 -4789 -116 6752 7008 347 -6706 -10415 -6920 2087 4974 -1276 -2751 5219 10259
381A0259r488j2975K32Q819M960K019J085o09j358n51p94n593n42J0993P593r751
$$ 10259 771 -12204 -11972 -3153 1807 3826 4911 4302 2944 2393 1599 -3994 -4536 6457 14050 4299
397D299j5303j134R967K656n713J862R199N481n080j0578p030J271Q348Q688j543
$$ 4299 -11004 -12138 -2171 485 -5228 -3366 5833 11314 6234 -4344 -11374 -10103 -1755 6933 5390
412E390m999J694M833k157r278k407Q741O935m207q145m061J091J549J216R85
$$ 5390 391 2085 6918 4761 -4517 -6924 1817 8752 4545 -3600 -7661 -6570 -5021 -3805 -2820
427b820K185O548P929l057j3330q659N068Q256K37l137K185K556j926m095l687
$$ -2820 -635 5913 13842 10785 -2545 -11204 -6136 2120 2357 -780 1405 3961 2035 -2060 -5747
442e747l02N109R924K233j2038j1595M927R152j145o122L308J2511N166o693j0923
$$ -5747 -6049 -940 8984 11217 -821 -12416 -7489 1663 518 -5604 -2296 10215 15381 8688 -2235
457b235o045K713P267J912o039m512L945L762m921m485N391R493K173l533k120
$$ -2235 -8280 -5567 1700 3612 -2427 -6939 -2994 768 -4153 -8638 -3247 6246 8419 4886 2766
472B766Rk487k805r85j045K673Q458N400q029j1763J025R186k37p995p30O460
$$ 2766 2775 288 -2517 -3502 -4547 -1874 6584 11984 3955 -7808 -6783 2403 2166 -5829 -6559 -99
488i9J783n477k663O83J633P094R987p04j0670l384P957P72j0615l934Q815M737
$$ -99 1684 -3793 -6456 -5773 -4140 2954 12941 12237 1567 -1817 6140 6912 -3703 -7637 1178 5915
504E915m815m330l3j782k056L951J584n407J224J1840L724j2033o651J1084R511
$$ 5915 1100 -3230 -3263 -5045 -7101 -3150 -1566 -6973 -5749 6091 9815 -2218 -8869 2215 11726
519A1726m782l996N620J167r377p135K45q84M24R578O007j1132j1395P925J3300
$$ 11726 6944 2948 8568 9735 358 -6777 -6532 -7416 -6992 2586 8593 -2539 -13934 -6009 7291
534G291m134j1540L933J0762j250o807J000K870l009M86P681K402o284K50N702
$$ 7291 3157 -8383 -4450 6312 5062 -1745 -745 2125 -884 -398 7283 9685 3401 3651 9353
549I353p356j6011j419J3976M637p549k074M579k08l506L904N955n50J898O828
$$ 9353 1997 -14014 -15433 -1457 3180 -4369 -6443 -1864 -2072 -5578 -1674 4281 3731 5629 12457
564A2457k837j4629n205J1203O936p218m626O462L081o551n004J214P53r76M117
$$ 12457 9620 -5009 -10214 989 7925 707 -3919 2543 5624 -927 -5931 -4717 -3964 -4940 -823
579h23M029l371l484M098K430n879l287Q408R585k581q205k984L53j293J220L382
$$ -823 3206 -165 -3649 449 2879 -3000 -6287 2121 11706 9125 920 -2064 -1711 -3004 -1784 1598
595A598J744j007k26k054o584l674N800P948n35n391o6M120K070j323k376k009
$$ 1598 3342 2335 2109 55 -6529 -10203 -4403 3545 3010 -2381 -2447 1673 3743 2420 44 -1965
611a965K039O921J823p134p263J175L099k557j605N219N830Q0m265m309l383J901
$$ -1965 74 6995 8818 1684 -5579 -4404 -1305 -3862 -5467 -248 5582 5662 1397 -2912 -6295 -4394
627d394P446L842n112n096K641K266l984k641M913N003r85j998L03k456k741J223
$$ -4394 3052 6894 1782 -3314 -673 1593 -2391 -5032 -119 4884 3899 1901 2204 -252 -2993 -1770
643a770J826l893k375P615Q001m787j0461k34O586J571j461K478L171l726n661
$$ -1770 56 -3837 -6212 1403 9404 4617 -5844 -6078 508 2079 618 3096 6267 2541 -3120
658c120q26l77o31N252O967k582r474n66P106M77o696K96Q583L185m543l054p68
$$ -3120 -3946 -4323 -4954 298 7265 4683 -4791 -5357 1749 2226 -4470 -4174 4409 7594 3051 -3 -771
675g71j651M44L985p6n849J080Q616J19j0994n923P729P953j044l088J324K53
$$ -771 -2422 -1978 2007 1931 -3918 -2838 5778 5897 -5097 -11020 -3291 4662 3618 530 1854 2107
691B107m444k288J570K668L830M056p66p773m928M359N102j803m540N70M518q82
$$ 2107 -2337 -4625 -3055 -387 3443 7499 6733 -1040 -5968 -1609 3493 1690 -2850 -2280 2238 1356
707A356m344j879J331J936J348J142Q21LP98J360l999n093J743P565M886l419
$$ 1356 -2988 -4867 -3536 -1600 -252 890 1711 1714 2512 3872 -127 -5220 -3477 4088 8974 5555
723E555o238k692K49J595Q91k13J49J239j03k485l108O19L669L201N96k378j01
$$ 5555 -683 -3375 -3126 -1531 -640 -853 -704 535 432 -2053 -5161 -4542 -873 2328 2924 546 445
740D45K873J174m939m465L342O778N96m738k220K076n44l175j600Q50K275L021
$$ 445 3318 4492 -447 -4912 -1570 5208 5804 1066 -1154 922 378 -2797 -4397 -3547 -1272 1749
756A749J564m832o138J191Q136L088l644j039M386J456m351l688L20J834J434
$$ 1749 3313 -1519 -7657 -6466 1670 4758 1114 75 4461 5917 1566 -2122 -1802 32 1466
771A466J708ol727k878K050J053l277j665M820M228l698m394J354K944n14k54
$$ 1466 3174 3168 -559 -3437 -1387 -334 -3611 -5276 -456 3772 74 -4320 -2966 -22 -536 -790
787g90K552K531L60j6j271n493m186M644P219j139o776j023L847l63m406o15L346
$$ -790 1762 4293 4653 4637 3366 -2127 -6313 -1669 5550 4411 -2365 -3388 459 96 -4310 -4925 -1579
804a579K989L24q86k334k632K228M636J54l513J247N500J363n839n416L07L119
$$ -1579 1410 1734 848 -1486 -4118 -1890 2746 2900 -613 634 6134 7497 1658 -3758 -3451 -332
820c32J829l66j854j693J7J068q46j535J619M552J586k950l038M02K203L40j022
$$ -332 1497 1131 -723 -2416 -2399 -1331 -2177 -3712 -2093 2459 4045 1095 -1943 -1541 662 1002 -20
837b0o8K200K306j29l507l635q9K841R96j676j545J382J271j694k419P83L836
$$ -20 -88 2112 4418 4289 782 -2853 -2942 -101 895 -781 -2326 -944 327 -1367 -3786 -3003 833
854H33L489n18l310k281K088K904k508m098J59N502L341l046m258j729J265K525
$$ 833 4322 3804 494 -1787 301 3205 697 -3401 -3242 2260 5601 2555 -1703 -3432 -2167 358
870C58P85j513j851J256K281o69l437o44M346L026j451j943O05K44j777j689R6
$$ 358 1143 -370 -2221 -965 1316 647 -2790 -3434 912 3938 2487 544 1149 1393 -384 -2073 -1977
887a977P60R92K187K34k626k721J511K562p87j735K134K927j064m311j295J885
$$ -1977 -1217 -225 1962 2196 -430 -3151 -1640 922 135 -1600 534 3461 2397 -1914 -3209 -1324
903a324K594J454m77k317j215J870J370l009m559J104O524K518l172l676L95K287
$$ -1324 1270 2724 2247 -70 -1285 585 1955 -1054 -5613 -4509 2015 4533 1361 -2315 -1920 367
919C67Q57j66o5p1N43J189k420l832j41M029K346k310j641K112J154k662k958
$$ 367 1224 1058 993 922 1465 2654 234 -3598 -3739 290 2636 326 -1315 797 1951 -711 -3669
936c669O90K186J889N29k68j290m93J133O98j130Q9L194J614l747m937q65L053
$$ -3669 -2979 -793 1096 1625 1357 67 -426 707 1405 275 364 3558 5172 1425 -3512 -4377 -1324
953a324J304q70j031O26J218J075j068k016j292L352L976j61l116j057J382O30
$$ -1324 -20 -890 -1921 -1295 -77 998 -70 -2086 -3378 -26 3950 3789 673 -384 998 1628
969A628j867n68J429K105j55j427l101k285J149L452l83k659j33L559J656l011
$$ 1628 -239 -807 622 2727 2572 1145 -1956 -4241 -3092 360 -23 -2682 -2815 744 2400 -611
985f11k196J068L064J615R09q99j527m25N65j141j811M50L164K71m110k943Q85
$$ -611 -2807 -1739 1325 2940 3849 2950 1423 998 1563 422 -1389 -939 2225 2496 -1614 -4557 -3672
1002c672K074K9n50N41J899J405R90j842k640N06M122K056k497l063J049K137
$$ -3672 -1598 -1569 -2119 -1578 321 1726 2716 874 -1766 -1260 2862 4918 2421 -642 407 2544
1018B544k027l604M80K898J484m97k027k438m81K470J675j901k284L234M488p51
$$ 2544 517 -3087 -2607 291 1775 1278 -749 -3187 -3668 -1198 477 -1424 -3708 -474 4014 3263
1034C263m002p48K870J484p36J96L31r81j710j546j801k10K624K494j467l274
$$ 3263 -739 -1487 1383 2867 2131 2327 2658 1677 -33 -1579 -3380 -3590 -966 1528 61 -3213
1050c213N40K794M68j438L8J539J741P6q35j824j426R87K463l00j924m25K307
$$ -3213 -2673 121 589 -849 -811 728 2469 2545 1710 -114 -1540 -553 1910 1610 -314 -739 1568
1067A568Q53l325l141P70K968K192k95k753j490J005K057Q9j745P54L352J005
$$ 1568 2421 -904 -4045 -3275 -307 1885 1590 -1163 -2653 -1648 409 498 -1247 -493 2859 3864
1083C864k354k421n0J169Q14l29r70k85N01P51j949k322J862K915J067k910l79
$$ 3864 1510 -911 -961 208 1022 693 -277 -562 -61 690 -1259 -3581 -1719 1196 2263 -647 -1026
1100a026K337P88k110j353lJ158J917P92j622k984L33J905L89j631P73K763K06
$$ -1026 1311 2099 -11 -1364 -1367 -209 1708 2500 878 -2106 -1773 132 521 -1110 -337 2426 2632
1117B632l408j669L58K128R65O53j064k190M04K615O11l346j179K330K409j248
$$ 2632 -776 -2445 -2087 41 1006 1659 595 -1595 -1191 1424 2035 -1311 -2490 -160 2249 1001
1133A001j287M12J85j723n03Q46R73J288J364n63l590j637K884L275r80j844J67
$$ 1001 -286 126 311 -1412 -1915 -1069 -96 1192 2556 1993 -1597 -3234 -350 2925 1945 101 268
1150B68O49j362j720M58J033M25Q37pj487n82K407J188k339k164J809L426j80
$$ 268 917 -445 -2165 -1707 -674 -249 588 581 -906 -1488 919 2107 -232 -2396 -587 2839 2659
1167B659k494j116L40j6Q34O11m16k60R96N4k538k929J641L673R30j666j530K09
$$ 2659 165 -951 -611 -627 207 818 402 142 1138 1192 -1346 -4275 -2634 1039 1969 303 -1227 -1018
1185a018N07K85J013l41M46J110P38k351j839J602J492j274j962K47K128L98j373
$$ -1018 -511 -226 787 446 892 2002 2740 389 -1450 152 1644 370 -1592 -1345 783 1181 -192
1202a92j381p74J56J432J657j81p87Q17J198j922k424K303L722K83k983j603l10
$$ -192 -1573 -2347 -2191 -759 898 717 -70 747 1945 23 -2401 -98 3624 3907 924 -679 -989
1219i89J14J103J022j229k187P44K412m77l100m0K718K51j934R27K344j43o02
$$ -989 -875 228 1250 21 -2166 -1422 990 513 -2587 -2627 91 342 -1592 -665 1679 1536 934
1236I34M0l04j886J230M009k2m333k393K113N99k221l82L524J78j976j275Q81
$$ 934 974 670 -1216 14 4023 4001 -332 -2725 -612 -13 -2234 -2616 908 1086 -890 -2165 -1284
1253a284j93L95K476N13k742l66L558J165l553j949K646K300j803j584R82o1j574
$$ -1284 -1477 -1082 1394 1907 -835 -1201 2357 3522 -31 -1980 666 2966 1163 -421 561 500 -1074
1270a074n99K83q28J8K937K251l280l187J394L505l25j333J621R63j172j545O66
$$ -1074 -1673 -1390 -2218 -2200 737 2988 -292 -3479 -2085 1420 1095 -238 1383 2346 1174 -371 295
1287B95m0p19J283J832j389l514L95K718j306k679P35K616K11r24R33L3q81l75
$$ 295 255 -464 819 2651 1262 -2252 -1857 861 -445 -3124 -2389 227 438 -486 447 480 -401 -776
1305g76J732O64j154R70J762k272l372j99L596J097j487j134J39p1o14J2m8m93
$$ -776 956 1620 466 1436 3198 926 -2446 -2645 951 2048 561 -573 -434 -505 -1119 -1107 -1155 -1648
1323a648J324K293q80k587J20K457P91j728q22J438J117o23q93j094j268R36J843
$$ -1648 -324 1969 1089 -1498 -1378 1079 1870 142 -680 758 1875 1252 359 -735 -2003 -1067 776
1340G76M96j751m23J475J92k497n52K384J496n33r93n38R9p7R52J11j402N41J827
$$ 776 1272 -479 -902 573 765 -1732 -2284 100 1596 1063 70 -468 -369 -446 506 617 -785 -244 1583
1359A583K40l162j180K066J538j120p50R94N58o9n95k1j060k57K148J352j829
$$ 1583 1823 -1339 -2519 -453 1085 -35 -785 209 767 698 103 82 -978 -1235 913 2265 436
1376D36j934J118J237j307j552J435J648k67j009q1k66o01R97J186l61j412R89
$$ 436 -1498 -380 857 -450 -2002 -567 1081 814 -195 -276 -542 -1143 -146 1040 679 -733 256
1393B56J766j261k026RK176J04j092p37P34l45k63k04k79j43J410J896q18k155
$$ 256 2022 761 -1265 -1256 920 1024 -68 -805 -71 -416 -679 -883 -1162 -1305 105 2001 1183 -972
1411i72o05K128Q57j128o54J199J065o79j594n82J53N64R99m44j419k79J025P32
$$ -972 -1577 551 1408 280 -374 825 1890 1211 -383 -965 -812 -248 751 307 -1112 -1391 -366 366
1429C66j740j130J921K280k18j228o63R13L30j1k36k83K15Q80r3j593k022P73
$$ 366 -1374 -2504 -583 1697 1479 251 -412 501 831 820 584 301 516 1396 1303 -290 -2312 -1539
1447a539J636J57j047k90Q49J56n57n68O29N78P89O06o36p65L25P93o6q53m71
$$ -1539 97 254 -793 -1083 -234 -78 -635 -1203 -574 4 793 1399 763 -2 323 1116 1050 197 -274
1466b74J080R80j033j868l40O40j61M13m52M5M23L52k1l91l68J528J669l82j212
$$ -274 806 1786 753 -1115 -1455 -815 -976 -563 -1015 -970 -547 -195 -216 -607 -975 553 2222 1840 628
1485F28k31P61j14r77o43K34O71K19n74j193p12Q06Q90k01o39L91J262M69j273
$$ 628 397 1158 1044 67 -576 -342 329 548 -26 -1219 -1931 -1125 -235 -436 -1075 -684 578 1047 -226
1504b26q01O33J153Q78j63j199Q7O41M28j289j444N89J476K91j752r24o9P50K26
$$ -226 -1027 -394 759 1637 1474 275 362 1003 1431 142 -1302 -713 763 1054 -698 -1622 -1691 -941 -715
1523g15M3q6P46J114Q5r29p92N76J356m6o65m59L98l0p70j333J17Q44P42J06m94
$$ -715 -672 -758 -12 1102 1187 258 -534 42 1398 1352 687 228 626 596 -174 -1507 -1390 -546 196 302 -192
1544a92o22LN35J53n79P7J279P61r45q68l23R62N74m9m20j21L13k47j7j170q48
$$ -192 -814 -811 -276 -123 -702 -625 654 1415 470 -398 -721 241 815 766 346 225 538 291 274 -896 -1744
1565a744P29J135M60q78o71L78M36J67l35N43N56M41n65r39o15R39L98n95l12
$$ -1744 -1015 120 580 -298 -969 -591 -155 12 -323 220 776 1217 652 -287 -902 37 435 -160 -472
1584d72R3J169k60p43j031M08J266K24j18q28N92O1l70q26j27R78J170p2j222
$$ -472 -379 790 530 -213 -1244 -836 430 654 536 -292 300 361 -9 -835 -962 16 1186 1114 -108
1603a08j097N04J247R5q05m60O39Q74l35j222kJ85L83K24K55q4j04N1m3o62m57
$$ -108 -1205 -701 546 641 -164 -624 15 889 554 -668 -670 -485 -102 122 377 293 189 240 197 -465 -922
1624i22P69J167l50r08o95N36j85N9J76M03M80K94O3q64p25M80J387Mj338m9O21
$$ -922 -153 1014 664 -244 -939 -403 -588 -529 -353 50 530 824 887 23 -702 -222 1165 1169 -169 -218 403
1645D03R8r35n79L38N05L46K72o30r40M53J205m15j373O01J907J008j534j201
$$ 403 501 -434 -1013 -675 -170 176 448 -182 -1122 -669 536 121 -1252 -651 1256 2264 730 -471
1663d71L70M30J29M46j17q32m71N04l15j161R0J597O75j697n70J525K60l72n03
$$ -471 -101 329 458 904 787 -45 -516 -12 -327 -1488 -1398 199 874 -823 -1393 132 392 20 -483
1682d83Q18j40K75P64K25j382n77J108K65j101n29J545M38j748j696R50P19N83
$$ -483 335 195 470 1234 1459 77 -500 608 873 -228 -757 788 1226 -522 -2218 -1268 -549 34
1700C4N53J23j078j072J646J459j013j442J556J431j118j431L63P70o77m11J32
$$ 34 587 710 -368 -1440 206 1665 652 -790 766 2197 1079 -352 11 781 104 -307 -175
1717a75k35n77L41J174j202j939Q43K287r6q38M88J766j369j286R63J015k95K7
$$ -175 -410 -987 -646 528 -674 -2613 -1770 517 421 -417 71 1837 468 -818 145 1160 865 892
1735H92N13p91j743o8K086m77j582j6J666l36j576m00J894J15m68L33O02q85N29
$$ 892 1405 614 -1129 -1197 889 412 -1170 -1186 480 144 -1432 -1832 62 177 -291 42 644 -241 288
1754B88J632l64k260n26K111J405j806p80O23p23q68q0J537n2o92N30q2j135n74
$$ 288 1920 1556 -704 -1230 881 2286 480 -300 323 -400 -1268 -1348 189 137 -555 -25 -107 -1242 -1816
1773a816K142J878j920j079J481O81j237j8P70k9j052J71O85n64p19O34Q3j281
$$ -1816 326 2204 284 -795 686 1367 130 112 882 853 -199 -28 657 93 -626 8 91 -1190
1791a190j113K363J969j602j426L63O71l35N47Q19O0j088K57O91r65j141J218
$$ -1190 -2303 60 2029 427 -999 -636 35 -300 247 1066 1126 38 295 986 21 -1120 98
1808I8J506j051j644K64J267l09q99K78K98o38P38Q15k31j219j18J567n76j123
$$ 98 1604 553 -1091 -827 440 131 -768 -490 -192 -830 -92 723 492 -727 -845 722 146 -977
1826i77Q43J547l60j199m79K80j4R8R41O3j040m98J262l52j085Q09J660k96j858
$$ -977 -134 1413 1053 -146 -625 -345 -359 -261 680 743 -297 -795 467 115 -970 -161 1499 1203 -655
1845f55k63J564K71j129l2k32l31L04J236J76j750l21J603K24j243Q7J862L3j497
$$ -655 -918 646 917 -212 -244 -476 -807 -503 733 909 -841 -1162 441 665 -578 -491 1371 1404 -93
1864i3j010Q85M22K45K97J50j290q47R14R79j213n82R36R11o71p39O77O04p57
$$ -93 -1103 -218 204 449 746 896 -394 -1241 -327 652 -561 -1143 -207 704 33 -706 -29 575 -182
1883a82k50J059J8m97M24M04r47j045M88J297n43p35Q3P63r32l48j15R31j5M70
$$ -182 -432 627 645 148 572 976 29 -1016 -528 769 226 -509 -426 337 -595 -943 -1058 -127 -142 328
1903C28K22n76p49N70J133O1j218K85Q73R9o83p76J44K96j32J84k24o86J58O31
$$ 328 550 -26 -775 -205 928 989 -229 56 929 1028 345 -431 -287 9 -123 61 -163 -849 -691 -60
1923f0j36r35K66J194K84k93k80P7K77n9J00K08pJ18M5j154o94K37O75J68l33
$$ -60 -196 -1131 -865 329 613 320 40 117 394 335 435 643 636 754 799 -355 -1049 -812 -137 31 -302
1944c02n76L71N42n43R3j26K27O66J58j11k13L71K01l06j98j08O50L07o04p94
$$ -302 -878 -507 35 -508 -415 -541 -314 352 510 399 186 557 758 452 254 146 796 1103 499 -295
1964b95r09L82N38J03k52l11Q5M21Ql65K02P81M90q2n80L6K73J09Jr49k9K88O40
$$ -295 -1204 -822 -284 -181 -433 -744 -659 -238 -230 -595 -393 388 878 796 216 252 525 634 635 -314 -343 -55 585
1987E85l48p64l84J26O57k03k25j7N16ko4l77J32R04K08J97m10O9L69l08p09k18
$$ 585 237 -527 -911 -785 -128 -331 -556 -573 -57 -59 -123 -500 -368 536 744 941 531 600 969 661 -48 -266
2009b66QQ54l23o75m35l3K83M00l49n5N35O08Om21k59J15O29R7m89k54K16J82
$$ -266 -258 596 273 -402 -837 -870 -587 -187 -536 -591 -56 552 558 137 -122 -7 622 719 230 -24 192 374
2031C74Q6q54j12J35P52l3o52k06J41o3J48MR9L62M15m22j47m22L30O45j06n19
$$ 374 460 -394 -506 -371 381 348 -304 -510 -369 -432 -284 -280 -181 181 596 174 27 -395 -65 580 474 -45
2053d5q8O37J51p82m99K1M65M18j37l16m99K93O80P3n10l53R12K59m72n40k67
$$ -45 -133 504 655 -127 -626 -605 -140 278 141 -175 -674 -381 299 372 -138 -491 421 680 208 -332 -599
2074e99M39M9Q9j46l93P40K76l49o14L9Q72J27l42n02K07K08k10k75K76P1L27
$$ -599 -160 -111 -22 -168 -561 179 455 106 -508 -469 403 530 188 -314 -107 101 -109 -384 -108 -37 290
2095B90J2k71o65K25L00K79l95l61M48O12j37q39J9L34N22L67m91L3l24M37l29
$$ 290 302 31 -634 -409 -109 170 -225 -586 -138 474 337 -502 -483 -149 373 740 249 282 -42 395 66
2116F6k70n22M16N54K34j028o03Q58K89j35l2j75O70K64k6l30m10J08M07M95m49
$$ 66 -204 -726 -310 244 478 -550 -1153 -295 -6 -141 -173 -348 322 586 560 230 -180 -72 335 830 381
2137C81m29K13M73r31k42j33O67J62n52J0l45K49L10J46l11O3P76N82o51o19K56
$$ 381 -48 165 638 -293 -535 -668 -1 161 -391 -381 -726 -477 -167 -21 -332 -269 507 1089 438 -181 75
2158G5P69j24n10j52N6J46m26M1m35m59O36M75K8r76P6R15L58o23J74M69K07k27
$$ 75 844 720 210 58 114 260 -166 -125 -560 -1019 -383 92 120 -856 -780 135 493 -130 44 513 720 493
2180D93K32l26m62l21R02J61r56J53K89p3j083k15R68J22k46k88K96L50j8M77
$$ 493 725 399 -63 -384 518 679 -277 -124 165 92 -991 -1206 -238 -116 -362 -650 -354 -4 -22 455
2200D55p2l32p5R18N57j441n65J075K6r03j99J86N53j96m37p0l74k37R92O04o69
$$ 455 383 51 -24 894 1451 10 -555 520 546 -357 -556 -370 183 -13 -450 -520 -894 -1131 -139 465 -204
2221b04m83N24R12l86m82O88M12m99l63K56M0q10J96L79m67p95N93R96l54q56
$$ -204 -687 -163 749 363 -119 569 981 482 119 375 415 -395 -199 180 -287 -1082 -489 507 153 -703
2241g03k46J014j80l03M50M48j24j36J42j29o09L66J071q6j441k02P55Rl99l33
$$ -703 -949 65 -115 -418 32 480 356 220 362 233 -376 -10 1061 975 -466 -668 87 96 -303 -636
2261f36P92m11m87K40N55k88J33N78N3r13J71J003K09j225j18O81J96n00J26L76
$$ -636 156 -255 -742 -502 53 -235 -102 476 529 -384 -213 790 999 -226 -344 337 533 33 159 535
2281E35o47o64K06N25m16J41R40J89j299n63J037P82o49l60O57k72l37rP79n62
$$ 535 -112 -776 -570 -45 -461 -320 620 809 -490 -1053 -16 766 117 -243 414 142 -195 -204 575 13
2301A3m48P00L45q63n87J069M65j051o31Q91N01l07K26J58m57p51M19P93r1n74
$$ 13 -435 265 610 -253 -840 229 694 -357 -988 -97 404 97 323 481 24 -727 -308 485 394 -180
2321a80L90M15j037n49O63P86k10l32k4l9j24L38N80j72q20j00R82k9r89K37N20
$$ -180 210 625 -412 -961 -298 488 278 -54 -78 -117 -241 97 677 505 -315 -415 567 538 -451 -214 306
2342C06j21j030L61P00m4p1Q6l71o44L82R88K31r72N0O20j53p77K00Q11j86j82
$$ 306 185 -845 -484 216 172 101 187 -184 -828 -446 542 773 -199 -149 471 318 -459 -259 552 366 184
2363A84k75K3m73K04P88n55r19j73J201M79p17o9M65N9l74m7P21P1k09L06n83
$$ 184 -91 -68 -541 -337 451 -104 -1023 -1196 5 484 -233 -302 163 222 -152 -199 522 593 384 690 107
2384A07n15K23R12J55j220l94J67L70k54j46N49K69n62P2J69k9K61M73P9o26l12
$$ 107 -408 -185 727 882 -338 -732 -565 -195 -449 -595 -46 223 -339 -267 -98 -127 134 607 686 60 -252
2405b52P31O68o69m24j58l53J31L37r0j76l20OK39m53L13Q05L69m35o22K31N76
$$ -252 479 1147 478 54 -104 -457 -326 11 -79 -255 -575 -569 -330 -783 -470 335 704 269 -353 -122 454
2426D54j91K43K24n57qK80J44n11m55L82J0l82o95R39L19n18l40J87K86J35N22
$$ 454 263 506 730 173 165 445 589 78 -377 5 15 -367 -1062 -123 196 -322 -662 -475 -189 -54 468
2447D68J48o50j62L89L23q8o30M60Q31r22o44k32N77O5l24J4J2j63M40K67k43
$$ 468 616 -34 -196 193 516 428 -202 258 1089 167 -477 -709 -132 -67 -391 -377 -365 -528 -88 179 -64
2468f4l78L27O11m5m87L80M56l02m79q5K93k8p9J61q05j21J17M58k4n02K20M40
$$ -64 -442 -115 496 451 -36 344 800 498 19 -66 227 199 120 281 -524 -645 -528 -70 -94 -596 -376 64
2490F4n7m67K78K72K55M2J32k75k34J38J67K44j046L05L12l0q6l09K26J92l11
$$ 64 7 -460 -182 90 345 387 519 244 10 148 315 559 -487 -182 130 100 14 -295 -69 123 -188
2511a88q5M2L4K08K62j44l41j11N98Q8q2o8K14k69P7l59kj25K45N7P2o01P9P22
$$ -188 -273 -231 -197 11 273 129 -212 -323 275 363 281 213 427 158 235 -124 -126 -251 -6 51 123 -478 -399 323
2535C23l07k60j70L68M70O5n21n5l4k3N97j61l06k58L97J53l29k77J11M22k41
$$ 323 16 -244 -414 -46 424 489 -32 -87 -121 -144 453 292 -14 -272 125 278 -51 -328 -217 205 -36
2556c6j72J90J81j51K18j25J18l98L70no56M8J74J36K85n06l2O74j08k95o5L0
$$ -36 -208 -18 163 12 230 105 223 -175 195 190 -466 -418 -244 -108 177 -329 -361 313 205 -90 -155 -125
2578a25N0L60K00l16j74o1N02k89n36Q0O94j27j02o14Qm0K98L07k96P7K40M8M9
$$ -125 -75 285 485 169 -5 -66 436 147 -389 -309 385 258 156 -458 -450 -490 -192 115 -181 -104 136 184 233
2601B33l90lO91K13l28l90K68p4j24r8n52L35Q6L17k59l00l02M09K05J66k68K50
$$ 233 -157 -160 531 744 416 26 294 220 96 -2 -554 -219 -133 184 -75 -375 -677 -268 -63 103 -165 85
2623H5L70N3j52o74N63L45l78K04m12N1O9j02l18j95J71M08l3o36J89RL21k60
$$ 85 455 508 356 -318 245 590 212 416 4 55 124 22 -296 -491 -320 88 55 -581 -392 -383 -62 -322
2645c22L15m1L57J28j79K48m05o4O06j49k70j41J11j76k56j07L2j47K48J57j91
$$ -322 -7 -48 309 437 258 506 101 37 643 494 224 83 194 18 -238 -345 -313 -460 -212 -55 -246
2666b46j61P4N19l2j24N0J59L40m16J50Oj12K28m79L7k86K49M7l67j01m5M15n5
$$ -246 -407 -333 186 154 30 80 239 579 163 313 319 207 435 -44 -7 -293 -44 3 -364 -465 -510 -95 -150
2689a50n2j24K74n6M07P1j81j78J49N89n20k66j32M66j79j17l68K70L2K2l85P1
$$ -150 -202 -326 -52 -108 299 370 189 11 160 749 229 -37 -169 297 118 1 -367 -97 -65 -43 -428 -357
2711c57J23r6K46J25k84J29l0M66m18J9L70K85j57k93k07P6J73k70M4j77J4K00
$$ -357 -234 -330 -84 41 -243 -114 -144 322 -96 -77 293 578 421 128 -79 -3 170 -100 -56 -233 -219 -19
2733a9J92n82j26M80n4N24m96J31K85k7n90M71J41J76l67P8m14L6K54J01m9n06
$$ -19 173 -409 -535 -55 -109 415 -81 50 335 308 -282 189 330 506 139 217 -197 -161 93 194 145 -361
2755c61J13O8J51j48R2k90L05J03N8o1k8r2M06r0l61j88M27K51l57q4M6l5K0R3
$$ -361 -248 -180 -29 -177 -85 -375 -70 33 91 30 2 -90 316 226 -135 -323 104 355 -2 -86 -40 -75 -55 38
2779C8j81P7J93L13j64l05k73N23J63p08k8M99R6l87k30L37J83k36J06K24l04
$$ 38 -143 -66 127 440 276 -29 -302 221 384 -324 -352 147 243 -144 -374 -37 146 -90 16 240 -64
2800f4k42L62l5l65R2M24L68j83n81RL7J0K51j35n2j38M58p6k64j95K25L89m28
$$ -64 -306 56 21 -344 -252 172 540 357 -224 -215 -178 -168 83 -52 -104 -242 216 140 -124 -319 -94 295 -133
2823a33k81N20J30j1K5l57L5j64M84K81o52k64M08k14j75k19O20J08l87R4k71
$$ -133 -414 106 236 225 250 -107 -72 -236 248 529 -123 -387 21 -193 -368 -587 33 141 -246 -152 -423
2844d23K46J45J88K14n92K3N16K64k22n56K69Q4n9m2j70K70m21K62j09m75N5M96
$$ -423 -177 -32 156 370 -222 -199 317 581 359 -197 72 156 97 55 -115 155 -266 -4 -113 -588 -533 -37
2866c7N44m37l62p6O36k94K75J66L12n45l13O36k58O5j21Lk44n37J37O56m3j024
$$ -37 507 70 -292 -368 268 -26 249 415 727 182 -131 505 247 312 191 194 -50 -587 -450 206 163 -861
2888h61L66M24j39k02N94j23q0j16K99L57m78M06L19o38m19k0L71K56m50M7J45
$$ -861 -495 -71 -210 -412 182 59 -21 -137 162 519 41 447 766 128 -291 -311 60 316 -134 -87 58
2909E8m34m49M65Q8k28L07M20Q2p26L09L51M65n64l38O87k56j97L27l5o21k84
$$ 58 -376 -825 -360 -272 -500 -193 227 309 -417 -108 243 708 144 -194 493 237 40 367 332 -289 -573
2930e73K89J70k98J79M48l11n71q4P84J35Jj1J07j59k82N03O42o42n08L54J08
$$ -573 -284 -114 -412 -233 215 -96 -667 -751 33 168 169 158 265 106 -176 327 969 327 -181 173 281
2951B81k70l33J15M90o38j24M27j44J22K15N7m54n15R25L75l81l98M12K80m00
$$ 281 11 -322 -207 283 -355 -479 -52 -196 -74 141 198 -256 -771 154 529 148 -250 162 442 42
2971D2k85L24L81o44K36p3k91r6R1O06m89l78K84O04m01o8K19M36l12m84L60K86
$$ 42 -243 81 462 -182 54 -19 -310 -406 -315 291 -198 -576 -292 312 -89 -157 62 498 186 -298 62 348
2993C48k25j3K5j47k81M37N58k37p71k03K69N1M2k3N49l56l21L46j2o8K33K78
$$ 348 123 110 135 -12 -293 144 702 465 -306 -509 -240 -189 -147 -170 379 23 -298 48 36 -32 201 479
3015D79m7r21J59O03j40l33j44M56o0k22k5M51m06J2K45P8j97j05O78J35q83j95
$$ 479 432 -489 -330 273 133 -200 -344 112 52 -170 -195 256 -150 -138 107 185 -12 -117 561 696 -187 -382
3037c82N43j24k72OJ99j02Pj2L00k95k35N60L92o20p9J91L77k67k67q3K81q8J0
$$ -382 161 37 -235 -229 -30 -132 -125 -137 163 -132 -367 193 585 -35 -114 77 454 187 -80 -163 118 30 40
3060D0l6j73k76K11n9L46l57J64M30k65l30J3N32j3K65l08J28m57J57L57k80k73
$$ 40 4 -169 -445 -234 -293 53 -304 -140 290 25 -305 -292 240 227 492 184 312 -145 12 369 89 -184
3082a84J45J32l39r0O4N68k83l12L28N9r9J07J99k95J16J95M0K06o30J29J76J22
$$ -184 -39 93 -246 -336 -272 296 13 -299 29 88 -11 96 295 0 116 311 351 557 -73 56 232 354
3104C54l64k11J55Rm9o5Ok30J70o3L05k78L5M21L67l60j90L2M85j72j73R3k25
$$ 354 -10 -221 -66 -57 -106 -171 -165 -395 -225 -288 17 -261 -226 195 562 202 12 44 529 357 184 277 52
3127E2K28l87J39L7m18J83K15o69K79j64L39J46l12M82R7O7M6k68O8K49l21Q4
$$ 52 280 -107 32 69 -349 -166 49 -620 -341 -505 -166 -20 -332 150 247 314 360 92 160 409 88 172
3149A72M5j11j93K44j06m14R7P7Q8k40K92l52P4J39J03J65k2K36K37l34K31n64
$$ 172 217 106 -87 157 51 -363 -266 -189 -101 -341 -49 -401 -327 -188 -85 80 58 294 531 197 428 -136
3171a36M64K02l78m61N01l15J82l63K28r4p3J95K63m12j65L75R7J59m06j2N33
$$ -136 328 530 152 -309 192 -123 59 -304 -76 -170 -243 -48 215 -197 -362 13 110 269 -137 -149 384
3192C84j88K66m27J97M0n15L64l14RL1K40j07m98J21L84r7J84J3k83L33m1k92
$$ 384 196 462 35 232 272 -243 121 -193 -184 -153 87 -20 -518 -397 -13 -110 74 87 -196 137 96 -196
3214a96K84K1Q5K07l08k9o0J33j53q7j71M81j02p4k02j82K15l7%mK6M76j30j18
$$ -196 88 109 194 401 93 64 4 137 -16 -103 -274 207 105 31 -171 -353 -138 -175 -175 -179 -153 323 193 75
3238G5k8k27L92j47J65k92k5J94K10n60K32R2pO0l35J28k00L69J13j01m78L40
$$ 75 47 -180 212 65 230 -62 -87 107 317 -243 -11 81 74 134 -201 -73 -273 96 209 108 -370 -30
3260c0K5J25k33Mj30L42J63l53q6J20KR0K12n02M8O47l45J65m80K00J50j46n8
$$ -30 -5 120 -113 -109 -239 103 266 -87 -173 -53 -51 39 251 -251 -203 444 99 264 -216 -16 134 -12 -70
3283g0pJ85k87N10k17j96K36j94k6J20p0N0J44O8k60J73j59K35j30J67m32J30
$$ -70 -77 108 -179 331 114 -82 154 -40 -66 54 -16 34 178 246 -14 159 0 235 105 272 -160 -30
3305c0N15m80lj53O0K07J33m40j21J61K25l4j63K43n4K6j30M08Jl36L91l03r5
$$ -30 485 5 2 -151 -91 116 249 -191 -312 -151 74 40 -123 120 66 92 -38 370 371 35 426 123 28
3328B8j19M22m96L56l31l19L53r9j70J87L4k2K53l0j03Q3L90j96J57l5m08K03
$$ 28 -91 331 -165 191 -140 -459 -106 -205 -375 -188 -154 -176 77 47 -56 27 417 221 378 343 -65 138
3350A38J39j51k41M58n98o5K53J74m09NN01l76o0k1N64M18o22N5O6K07j13k99
$$ 138 277 126 -115 343 -255 -320 -67 107 -302 -297 204 -172 -232 -253 311 729 107 162 228 435 322 23
3372B3J74L2l4n96L66j09k8J78J63l83q6L9M29j59l45J43L80j74P8J78J44l23
$$ 23 197 229 195 -401 -35 -144 -172 6 169 -214 -300 -261 168 9 -336 -193 187 13 91 269 413 90
3394I0K87K40n86j38J10K83j82o34M50k9j53j02N53N7n44K15K65K10n83K22L44
$$ 90 377 617 31 -107 3 286 104 -530 -80 -109 -262 -364 189 246 -298 -83 182 392 -191 31 375
3415C75j61m05K71L88Nk37L9l82J09l0M8K17n83M0J19J78j26l11M10L92p13J50
$$ 375 214 -191 80 468 473 236 275 -107 2 -28 20 237 -346 -306 -187 -9 -135 -446 -36 356 -357 -207
3437b07M70J60l16J25L1n57K60L87j51k73k85K09J39l90J1K70K78m17M1L63j02
$$ -207 263 423 107 232 263 -294 -34 353 202 -71 -356 -147 -8 -398 -387 -117 161 -256 -215 148 46
3458D6l94O66k5l07j16K24K62k82p7O7K04n68P8J34L35k67o6J14l86J53L86M84
$$ 46 -348 318 293 -14 -130 94 356 74 -3 64 268 -300 -222 -88 247 -20 -86 28 -358 -205 181 665
3480F65q87j07J56M62l55l1L11M8m14J11N6j2l12J85M25n23n6J84L79m7m83L51
$$ 665 -222 -329 -173 289 -66 -97 214 262 -152 -41 15 3 -309 -124 301 -222 -278 -94 285 238 -245 106
3502A06k41qp4M48Km38J91J57r3l65J82N87l78k62J37K60Q6n38L93K24n05K4L69
$$ 106 -135 -143 -217 231 233 -205 -14 143 50 -315 -133 454 76 -186 -49 211 297 -241 152 376 -129 -105 264
3525B64j67O2j48K32k12m48L9O45k8l00k93K24J4l1L72mk5o44O99k05%r3J30J35
$$ 264 97 159 11 243 31 -417 -378 267 239 -61 -354 -130 -116 -147 225 221 196 -448 251 46 46 -47 83 218
3549B18m76l4M40O4l21R9O0j66m66L60J23K32l30LK86l05J00O16j24r4l53J38
$$ 218 -258 -292 148 212 -109 -10 50 -116 -582 -222 -99 133 -197 -194 92 -213 -113 503 379 285 -68 70
3571G0J80k19J02n7l28o6K45okj01K73j5k17j4m7P52m36m27M40P3k21J51J73J10
$$ 70 250 31 133 76 -252 -318 -73 -79 -81 -182 91 76 -141 -155 -202 550 114 -313 127 200 -21 130 303 413
3595D13m26J92J23r6m69K62l2k39n0K09L6M3O9j85L5P4l04N19j47J17r2R3K68
$$ 413 -13 179 302 206 -263 -1 -33 -272 -322 -113 -77 -34 35 -150 -115 -41 -345 174 27 144 52 145 413
3618D13k27nM8j37j61O7j93J02k46M07j54l83K74P4L14k33q7K30O8L9j34rn9K91
$$ 413 186 181 229 92 -69 -2 -195 -93 -339 68 -86 -469 -195 -121 193 -40 -127 103 171 210 76 67 8 299
3642B99o4P6m57J22j3oj15l65L80K26j33L0j00Q6p2J42j33J39LL54k07n5j58J14
$$ 299 235 311 -146 -24 -37 -43 -158 -523 -143 83 -50 -20 -120 -34 -106 36 -97 42 45 399 192 137 -21 93
3666I3k2j1J70k67J15j93j16L3J08j00P8J31k05J6j46L47lj62L27j2Q2l2j70m1
$$ 93 71 60 230 -37 78 -115 -231 -198 -90 -190 -112 19 -186 -170 -316 31 28 -134 193 181 263 231 61 20
3690B0K31j22R4j50j33Q0K01l26n4o1M18l6k38r0J06m9J04k95L62j74L30K9j48
$$ 20 251 129 223 73 -60 20 221 -105 -159 -220 198 162 -76 -166 -60 -109 -5 -300 62 -112 218 247 99
3713I9m9k88J64q4K21n4j01L7K2j71J87j04O1K65m81M26k10P5J17l62K04j70J76
$$ 99 50 -238 -74 -158 63 9 -92 -55 -33 -204 -17 -121 -60 205 -276 150 -60 15 132 -230 -26 -196 -20
3736b0M67m40k17J79K13k31j78K91j97K49k3J83j84n2N67q31K11lO1j12m7k79
$$ -20 447 7 -210 -31 182 -49 -227 64 -133 116 93 276 92 40 607 -224 -13 -16 45 -67 -114 -393
3758c93j4K95K29j32jj21K35j90p3K91lj65M5J87j67l14K36J42J04k08K90l78
$$ -393 -407 -112 117 -15 -16 -137 98 -92 -165 126 123 -42 3 190 23 -291 -55 87 191 -17 273 -105
3780a05J67j89Qm0K00l04J08J58j26M28l40L01l08O6L01k50J37l13j1J28J5K2
$$ -105 62 -127 -119 -159 41 -263 -155 3 -123 305 -35 266 -42 24 325 75 212 -101 -112 16 31 53
3802E3q2k2L6l00J81K42j83K2PM8N6j16L31J18k15k0j15K22M9j13k72J05k06k68
$$ 53 -29 -51 -15 -315 -134 108 -75 -53 -46 2 58 -58 273 391 176 156 41 263 312 199 -73 32 -174 -442
3826d42L90j46J8jQ5m50M02J11K73l38J05R5kK76p9j9l02L26j73K53l84j66R3
$$ -442 -52 -198 -180 -181 -96 -546 -144 -33 240 -98 7 102 100 376 297 278 -24 302 129 382 -2 -168 -75
3849g5j54J21k10K54j16O9K3j20K47q9J19R1k66J25K61K1J3k87O9L1O5j43kk79
$$ -75 -229 -108 -318 -64 -180 -111 -88 -208 39 -50 69 160 -106 19 280 301 314 27 96 127 192 49 47 -232
3873b32j22L09p6l19L67k9j13K93k69K67K38l73J81k53M00K1k94J61l12K8K13
$$ -232 -354 -45 -121 -440 -73 -102 -215 78 -191 76 314 -59 122 -131 269 290 -4 157 -155 -127 86
3894H6K1l03k23L27L25k29j95M6n5L51j07N0l6k18L35K63l16j00PJ58k48J35O8
$$ 86 107 -196 -419 -92 233 4 -191 -145 -200 151 44 94 58 -160 175 438 122 22 29 187 -61 74 142
3917A42p5q7J31j34L2K5k56L45j81k89M52j22M2j98K09K61k78O8O6j98n3K67k35
$$ 142 67 -20 111 -23 9 34 -222 123 -58 -347 105 -17 25 -173 36 297 19 87 153 -45 -98 169 -66
3940f6J91l54k03N45K2l40j6M07l72J71K3J73k08r8J54K59l48P7J90p4m0j95J65
$$ -66 125 -229 -432 113 135 -205 -221 186 -186 -15 8 181 -27 -125 29 288 -60 17 207 133 93 -102 63
3963F3j37L0J05J43qj72k76K33K12m13L81Q5l04m4J82J33nk70N7O1k9n8kJ35j70
$$ 63 -74 -44 61 204 196 24 -252 -19 193 -220 161 246 -58 -102 80 213 208 -62 -5 56 27 -31 -33 102 -68
3988f8k7j8L04m62L58J26j51r5J42J71l75lo7L89m03P4J76L8n15N4M77j19l49
$$ -68 -95 -113 191 -271 87 213 62 -33 109 280 -95 -98 -165 224 -179 -105 71 109 -406 -352 125 6 -343
4011c43L05K17k67k47M75L5K33l26L6R8l09j02J77p1j69K19L6j73l80L57P3K33
$$ -343 -38 179 -88 -335 140 175 408 82 118 216 -93 -195 -18 -89 -258 -39 -3 -176 -556 -199 -126 107
4033A07L3J2l09M3j7O54l38m9k22J05L45k12J53j00Ll39n67O17M9k29O8K94k47
$$ 107 140 152 -157 -114 -131 523 185 136 -86 19 364 152 305 205 208 -131 -698 -81 -32 -261 -193 101 -146
4056a46l1J28J14N3R3N9l2j52R2J64Q5m88K31j30k10K02M9L5l67j47K34l4M3n4
$$ -146 -177 -49 65 118 211 270 238 86 178 342 427 -61 170 40 -170 32 81 116 -251 -398 -164 -198 -155 -209
4080b09M63j81k52OL77K39m34L50K0n27j0N06k70O7l52R0P1j63J10k30M70j68
$$ -209 254 73 -179 -173 204 443 9 359 379 -148 -158 348 78 145 -207 -117 -46 -209 -99 -329 141 -27
4102b7N2k67L40p5pL04j43r5l59O54m9j67k64K86m07J33Jm9n5j51K79K3k83J26
$$ -27 25 -242 98 23 16 320 177 82 -277 377 328 161 -103 183 -224 -91 -90 -139 -194 -345 -66 -43 -326 -200
4126b00K55j50j06K39l8K86J12m12M69m02j34M0O2J54j89K76n67K73k95J45K04
$$ -200 55 -95 -201 38 0 286 398 -14 455 53 -81 -41 21 175 -14 262 -305 -32 -327 -182 22
4147B2k78o4K20R8j13Q6J01J17o2M4j61j14p3M70l29j09kK54j27NK24l59pn0J65
$$ 22 -256 -320 -100 -2 -115 -29 72 189 127 171 10 -104 -177 293 -36 -145 -147 107 -20 -15 209 -150 -157 -207 -42
4172d2J78k34K4J32l3o9J43M60l91k10K46m55jM37k03L99m81pj08L81k32k50L41
$$ -42 136 -98 -74 58 25 -44 99 559 168 -42 204 -251 -252 185 -18 381 -100 -107 -215 166 -66 -316 25
4195B5K23l90o8L16J67k91Q6j94J97J1J61O2m68J01r6K32j69Q9mK7J03j83J09
$$ 25 248 -142 -210 106 273 -18 68 -126 71 82 243 305 -163 -62 -158 74 -95 -6 -10 17 120 -63 46
4218D6o2J46o3k54K26K10l03K89k95j35K20j57m15M82Q3j88J75q4J7L90m52K4
$$ 46 -16 130 67 -187 39 249 -54 235 -60 -195 25 -132 -547 -65 18 -170 5 -79 -62 328 -124 -100
4240a00L26j17k2J7j31K06j54J32r3j79j23L56k72p0N14k28j68j78J90P0n8J42
$$ -100 226 109 87 104 -27 179 25 157 64 -115 -238 118 -154 -224 290 62 -106 -284 -94 -24 -82 60
4262F0k9K22j47O7K17k82J11l31Q9J29k00m4J10k44j2J5K33m2j68J14J43J46j37
$$ 60 31 253 106 173 390 108 219 -112 -23 106 -94 -138 -28 -272 -284 -269 -36 -78 -246 -132 11 157 20
4285B0K88q7l23K43mJ04L0l24K74r7m0m37R7K22K2P7j62j56n6J70J58L6l1K75
$$ 20 308 221 -102 141 137 241 271 -53 221 124 84 -353 -256 -34 -12 65 -97 -253 -309 -139 19 55 24 299
4309B99l16N5l4j4K21j23j43J41j70M9j14k9R8r6K31l57j9L53k28J40Q6J11j7
$$ 299 -17 38 4 -10 211 88 -55 86 -84 -35 -149 -178 -80 -176 55 -302 -321 32 -196 -56 30 141 124
4332A24r6L06l53J14L8R4j53L1P8j09k92j3J76k13M9K40J70k96j05o8J68J78L0
$$ 124 28 334 -19 95 133 227 74 105 183 74 -218 -231 -55 -268 -219 21 191 -105 -210 -278 -110 68 98
4355I8o1J90J4o7K41k61N3p1J00k09n0k63J31j2j66n3J70J31J51K7l42L31K68
$$ 98 37 227 241 174 415 154 207 136 236 27 -23 -286 -155 -167 -333 -386 -216 -85 66 93 -249 82 350
4378C50l19j9o6L00j25L4j33q5j04J48K84j74j30p1K19m63K07K06j42N4Q9J38
$$ 350 31 12 -54 246 121 155 22 -63 -167 -19 265 91 -39 -110 109 -354 -147 59 -83 -29 60 198
4400A98k96K81j62j43L93j91n5O1K9l44K21j92M08l70l8k5L22k43L3oK05q1r5
$$ 198 -98 183 21 -122 271 80 25 86 115 -229 -8 -200 208 -162 -200 -225 97 -146 -113 -119 86 5 -90
4423i0J38m3l82P18k39m15P8J66L1J15n2N1o4J3M4J69j05k06K8J39J32k47j13
$$ -90 48 5 -377 341 102 -313 -235 -69 -38 77 25 76 12 25 69 238 133 -73 -45 94 226 -21 -134
4446a34r8M96k38j48j12J58J6O0j30j1J62n4J50n5k72K87L6o7k3Qn7o1J31J6p
$$ -134 -232 264 26 -122 -234 -76 -60 0 -130 -141 21 -33 117 62 -210 77 113 46 23 31 -26 -87 44 60 53
4471E3O9k02m6J61j28J75j31n7j54L04k48Q6J85L40m80K54O4j95k29L01J00l3
$$ 53 122 -80 -126 35 -93 82 -49 -106 -260 44 -204 -118 67 407 -73 181 245 50 -179 122 222 189
4493A89r4k20J1KJ2q4O3j64J90l3r7J29P5j76L34J0l35O1O08m09J11j85m4J9K63
$$ 189 95 -125 -114 -112 -100 -184 -121 -285 -95 -128 -225 -96 -21 -197 137 147 -188 -127 481 72 183 -2 -46 -27 236
4518B36q9m95L57j80j19J60j96K70Q8j8l02L52K0KJ31k3j72J66J26L4k99j21J1
$$ 236 147 -348 9 -171 -290 -130 -326 -56 32 14 -288 64 84 86 217 194 22 188 314 348 49 -72 -61
4541f1L56k80k65O2K30k96l2K32k52M1K44L1l2l30O07j38J33j37K01j86k9J28
$$ -61 295 15 -250 -188 42 -254 -286 -54 -306 -265 -21 10 -22 -352 255 117 250 113 314 128 99 227
4563B27J84l35j70q8J23k93J74M2K83l5l95J33m5N51n36K66K15j52l8J58j60n3
$$ 227 411 76 -94 -182 -59 -352 -178 -136 147 112 -283 -150 -195 356 -180 86 301 149 111 269 109 56
4585E6K53o2l58j55J48K17j0l18kJ03q3k29K51RL96j91j85K66m3O7Q0R5l12K15
$$ 56 309 247 -111 -266 -118 99 89 -229 -231 -128 -211 -440 -189 -180 216 25 -160 106 63 130 210 305 -7 208
4609B08k15J06oP4j34k34J90q1N8j44J47K5J68k80k40N44q2J13k34K65k85L23
$$ 208 -7 99 93 167 33 -201 -11 -92 -34 -178 -31 -6 162 -118 -358 186 104 217 -17 248 -37 286
4631B86j73p1K14l10M5J11l37K30O2l09R9k09M56O7J74n06J28K68j98J7J77N6
$$ 286 113 42 256 -54 -9 102 -235 -5 57 -252 -153 -362 94 161 335 -171 -43 225 27 44 221 277
4653B77k12j05L12n0l89R1L22l04j9j54L37j55k48M65r6r3j16K75K6j52k3O2K4
$$ 277 65 -40 272 222 -167 -76 246 -58 -77 -231 106 -49 -297 168 72 -21 -137 138 164 12 -11 51 75
4676G5n62N31j15L05j63k9j5p2L2L91l29k37L7J85o1o5J00K90k01j51m1L50l68
$$ 75 -487 44 -71 234 71 42 27 -45 -13 378 49 -188 -151 34 -27 -92 8 298 97 -54 -95 255 -113
4699a13K40M0l00r3J78K26j54k35Q1J68J44j05k4J19Nj97K58j35k73J64J14k7
$$ -113 127 167 -133 -226 -48 178 24 -211 -130 38 182 77 53 172 177 -20 238 103 -170 -6 108 81
4721H1l7l19L82k7k74k3J76J31j30J09J37k81l23N13o4j78J73j59J68J01m69K83
$$ 81 44 -275 107 80 -194 -217 -41 90 -40 69 206 -75 -398 115 51 -127 46 -113 55 156 -313 -30
4743c0K12l56N5J5j85K55j35o9O2J41J39o1J66m11L08K02m51K72k35J24K8J1j90
$$ -30 182 -174 -119 -104 -289 -34 -169 -238 -176 -35 104 43 209 -202 106 308 -143 129 -106 18 46 57 -133
4766a33k2K00j97J01OJ1j43K70m2j71n4Q0K88j93MK64l05L5K5J36l18J87J78K7
$$ -133 -155 45 -152 -51 -45 -34 -177 93 51 -120 -174 -94 194 1 5 269 -36 -1 24 160 -158 29 207 234
4790B34m35R6j04K05k91Q3M5K71p7O0n8j22K29n9K26m4m23M62l12j41J98n3O3
$$ 234 -201 -105 -209 -4 -295 -212 -167 104 27 87 29 -93 136 77 303 259 -164 298 -14 -155 43 -10 53
4813E3q1J15k75L1J96j48J5k8j01M53k22L8M0P2j14j51rL38pj85J66k04q6J96
$$ 53 -28 87 -188 -157 39 -109 -94 -122 -223 230 8 46 86 158 44 -107 -116 222 215 30 196 -8 -94 102
4837A02j13r3k5L6Mr3L70l95j13O92m75qJ23J9L8KK02m56J95M4Q3K8m46K74r5
$$ 102 -11 -104 -129 -93 -89 -182 188 -207 -320 372 -103 -111 12 31 69 71 273 -183 12 56 139 167 -279 -5 -100
4862a00j48j3L32j66j5K72n63M30m8JJ17n7j27K75%m2j56QMJ64k01L24k67j85
$$ -100 -248 -261 71 -95 -110 162 -401 29 -19 -18 99 42 -85 190 190 148 -8 0 4 168 -33 291 24 -161
4886a61J38Q6K91m35j46K07L4L0j72K18No5M0k4J9K3J3L0l09Q1R9K00m20J45J25
$$ -161 -23 63 354 -81 -227 -20 14 44 -128 90 95 30 70 46 65 88 101 131 -178 -97 2 202 -218 -73 52
4911E2j16J42j08k23J17J48j29P9j70L46k24J1l6R7L71k91O3j22J54r0k00Q7j42
$$ 52 -64 78 -30 -253 -136 12 -117 -38 -208 138 -86 -75 -111 -14 357 66 129 7 161 71 -129 -42 -184
4934a84L55k27O4n7j39L37k33J87J13k42o6K9l4J08j6j01r2L65k29J90k51N3M6
$$ -184 171 -56 8 -49 -188 149 -84 103 216 -26 -92 -63 -97 11 -5 -106 -198 167 -62 128 -123 -70 -24
4957b4K35k88Q3p0K79k85K83j83Nj39rL55k29k8Q1j29Kk63M17k14J7J55m7K01
$$ -24 211 -77 6 -64 215 -70 213 30 35 -104 -113 242 13 -15 66 -63 -61 -324 93 -121 -104 51 4 205
4981B05k4k84K82J3k48M4j73K71j60J49k69R1Qj53o2M41j02m78O95k90L19k32
$$ 205 181 -103 179 192 -56 -12 -185 86 -74 75 -194 -103 -95 -248 -310 131 29 -449 246 -44 275 43
5003D3K49k33K59p1k21N6r3J40j44j26K8p5J22L2j13k54L40r5PJ58l75N18j16
$$ 43 292 59 318 247 26 82 -11 129 -15 -141 -113 -188 -66 -34 -147 -401 -61 -156 -149 9 -366 152 36
5026C6Jj57K79j58K68J66j85o10N71l47J35J72l94K74q6j00k86N90j85k76L40
$$ 36 37 -120 159 1 269 435 250 -360 211 -136 -1 171 -223 51 -35 -135 -421 169 -16 -292 48
5047D8k32Q4O7j5K61k61j99M16J31j81l33L15j68l7k67L13l2Q6j22P3k21J06K60
$$ 48 -184 -100 -33 -48 213 -48 -247 169 300 119 -214 101 -67 -104 -371 -58 -90 -4 -126 -53 -274 -168 92
5070I2J89Ok67J38j32J78K98n49N02m28QK87m73J39q1L70m81N8M5k4J37J67r1
$$ 92 281 287 20 158 26 204 502 -47 455 27 35 322 -151 -12 -93 277 -204 -146 -101 -125 12 179 88
5093H8J3j14J50qj95nK74P0l09J24R9p8k8k30P7K77j24K8Q5p6l24O9J01L40m20
$$ 88 101 -13 137 129 -66 -71 203 273 -36 88 187 109 81 -149 -72 205 81 109 194 118 -206 -137 -36 304 -116
5118a16J2L09j00k38JJ92K64m77J60o4Q4m5Q3J05j63j68m7K01r7j7K74L9k26O0
$$ -116 -104 205 105 -133 -132 60 324 -153 7 -57 27 -18 65 170 7 -161 -208 -7 -104 -121 153 192 -34 26
5142B6R7Q1Q4j02Mk08n1M6n2K18j26J53M6l76K54J49M1l80l6K08Q6k97K44r3j7
$$ 26 123 204 288 186 190 -18 -69 -23 -75 143 17 170 216 -160 94 243 284 -96 -132 76 162 -135 109 16 -1
5167ak51o4M81l59L18k24J30J8m83L19R0M9q9k1j07J68O8J55r5Jl16K37l1j8K02
$$ -1 -252 -316 165 -194 124 -100 30 48 -435 -116 -26 23 -66 -87 -194 -26 42 197 102 103 -213 24 -7 -25 177
5192A77j42J97m73nK60j69M8M18j61k77J69J29l1j83j51K22J27nj68O0j99J24
$$ 177 35 232 -241 -246 14 -155 -107 311 150 -127 42 171 140 -43 -194 28 155 150 -18 42 -157 -33
5214c3j65J49k12J32L20l2o19J94L4P9J16J31J69l00J02K8J01m3k20R1J17k70
$$ -33 -198 -49 -261 -129 191 159 -460 -266 -232 -153 -37 94 263 -37 65 93 194 151 -69 22 139 -131
5236a31J00Q4J79k30oO2l43j24L93J24j53n1j38N46k03k06Q0Q8J3k02L67J65l20
$$ -131 -31 53 232 2 -4 58 -285 -409 -16 108 -45 -96 -234 312 109 -97 -17 71 84 -118 249 414 94
5259I4n4K45r2l92Kl5K01k65J02n0Q1L0j12O16l19j47J68M6J49k70K00m8k9k94
$$ 94 40 285 193 -199 -197 -232 -31 -296 -194 -244 -163 -133 -245 371 52 -95 73 119 268 -2 198 150 121 -173
5283a73O5p1k63M91k50L60m08K83l0j85K2N1K60k29J11m7K29n0k02K60k3j11J45
$$ -173 -108 -179 -442 49 -201 159 -249 34 4 -181 -159 -108 152 -77 34 -13 216 166 -36 224 201 90 235
5306B35j49oj81Q9l46L19K4OK29k35j60L83k97k19K44k4L23q8k53L06p5k51J61
$$ 235 86 80 -101 -12 -358 -39 -15 -9 220 -15 -175 208 -89 -308 -64 -88 235 147 -106 200 125 -126 35
5329C5n7K86l07l6J46l01P4%K60k33o5jK31Rk61J46R2p2L00k31j71k0J97l8J14
$$ 35 -22 264 -43 -79 67 -234 -160 -160 100 -133 -198 -199 32 41 -220 -74 18 -54 246 15 -156 -176 21 -17 97
5354I7L8j01M2r9o7J99j50j78J76Q4k70J05J57J91o05J80K83J34k65K31k73j4
$$ 97 135 34 76 -23 -90 109 -41 -219 -43 41 -229 -124 33 224 -381 -201 82 216 -49 182 -91 -105
5376a05J2k7j2J9L95k84K31l35Q8K56k7j19m4q6N6J67k7j21l5qr9L5J36j50J85
$$ -105 -93 -120 -132 -113 282 -2 229 -106 -18 238 211 92 48 -38 18 185 158 37 2 -6 -105 -70 66 -84 101
5401A01n2K6p7M6J05k56K78k45j42L90m5j3l65K98k71M10l17k33L54j25J09J23
$$ 101 49 75 -2 44 149 -107 171 -74 -216 174 129 116 -249 49 -222 188 -129 -362 -8 -133 -24 99
5423I9n9k30P1J46j1K48k63K56J71n00r9q2L46j40q3J57Pk46K15R2k38J04k22
$$ 99 40 -190 -119 27 16 264 1 257 428 -72 -171 -253 93 -47 -130 27 34 -212 3 95 -143 -39 -261
5446b61N8N7J14j29L62l37J38J69l6K43k66L9q7r8N4J90k63J68p2J61j4m26j41
$$ -261 -203 -146 -32 -161 201 -136 2 171 135 378 112 151 64 -34 20 210 -53 115 43 204 190 -236 -377
5469c77M38K02j23%Oj73L9n0L0J10P4j82L2J99j32p0j33J35n8q5n6j54J26K52
$$ -377 61 263 140 140 146 -27 12 -38 -8 102 176 -6 26 225 93 23 -110 25 -33 -118 -174 -328 -202 50
5493E0Q8k92J11R9J03k09L5o7L73j27j05k0J07l38j12M42m59K94J51l88J17J14
$$ 50 138 -154 -43 56 159 -50 -15 -82 291 164 59 39 146 -192 -304 138 -321 -27 124 -264 -147 -33
5515c3J7J33J15j33J89m1r2J86k08n4L42k9n21M54k36k36j56M26j47J81l99K2
$$ -33 -16 117 232 99 288 247 155 341 133 79 421 392 -129 325 89 -147 -303 123 -24 157 -242 -220
5537b20J44L54m73J06k92J64J21p1K15m0m2N0J14l44RK99k75P7L25k61O4j19R4
$$ -220 -76 278 -195 -89 -381 -217 -96 -167 48 8 -34 16 130 -214 -205 94 -181 -104 221 -40 24 -95 -1
5560am2j25R6K82l99L44k88j7L36J68m09J79J3R0j9n0n8l07J9J97J27j87rr1M14
$$ -1 -43 -168 -72 210 -189 155 -133 -150 186 354 -55 124 137 227 208 158 100 -207 -188 9 136 -51 -60 -151 263
5585B63j32m88M02k8o5K42Mk78k66M07Rrj10M0k7M7j23P0J3j9K03k89J62j83K52
$$ 263 131 -357 45 17 -48 194 198 -80 -346 61 70 61 -49 -9 -36 11 -112 -42 -29 -48 155 -134 28 -155 97
5610I7q4Q1r4J21J1j26j44J59Q0l03Q4J7NL22l75p2N09j29k61K7R9j89O1J28J03
$$ 97 13 94 0 121 132 6 -138 21 101 -202 -118 -101 -96 226 -149 -221 288 159 -102 -75 24 -165 -104 24 127
5635A27l00K07pK76n43J22j6P3J22o8p1J21j11J21k14J21k4k2p5N85l07j08J77
$$ 127 -173 34 27 303 -240 -118 -134 -61 61 -7 -78 43 -68 53 -161 -40 -64 -86 -161 424 117 9 186
5658A86l48L10k61j30J25L8K73j97J2k26M32l65J3O3J47j73M8K59k54j52L03O7
$$ 186 -162 148 -113 -243 -118 -80 193 -4 8 -218 214 -151 -138 -75 72 -101 -53 206 -48 -200 103 170
5680A70k19J43k44M21k48q9k16M51m40K25J8q9J12j1K13l78K59l13M02J5k24J79
$$ 170 -49 94 -150 271 23 -66 -282 169 -271 -46 -28 -117 -5 -16 197 -181 78 -235 167 182 -42 137
5702A37J4Jk6k62Q2K26j72R6K4k73PL8j46J32Q5L89m51K38j50K48j44K21m54M13
$$ 137 151 152 126 -136 -54 172 0 96 120 -153 -146 -108 -254 -122 -37 352 -99 139 -11 237 93 314 -140 273
5726B73k36L5K80l82Q9k96L02j01j45Q8j18L67k25N8l1j63K7K72L4K6rl30J64
$$ 273 37 72 352 -30 59 -237 65 -36 -181 -93 -211 156 -69 -11 -42 -205 -178 94 128 154 145 -185 -21
5749b1K26m5j92P1K5j44Q1k33J44J62ln31K92J53J12l42o1N81m31L09p7J73N0
$$ -21 205 160 -32 39 64 -80 1 -232 -88 74 71 -460 -168 -15 97 -245 -306 275 -156 153 76 249 299
5772B99m14K73k68J75k99J56k09K25m12L61J18j11k4l5K26l52J13K40R1mJ01k67
$$ 299 -115 158 -110 65 -234 -78 -287 -62 -474 -113 5 -106 -130 -165 61 -291 -178 62 153 149 250 -17
5794a7J02p3k2K41j25j9j85nR3j84J63K16l98J17J32j19J59N0J26k33k39K72R9
$$ -17 85 12 -10 231 106 87 -98 -103 -10 -194 -31 185 -213 -96 36 -83 76 126 252 19 -220 52 151
5817A51M3l07K93Q3m36K13M2j04j04K43k14P0j75K48Mk60J20J17Q5n6j8J8o3Q8
$$ 151 194 -113 180 263 -173 40 82 -22 -126 117 -97 -27 -202 46 50 -210 -90 27 112 56 38 56 -7 81
5841H1k06K89J36k56k3K26j09p3j65M93n03J74P9j46r3J82k15J57J04j70q2K03
$$ 81 -125 164 300 44 21 247 138 65 -100 393 -110 64 143 -3 -96 86 -129 28 132 -38 -120 83
5863H3r4q0J64j10P5j94o6L47l70M87j75O5j90J90K4k39M3j44J86j06J14J8J72
$$ 83 -11 -91 73 -37 38 -156 -222 125 -245 242 67 132 -58 132 156 -83 -40 -184 2 -104 10 28 200
5886B00l26K36j20K54l43j58J24j9K7Q1o1J47JN0j00J3J07k0kk40J37J61j32j34
$$ 200 -126 110 -10 244 -99 -257 -133 -152 -125 -44 -105 42 43 93 -7 6 113 93 91 -149 -12 149 17 -117
5910a17J50j78K61l85L63j48P6k56j41L28K22m33J13K54L2l0J71j74J97l42k3
$$ -117 33 -145 116 -269 94 -54 22 -234 -375 -47 175 -258 -145 109 141 111 282 108 305 -37 -60
5931f0k3q3J76K09l28J5L3lK40n2m65M32l10L07J15j64N2J62J79l95J00M8q7J14
$$ -60 -83 -166 10 219 -109 -94 -61 -64 176 124 -341 91 -219 88 203 39 91 253 432 37 137 185 98 212
5955B12l13j22J09J44k63N3j24K39k43N01k97J41m8j75R8K66j58j9L5K22p9k32
$$ 212 -101 -223 -114 30 -233 -180 -304 -65 -308 193 -104 37 -11 -186 -88 178 20 1 36 258 179 -53
5977e3J83qn5J09k46q2L8N1J24l35R0J63R6J48k05j14OL43l0Oj90m1jPL9K5j35
$$ -53 130 122 67 176 -70 -152 -114 -63 61 -274 -184 -21 75 223 18 -96 -90 253 223 229 39 -2 -3 4 43 68 -67
6004f7k00J32O5j2K5O4j67K8j11K28j74J67j40Q0J87l26L29k55K88k51L49L2m03
$$ -67 -267 -135 -70 -82 -57 7 -160 -132 -243 -15 -189 -22 -162 -82 105 -221 108 -147 141 -110 239 271 -132
6027a32L1J0Q3K32k21n5j72L53j99L3R9k5q1J14K7O2m3lj75nM7J37j17P5Nk42
$$ -132 -101 -91 -8 224 3 -52 -224 129 -70 -37 62 37 -44 70 97 159 116 113 -62 -67 -20 117 0 75 80 -162
6053a62L3k13M83l75P8J91r6j67R2J4J37j01K68l48J72J80n07J73J57N6Rl6j05
$$ -162 -129 -342 141 -234 -156 35 -61 -228 -136 -122 15 -86 182 -166 6 186 -321 -148 9 65 74 38 -67
6076f7Q7r0M06l59P5J01n5n2mN8k28R7j30rJ16M7K15j21p5J1k8O6R7j58R5l09
$$ -67 20 -70 336 -23 52 153 98 46 42 100 -128 -31 -161 -170 -54 -7 208 87 12 23 -5 61 158 0 95 -214
6102b14K95K43m64J36l0p6K11j60K4m0l29K83NK21J20l21K19j28o0J85j68J42
$$ -214 81 324 -140 -4 -34 -110 101 -59 -35 -75 -404 -121 -116 105 225 -96 123 -5 -65 120 -48 94
6124I4J75j20k72J76N3j99l20O35k63rM7q1K65k71J82j48Lp6R5J67Jj99L43M1
$$ 94 269 149 -123 53 106 -93 -413 222 -41 -50 -3 -84 181 -90 92 -56 -53 -129 -34 133 134 -65 278 319
6148C19j00j40L60n46J83j88J46J18J33j43l85R2r8M42m71L52o4R0j93J7J72l34
$$ 319 219 79 439 -107 76 -112 34 152 285 142 -243 -151 -249 193 -278 74 10 100 -93 -76 96 -238
6170b38K98K49j62o7K16l97J73J25N6m57K30K81l14j45n8J88J34m04J64p4K29
$$ -238 60 309 147 80 296 -101 72 197 253 -204 26 307 -7 -152 -210 -22 112 -292 -128 -202 27
6191B7L7P9Q0j19o3J76o0k28L7kJ22J7j88pL08j55j99k6J99k0J4r0j19J76K34
$$ 27 64 143 223 104 41 217 157 -71 -34 -36 86 103 -85 -92 216 61 -138 -164 35 15 29 -61 -180 -4 230
6216B30j27j40K49j58J59L5J08o8l11j2N6j16N2k6M0k18L00k04K16%k10J73J9
$$ 230 103 -37 212 54 213 248 356 288 -23 -35 21 -95 -43 -69 -29 -247 53 -151 65 65 -145 28 47
6239D7M7p7R2N5j35j78J73K11M9j84r0k85J14J24j35k8K85j43J23j04j30P6L09
$$ 47 94 17 109 164 29 -149 24 235 284 100 10 -275 -161 -37 -172 -200 85 -58 65 -39 -169 -93 216
6262B16j04j34K3J64j51j1LK07k94L7J36l65K00J47k4J94n32L72j30l7K51r5J3
$$ 216 112 -22 1 165 14 3 6 213 -81 -44 92 -273 -73 74 50 244 -288 84 -46 -83 168 73 86
6285H6L1L2j67R1o3O0L23m34n5m8K53rmp2J13k00j96J91o1j2K56k08j75K12J81
$$ 86 117 149 -18 73 10 70 393 -41 -96 -144 109 100 96 24 137 -63 -259 -68 -129 -141 115 -93 -268 -56 125
6310A25J12k12j25r6K43RJ50j86R6l08J78k07K52L8k01Q3M34l00k44O03l05r2
$$ 125 237 25 -100 -196 47 56 206 20 116 -192 -14 -221 31 69 -132 -49 385 85 -159 444 139 47
6332D7k13K38o9k52M38j20l40J30n1J99m2R7q9N9K1k45j36L63r1L24j81J0lJ2
$$ 47 -166 72 3 -249 189 69 -271 -141 -192 7 -35 62 -27 32 53 -192 -328 35 -56 268 87 97 94 106
6356A06j96J90r7q2N1K26n50L79L5p6J8L6nO8J35k9R6j99pK18l93r9J52l4L9k36
$$ 106 -90 100 3 -79 -28 198 -352 27 62 -14 4 40 35 103 238 209 305 106 99 317 -76 -175 -23 -57 -18 -254
6382b54K12R1k37K60j19r8L7j2K03p3j53K2R8O1N4J48j36l6j13n3N22k07j83j36
$$ -254 -42 49 -188 72 -47 -145 -108 -120 83 10 -143 -121 -23 38 92 240 104 68 -45 -98 424 217 34 -102
6406a02J38K01o60N35Rj41r1J60O6R5k30l4L05k9j14J7k1l72J54K31j15j76J37
$$ -102 36 237 -423 112 121 -20 -111 49 115 210 -20 -54 251 222 108 125 104 -268 -114 117 2 -174 -37
6429c7M60m30l26K31R7l49M71j51J90l80L68j7J38j90j13L4L5k96O9J85q5j17
$$ -37 423 -7 -333 -102 -5 -354 117 -34 156 -224 144 127 265 75 -38 -4 31 -265 -196 -11 -96 -213
6451b13L09j66p7J23j1p6K23k79J16J96k31Q1k38M16k66J51M6j74P7Q5p4O8M6
$$ -213 96 -70 -147 -24 -35 -111 112 -167 -51 145 -86 -5 -243 173 -93 58 104 -70 7 92 18 86 132
6474A32j24Rj20q1L12k23j49L15j92NJ61K3j19J09J31J5j25k22K03J79q2k39n1
$$ 132 8 17 -103 -184 128 -95 -244 71 -121 -116 45 68 -51 58 189 204 79 -143 60 239 157 -82 -133
6497a33J22Q4j07j28J08J72m40J66K15m5N1j96J15J31m4O0m6n1K1on6j83K52k42
$$ -133 -11 73 -34 -162 -54 118 -322 -156 59 14 65 -131 -16 115 71 131 85 34 55 49 -7 -190 62 -180
6521a80mK04J18j74k50L00L4J50M2l69K65j24K11k58J18n1J45j09j04J36K40l20
$$ -180 -184 20 138 -36 -286 14 48 198 240 -129 136 12 223 -35 83 32 177 68 -36 100 340 20
6543B0k08K22k17L58m1j04j60L57l8j72l15L12N0k92M89l62kJ55k58J03L02l43
$$ 20 -188 34 -183 175 134 30 -130 227 189 17 -298 14 64 -228 261 -101 -103 52 -206 -103 199 -144
6565a44M16k44LJ92m64K49J06K2J05j03j18k0J15M7j76J91l14L6j71J66k9L25
$$ -144 272 28 31 223 -241 8 114 136 241 138 20 0 115 162 -14 177 -137 -101 -272 -106 -135 190
6587A90j80K9j05j3J29j60R6ol2J24Q8P7j68J8K7L5m33K51o7l0L33j65j6k09R6
$$ 190 10 39 -66 -79 50 -110 -14 -20 -52 72 160 237 69 87 114 149 -284 -33 -100 -130 203 38 22 -187 -91
6612i1J95J97k19j25p1K57l5QRj69q7J02k4L83m07K58k58J85R1m23j72L04j3J84
$$ -91 104 301 82 -43 -114 143 108 116 125 -44 -131 -29 -53 330 -77 181 -77 108 199 -224 -396 -92 -105 79
6636G9k4m7J53r9Pr3J19M3q2j53K83m4n5p8K09k22j11J16k11N15n24O3J87j04
$$ 79 55 8 161 62 69 -24 95 138 56 -97 186 142 87 9 218 -4 -115 1 -210 305 -219 -156 31 -73
6660g3m2K11j81Q3jo9J33j2J0n3k19K45J2R4j72J3qL7k29J69Q0r5J20Q7m85L86
$$ -73 -115 96 -85 -2 -3 -72 61 49 59 6 -213 32 44 138 -34 -21 -29 8 -221 -52 28 -67 53 140 -345 41
6686D1j2J06j97Q2K29k43K07l5n7l05K18N1p8m2N5j65j63K06R8q1J41l8qL0J0
$$ 41 29 135 -62 20 249 6 213 178 121 -184 34 85 7 -35 20 -145 -308 -102 -4 -85 56 18 10 40 50
6711E0K05l35j22K71k6K30l21L74l03K88l58N6j41M6L7J50k89K07L2k34M6J16
$$ 50 255 -80 -202 69 43 273 -48 326 23 311 -47 9 -132 -86 -49 101 -188 19 51 -183 -137 -21
6733b1j06K37l02L30J07l32J38O9L7j12K03j75J35k88n7J59j16J18m4j19O4J43
$$ -21 -127 110 -192 138 245 -87 51 120 157 45 248 73 208 -80 -137 22 -94 24 -20 -139 -75 68
6755F8l8p2n1J94o2k70J71m3M87k16l20K33j06j08K46P8k81N9J09o3K43m13n7
$$ 68 30 -42 -93 101 39 -231 -60 -103 384 168 -152 81 -25 -133 113 191 -90 -31 78 15 258 -155 -212
6778b12K34L55l51K31l75K34j6r5J44j06M5j14J64O9k83N1N3k36K90J39l19J38
$$ -212 22 377 26 257 -118 116 100 5 149 43 88 -26 138 207 -76 -25 28 -208 82 221 -98 40
6800D0l51L38MJ18J5j9k53J93J34j58j47J18n8p8J73p1P2K2j71k0K05j05L71l35
$$ 40 -311 27 31 149 164 145 -108 85 219 61 -86 32 -26 -104 69 -2 70 92 -79 -99 106 1 372 37
6824C7K40l04l5K89j84k26J8J83p9J62%j54j59L13n2l82K84k69J65J18K08j11
$$ 37 277 -27 -62 227 43 -183 -165 18 -61 101 101 -53 -212 101 49 -333 -49 -318 -153 -35 173 62
6846F2j04R8j71Oj0J77k14o9Q0JJ37m2N0J15l90L34o5nJ17j59J02j3J9q2L2M3
$$ 62 -42 56 -115 -109 -119 58 -156 -225 -145 -144 -7 -49 1 116 -274 60 -5 -10 107 -52 50 37 56 -26 6 49
6872D9m8R9J4j13j5j44L24k32J37r1J60k42J18j16R8r2k98O18k90k6J26K28k58
$$ 49 1 100 114 1 -14 -158 166 -66 71 -20 140 -102 16 -100 -2 -94 -392 226 -64 -90 36 264 6
6895Fl2K01O9k55k33K70j55N0J49j00P7j21j50L20k4j30M0J36j70P8L02l82M58
$$ 6 -26 175 244 -11 -244 26 -129 -79 70 -30 47 -74 -224 96 72 -58 -18 118 -52 26 328 -54 404
6918D04l48m9j33j1oPJ47j48o6J90J66j68j8K13k98Q9j03O37l82r3N0j13pJ33
$$ 404 56 7 -126 -137 -143 -136 11 -137 -203 -13 153 -15 -33 180 -118 -29 -132 505 123 30 80 -33 -40 93
6942I3J32q3j70j74L62l05K5J16q3K76p1j27o4L5k54N33o9j57L0k81J36m1K05
$$ 93 225 142 -28 -202 160 -145 -120 -4 -87 189 118 -9 -73 -38 -292 241 172 15 45 -236 -100 -141 64
6965F4M7j55o2j22K01l5p4l0k7M05J5k41K20Pl09L8L9j0J50O3p6J3l51J49m9J61
$$ 64 111 -44 -106 -228 -27 -62 -136 -166 -193 212 227 -14 206 213 -96 -58 -19 -29 121 184 108 121 -230 -81 -130 31
6991C1Q7j89j23m7p1K14j41L71k99J27K01k21n8L21j20J92l7k04K21l41%M3p8
$$ 31 118 -71 -194 -241 -312 -98 -239 132 -167 -40 161 -60 -118 203 83 275 238 34 255 -86 -86 -43 -121
7014a21O4J09j13L2R1k5rk94K36O2l9j86O42m67PRJ59j58KR4K1j93Q4r5J16r9
$$ -121 -57 52 -61 -29 62 37 28 -266 -30 32 -7 -193 449 -18 -11 -2 157 -1 1 95 116 -77 7 -88 28 -71
7040g1j59K28Q0L3l12L71j10J84l36J21j58M2K9Ol2O7K64l32k1L45k66L60n60
$$ -71 -230 -2 78 111 -201 170 60 244 -92 29 -129 -87 -58 -52 -84 -17 247 -85 -106 239 -27 333 -227
7063b27K53j6j45J33j80J32J30N2j3p1O8l56L20Q0l37K9J20k51J16K23j34J15
$$ -227 26 10 -135 -2 -182 -50 80 132 119 48 116 -240 80 160 -177 -148 -28 -279 -163 60 -74 41
7085D1jq4L4r4Q2L5J72l5Mj87Q8P3M9k44j52J08J77j54J19k81p0K13J02jj67J48
$$ 41 40 -44 -10 -104 -22 13 185 150 154 -33 55 128 177 -67 -219 -111 66 -88 31 -250 -320 -107 -5 -6 -173 -25
7111b5R0p6L08p7k13KJ91j60KP5p9k21r1K41l18J31K54l54J64K27k23J57O5P8
$$ -25 65 -11 297 220 7 9 200 40 42 117 38 -183 -274 -33 -351 -220 34 -320 -156 71 -152 5 70 148
7135A48J4q5m7j84rJ73j90m5R6N2M2J31k01J59j03j74K47j59K7%K68j19M2j12
$$ 148 162 77 30 -154 -163 10 -180 -225 -129 -77 -35 96 -105 54 -49 -223 24 -135 -108 -108 160 41 83 -29
7159b9K21j22R9k27L80j36k39L22j90r2l5j75J42R8j88J79J43n5l96J76N3M12
$$ -29 192 70 169 -58 322 186 -53 269 79 -13 -48 -223 -81 17 -171 8 151 96 -300 -124 -71 341
7181C41k96O0k40J96k5J65Nl78J32n3kL5J12M5o7K38k79K01J49l69L46J3k14j73
$$ 341 45 105 -135 61 36 201 206 -172 -40 -93 -95 -60 52 97 30 268 -11 190 339 -30 316 329 115 -58
7205e8K6J72j12j8R8J42l6l24L6J17j12O5J5l5K65l40J31j88N9n7J12K22q7p4
$$ -58 -32 140 28 10 108 250 214 -110 -74 43 -69 -4 11 -24 241 -99 32 -156 -97 -154 -42 180 93 19
7229A9J48m14L79Q7k63K35k07K80p6j8j53j20N7K4L4q9M9Q0j96K13j18Q8j54L29
$$ 19 167 -247 132 219 -44 191 -16 264 188 170 17 -103 -46 -22 12 -77 -28 52 -144 69 -49 39 -115 214
7253B14l10Q6K32p8J61k39j89M7Q7J13j29Rj49L14j58k08Q7J24j12J66k82M07
$$ 214 -96 -10 222 144 305 66 -123 -76 11 124 -5 4 -145 169 11 -197 -110 14 -98 68 -214 193
7275A93q9J72j99j9q7J44k06%J34j39M15l96K66k90K86l54J92k06J85L7N7q8j31
$$ 193 104 276 77 58 -29 115 -91 -91 43 -96 319 -77 189 -101 185 -169 23 -183 2 39 96 8 -123
7298a23J84k18K68l61K43K5K3J02j48J88l20L69l97L62l6j83O3j86km3J58K0j25
$$ -123 61 -157 111 -250 -7 18 41 143 -5 183 -137 232 -165 197 161 -22 41 -145 -147 -190 -32 -12 -137
7321a37K96k34J38o5k38M5J61L9J05j40O9j2%j93K34M2j16J08J12%l22J29J25
$$ -137 159 -75 63 -2 -240 -195 -34 5 110 -30 39 27 27 -166 68 110 -6 102 214 214 -108 21 146
7344A46l40j0J23j28L34o3m5J64k18Rj61K5J59P6j1J44j14N4k79J88J37m8j7o
$$ 146 -194 -204 -81 -209 125 62 17 181 -37 -28 -189 -164 -5 71 60 204 90 144 -135 53 190 142 125 119
7368A19l04L65k28k01k1M84j40k86O6R9m5K34j94j6p2K48j71Rr6Q9K59l28J89
$$ 119 -185 180 -48 -249 -270 214 74 -212 -146 -47 -92 142 -52 -68 -140 108 -63 -54 -150 -61 198 -130 59
7391E9p9J86j54k74K53j4j75N3K77l14L03j51K0j2J81j55q0p4K48l1N7k86J53
$$ 59 -20 166 12 -262 -9 -23 -198 -145 132 -182 121 -30 -10 -22 159 4 -76 -150 98 67 124 -162 -9
7414iJ58p2r7r8J92j39Q6L6L8j27m2P3J46n4Mj92M2K08k42Q3j89L92l08M1j68
$$ -9 149 77 -20 -118 74 -65 21 57 95 -32 -74 -1 145 91 95 -97 -55 153 -89 -6 -195 197 -111 -70 -238
7439b38L33k39L1K40j75l18L72j75K27j34n1R5j31P3J64J95k64j02L7j61L48j1
$$ -238 95 -144 -113 127 -48 -366 6 -169 58 -76 -127 -32 -163 -90 74 269 5 -97 -60 -221 127 116
7461A16j88N7o8J36o1J9r7R6m2J72k31M1k5k20K47Q8n7N6j83O4P2Qj80K55k97
$$ 116 -72 -15 -83 53 -8 11 -86 10 -32 140 -91 -50 -75 -295 -48 40 -17 39 -144 -80 -8 0 -180 75 -222
7486b22K69j2k55J83k03K39R6j50L7j67J66n2k8J84k26m6K92J35j63K4pq1m4k29
$$ -222 47 35 -220 -37 -240 -1 95 -55 -18 -185 -19 -71 -99 85 -141 -187 105 240 77 101 94 13 -31 -260
7510b60K83j14K09k95K96k15O9j64J55q5J07k0mN0J59k75L91j16l67K42n0M2J61
$$ -260 23 -91 118 -177 119 -96 -27 -191 -36 -121 -14 -34 -38 12 171 -104 287 171 -196 46 -4 38 199
7533A99K59l07j71K93l90k21Q6J77j22nL30l56K53O4k85L4P9rk4P5jn3j04K17
$$ 199 458 151 -20 273 -117 -338 -252 -75 -197 -202 128 -228 25 89 -196 -162 -83 -92 -116 -41 -42 -95 -199 18
7557A8O3j9O2o8o3o2J25J51n49K92j4m7J89p5o1j32jK10k7m2K59j36j02O5o7P3
$$ 18 81 62 124 56 -7 -69 56 207 -342 -50 -64 -111 78 3 -58 -190 -191 19 -8 -50 209 73 -29 36 -31 42
7583D2Q3j09O5j11O7J78O3p3k72r1K06O3r3k23L94m05j44L11Q2J37j99o4K51j86
$$ 42 125 16 81 -30 37 215 278 205 -67 -158 48 111 18 -205 189 -216 -360 -49 33 170 -29 -93 158 -28
7607b8o8m6K30N4k82J13J67j93J9M5j93J32Q0j70J16O6r7J60k47J84o4k94K83
$$ -28 -96 -142 88 142 -140 -27 140 -53 -34 11 -182 -50 30 -140 -24 42 -55 105 -142 42 -22 -316 -33
7630c3K44k07n0P0j28J64j42N5J29J04l15j02N2p8l5J67J72mm82L87j94L08k02
$$ -33 211 4 -46 24 -104 60 -82 -27 102 206 -109 -211 -159 -237 -272 -105 67 63 -419 -32 -226 82 -120
7653a20J98j9j05O9r0m7L09j58l7J02Ko1l4j65J65j65M8J11K08l54k0K59j42R7
$$ -120 78 59 -46 23 -67 -114 195 37 0 102 104 43 9 -156 9 -156 -108 3 211 -143 -163 96 -46 51
7677E1Mj05J41J4pj24K0M16l83oq6L2j08L20l39J70M3r3K88k15j32l6Q4P1J23
$$ 51 55 -50 91 105 98 -26 -6 410 27 21 -65 -33 -141 179 -160 10 53 -40 248 33 -99 -135 -51 20 143
7702A43k24J2k20M22k35p7J21J31r8j70j29K19O3j20L13k66nQ4KJ06J81j51j8
$$ 143 -81 -69 -289 133 -102 -179 -58 73 -25 -195 -324 -105 -42 -162 151 -115 -120 -36 -34 72 253 102 84
7725H4r7R6k15J59k35o8J40Jo9J47j97N00k97O8j66L55k6k55k1K4r7K22K3l40
$$ 84 -13 83 -132 27 -208 -276 -136 -135 -204 -57 -254 246 -51 17 -149 206 180 -75 -96 -72 -169 53 76 -264
7749b64N58l87p1J68K7m18L17R5O4P2k01N2J56l63K74p2j7J8O9r6Q6k54K51j10
$$ -264 294 -93 -164 4 31 -387 -70 25 89 161 -40 12 168 -195 79 7 -10 8 77 -19 67 -187 64 -46
7773d6l7J42O4qK0j85K70k36p2L05k51r4K34o6o7j64o2L83J26l17Jp9L7P0n9j77
$$ -46 -83 59 123 115 135 -50 220 -16 -88 217 -34 -128 106 40 -27 -191 -253 130 256 -61 -60 -139 -102 -32 -91 -268
7799b68J72o8L59l75L37o2j79P5l9J4n9L5J88m35L14J51q8j56K28r3q8j22k9o1
$$ -268 -96 -164 195 -180 157 95 -84 -9 -48 -34 -93 -58 130 -305 9 160 72 -84 144 51 -37 -159 -188 -249
7823b49L2j42L30K38k85J93N6Qq5j88n6K52j22q1Q8j24J34k27K57k36J49j11K46
$$ -249 -217 -359 -29 209 -76 117 173 181 96 -92 -148 104 -18 -99 -11 -135 -1 -228 29 -207 -58 -169 77
7846G7J79k13q3M4j90R3J53J09l51K92j01j18J35J58n6j53P5j3K0L1j25L17q6
$$ 77 256 43 -40 4 -186 -93 60 169 -182 110 9 -109 26 184 128 -25 50 37 57 88 -37 280 194
7869A94k82J03J6n9k53M8L38j31J1K05l24J45j38KJ18J51k83K93k81K61l09%R7
$$ 194 -88 15 31 -28 -281 -233 105 -26 -15 190 -134 11 -127 -125 -7 144 -139 154 -127 134 -175 -175 -78
7892g8J67q0R2r9l31K98N1k09p2J26L15J10l96k8K33K9k26j11K23n5K33l60M58
$$ -78 89 9 101 2 -329 -31 20 -189 -261 -135 180 290 -106 -134 99 128 -98 -209 14 -41 192 -168 290
7915B90j99K5k16L9l4l9Q8J09N1r5j90M03q4r5M0j01j8m9K59l09mJ33j51j2J32
$$ 290 91 116 -100 -61 -95 -134 -46 63 114 19 -171 232 148 53 93 -8 -26 -75 184 -125 -129 4 -147 -159 -27
7940b7n2Kk2J89l05K52J38q2j74J65j5Q7O4r9o9p7J97l02K10R0m13J61M11j95
$$ -27 -79 -77 -99 90 -215 37 175 93 -81 84 69 156 220 121 52 -25 172 -130 80 170 -243 -82 329 134
7964A34j72J7R2J56k98J28l3J61j80j5J24Jj99Q7j98K2K10j3k0M10o51J09L33
$$ 134 -38 -21 71 227 -71 57 24 185 5 -10 114 115 -84 3 -195 -173 37 24 4 414 -237 -128 205
7987B05l88Q6j25L23kj39N3p3j02K65j99k8N8J67Q4L2l44J3j60K44K37k73K54
$$ 205 -183 -97 -222 101 99 -40 13 -60 -162 103 -96 -124 -66 101 185 217 -127 -114 -274 -30 207 -66 188
8010A88l14L56l69J39J01n2O7l04N2J13Pl40M52m37J20L21j05n3M2Q3J24n7j05
$$ 188 -126 230 -139 0 101 49 116 -188 -136 -23 -16 -356 96 -341 -221 100 -5 -58 -16 67 191 134 29
8033B9K4m2kJ51j45o7J09j18J08o4J10j82k38L47P8q6j48J19j3j14J85J11M7j94
$$ 29 53 11 9 160 15 -52 57 -61 47 -17 93 -89 -327 20 98 12 -136 -17 -30 -144 41 152 199 5
8057EK41ok52r5J19K04j05o4m8j27j63K94j24m7K37l50L12j46j98K46K20J30l54
$$ 5 246 240 -12 -107 12 216 111 47 -1 -128 -291 3 -121 -168 69 -281 31 -115 -313 -67 153 283 -71
8080g1J13N5o8l0n6K02k95K58J18k73k95K84K31k66o2K33l70O8J17K95k60l1N
$$ -71 42 97 29 -1 -57 145 -150 108 226 -47 -342 -58 173 -93 -155 78 -292 -224 -107 188 -72 -103 -98
8103i8KJ76J32K5m51N69l18M5j81P0J07k18R3J06j14J1R7J34l44L4J89o2j83J34
$$ -98 -96 80 212 237 -214 355 37 82 -99 -29 78 -140 -47 59 -55 -44 53 187 -157 -123 66 4 -179 -45
8127d5L6o9L23r3j3k37K80ol05J74N3k65J72r7j5O3M5P6pJ26k73K08k8j33L07
$$ -45 -9 -78 245 152 139 -98 182 176 -129 45 98 -167 5 -92 -107 -44 1 77 70 196 -77 131 103 -30 277
8152B77j74j39j99N91l00j01J80m3o3j34Q5oo9L6j81L95l91P0N4J55k29M58l34
$$ 277 103 -36 -235 356 56 -45 135 92 29 -105 -20 -26 -95 -59 -240 155 -236 -166 -112 43 -186 272 -62
8175f2J24J19j33M9j41L8O8j97J59L9p9p4j88K69r1J85
$$ -62 62 181 48 97 -44 -6 62 -135 24 63 -16 -90 -278 -9 -100 85
8191H5
$$ Imaginary data points
##PAGE= N=2
##DATA TABLE= (X++(I..I)), XYDATA
0@%%%%%%%%%%%%%qJ6j6J6j6K4l2L2m0M8n6P1q1R0j05J23j42J64j86K11k40K71
$$ 0 0 0 0 0 0 0 0 0 0 0 0 0 0 -8 8 -8 8 -8 16 -16 16 -24 24 -32 39 -42 48 -57 66 -76 88 -98 113 -127 144
35A44l05L41l82M27m77N32n91O55p25Q04q90R83j082J191j313J444j590J755j939
$$ 144 -161 180 -202 225 -252 280 -311 344 -381 423 -467 516 -566 625 -688 756 -834 921 -1018
54a018K142k370K630k928L277l690M185m790N553o551P916r900J3068j8940L3397
$$ -1018 1124 -1246 1384 -1544 1733 -1957 2228 -2562 2991 -3560 4356 -5544 7524 -11416 21981
69B1981j34397k16031K68987K38223q4477j84086Q5155J04521m6803p0679M274
$$ 21981 -112416 -328447 -59460 178763 94286 -89800 -4645 99876 53073 -17606 -13332
80a3332J3634L20J0413K3242m7270l4177M1850J7193m6481j5243O1811N6622o0594
$$ -13332 302 622 11035 34277 -12993 -47170 -5320 11873 -34608 -49851 11960 68582 7988
93G988o3118L2278K8683k3977j4015L5767N1453j0889k0391J1015l0982m6471
$$ 7988 -55130 -22852 5831 -18146 -32161 3606 55059 44170 23779 34794 3812 -42659
105d2659J9000N0927O240n0303j0933L5595k0877l9007K2989L3092l48M91L7935
$$ -42659 -23659 27268 33508 -16795 -27728 7867 -13010 -52017 -29028 4064 3716 4207 42142
118D2142N971q4312l7107Q1405N9872l9225n8569J5069N2894q052l9370j1457
$$ 42142 48113 -36199 -73306 8099 67971 28746 -29823 -14754 38140 30088 -9282 -20739
130b0739L257J6224J3857o161j1700j2474r52J987j1142J1469L2032J7236j126
$$ -20739 -17482 -1258 12599 6438 -5262 -17736 -18688 -16701 -27843 -16374 15658 32894 31768
143C1768k2231j6533P860M398l061p571n92K0431N538k0631j7428m572J5718J3878
$$ 31768 9537 -6996 864 5262 2201 -5370 -5962 14469 20007 -624 -18052 -22624 -6906 6972
157F972q252p056J07L678L557r724k009J5512J6360J6335j81k0112j7812j1605
$$ 6972 -1280 -8336 -8229 -4551 -994 -10718 -12727 2785 19145 35480 35299 15187 -2625 -14230
171a4230j694J724m125N077Q907N754O544r638j4022J0674K4897Q260k3710j6715
$$ -14230 -15924 -14200 -18325 -13248 -4341 1413 7957 -1681 -15703 -5029 19868 28128 4418 -12297
185a2297K0148Q785k5863j6973J1906J9829L975J770R591j4089k7480J098J5687
$$ -12297 7851 16636 -9227 -26200 -14294 5535 9510 11280 20871 6782 -20698 -19600 -3913
198c913L451m995P097J3464j5391k3533J0643K4173N891r436l693J1632J267j2746
$$ -3913 -462 -5457 1640 15104 -287 -23820 -13177 10996 16887 7451 3758 15390 16657 3911
212C911r920j1441k515J6614J7580j608k2277r535J8881O468j7530p525J6450
$$ 3911 -6009 -17450 -19965 -3351 14229 12621 -9656 -19191 -310 6158 -11372 -18897 -2447
225b447K0285l632j4942l98K564L53P713M851m716n153L703l70k6925k3352J7838
$$ -2447 17838 14206 -736 -1134 1430 1783 9496 14347 9631 4478 8181 7811 -19114 -42466 -24628
240b4628L0955N675j3015n68J2379m434j2745L413J0257K943n033n501m269n597
$$ -24628 6327 12002 -1013 -1581 10798 6364 -6381 -2968 7289 10232 5199 -302 -4571 -10168
254a0168N036J5548j468j5257o42K0233J2324j9579k7777l026J3260J0939M965
$$ -10168 -5132 10416 8948 -6309 -6951 13282 25606 6027 -21750 -24776 -11516 -577 4388
267D388j634l073k020L973M651r477o806J3151J5189m549j7928m352J0028r85
$$ 4388 2754 -319 -2339 1634 6285 -3192 -9998 3153 18342 13793 -4135 -8487 1541 556
281E56q178N299J1529L846o320r474q303n901P184J4471j927j1191L180J3987
$$ 556 -7622 -2323 9206 13052 6732 -2742 -11045 -16946 -9762 4709 2782 -8409 -5229 8758
295H758K438j4809p050J2603J0275k363o476m375j132l82j35j977l823P329J7694
$$ 8758 11196 -3613 -10663 1940 12215 9852 3376 -999 -2131 -2513 -2648 -4625 -8448 -1119 16575
310A6575L828j6975j8375R38J1482J070n619J669N858K843l602m756j23O045J1940
$$ 16575 20403 3428 -14947 -14009 -2527 -1457 -7076 -5407 451 3294 -308 -5064 -5187 858 12798
325A2798N908j0269j1116K529N476o101j1609K951J5868N572q879j0193m564L583
$$ 12798 18706 8437 -2679 -150 5326 -775 -12384 -9433 6435 12007 3128 -7065 -11629 -8046
339h046N475l61n353J03J3517J0980q785j4407R54J2494O480n443l996R18k407
$$ -8046 -2571 -2932 -8285 -8182 5335 16315 7530 -6877 -5923 6571 13051 7608 3612 4530 2123
354B123n024n102l373K433R013Q518k205j1588l799N122K834l533m75Q399P135
$$ 2123 -2901 -8003 -11376 -8943 70 8588 6383 -5205 -9004 -3882 -1048 -4581 -5056 3343 10478
369A0478l091p217l863O95O491O472q79p701l890N445J574j1562r232M784J2072
$$ 10478 7387 170 -3693 -2998 3493 9965 9086 1385 -2505 2940 4514 -7048 -16280 -11496 576
384E76M315k999k178q84j971J191J904r96L047R333L464j1479j4111L028J2662
$$ 576 4891 1892 -286 -1170 -3141 -1950 -46 -1042 2005 11338 14802 3323 -10788 -7760 4902
399D902J101p174j141O297O55r420q632j34P214J1602N517m197o887M24M453k158
$$ 4902 6003 -1171 -2312 3985 4640 -4780 -13412 -13546 -6332 5270 10787 6590 -297 127 4580 2422
415B422p489P24R317M578p468r498p45M337L099J300M28J012L537J692o243j1420
$$ 2422 -5067 -4343 4974 9552 2084 -7414 -8159 -3822 -723 577 1005 2017 5554 7246 1003 -10417
431a0417k577J0877J0497r18n273j99J414l244m711l28K870N259O089l081j2629
$$ -10417 -12994 -2117 8380 7462 2189 1990 3404 160 -4551 -4879 -2009 3250 9339 6258 -6371
446f371p955P891J0994j690p397K964R458R48r841q488J694R638Q443N85p778
$$ -6371 -14326 -6435 4559 2869 -4528 -1564 7894 8842 -999 -9487 -7793 1845 10288 10873 3095
461C095n269K966J222o148n217M394P706j144o159j124K473J542J041K110K476
$$ 3095 -2174 792 2014 -4134 -9351 -4957 2749 1605 -4554 -5678 -3205 -1663 -622 1488 3964
476C964K807L999k9j1273j0151M341J0597M01q014k43P519R5p017l238J794K477
$$ 3964 6771 10770 10741 -532 -10683 -6342 4255 4656 -3358 -3601 3918 4013 -3004 -6242 -4448 -1971
492a971L498L763m415j0546l10J0861M219o705j8J0979N033p806o884P25r47k134
$$ -1971 1527 5290 875 -9671 -9981 880 5099 -1606 -1624 9355 14388 6582 -302 423 -524 -2658
508b658J960R11n089n74Q286P82j3070m852J2988R794o221o035N893L216p133
$$ -2658 -698 213 -4876 -5450 2836 3618 -9452 -14304 -1316 8478 2257 -3778 2115 5331 -1802
523a802k963O010M098R39M510M53j3341j1036Q261J2185o503j1994M562J1230
$$ -1802 -4765 1245 5343 6282 10792 11245 -2096 -13132 -4871 7314 811 -11183 -6621 4609
537D609j970q890Q56M761j504n32O904J342o283l21O266k709r777M573J6046K629
$$ 4609 2639 -6251 -5395 -634 -2138 -2670 4234 5576 -707 -1028 5238 2529 -7248 -2675 13371 16000
553A6000j2955p053L252k491o230J861N532j068l54M597n71r434J312J5495O837
$$ 16000 3045 -4008 -756 -3247 -9477 -7616 -2084 -3152 -3506 1091 520 -8914 -7602 7893 14730
568A4730r435o644N182J756p579m740M059L727L6K792K316n037n317K360J297
$$ 14730 5295 -1349 3833 5589 -1990 -6730 -2671 1056 1092 3884 6200 1163 -4154 -1794 -497
583d97n678k824Q428O563n296p714M79N770L310K432L628K19l979l253l057l974
$$ -497 -6175 -8999 -571 5992 696 -7018 -6539 -769 2541 4973 8601 8820 4841 1588 -1469 -5443
599e443j413O725N862l021p148k53M660J031k822k125j21L890N215M39p001m782
$$ -5443 -6856 -131 5731 2710 -4438 -4691 -31 1000 -1822 -3947 -4068 -178 5037 5476 -1525 -6307
615f307N080N823j108k327L192K606m763p031l427M27M894P084K033n920m530
$$ -6307 -1227 4596 3488 1161 4353 6959 2196 -4835 -8262 -7835 -2941 4143 6176 256 -4274
630d274L598L820l678k753M233L839l658l798O83R1n95K794L667k058j799N212
$$ -4274 -676 3144 -534 -3287 946 4785 1127 -2671 -1988 -1897 -2492 302 3969 1911 112 5324
646E324L177q617j1150J287Q992K679k458K045L028k834l923J437K874Q67J988
$$ 5324 8501 -116 -11266 -9979 -987 1692 -766 1279 4307 1473 -2450 -1013 1861 2728 4716
661D716K480n966j0020o2Q167J882n910J609Q960J830o629m394J426N2R17L267
$$ 4716 7196 1230 -8790 -8852 -685 1197 -4713 -3104 5856 7686 1057 -3337 -1911 -1859 -942 2325
677B325k80m479R18P278m86j0033l017R904P268n190o769k24j45l296o73M402
$$ 2325 2045 -2434 -1516 5762 5276 -4757 -7774 2130 9398 4208 -2561 -2785 -2930 -6226 -6899 -2497
693b497M402K577J378k704o787k331O616N588l077n086R45M610j243m977m01K561
$$ -2497 1905 4482 5860 3156 -3631 -5962 654 6242 3165 -1921 -976 3634 2391 -2586 -2987 -426
709d26K315j63q68j448j863j24j04k158j898M634Q524K693n594n723o84L271K694
$$ -426 1889 1726 858 -590 -2453 -2577 -2681 -4839 -6737 -2103 6421 9114 3520 -2203 -2887 384 3078
726C078L50j398r20k42j581k415j263J947M139J785j750l835j051K285L9l879
$$ 3078 3428 2030 1110 868 -713 -3128 -4391 -2444 1695 3480 1730 -2105 -3156 -871 -832 -4711
742d711j855N470P290j80n547j178L623M87k478j472J885J365J18j699n459m847
$$ -4711 -6566 -1096 6194 6014 467 -711 2912 3399 921 -551 1334 2699 2817 1118 -4341 -9188
758i188L812Q431J462n218k435L754Q68m661k519L589M004J543M97n05l116j272
$$ -9188 -5376 3055 4517 -701 -3136 618 1486 -3175 -5694 -2105 1899 3442 3939 3434 318 -954
774i54K868J816l121j802L463J267n238n171K163L644k93p12K441K257j099j479
$$ -954 1914 3730 609 -1193 2270 3537 -1701 -6872 -4709 -1065 -1358 -2070 371 2628 1529 50
790E0j279k509p33O215O752k852p616Q6M821J64l998o08L664J143k769k932k528
$$ 50 -1229 -3738 -4471 1744 8496 5644 -1972 -1886 2935 3099 -899 -1507 2157 3300 531 -2401 -4929
807d929j086K772M259k94l118J284N295R0n769l361L714N040J296j958k401j613
$$ -4929 -6015 -3243 1016 722 -2396 -1112 4183 4273 -1496 -4857 -1143 3897 5193 3235 834 -779
823g79N62O19o30j132J420K585p67m461k992J692L091P02p32O55K412J275j404
$$ -779 -217 402 -228 -1360 60 2645 1878 -2583 -5575 -3883 -792 -90 -822 -167 2245 3520 2116
840B116k997j660K243L493Q37k741j824J041N31k093j984J313L007J142k097m007
$$ 2116 -881 -2541 -298 3195 4032 1291 -533 508 1039 -1054 -3038 -1725 1282 2424 327 -3680
856c680r50L141K731j325k862J981N187J751m556m464P27K912J717j11k132j574
$$ -3680 -4630 -1489 1242 -83 -2945 -964 4223 5974 1418 -3046 -2319 593 2310 2199 67 -1507
872a507O79J822j039l102N36M028J810k579k371N33J144j088m10J585J476P20
$$ -1507 -828 994 -45 -3147 -2611 1417 3227 648 -1723 -1190 -46 -1134 -1544 41 1517 2237
888B237Q82q24l282k025K476J886r64k229K157J765j984l462O2L539K750Q6j786
$$ 2237 3119 2295 -987 -3012 -536 1350 386 -1843 314 2079 95 -3367 -3305 234 2984 3070 1284
905A284k005q94K073J053k514k998K604N456R21n450l900J060L158N70p00J01
$$ 1284 -721 -1615 458 1511 -1003 -4001 -1397 4059 4980 -470 -4370 -3310 -152 418 -282 -181
921a81R8P09M10j623k147J290M802J472l358k708J373J126k750k293J921K993
$$ -181 -83 626 1036 -587 -2734 -1444 3358 4830 1472 -1236 137 1263 -1487 -3780 -1859 1134
937A134Q03j182j765j229l11J041R37k01N53K897R33l537k973J780M382J432k343
$$ 1134 1937 755 -1010 -2239 -2550 -1509 -572 -773 -220 2677 3610 73 -2900 -1120 3262 4694 2351
954B351k031l19K29o63k348j840K20L491L228j054l497m41L005J025j557J59J901
$$ 2351 320 1 230 -433 -2781 -4621 -4401 -910 2318 1264 -2233 -2674 331 1356 -201 -42 1859
971A859J420j161j527k061j93K753K833r73l576q73K576j47m324k384J873L766
$$ 1859 3279 2118 591 -1470 -1663 1090 3923 2950 -626 -1499 1077 930 -3394 -5778 -3905 -139
987a39O97n58r07m82R76J749P81r37Q62K483n04m203k554J860K446r87j665M5
$$ -139 558 0 -907 -1389 -413 1336 2117 1180 2042 4525 4021 -182 -2736 -876 1570 583 -1082 -1037
1005a037P27K37j255k027j463J907M302J768k867k100K328K574j382k484J298
$$ -1037 -310 -73 -1328 -3355 -4818 -2911 1391 3159 292 -1808 520 3094 1712 -772 526
1020E26L283j92k085k638j298O46K353J009k411k033K282K868k387m760j89L986
$$ 526 3809 3617 1532 -1106 -2404 -1758 595 1604 -807 -2840 -558 2310 -77 -4837 -5026 -1040
1036a040K285n97m06J381J69o35oj83P19K095j2l266l786m9K276L03j425J9K298
$$ -1040 1245 648 242 1623 1792 1157 1151 968 1687 3782 3770 504 -3282 -3331 -1055 -752 -2177 -2158 140
1055A40J496r90j016j224Q7J318K123p57k056J25K401M51k821j256K324K977O24
$$ 140 1636 646 -370 -1594 -1507 -189 1934 1177 -879 -754 1647 2098 -723 -1979 345 3322 3946
1072C946k391l083j689J168K128o41j986J181K690M64k340j828J534K297M57o05
$$ 3946 1555 -1528 -3217 -2049 79 -562 -2548 -1367 1323 1787 -553 -2381 -847 1450 1907 1302
1088A302o83p46P14K40j533j391J798K597k54k860j205J904M84j745r15J155K156
$$ 1302 619 -127 587 827 -706 -2097 -299 2298 2044 -816 -2021 -117 367 -1378 -2293 -1138 1018
1105A018J027k9j810k231J098K127L10j904L1J879n76k894j418K620K620K05n69
$$ 1018 2045 2016 206 -2025 -927 1200 1510 -394 -363 1516 940 -1954 -3372 -752 1868 2073 1504
1122A504j288j814N33J806o5k626j000L166K329j198j767O77M31r01o43J320M51
$$ 1504 216 -1598 -1065 741 676 -1950 -2950 216 2545 1347 -420 257 688 -213 -856 464 915
1139I15m35k75j413k259j67L803L551j435k737P34J194r19j573O50J178R8n88
$$ 915 480 205 -1208 -3467 -3634 169 3720 2285 -452 282 1476 557 -1016 -366 812 910 322
1156C22o10j058o75K104J335k263j669K310L180j692l210n01J290J342O95O81
$$ 322 -288 -1346 -2021 83 1418 -845 -2514 -204 2976 1284 -1926 -2427 -1137 205 900 1581
1172A581m72l89P88j39k446j643K536K954k92l456j343J80Q55Q56M43j40m75P40
$$ 1581 1109 720 1508 1369 -1077 -2720 -184 2770 2478 -978 -2321 -2141 -1286 -430 13 -127 -602 138
1190A38M19j548j089K264K292j248j721J395J693k84k203j111j66K34J015Q79
$$ 138 557 -991 -2080 184 2476 1228 -493 902 2595 2311 108 -1003 -1169 -935 80 959
1206I59j517j441K33J207j097j219K867L502q51l601j187J687J128J186M51j084
$$ 959 -558 -1999 -1766 -559 -1656 -2875 -8 3494 2643 -958 -2145 -458 670 1856 2307 1223
1222A223j978Q28K564j177l314l5K602o77k059J83K048q10j555Q0J014J94J403
$$ 1223 -755 73 2637 1460 -1854 -1889 713 36 -2023 -1840 208 -602 -2157 -2077 -1063 -869 534
1239E34L360o51m327j220L331J298k159l85K672m7l291j317J048L27J67R23l26
$$ 534 3894 3243 -1084 -2304 1027 2325 166 -219 2453 2406 -885 -2202 -1154 -827 -660 263 -63
1256f3k297o04L292J067l214j399L689K918j909j480J499K83j464p06R98l93j33
$$ -63 -2360 -2964 328 1395 -1819 -3218 471 3389 1480 0 1499 1782 318 -388 610 217 84
1273H4J785M76l566l587K418L582n74k145Q05J608j769j164J098J480n6R96J482
$$ 84 1869 2345 -1221 -4808 -2390 1192 618 -1527 -722 886 -883 -2047 -949 531 475 1471 2953
1290B953j940k384R93K798r41l068N48K139K23k416m8Q3q22M3J973L66q64L15
$$ 2953 1013 -1371 -378 2420 1479 -1589 -1041 1098 1321 -1095 -1143 -1060 -1882 -1839 134 500 -364 -49
1308d9J448j744k317J086L787J402k645j420O05L61p44J32j97L2K46J060r97k756
$$ -49 1399 -345 -2662 -1576 2211 3613 968 -452 153 514 -230 -98 -295 -263 -17 1043 46 -2710
1326b710L91K947N36j912l65J482J394q69j348j98R4J143J559l05k175q61J633
$$ -2710 -2319 628 1164 -748 -1113 369 1763 894 -454 -652 -558 585 2144 1839 -336 -1197 436
1343D36j27j945k41K638J306j843j769O70M25Q3O19J64o93K49J609n59k375j007
$$ 436 309 -1636 -1877 761 2067 224 -1545 -875 -450 -367 252 416 -277 -28 1581 1022 -1353 -2360
1361b360K707J313j363j027P21R19q66j031k6n0L92K064O00j883j973J389J596
$$ -2360 347 1660 297 -730 -9 910 44 -987 -1013 -1063 -671 1393 1993 110 -1863 -474 1122
1378A122q46j244J001J639q31j704j43J61j78R73P67l99j129P26J204q54j964
$$ 1122 276 -968 33 1672 841 -863 -1006 -845 -1023 -50 717 318 -811 -85 1119 265 -1699
1395a699O85K821L11j953l42O98j0n26k78j62m4O53J281j606k519K36K642P85
$$ -1699 -1014 1807 2118 165 -177 521 511 -15 -293 -455 -499 154 1435 -171 -2690 -2454 188 973
1413I73j397n13J505R90r59j656L09J299M44O73l47j641k14J166k03j224j019
$$ 973 -424 -937 568 1558 599 -1057 -748 551 995 1668 1321 -320 -534 632 429 -795 -1814
1430a814J328J792j165k081o9J218M45mK08M38N36R38o20j076r65J231J792n36
$$ -1814 -486 1306 141 -1940 -2009 -791 -346 -350 -142 296 832 1770 1150 74 -891 340 2132 1596
1448A596j730n09Q14r9j123l59M07P40L01K63q36j049N12J243L41n14j19J554
$$ 1596 -134 -643 171 72 -1051 -1410 -1003 -263 38 301 -535 -1584 -1072 171 512 -2 -121 1433
1466A433N77j116r58K0R42Q2j43o10n51n8n60k04o52mJ173J180m31j052k8J410
$$ 1433 2010 894 -64 -44 898 980 837 227 -324 -382 -942 -1146 -1798 -1802 -629 551 120 -932 -960 450
1486D50K11n97j05J036P02M9r43j004m00R04M16n06j023m94J193j48j302o52J154
$$ 450 661 64 -41 995 1697 1746 803 -201 -601 303 719 213 -810 -1304 -111 -259 -1561 -2213 -1059
1505a059J380L18o16n61K28R60K39o24p71J200J413O3k050r30N53R94l28j060
$$ -1059 321 639 23 -538 -310 650 889 265 -506 694 2107 2170 120 -810 -257 737 409 -651
1523f51k76N60p2o58m55j14J294R23K20n73R8O97j66n83o55M17J052J45n44r06
$$ -651 -927 -367 -439 -1097 -1552 -1666 -372 551 771 198 296 993 827 244 -411 6 1058 1203 659 -247
1543b47m23k0N29K20o92J92P91j74q25r30L20R26P83j04k47J45m2M56L0r72O7
$$ -247 -670 -690 -161 59 -633 -441 350 176 -649 -1579 -1259 -333 450 346 99 244 202 658 688 -284 -217
1564b17N93R92m42j312r35Q60R6j74m9M02N27Mm40p39J4J041P68l51o69L36M99
$$ -217 376 1368 926 -386 -1321 -461 -365 -539 -588 -186 341 345 -95 -834 -820 221 989 638 -31 305 804
1585H04l59q39q40P25J608k01j050n13N18L15j25r44M09J059N98o31j092q37P25
$$ 804 445 -394 -1234 -509 1099 898 -152 -665 -147 168 43 -901 -492 567 1165 534 -558 -1395 -670
1604f70J439J68j070n30R40M44n66q47p7N76M87J11k2o40n8K35J72k43m7J103
$$ -670 769 937 -133 -663 277 721 155 -692 -769 -193 294 405 383 -257 -315 -80 92 -151 -198 905
1624I05M93m80j177m23O92k57p7J28N5kO8j82n44n06J252J283j2j239l8R12j79
$$ 905 1398 918 -259 -682 10 -247 -324 -196 -141 -143 -75 -257 -801 -1307 -55 1228 1216 -23 -61 851 672
1645F72r00k64Q44L50N0l12q25p12N36O45j42j128M04J696Kj875p26Q54J211K81
$$ 672 -228 -492 352 702 752 440 -385 -1097 -561 84 -58 -1186 -782 914 916 -959 -1685 -831 380 661
1665F61K54k02l51n24Q76l13p91O25J042k01j943r55J283M96n68m58M03J76J29
$$ 661 915 713 362 -162 714 401 -390 235 1277 1076 -867 -1822 -539 -43 -611 -1069 -666 -490 -361
1684c61P19J16j185j39J518Q63j063n24J540K49j923j479J223J127j09n04k87
$$ -361 358 474 -711 -850 668 1531 468 -56 1484 1733 -190 -1669 -446 681 572 68 -219
1701b19j187m72J355J121j101j054J327J634j435j164R24J253k61n62P23p4n7
$$ -219 -1406 -1878 -523 598 -503 -1557 -230 1404 -31 -1195 -271 982 721 159 882 808 751
1718G51j46O06j075k020J029J861o39j420M32Q06j180q50Q26J667k0k41N63l01
$$ 751 605 1211 136 -1884 -855 1006 367 -1053 -621 185 -995 -1845 -1019 648 628 387 950 649
1736F49j374P06J881j84j868q5J588l24k160j52J623j99j164j32N48L2J14J035
$$ 649 -725 -19 1862 1678 -190 -275 1313 989 -1171 -1323 300 101 -1063 -1195 -647 -615 -501 534
1754E34l24j627l4K941R83j795j317R43L99j078J56J634l70r63q5k55j067j58
$$ 534 210 -1417 -1451 1490 2473 678 -639 304 703 -375 -219 1415 1045 82 -3 -258 -1325 -1483
1772a483J888O79j744j279J302J416j169n63J376K87q34J8J301k68j052Q57j31
$$ -1483 405 1084 -660 -1939 -637 779 -390 -953 423 710 -124 -106 1195 927 -125 732 601
1789F01j273m61K060J055k005j923N11J581l29J25L70j89r92N86O03m98m82J357
$$ 601 -672 -1133 927 1982 -23 -1946 -1435 146 -183 -58 312 123 -869 -283 320 -178 -660 697
1807F97J099j377j464P57J455o37q96K27L40n54L21O28m70j724P77J372k00j270
$$ 697 1796 419 -1045 -288 1167 530 -366 -139 201 -353 -32 596 126 -1598 -821 551 351 -919
1825i19Q14J357n95j702J50J191r2q7Q79k53j494k60J236J89j263O18J508n21
$$ -919 -105 1252 657 -1045 -895 296 204 117 996 743 -751 -1011 225 414 -849 -231 1277 756
1843G56j652q2J733J47j135Q0L79m74J67Q48m44j142l94J688L13j419K9J271K27
$$ 756 -896 -978 755 902 -233 -153 226 -248 -81 767 323 -819 -1213 475 788 -631 -602 669 896
1862H96j521r98J611R50j80k76J17j331j42J238Q10j008q85J054L63j005p68Q02
$$ 896 -625 -1623 -12 938 758 482 599 -732 -874 364 1174 166 -719 335 698 -307 -1075 -273
1880b73N53r35j39P19K42n18M41K10n80n79J172J193n11j073J7L31l59n01N56
$$ -273 280 -655 -794 -75 167 -351 90 300 -280 -859 313 1506 995 -78 -61 270 -89 -590 -34
1899c4L70K1l13m63m62k76L37J332n80m61K43P70K39n13n74N08Q47n0l3k73q75
$$ -34 336 357 44 -419 -881 -1157 -820 512 -68 -529 -286 484 723 210 -364 144 991 941 908 635 -240
1920b40K16J30k64n92K28M48R8n52o24L31K63L23o7O61K1J92p8l85l24K62J119
$$ -240 -24 106 -158 -750 -522 -74 24 -528 -1152 -821 -558 -235 -302 359 380 572 494 109 -215 47 1166
1941A166o9p53o65L14K23p94k17J42K69R2j16n21L2K36Q91m55M7J86J267m9l73
$$ 1166 1097 344 -321 -7 216 -578 -795 -653 -384 -292 -408 -929 -897 -661 230 -225 -178 8 1275 1226 853
1962H53q96OM39M06K65o96o77k09R9k53l02J02N59J31J36n28J00J99O84O8m56
$$ 853 -43 -37 402 808 1073 377 -300 -509 -410 -663 -965 -863 -304 -173 -37 -565 -465 -266 418 486 30
1983C0L41M73k54M3p68j96P66K13k53k81l01P1q5l45k08J8P36K70k42o44L46L75
$$ 30 371 844 590 633 -135 -331 435 648 395 114 -187 -116 -201 -546 -754 -736 0 270 28 -616 -270 105
2005A05L75n94LP25N73k73o06m89M2K54M08p73m33L07L91j42q28k26Q42O42K40
$$ 105 480 -114 -111 614 1187 914 308 -181 -139 115 523 -250 -683 -376 15 -127 -955 -1181 -339 303 543
2026E43m87l92K65M72j04l39n07J051O48o80o92m7N70m37K85k81j4L9J07j85n51
$$ 543 56 -336 -71 401 297 -42 -549 502 1150 470 -222 -269 301 -136 149 -132 -146 -107 0 -185 -736
2047g36L7L81O37j69n82K28P27k56k51k64L04L96M8l57m09n77J40R52k84n65L46
$$ -736 -699 -318 319 150 -432 -204 523 267 16 -248 56 452 500 143 -266 -843 -703 249 -35 -600 -254
2068b54P08q7o81m26M86M06P0j79n6J88q9J1l46l82K35P49M34o37n89K79K60J55
$$ -254 454 367 -314 -740 -254 152 222 43 -13 175 86 97 -249 -631 -396 353 787 150 -439 -160 100 255
2090B55n10K65K43K10J1l15n99K17L70K87o72k8K79N53m80m78n18R51K52j05k91
$$ 255 -255 10 253 463 474 159 -440 -223 147 434 -238 -266 13 566 86 -392 -910 41 293 188 -103
2111a03k60O32J20O3k48j12%P27k4j058l89M82M65n52k96L26J63j64N8o8l60M50
$$ -103 -363 269 389 452 204 92 92 819 795 -263 -652 -170 295 -257 -553 -227 -64 -228 -170 -238 -598 -148
2133a48N56K15l07m80N21K06n12o38P25O20l21j94l85j72J56J15m28j28jL72J70
$$ -148 408 623 316 -164 357 563 51 -587 138 758 437 243 -142 -314 -158 -43 -471 -599 -600 -228 -58
2154e8k27p68O00P54J53k16l34Q22k22k28r5k71M14p8J16o3r57l58P85K22p41
$$ -58 -285 -1053 -453 301 454 238 -96 726 504 276 181 -90 324 246 362 299 -658 -1016 -231 -9 -750
2175g50k74P96M89k37k38p0j43L41O98M10o27j75M90p0n47l85O90K37o70o15K23
$$ -750 -1024 -228 261 24 -214 -284 -427 -86 612 1022 395 220 710 640 93 -292 398 635 -35 -650 -427
2196d27n6L0Q5r9j88J75P16J99p40l39P81O54n89k72O42M32m17o64k25j37L65
$$ -427 -483 -453 -368 -467 -655 -480 236 435 -305 -644 137 791 202 -70 572 1004 587 -77 -302 -439 -74
2217g4kL09p56n48K23P25k45l55L76R75l45m72L09K62l91L62N71m26p75M31Q68
$$ -74 -76 233 -523 -1071 -848 -123 -368 -723 -347 628 283 -189 120 382 -9 353 924 498 -277 154 1022
2238A022p27q56m1P21j54n76L89N37m08l48m1L42j72M67J017n36j293L01J062
$$ 1022 295 -561 -602 119 -35 -611 -222 315 -93 -441 -482 -140 -312 155 1172 636 -657 -356 706
2257G06K3m90k73O07j40r81N38J43m61q7O11k19q63L03R61J31r46l26P81Q35l38
$$ 706 729 239 -34 573 433 -548 -10 133 -328 -415 196 -23 -886 -583 378 509 -437 -763 18 853 515
2278E15m11Q6k37m12M79M78n12j80O61Lj259j79Q08Q07n52p46M97L04l01K34K84
$$ 515 104 190 -47 -459 20 498 -14 -194 467 470 -789 -968 -160 647 95 -651 -154 150 -151 83 367
2299C67m74r4M85J38n94k51N58M10q99m36J005N07m37r4km76m35O93O48m78k40
$$ 367 -107 -201 284 422 -172 -423 135 545 -354 -790 215 722 285 191 189 -287 -722 -29 619 141 -99
2320i9N9N14o22n59O83P72l66p27m9K80j20n1P00k24o62K53O61k20n91L96O08
$$ -99 -40 474 -148 -707 -24 748 382 -345 -394 -114 -234 -285 415 191 -471 -218 443 223 -368 28 636
2341F36n76n98M08Q66l66k80k16j70m51M80R43l7j101m08P08M98r38M96O08mn14
$$ 636 60 -538 -130 736 370 90 -126 -296 -747 -267 676 639 -462 -870 -162 336 -602 -106 502 498 -16
2362a6K7J43j09K62L01j56p80l59J171k52n59j88K34K86m42Q5P89k04l15l6r6
$$ -16 11 154 45 307 608 452 -328 -687 484 232 -327 -515 -281 5 -437 -352 437 233 -82 -118 -214
2383b14k00Q18N20o8p96n59P32O3l71k27M69O6o00k06K37j64J23M56l95n21K04
$$ -214 -414 404 924 856 60 -499 233 296 -75 -302 167 233 -367 -573 -336 -500 -377 79 -316 -837 -633
2404f33Q57N37m38k36l13O99J14l5K48o05m13L9J40l00R6M99K0q82n23L45Q49
$$ -633 224 761 323 87 -226 473 587 552 800 195 -218 -179 -39 -339 -243 256 276 -606 -1129 -784 65
2425F5l33K69j18O1j79M77L22k61l69O18K45p85j86N98O5l63r60K22N48j03j60
$$ 65 -268 1 -117 -56 -235 242 564 303 -66 552 797 12 -174 424 489 126 -834 -612 -64 -167 -327
2446c27K39n24r5J80P17q9l58R13K94k09q63J28N12K36l80k96j41m36J11L38n01
$$ -327 -88 -612 -707 -527 190 101 -257 656 950 741 -122 6 518 754 374 78 -63 -499 -388 -50 -551
2467e51K5K48M39m01m92J09P48k15J5j54N43J81J31j80l55o6K97J87j50l84rM01
$$ -551 -526 -278 161 -240 -732 -623 125 -90 -75 -229 314 495 626 446 91 25 322 509 359 -25 -34 367
2489C67n07n57K40Q6M68j50j05P2J9j90N03J86n33Q3M16K54l85l13J2Q6k22l3
$$ 367 -140 -697 -457 -371 97 -53 -158 -86 -67 -257 246 432 -101 -18 398 652 267 -46 -34 52 -170 -203
2511b03LJ84k96M0Oj25M7M64j6j7l00L21n7r2N0K29O4k21J94k65m65J85L70K54
$$ -203 -200 -16 -312 -272 -266 -391 -344 120 104 87 -213 108 51 -41 9 238 302 81 275 10 -455 -270 100 354
2535C54o78k11O59P4n3q23N97j37K36M39m25J02j1K76j15n24r6O93j89r8l07o6
$$ 354 -324 -535 124 198 145 -678 -81 -218 18 457 32 134 123 399 284 -240 -336 357 168 70 -237 -303
2557c03L09j42L43P0j86O6K5J38m17k58M73J22k65k80J57K79j07l14q7M36j5j32
$$ -303 6 -136 207 277 91 157 182 320 -97 -355 118 240 -25 -305 -148 131 24 -290 -377 59 44 -88
2579h8j15J96l16K66K90j52q2n0M65Q7m54l7K16k36J46p9J91n21k21P57p28M1
$$ -88 -203 -7 -323 -57 233 81 -1 -51 414 501 47 10 226 -10 136 57 248 -273 -494 263 -465 -424
2601d24J73J61K93n0l63K48J74J66j02R8j39J54R7m28m5l40N26j93j51j55J44
$$ -424 -251 -90 203 153 -210 38 212 378 276 374 235 389 486 58 13 -327 199 6 -145 -300 -156
2622a56L74m31l60J35M85m7M10l58K1J4N18k22k08r5J48O30o71l82k63k6M66j69
$$ -156 218 -213 -573 -438 47 0 410 52 73 87 605 383 175 80 228 858 187 -195 -458 -484 -18 -187
2644a87m04K14K72j09j50j51J15K01O70J35l16j38K17J26k16j57j36M01j18k41
$$ -187 -591 -377 -105 -214 -364 -515 -400 -199 471 606 290 152 369 495 279 122 -14 387 269 28
2664B8k93j24j31J89L76k85j13M93r9k66q9K07L82Q5k19K74j05K7j9k42l06K64
$$ 28 -265 -389 -520 -331 45 -240 -353 140 41 -225 -314 -107 275 360 141 415 310 337 318 76 -230 34
2686C4J63Q2k82o33K28Q2J33l12j62M77K06q7K10l70J99L10n9J14r8m8M02k93
$$ 34 197 279 -3 -636 -408 -326 -193 -505 -667 -190 16 -71 139 -231 -32 278 219 333 235 187 589 296
2708B96l19j92K12J68j87m63J36j54pM88l6l46K14N63l21K6J0J88j95J79k92K11
$$ 296 -23 -215 -3 165 -22 -485 -349 -503 -510 -22 -58 -404 -190 373 52 78 88 276 81 260 -32 179
2730A79J91m19Q7j94j72K63L72k34m40M9J94Jj86m6M30K98o4Q1k02k20L04K80
$$ 179 370 -49 38 -156 -328 -65 307 73 -367 -318 -124 -123 -309 -355 75 373 309 390 188 -32 272 552
2752E52l99j64n8J88J06l74j73J07K29r3K07k88J65L4o6J2k81L79K79n5m24j26
$$ 552 153 -11 -69 119 225 -149 -322 -215 14 -79 128 -160 5 39 -27 -15 -296 83 362 307 -117 -243
2774b43J34K19m6k29L31j82J5K4O0j51L2K39l7l60K06K46L11o88j3M9J29K15k70
$$ -243 -109 110 64 -165 166 -16 -1 23 83 -68 -36 203 166 -194 12 258 569 -119 -132 -83 46 261 -9
2797iO2j94k33N03J3o77J83K60L04k93l97K73K51J15P4Pl33L3J54L51p17K5J28
$$ -9 53 -141 -374 129 142 -535 -352 -92 212 -81 -478 -205 46 161 235 242 -91 -58 96 447 -270 -245 -117
2820a17J12k69k32L81J56k27j27J72m5R7K53N75p22k44L37L33m43q5M05K15l12
$$ -117 -5 -274 -506 -125 31 -196 -323 -151 -196 -99 154 729 7 -237 100 433 -10 -95 310 525 213
2841B13o19K82N2q7Q3l1m44K89J15M73k12k06m8J16P8K01J26n9j26j89J45j23
$$ 213 -406 -124 -72 -159 -76 -107 -551 -262 -147 326 114 -92 -140 -24 54 255 381 322 196 7 152 29
2863B9k97N55K60p80k50J3M67nj99K34Q9l24j67M33N32j11m8O3k49l48M4Q03l94
$$ 29 -268 287 547 -233 -483 -470 -3 -8 -207 27 116 -208 -375 58 590 479 431 494 245 -103 -59 744 350
2886C50n67J13J64k48k11K16R9j46r3N1K41l92O52K37L3q58K96P08J3l47J67R7
$$ 350 -217 -104 60 -188 -399 -183 -84 -230 -323 -272 -31 -423 229 466 499 -359 -63 645 658 311 478 575
2908E75q47JM90J36k92k68J79k34m89J96O26K28p55l3N18J02J04j06P6o0l35M49
$$ 575 -272 -271 219 355 63 -205 -26 -260 -749 -553 73 301 -454 -487 31 133 237 131 207 147 -188 261
2930B61L38j83n46L85o8q00J16M17J35k24k25j06L8k25P37K83l79k90P09J12k14
$$ 261 599 416 -130 255 187 -613 -497 -80 55 -169 -394 -500 -462 -687 50 333 -46 -336 373 485 271
2951B71l40N65j9n44j43L37J52l26m11M10m21l13P14M96k90q42Q38L4m46O6N79
$$ 271 -69 496 477 -67 -210 127 279 -47 -458 -48 -469 -782 -68 428 138 -704 134 168 -278 -212 367
2972C67L06n13l63J30J66n0J51J4l9m75J03L32l33l22M38K21l11k34R4M83j05
$$ 367 673 160 -203 -73 93 43 194 208 169 -306 -203 129 -204 -526 -88 133 -178 -412 -318 165 60
2993F0k52M42j91k62L33M43m60l16k49O58k77j16L61j71n7j84J02L72j66PK12
$$ 60 -192 250 59 -203 130 573 113 -203 -452 206 -71 -187 174 3 -54 -238 -136 236 70 77 289
3014B89R1q03q9O54K68p90L34P5M7j88j8L95l03j25K50k40Q3L9M08j13n55K7J82
$$ 289 380 -423 -512 142 410 -380 -46 29 76 -112 -130 265 -38 -163 87 -153 -70 -31 377 264 -291 -264 -82
3037h2M78j43k86N4J4k61L2M33l35k17M07Q5n95N4O03K9k48j40N0L16j56K3K52
$$ -82 396 253 -33 21 35 -226 -194 239 -96 -313 94 179 -416 -362 241 270 22 -118 -68 248 92 115 367
3060C67k74j64J69L47l07l08J01K02m3m64M8K43M3j18J06j77j20M76J76j90K9
$$ 367 93 -71 98 445 138 -170 -69 133 90 -374 -326 -83 -40 -158 -52 -229 -349 127 303 113 142
3081A42N2K23m2l03m30O05q6k85p1j3n1j63M26l45K31jL61j37l3o7J52j18J94
$$ 142 194 417 375 72 -358 247 161 -124 -195 -208 -259 -422 4 -341 -110 -111 250 113 80 13 165 47 241
3104B41m50N86O2j41k41k56k2J14J36k25J4k40K90M3k5k82J63L75j08l6J67j00
$$ 241 -209 377 439 298 57 -199 -221 -107 29 -196 -182 -422 -132 -89 -114 -396 -233 142 34 -2 165 65
3126F5J93j34j01O0m1L20N8j72l80J89k04M1r5J9j32L69m2m30O56l29L36J33o5
$$ 65 258 124 23 83 42 362 420 248 -132 57 -147 -106 -201 -182 -314 55 13 -417 239 -90 246 379 314
3149C14l48L96J41j31l85P3L44j30l31l54K57M9o9k28J90J95m20L13j16rj63N68
$$ 314 -34 362 503 372 -13 60 404 274 -57 -411 -154 -105 -174 -402 -212 -17 -437 -124 -240 -249 -412 156
$$ [...]
8191b18
##END NTUPLES=NMR FID
##END=
