##TITLE=1H_SL90-Dau
 CDCl3,8 sc, 
 22.9.2021
##JCAMPDX= 6.0         $$ Bruker NMR JCAMP-DX V2.0
##DATA TYPE= NMR FID
##DATA CLASS= NTUPLES
##ORIGIN= UXNMR, Bruker Analytische Messtechnik GmbH
##OWNER= root
$$ XWIN-NMR		Version 3.5
$$ Wed Sep 22 09:35:16 2021 Russian Standard Time (UT+4h)  she@DPX200
##.OBSERVE FREQUENCY= 200.1314
##.OBSERVE NUCLEUS= ^1H
##.DELAY= (6, 6)
##.ACQUISITION MODE= SIMULTANEOUS
##.ACQUISITION SCHEME= undefined
##.AVERAGES= 8
##.DIGITISER RES= 18
##SPECTROMETER/DATA SYSTEM= spect
##.PULSE SEQUENCE= zg30
##.SOLVENT NAME= CDCl3
##.SHIFT REFERENCE= (INTERNAL, CDCl3, 0, 15.7039)
##AUDIT TRAIL= $$ (NUMBER, WHEN, WHO, WHERE, WHAT)
$$ ##TITLE= Audit trail, XWIN-NMR		Version 3.5
$$ ##JCAMPDX= 5.01
$$ ##ORIGIN= Bruker BioSpin GmbH
$$ ##OWNER= she
$$ F:/spectra/data/she/nmr/H-F/1/audita.txt
$$ ##AUDIT TRAIL=  $$ (NUMBER, WHEN, WHO, WHERE, WHAT)
(   1,<2021-09-22 09:33:48.03 +0400>,<she>,<DPX200>,
      <created by zg, POWCHK disabled, PULCHK disabled
       configuration hash MD5:
       00 E9 B6 7A A2 85 ED C7 34 08 36 98 17 FE 4E 26
       data hash MD5: 16K
       B3 B4 FD 1A C2 CA A0 84 FC 31 A4 B0 6D 89 E3 89>)
$$ ##END=
$$ 
$$ hash MD5
$$ 73 D5 3B 55 EE 0E 1C 70 1A 2E C2 33 BA EF 02 64
##$RELAX= 
##$RELAX= 
##$RELAX= 
##$RELAX= 
##$RELAX= 
##$RELAX= 
$$ Bruker specific parameters
$$ --------------------------
##$DU= <F:/spectra>
##$EXPNO= 1
##$NAME= <H-F>
##$PROCNO= 1
##$TYPE= <nmr>
##$USER= <she>
##$AMP= (0..31)
100 100 100 100 100 100 100 100 100 100 100 100 100 100 100 100 100 100 
100 100 100 100 100 100 100 100 100 100 100 100 100 100 
##$AQSEQ= 0
##$AQ_mod= 1
##$AUNM= <au_zg>
##$AUTOPOS= <>
##$BF1= 200.13
##$BF2= 200.13
##$BF3= 200.13
##$BF4= 200.13
##$BF5= 200.13
##$BF6= 200.13
##$BF7= 200.13
##$BF8= 200.13
##$BYTORDA= 1
##$CFDGTYP= 0
##$CFRGTYP= 5
##$CHEMSTR= <none>
##$CNST= (0..31)
1 1 145 1 1 1 1 1 1 1 1 1 1 1 1 1 1 1 1 1 1 1 1 1 1 1 1 1 1 1 1 1 
##$CPDPRG= <>
##$CPDPRG1= <>
##$CPDPRG2= <>
##$CPDPRG3= <>
##$CPDPRG4= <mlev>
##$CPDPRG5= <mlev>
##$CPDPRG6= <mlev>
##$CPDPRG7= <mlev>
##$CPDPRG8= <mlev>
##$CPDPRGB= <>
##$CPDPRGT= <>
##$D= (0..31)
0 1.2 0 0 0 0 0 0 0 0.06 0 0.03 0 0 0 0 0.0002 0 0 0 0 0 0 0 0 0 0 0 0 
0 0 0 
##$DATE= 1632288827
##$DBL= (0..7)
120 120 120 120 120 120 120 120 
##$DBP= (0..7)
150 150 150 150 150 150 150 150 
##$DBP07= 0
##$DBPNAM0= <>
##$DBPNAM1= <>
##$DBPNAM2= <>
##$DBPNAM3= <>
##$DBPNAM4= <>
##$DBPNAM5= <>
##$DBPNAM6= <>
##$DBPNAM7= <>
##$DBPOAL= (0..7)
0.5 0.5 0.5 0.5 0.5 0.5 0.5 0.5 
##$DBPOFFS= (0..7)
0 0 0 0 0 0 0 0 
##$DE= 6
##$DECBNUC= <off>
##$DECIM= 32
##$DECNUC= <off>
##$DECSTAT= 4
##$DIGMOD= 1
##$DIGTYP= 9
##$DL= (0..7)
0 120 120 120 120 120 120 120 
##$DP= (0..7)
150 150 150 150 150 150 150 150 
##$DP07= 0
##$DPNAME0= <>
##$DPNAME1= <>
##$DPNAME2= <>
##$DPNAME3= <>
##$DPNAME4= <>
##$DPNAME5= <>
##$DPNAME6= <>
##$DPNAME7= <>
##$DPOAL= (0..7)
0.5 0.5 0.5 0.5 0.5 0.5 0.5 0.5 
##$DPOFFS= (0..7)
0 0 0 0 0 0 0 0 
##$DQDMODE= 0
##$DR= 18
##$DS= 0
##$DSLIST= <SSSSSSSSSSSSSSS>
$$ [...]
##$SUBNAM2= <"">
##$SUBNAM3= <"">
##$SUBNAM4= <"">
##$SUBNAM5= <"">
##$SUBNAM6= <"">
##$SUBNAM7= <"">
##$SUBNAM8= <"">
##$SUBNAM9= <"">
##$SW= 20.0188988654967
##$SWIBOX= (0..15)
0 0 2 0 0 0 0 0 0 0 0 0 0 0 0 0 
##$SW_h= 4006.41025641026
##$TD= 16384
##$TD0= 1
##$TE= 0
##$TE2= 300
##$TE3= 300
##$TEG= 300
##$TL= (0..7)
0 120 120 120 120 120 120 120 
##$TP= (0..7)
150 150 150 150 150 150 150 150 
##$TP07= 0
##$TPNAME0= <>
##$TPNAME1= <>
##$TPNAME2= <>
##$TPNAME3= <>
##$TPNAME4= <>
##$TPNAME5= <>
##$TPNAME6= <>
##$TPNAME7= <>
##$TPOAL= (0..7)
0.5 0.5 0.5 0.5 0.5 0.5 0.5 0.5 
##$TPOFFS= (0..7)
0 0 0 0 0 0 0 0 
##$TUNHIN= 0
##$TUNHOUT= 0
##$TUNXOUT= 0
##$USERA1= <user>
##$USERA2= <user>
##$USERA3= <user>
##$USERA4= <user>
##$USERA5= <user>
##$V9= 5
##$VALIST= <valist>
##$VCLIST= <CCCCCCCCCCCCCCC>
##$VD= 0
##$VDLIST= <DDDDDDDDDDDDDDD>
##$VPLIST= <PPPPPPPPPPPPPPP>
##$VTLIST= <TTTTTTTTTTTTTTT>
##$WBST= 1024
##$WBSW= 4
##$XGAIN= (0..3)
0 0 0 0 
##$XL= 0
##$YL= 0
##$YMAX_a= 130068
##$YMIN_a= -245857
##$ZGOPTNS= <>
##$ZL1= 120
##$ZL2= 120
##$ZL3= 120
##$ZL4= 120
##$ABSF1= 10
##$ABSF2= 0
##$ABSG= 5
##$ABSL= 3
##$ALPHA= 0
##$AQORDER= 0
##$ASSFAC= 0
##$ASSFACI= 0
##$ASSFACX= 0
##$ASSWID= 0
##$AUNMP= <proc_1d>
##$AZFE= 0.1
##$AZFW= 0.1
##$BCFW= 1
##$BC_mod= 2
##$BYTORDP= 1
##$COROFFS= 0
##$CY= 11.3945322036743
##$DATMOD= 1
##$DC= 2
##$DFILT= <>
##$DTYPP= 0
##$F1P= 2.36226072786647
##$F2P= -0.459571619588291
##$FCOR= 0.5
##$FTSIZE= 0
##$FT_mod= 4
##$GAMMA= 1
##$GB= 0.15
##$INTBC= 1
##$INTSCL= 1
##$ISEN= 128
##$LB= 0.24
##$LEV0= 0
##$LPBIN= 0
##$MAXI= 10000
##$MC2= 0
##$MEAN= 0
##$ME_mod= 0
##$MI= 1.114404
##$NCOEF= 0
##$NC_proc= 0
##$NLEV= 6
##$NOISF1= 3.799351
##$NOISF2= 2.8
##$NSP= 1
##$NTH_PI= 0
##$NZP= 0
##$OFFSET= 15.70392
##$PC= 1
##$PHC0= -14081.94
##$PHC1= 20.80089
##$PH_mod= 1
##$PKNL= yes
##$PPARMOD= 0
##$PSCAL= 0
##$PSIGN= 0
##$REVERSE= no
##$SF= 200.130013532006
##$SI= 16384
##$SIGF1= 3
##$SIGF2= 2
##$SINO= 400
##$SIOLD= 16384
##$SREGLST= <1H.CDCl3>
##$SSB= 0
##$STSI= 0
##$STSR= 0
##$SW_p= 3612.71676300578
##$SYMM= 0
##$S_DEV= 0
##$TDeff= 0
##$TDoff= 0
##$TI= <>
##$TILT= no
##$TM1= 0
##$TM2= 0
##$TOPLEV= 0
##$USERP1= <user>
##$USERP2= <user>
##$USERP3= <user>
##$USERP4= <user>
##$USERP5= <user>
##$WDW= 1
##$XDIM= 8192
##$YMAX_p= 0
##$YMIN_p= 0
$$ End of Bruker specific parameters
$$ ---------------------------------
##NTUPLES= NMR FID
##VAR_NAME=  TIME,          FID/REAL,        FID/IMAG
##SYMBOL=    X,             R,               I
##VAR_TYPE=  INDEPENDENT,   DEPENDENT,       DEPENDENT
##VAR_FORM=  AFFN,          ASDF,            ASDF
##VAR_DIM=   8192,          8192,            8192
##UNITS=     SECONDS,       ARBITRARY UNITS, ARBITRARY UNITS
##FACTOR=    0.0002496,     1,               1
##FIRST=     0,             0,               0
##LAST=      2.0444736,     0,               0
##MIN=       0,             -245857,         0
##MAX=       2.0444736,     130068,          0
$$ Real data points
##PAGE= N=1
##DATA TABLE= (X++(R..R)), XYDATA
$$ [...]
1779D34k4j41k87j31O84k93J10n29L56J49M6k70k8k39J17o9Q1K40om36l58N15
1801g9J68j74j40L21o1j57j75R0J82j75K10J1k3m1l56J63n4N83j22m08k97Q06
1823B72l73K12r8J21j44n8K30m28L82M35n15k4L69j63j28j27L84r4J1m5l22J9
1845h4L03r0j70j91N96l6o30M57M02m25n53K15J80K08l69L4P6j94K07k66J03J84
1867d3K70o31L7M2O47l25j57O0k1j35J03J9K24J51j01k21j57L60qJ7j9j63Q9k42
1891b04J13J73LP2j7M1j00K5Qk4j38L64l16m30L46K8J59j11K9R3j80j36M7J34
1915b1J90J26l24k43J3L73M9Qj03k75q7L3K05j42K69l3k64K7K77j41o4J25j78
1938a80m3J53M2L18M6j35k84k2j3j35J50K2K26l0j03k59R7J91Q0o1l32L92M8k54
$$ y = [434, 410, 269, -18, -149, 535, 242, 352, -177, 179, 328, 374, 104, 76, -163, -46, -115, -34, 206, 200, -236, -594, -79, 89, -85, -225, 96, 35, -122, -297, -207, -25, -200, 10, 21, -2, -43, -399, -236, -290, 293, 171, -237, -534, 272, -101, 111, 13, 134, -10, -68, 162, -266, 116, 551, 36, 12, 381, 218, 90, -37, 347, 253, 264, 219, -103, -84, 219, 129, -41, -232, 364, 328, -302, 155, 557, 132, -421, -206, -26, 182, -187, -153, -77, -271, -64, -330, -227, -43, 227, -404, -367, -325, 322, -3, -160, -100, -121, -256, -153, -134, 90, 241, 140, -81, -238, 122, 114, 131, 112, -51, 38, -204, -91, 82, 85, 157, 140, 181, 81, 106, 114, 90, -48, 316, 0, -430, -84, -56, 103, -8, 21, 114, -66, -202, -155, -21, 169, 295, -29, -272, -259, 114, 163, 171, 68, -207, -294, -261, -56, -198, 71, 38, -226, -199, 78, -63, -127, -2, -180, -223, -70, -28, 290, 336, 201, -83, -105, -118, -253, -103, -81, 145, 115, 12, -247, -150, 41, 121, 60, -272, 120, 168, -86]
1962h6kK41J25m59K30l8J90j46k04l5O02l67o5l42K62J74j18J8o1J3J98r9j03
1985g2K37k5j39k47J85J45J50l06O0lJ73k9m11L49K41m22j26P5POp4J86J46j87
2009h1J13l67M67j14K14m60R0J65l0l1N0j88Q8J38l42K03L38k03k35j02K58J56
2031A27j5P5j04J17N1m02J4N5K19q5J7J86j71J82J5l62K76L9k62l6J03j05K02
2054A36l21L86k70J47n9l3j09j21K26O9l6J7Ko87N04K11K0j19o6R6K16j45l4k02
2078a72N4j17J42Rk6J83k3pk4j75K92l1r0k83K65p1oJ60O4j45M1j50O1P8j4mK14
2105B25k56J03P2j02k84L61k36p3R1R1p0J11r8M06j10m51K00j64J81p0k06l1M26
2128A16m6j41L27k34k2J61l00J37R4m8j55J26j25L24j70P5k88K62M9k15nK18k30
$$ y = [-86, -88, 153, 278, -181, 49, 11, 201, 55, -149, -184, 418, 51, -14, -356, -94, 80, -38, -20, -81, -68, 130, 31, -72, 165, 140, 1, -246, -61, 84, 234, -72, -12, -15, 158, 129, -282, 67, 308, -114, -240, -165, -158, -152, -226, -40, 106, -81, 32, -335, 132, 18, 232, -228, -138, 27, -3, -34, 16, -172, -84, 54, -288, -85, 253, 50, -185, -287, -29, 127, 112, 187, 83, 200, 251, -151, -137, -82, 137, 52, 69, 255, 84, 266, 281, -81, 195, 234, -28, -64, 39, -66, 136, -185, 201, -69, 78, 19, -14, -123, -244, -18, 51, 15, 32, 34, -653, -149, 62, 82, -37, -103, -7, 209, 64, 30, -172, -118, -235, -93, -84, -110, 73, 50, 43, 19, -156, 136, 105, 15, -268, -3, -74, -80, 80, 144, -1, 40, -110, -49, 29, 15, 11, 225, -31, 72, 144, 42, -242, 119, -117, -190, -99, -8, -78, 33, -65, 341, 231, -220, -20, -184, -3, -73, -279, -310, 116, 70, -71, 256, 22, 0, 161, -139, -2, 92, 44, -111, 15, -110, 214, 44, 119, -169, 93, 142, -73, -78, 140, -90]
2151i0l7L45k47r9L4l4J64K6L30m73J15r3Q1j57L9L7R2j61j26N38J19m00o7j96
2175b60L10J20j82j71J29L27m12J10J09K4k41J90Q3j72K73j95k42P0K38j1K0R0
2197B07r9q3j34J6K46k02J32Rr3J53l4j41%j06J39N3k57L84j23m1j60K68l3q4
2221A7o8J0K77j8j50J3k0J05K8o4j6j63J42k8m9K8J5r5K5L2Q3K27M1o78K33J23
2247E0M9J6L3k43J50J12j04p7N4k03J17M2l1q9K00n9Rj82J5M7ll1K21k7Nk69J16
2274h2M0K6j78K07j99J67K0OK9k47K41J31j6j81K13m7k1M7J27j34L9j76J17r8
2298C1p9P6J32k14N3L11k18k80J74o3K89l5l53L68k06K1q5Q6J06r3m9j37oM3L3
2323i5J92o5L3k14J89R2k91N1R2J5r8J78k56O2J13q8J23l8J10k75K44L96n64J6
$$ y = [-90, -127, 218, -29, -128, -94, -128, 36, 62, 392, -81, 34, -59, 22, -135, -96, -59, 33, -128, -254, 284, 403, 3, -64, -260, 50, 170, -12, -183, -54, 273, -139, -29, 80, 104, -137, 53, 136, -36, 237, 42, -200, -130, 108, 97, 117, 207, 108, 25, -109, -93, 153, -49, 83, 92, -1, 152, 118, -23, -23, -129, 10, 63, -194, 190, 67, 26, -134, 134, 101, 17, -51, -41, 236, 218, 68, 81, 61, 166, 194, 130, 114, -49, 93, 65, 16, 44, 59, -36, -11, 21, 104, 331, 372, -306, -73, 50, 99, 115, 148, -95, 55, 167, 63, -14, 40, -163, -46, -4, -35, -124, 76, 17, 26, -156, -141, -94, -97, -128, 93, 66, 71, -198, -82, -42, -16, -194, 13, -186, -19, 1, 7, 36, -211, 30, 161, 145, -36, 177, 130, 109, 156, 283, 149, 188, 12, 129, 31, -48, 28, 160, -54, -1, 310, 92, -188, -14, -77, 212, 177, -176, 192, -14, 7, -78, 8, 114, 21, -28, -165, -171, -128, -95, 97, 32, 65, -149, 40, 132, -159, -108, -16, -1, -99, 79, -177, -115, -2, -90, 33, -5, 105, -170, 74, 470, -94, -78]
2347g8J86j40K61k41J43p0r0q7OJ73n0J89j60L9k47J73K87m31J34pj20K30j75
2370g5L2K24l83N30k16oj28J25J03k96K51l41K13m0l7J5k1K75l85K37k0j30N3
2393b0j79K12j03K94l87K91j71j26O3K54j3j44L31j88p4m4J86j56j26k7J46j0
2415Il39K85M9L0j03O7R0p2L37j45m03L35J67m71R8L94j24qj43%Pl7j50J73j01
2440e5J80r9l6r8J22K40l60J71J36j97R9J01k48Q9j3j29N3Jj39K89k30o9K46r4
2464d0J07J89j58j22n8JJ83j79K92R0l49J8O6k19K12N7l32J88J77J3q6k25K21
2487D6j06k23L71J94j47J40k57k74K05M41n24R0J37j61M48m02j7K84j11l66K47
2508A5J8qL54m38j89K80O8n0m9j8r8K5J40J67j03o2L7j34M34m99K4O5J90r7k9
$$ y = [-78, 108, -32, 229, -12, 131, 61, -29, -116, -110, 63, 13, 202, 42, 81, -166, 7, 294, -137, -3, -10, -130, 100, -75, -43, 181, -202, 328, 112, 106, -22, 103, 206, -90, 161, -180, 33, -7, -44, -29, -50, 225, -160, 77, 57, -73, -20, -199, 13, -90, 204, -183, 108, -63, -189, -126, 128, 115, -29, 302, 114, 40, -4, 182, 26, -100, -127, 19, 9, -330, -45, 4, 34, -69, -2, 88, 16, 353, 208, -195, 140, 307, -164, -66, 328, 204, 196, 53, 53, 60, 23, -127, 46, -55, 125, 26, -10, -108, 14, 254, -106, 65, 201, 4, 103, 204, -44, 45, 32, -97, -44, -43, -182, 107, -123, -192, 54, -40, 67, 256, 98, -24, -82, -81, 102, -77, 215, 305, -44, -26, 40, -179, 33, 90, -242, -54, 123, 136, 50, -175, 46, -60, -283, 88, 282, 135, 275, 18, -256, -51, 390, -134, -44, 93, -68, 380, -22, -39, 245, 134, -232, 15, 33, 25, 379, -59, -248, 32, 100, 50, 1, -17, -115, -90, 50, 217, 114, 52, 89, -45, 389, -110, -86, -21, 169, 72, 43]
2533D3j66m6J53J15J80l78N3K88l04J47J01j58k48K48r4J07N5k03rQ4K53k60J85
2556A46j63l07L44r8M0M4O1J45k29M6N7n3J4L69l66m6j67L43j5K1J15l70L15l68
2580a22K15M8j60l2O2J84j10p7P4j01J15p1J79k23k70L94l6j99J29k78K73J18
2602A12q4j57j55K88o5P9J02n7L2m3J58k49L1Q1k6n9J38Q9j87J30k01K77k60N6
2626C0O6q5p9P6J06l64L13N5o7j28k10L12M2o9j35k2K20Q6r2N7k4p8J11j39q6
2651a04J60J44k42K00k27n6K67k56J17O1l48L19j66L09k01p0J19j71J67n7J93
2672A58j14j09j95J08J14L6j06Q2J51K9k97J12P4M0j64j06L11j53j46K22l2K1
2694C6M9j87r6M67k40k31K16J31k10J95q4j25K69Nj76J76J4k0J16l40O0O8K10
$$ y = [43, -123, -169, -16, 99, 279, -99, -46, 242, -62, 85, 186, 28, -220, 28, -66, 41, 96, -107, -116, -32, 221, -39, 146, -17, -324, 20, -78, -38, 6, 67, 212, -17, 29, 86, 33, 47, 416, 50, 4, -163, 180, 165, 186, 301, -69, 246, -122, 93, 141, -19, -51, 11, 195, 85, 8, 82, -19, 96, 25, 204, -19, -289, 105, 69, -130, -1, -279, -6, 112, 28, -129, -284, 4, -61, 18, 120, 63, 95, 52, 210, -39, -8, 73, 47, -12, 126, 215, 28, 158, -43, 234, -26, 30, 96, 11, -68, 8, 114, -250, 63, 118, 51, -77, -287, 25, 67, -2, -137, -159, 61, 147, 55, 112, 88, 10, 121, -18, -104, 56, 200, -42, 158, -69, -125, 142, -114, 3, 64, -284, 35, -131, 178, -23, -93, 26, -145, 22, -35, 158, 44, -65, -260, -152, -38, -2, -108, -26, 125, 154, -143, -31, 43, 83, -81, -187, 124, -29, -175, 47, 15, 36, 85, -102, -198, 269, 29, -202, 14, 145, -65, 130, 46, -79, 190, 195, 19, 195, 209, 189, 305, -35, 25, 93, 303]
2717C03l46O8J91l79K4K19n5K5k61J0K43J25K5l72N1Kj43N27k77k9J35j5kj57
2741h8K11k29J23j04O5k62j37M24K48k82J0J63Q4j16K5k83J89p2J28M1l46P7K25
2764I4k38J73j5j91M19l29J46k05J17J8O4o4K78k29k34K53L6K50k85L6l08L91
2786A77k89J94J52l77K85L9k12q1J98q0j98K86J37k50p9k1R6j7J74M4k92o1M26
2809B51j33oOJ3j68K1J18l14L04J94k13j30J77j99j0J22L9j3j55J63l80K68J68
2832A23J88m53K89l00K25P4j92k58N06k64K36k02l27J93k18M20M2j89K93l09R2
2853c1j09L5R8N3J27j69J28k58J96m3j06r3J93n9K58j22J11k58K55l61j62K24
2875i3J62l62K76QJ76k25m6kj09J99K15m86L20j02m6R1l7J21N1q0p6r8q7K66j37
$$ y = [303, -43, 25, 216, -163, -139, 80, 25, 50, -211, -201, 42, 167, 192, -180, -129, -127, -270, 257, -20, -49, 86, 71, 69, -88, 123, -106, 17, -87, -22, -284, -421, 3, 251, -31, -21, 142, 226, 110, 135, -148, 41, -31, 97, 138, -208, -131, 94, -144, 29, 14, -177, 242, -87, 59, -146, -29, -11, 53, -11, 267, 38, -196, 57, 93, 343, 58, 94, -214, 177, -112, 82, 234, -143, 142, 181, -31, -112, 86, 6, -192, 94, 231, -19, -98, -119, -23, -40, 134, 178, -114, -175, 251, 118, 112, 118, 131, -37, -16, 102, -212, 92, 286, 73, -57, 120, -79, -89, 33, 72, 59, -96, 67, -313, -45, 123, 311, -142, 147, -153, 72, 146, -46, -304, 202, -62, 174, -28, -355, -162, -380, 40, 82, -107, 186, -123, -31, -140, -105, -7, 46, 173, 4, 132, -126, 70, 27, -79, -172, 21, -38, 220, 98, 209, -49, 206, -155, -317, -93, 69, -293, -17, -9, 167, -58, -104, -106, -215, -16, 199, -287, 33, -69, -115, -24, -61, 60, 111, 31, -45, -143, -230, 36, -101]
2900a01L44k84R8k7n56N55M5j08p8N3J11j8L3l4n2J06N1k00J23J42o3j59j3j51
2924a83J00L36k74J05r7q9J89j34j10m8J72q0j40K75mj38L81j20l89L35l9l09
2946b61M65J4J9j94J37l41J13L90k90j79J70k0N8J83l97P9k22J14Q9j37J74K9
2968gj6K59k31r9J93p9P1J42j33j44K01Q4m3m7l70K48Q9J21K1o14M65p3j12l0
2992a04J55j40o3L7K42J70l19Q3o1O8k81P43o44p7J06J18j71K80j2M2j36j52K47
3015A31j37K39k02j38K38k83j07K62J73J69n34M1p7K02K5L43n02K36p3L5m5J34
3037A30j7j16j13Q9J31J8j00O9on0O5p9Q3j24K65k52o9K20J3j05L0q3r0K91k12
3062a2M3j09J25R1L9K7l30K33k65L28o9j81J5J83O0k47J90j95K0M4O6q4r0K88
$$ y = [-101, 243, -41, 57, 30, -526, 29, 74, -34, -112, -59, 52, 34, 67, 33, -19, 87, 138, -62, 61, 203, 140, -19, -32, -183, -83, 253, -21, 84, -13, -102, 87, -47, -157, -205, -33, -113, -253, 22, 18, -120, 261, 141, -248, 87, 48, -261, 204, 218, 237, 43, 180, -161, -48, 342, 52, -127, 43, 23, 81, 264, -133, -54, -276, -162, -73, -210, -36, -7, -23, 236, 5, -94, 99, 20, 91, 233, 100, -44, 157, 241, 198, 151, -219, 29, 118, 239, 260, -354, 111, 38, -74, -104, 51, -89, -152, -115, 127, 297, -22, 61, 0, 68, -213, 530, -114, -191, -85, 33, -138, 142, 130, 172, 36, -116, 131, -6, 233, 31, -107, 131, -152, -259, 3, 176, 345, -189, -148, -225, -23, 2, 345, -157, 79, 6, 41, -4, 130, 113, -3, -116, -27, 104, 122, 22, 91, 85, 35, 100, 21, 104, -20, 245, -7, -76, 144, 157, 52, 82, -1, -91, 200, -12, 31, -78, 47, 138, 177, 204, -126, 107, -158, 170, 101, -80, -65, 118, 178, -69, 121, -74, -54, -10, 56, -28, -118, 170]
3086A70l02O4j74J85p5k09L26R3l29L16k07K27k59R7o3J39j24o7JK83K3mn48J96
3110b41J91J98N9k94K09l55K72K2j8j96J57J24l68K16l8Q8N9lJ42j90L47l96q
3133b3J48o3J62k88J08N9K50l18Kj95K80p6j3n6J5j72J74n1K65l09J78n5j95J29
3157d4Q4j83K33J9k46K36j64J08j01K62l98K42j49j01K99j01J59m70L00J14m7
3178E2j68L1p1J27l5R3q8N4K04k4j36J04k58j0K01K2%k42J95l02L34m6J72k06
3202CP7jl06M73l35J01j63m0K25J55l85K81%j78L2O2K44j54k14K88l64K67q1j11
3226a24J95J45k00N8j65K17k79K6K5J45K4q9RJ93L5j08Nj41J20O6M1r8Ol48K75
3251C3K4o4J02j09j45J7N2P0J99j08j35P1J6j89K04L3k1N2j07j72K71L9o9j12
$$ y = [170, -132, -68, -242, -57, -132, -341, -15, 78, -251, 65, -142, 85, -174, -77, -140, -1, -125, -192, -191, 92, 115, 111, -437, -241, -50, 148, 207, -87, 122, -233, 39, 61, 43, -153, 4, 128, -240, -24, -62, 26, 85, 82, 224, 34, 381, -15, -23, 125, 62, 224, -64, 44, 103, 353, 35, 37, -158, 122, 46, 33, -23, -8, -180, -6, -57, 208, -101, 77, 22, -173, -44, 40, -143, 90, 109, -137, 99, -65, 43, -58, 204, -194, 48, -101, -202, 97, -4, 155, -315, -15, 99, 52, -116, -85, -156, -29, -64, 29, -59, -5, 199, 175, 39, 143, -115, -125, 76, 98, 98, -144, 51, -251, 83, 37, 209, 3, 80, 79, -227, 246, -89, 12, -151, -191, 34, 189, -196, 85, 85, -93, -61, 1, 245, 91, -123, 165, -199, 68, -13, -124, 71, 216, 16, 74, -91, 126, -153, -127, -102, 43, 67, -22, -13, 180, 215, 107, 112, -29, 91, 157, 198, 100, 106, -242, 33, 57, -7, 95, -14, -159, -142, -90, -20, 179, 71, -64, 7, 23, -166, 38, 71, 50, 102, -5, -177, 94, 133, 64, -48]
3275d8J7j94J52K71k6J2j3j17q1n1K39j88j62L40p6k62K26m8k04L50k16o3J46
3298DJ56k1n1o2j7P3k56L68J18l61J51K7l52J12q2K24J00j52K17k7l7Rk04K54
3322A91n5j1k29N8J49k29L26j88K24n70R9K68J38Oj43J64m83L54j92K93r7j62
3344h9m0M30o04L63k24j08K55k19J01J13o3j49K9K51J21l50r5L01j93K37J14l08
3366a27J65r7K1J14j44K01l8o7k32L41M0j04J9J38n80M61o5k44J08L42j46M3J75
3389C24m83M74k72l77L02J1p0j52M28o3j5r4k26L07n6k58K24j9N1k41J41Q8N0
3412G4j47p5p6K95j43M46j40k76lO4j89J95k5K51n4p2P1k23pQ9K44l32J43l89
3436b79K71R9m3k6N7k09J34q0j99L70j9P5K99m96l7L0N5k52K08P3k1j41J40M1
$$ y = [-48, -31, -225, -73, 198, 172, 184, 171, 54, -27, -78, 161, -27, -189, 151, 75, -187, 39, -9, -213, 137, -79, -142, 4, 160, 139, 88, 26, 9, 82, -174, 194, 312, -49, 102, 129, -223, -111, -193, 31, 131, -21, 196, 169, 132, 141, -63, 191, 136, 125, -104, -46, 103, -126, 200, 12, 236, -334, -235, 33, 171, 177, 34, 198, -285, 69, -123, 170, 73, -89, -129, 301, -303, 60, -164, -272, -17, -236, -135, -22, -85, -234, -205, 46, 167, -183, -278, 23, -170, 67, 181, -127, 38, -59, -38, 76, -68, 133, 95, 28, -204, 137, 177, 73, 92, 230, -350, 111, 46, -198, -90, 252, 106, 149, 324, -159, 315, 43, -334, -32, -21, -91, -243, 185, 122, 107, 13, -213, 94, 38, -220, 4, -15, 36, -205, -64, 24, 74, -73, -148, -224, 71, -72, 374, 234, -42, -45, 19, -170, 25, 0, 251, 197, 125, 196, -27, -34, 55, 299, -33, 110, -279, -8, 91, 48, 22, 79, -130, 4, -76, -275, 95, 76, 151, 450, -46, -83, -53, 2, -250, -42, 31, 10, -131, 9, 50]
3460E0K6k06J26m7l1O8K8j11J40n3p4J47j28P7n1m8K87o0q6J49j89j01K3Lj50
3485b11K92j19j78J10K45J1k71j76K34K42j17K05m02j62K43R1k98L51j69P3j21
3506a27O5N4J24o9l8j63J4M18j17m32J32J20J35j30j00K87k75k3K78j13k00Q4
3528g6J84j98K73R2m26K19k5r2J4j23R3j07K30r0J10r1j50j2M1J32j65K54l07
3551b20j5L47j55p7j5M30q8o6j11o5j53K61L81n69j5K09j45qJ80P0q6j72K46K2
3575A86k9Jj68j42L91J05k21k86K25J37k87p1K75j29j05J04J60o1O8l00L03l21
3597a65J77O4p8K99n46M01m01J17o2K71m23M69l90O6L42k37J31m12M77Q8j34k75
3619b21L88j78o3Q9M3lp1k74K73j59P4J20J09j18J84k08k55K42r6K25J12k91K06
$$ y = [50, 76, -130, -4, -51, -82, -14, 14, -97, 43, -10, -84, 63, -65, 12, -39, -87, 200, 140, 54, 203, 14, -87, -64, -61, -211, 81, -38, -216, -106, 139, 150, -121, -297, -63, 179, 62, 267, -135, -297, -54, 37, -261, 90, -79, -6, -127, -62, -8, 116, 47, 9, -154, -140, 278, 161, -271, -139, -19, 116, -14, -114, 173, -102, -125, 153, 40, -160, -76, 108, -90, 183, 275, -151, 68, 43, -49, -35, -158, -65, -172, 58, -32, 78, -13, -163, -175, -134, -2, -167, 87, -220, -235, 112, -43, -120, -135, 295, 207, 141, 30, -35, -188, 73, 454, -115, -130, 79, -66, -74, 106, 176, 90, -82, 164, 186, 157, 158, -10, -152, 239, 344, 123, -163, 62, 199, -88, -159, 116, -13, -118, -14, 146, 85, 153, -147, 156, -165, 12, 76, -2, 297, -249, 152, -249, -132, -194, 77, -346, 123, -267, -201, 141, -96, 35, -377, 100, 188, 54, -221, 167, -11, -74, 15, 58, 55, -16, -290, -17, -176, -102, 18, 127, 9, 193, -15, -270, -28, -124, 101, 213, -78, 128]
3642A28jj75Q8K6r9J96k34j55J64P8j09J22J13K26l70n6L5k32M20m99jM80j92
3665d7J0J73j03j31M19m33j58L06P7m8M6j24j39J10j29N2K15J8J25j98K27l32
3687f4j6j19J53J57k36k8J99K47l33J33l33J65M5R4m8K9p8l2m7J25P5j97K59j78
3711b8n8J59k34J12J53R4k49O9j78K16p2j12j41L09R6L9k14K83j34k53K77k29
3733i5K44L6k2k31q8Q0K97o04K86j5J33r6J68k96M3L2J47k81J46L6R1n3j58O7
3757a33M8j19J78q2P9P9j40j19L57j85J09k3l3L46m01L17j78Qk9O1j45L9k22L51
3781A63j53k01R2j4p2N35l22J07r0J41k03j25j92M88J6k16Q5J09k74j08K31j09
3803a12q6J25J24j92J59q9j42J85L9j50J44j83L5J61K19m08K58q6R3J6N1p9m0
$$ y = [128, 127, -48, 40, 66, -33, 163, -71, -226, -62, 16, -93, 29, 142, 368, -2, -58, -23, -255, 165, -334, -335, 145, -47, -37, 136, 33, -98, 321, -112, -270, 36, 113, 65, 111, -13, -152, -42, -171, -119, 96, 114, 239, 41, 268, -64, -80, -199, -46, 111, -125, -153, 46, 293, -40, 93, -240, -75, -30, 64, 16, 45, -33, -65, -112, 13, 88, -109, 150, -28, -86, 73, -161, -49, 104, 198, -51, 18, -160, 56, -16, -128, -269, 40, 136, 175, -39, 244, 110, -143, 134, -95, 149, 185, 163, -68, -156, -76, 221, -383, -97, -112, 21, -75, 93, -203, -160, -128, 19, -262, -116, -80, 11, -42, -200, -133, -85, -204, -26, -108, -29, 50, -90, -209, 148, -37, 72, 49, 16, 362, -39, 278, 100, 108, 79, 140, -5, 34, -188, 163, 10, -191, -99, -113, -185, 350, 28, 135, 45, 186, -17, -142, -334, 154, 170, -46, 39, 148, -126, -234, -3, -112, -198, -73, 51, -141, 18, -71, -213, -28, 11, -139, 5, -178, -143, 18, 237, -171, 87, 1, 94, 110, 161, 82, 42]
3826D2M3%Q3N0l47J31Pk8nq7J31l1o8K53R4k53N8j12K69k13r1J98l29J53J73L1
3852A52k80K09j98p8K92k87L28l20K93p3j9j85k06K22K18k78J52J13j31lO1K6
3874Hj59J65L26l23r7M29k64J5J0j55N9r5J38J39j43j25K37l3N9k09j38M15k37
3897B2l49M45m44N43l47K25j89J24j54L13r8j10K4J17j7j03P8q9J10j53j41K63
3919G0P1P8l40Jp2J56j23J7K64l3M4k33L58l64j07M54l21o9N9J43K76l06r5N6
3943a6j77k0M15j87K54l96N1J51N3l2m4N8j67n5n3L35j25O4j79J56J39k14J53
3966A64n0L0j90n8K95j44k85J61J67k00K17o9l32K68oK18m70L00n0nj64l0N16
3989B83m48J37J55o4j94J73Q4K3j26L63o48L47p7q8K0P9j8j68K9O5l9K68j46P8
$$ y = [42, 85, 85, 168, 218, -129, 2, 9, -19, -24, -111, 20, -11, -79, 174, 268, 15, 73, -39, 230, 17, -74, 124, -205, -52, 121, 152, -128, 81, -117, -195, 97, -190, 138, -182, 111, 38, 19, -166, -372, -150, 68, -210, -58, 55, -76, -79, -18, 8, -151, 14, 340, 17, -80, 349, 85, 100, 110, -45, 14, -81, 57, 196, 53, -72, 165, 132, 191, -18, -156, 259, 22, -327, 118, -326, 217, -130, 95, -94, 30, -124, 189, 91, -19, 5, 122, 105, 2, 80, -9, 101, -52, -193, 70, 141, 219, -121, -120, -192, -36, -159, -142, 122, 89, 133, -100, 258, -106, -213, 241, -80, -149, -90, 53, 329, 23, -72, -16, -193, -213, 202, 15, 269, -127, -76, 75, 128, 96, 52, 110, -57, -112, -165, 170, 45, 109, -70, 86, 225, 11, 164, 114, 144, -46, -104, 191, 47, -238, -77, 90, -110, 107, 38, -294, -26, -32, 186, -284, 16, -34, -39, -203, -233, 283, -165, -28, 127, 63, -131, 42, 126, 149, 23, 386, -262, 85, 8, -80, -60, 19, 1, -167, -138, -73, -112, 156, 10, 88]
4013H8J45j94j26q2K17l9q0k2J88m12L09J01r1P0r6N9K2j62K61n6N4o1Q0J07k97
4038a7J79o2j21j99K58K72l07r9J56K41k52k5K0j0r9K09k89K23l3J5n19M34K7
4061Bk17O4J60l6m4j28L02j02l30L50m7p7j80M97l42q4K51J05n8j28J14j06K32
4084A98j21OK1k07L36j22lJ14k12J11j16J33o7m6L6L3p9J26J05j38k48J56j14
4107i8R0j09M0n7J8J29k20N9J07K66k52n9j01J92j67J56j32K36k03L29o2k60R0
4130hj19L86l02j12K66o3k18K32l1o6K15Q0j86N3K42l64j36L29k04l6k50K09L0
4153e3j03J52l6j25K28m41K89J35Q3k47M4o8J44l8J33j2n4RL42l54Q8k21L76n8
4177B13k21J29j04J06l4N9j4Nn3Q1k28J74L3j99k41K0O50l5r4j70J8j89K90k89
$$ y = [88, 233, 39, -87, -169, 48, 9, -71, -93, 95, -317, -8, 93, 2, 72, -24, 35, 57, -105, 156, 100, 154, 93, 173, 280, -17, 162, 100, -21, -220, 38, 310, 3, -96, 60, 301, 49, 24, 44, 34, -65, 144, -145, 78, 45, 60, -459, -25, 2, -215, -151, 9, -27, -71, -199, 103, 1, -329, 21, -26, -103, -283, 214, -128, -212, 39, 144, 86, -42, 72, -34, 198, 77, 83, 104, -103, 233, 111, 108, 222, 10, 121, 5, 138, 71, 25, 61, 94, 15, 141, 246, 108, -140, 16, -98, -8, -117, -77, -134, -116, 13, -207, -148, -41, 225, -27, -86, -187, 5, -162, -6, -138, 98, -105, 224, 162, -98, -8, -127, 259, -43, -155, 111, 48, -170, 62, 31, -35, 180, 260, 74, 127, 369, 5, -131, 198, -6, -42, -292, -83, -53, -156, -4, -40, -165, 63, -378, -89, 46, 129, -118, -74, -142, 2, -36, 97, 85, 31, 40, 382, 28, 116, -105, 271, 213, -8, 121, 17, 123, 89, 148, 134, 139, 86, 167, -61, 113, 146, -53, -294, -274, 376, 341, 247, 77, 95, -94, 196, -93]
4201i3R5j8qQJ22k50L55m99M81j07j72J05J01jl85M6K46j4k62L37k24N0K58j23
4225D8j96O8K58o0j31K1Q5J1j19K33k67O8Ro5r4R6O7J30j30K17k01q5n7QJ59o2
4251A1M1l2K41k20jJ44l93J23j11j05J34L94q5l25O9J10j52L02Q5j48j32QM0J30
4275A28k42J93p2k8R3l76P1K54j3p2J13m6r4K73j9m67K53n0K04j86L34l14L05
4298B42m7k02J56k94R1j19k3L20p4Ok4n6J21pk59L20j39P6j84LP7o8J33k60K10
4323ak38J48l9J15j8K8j22K69k63K17j88J35K33l40Q3j85L31J92k89q2j03J47
4345C0J51j78p6J92n5L1j93J1m9K06r5L5J12j10jJ32J58m04P3J36j61L6Q1Rq2
4370a1R1J8q1k14J35K10Jk6k14O2j94L65j99l4J21K7l1J31k54J46l9o8K15k52
$$ y = [-93, 2, -16, -24, -16, 106, -144, 211, -288, 193, 86, -86, 19, 120, 119, -266, -220, 26, 12, -250, 87, -137, -87, 171, 48, -148, -80, 178, 118, -13, 8, 93, 104, -15, 218, -49, 19, 28, -37, -131, -35, 32, 162, 32, 249, 48, -37, -94, -86, 73, 11, 52, 20, 261, 41, 40, 184, -209, -86, -197, -302, -168, 226, 141, -184, -115, -5, -157, 145, 230, 82, -50, -42, -2, 128, -114, 79, 7, -21, 72, -304, -233, 21, 8, -64, 49, 3, -91, 182, 163, -304, -51, -101, 103, -83, 251, -63, 242, 195, -7, 149, -145, -54, -173, -196, 124, 50, 56, 32, -24, 97, 90, -169, 151, 12, 88, -96, -93, -16, -84, 49, -211, -1, -239, -91, -130, -15, -33, -5, -127, 142, -121, 96, -92, 43, 276, -64, 19, -166, 165, 357, 68, -14, -117, 30, 181, 3, -73, 119, 64, 95, -98, -87, -136, 70, -25, 10, 122, 12, 11, 143, 301, -103, -30, 106, -55, -19, 62, 71, -11, 80, 98, 17, -197, -62, 148, 149, 123, -91, -29, -223, 142, -57, -91, 30, 57, 26, 157, -97, 49, 10, -58, 157, -95]
4394i5M7J72k13k21K65OR1Jq2P3j13L3k1J32j50p3m8Q3n9K22p3J24l84L3N3J65
4420c2M3O4j60J9J59p5j4J41J23j67l19L97j64j16L36p8k05O5n0L32l04k56K87
4443B6J74k5M2q6j91J7J49k25R2J4k26M17k01J44k17M0r6J55j54K3J44O3j05J28
4467A02q2j97J81r2L29m89N00k60j70P1k46L37J44R1m73M46j65j46L78l31K60
4488A88j35p2K35j80k6j33J57L7j80j6J31P7l13N99l44k22J38J32R1j31j91J99
4510D1j0Nj26K45j87l2p9J32j01J68J25k42K8j9N4j12N5l8J54j43O1J55k30O6
4534c0P1o9K0p9K26k77K80k3j83K6P4m5K4J47k14j13M79l11K3P5q6k12K70q7J4
4559@j39J24J82r7nl43M24J9k09J9K56j89J91k26K0k3k69L31k14K6L77l26Q1r
$$ y = [-95, -48, 124, -89, -310, -45, -39, 52, 53, -29, 44, -69, -36, -57, 75, -75, -148, -196, -113, -172, 50, -23, 101, -283, -250, -197, -32, 11, 75, -85, -66, 93, 18, 4, 145, 268, 101, -218, 179, 15, -101, 235, 157, -48, 17, -33, 299, -5, -261, 26, 200, 175, 217, 131, -60, -43, 106, -119, -27, -13, -239, 178, -23, 121, -96, -56, -152, 3, -151, -128, 16, 79, -26, 102, 20, -177, 4, -88, 241, -248, 252, -8, -178, -107, -353, -16, 128, 219, -254, 192, 27, -119, 259, -72, 188, 53, -19, 216, 36, 10, -123, 34, 71, -109, -125, 6, 83, -230, 369, 25, -197, -59, 73, 164, 33, -158, 41, 31, 36, -90, 155, -32, -64, -143, -11, -112, 56, 181, -61, -33, -52, 2, -110, -55, -93, 61, -82, -21, 134, -96, -30, 41, -28, -8, -87, 139, -138, 142, 119, -64, -38, 36, -9, 15, 162, -52, -165, 314, 3, 26, 101, 15, -197, 73, -14, 0, -139, -15, 167, 70, 65, -278, 146, 165, -44, -25, 231, 42, 233, 7, 27, 4, -265, 66, -148, -122, 255, -71, 10, 1]
4583AP6k65J18O7j79K64j79j59K17o1J84R2l85K62O1j94m8N6o3K82n8k53K4K35
4607I5J3K6m06N4J99k13K28J27N9l07Q6j92J60J04k13J00L2K19l56J46K1J2j03
4630a09L06m3j77J07j31J15j06J21j92K0L3J23j38PN0L28k87J10j3m13K13n0Q
4653a18P9j77M25k85Q8m9N6l72N23l60R9j11J74J25k0P4j35k66K51j20l09L48
4675h0L14j91j93O05l74K5k39K02k48K44k00N11j59j62J30jk43K17k30J31r3j7
4697e1J75k6J41k87j66K92O3j50L4j07P2K7m5K41m36K86o3j02K69j3j76k16p1
4720c09k3O42l98oL48l89K48j50K32l4j97P2J62N2j88k27o7L75j07N1m51M39q6
4743a1r6J98%K09j50p9j33q1L36o2k15Q2J64m6r8J20j65j72L54k92N6L8K33j1
$$ y = [1, 77, -188, -70, -3, -182, 82, -97, -256, -39, -100, 84, 176, -209, 53, 114, -80, -128, -72, -135, 147, 89, -164, -140, 95, 108, 134, -272, -218, -19, -232, -4, 123, 182, -125, -39, -231, -71, 33, -180, -80, -48, 171, -185, -39, -18, -6, -109, 197, 154, -23, 84, -47, 68, -38, 83, -109, -89, -56, 67, -71, -64, -14, 314, 27, 137, 124, -289, -76, -126, -118, -39, -216, 209, -76, 12, -37, 19, -353, 170, -190, -91, -202, -28, 97, 77, 151, 16, -250, 1, -119, -428, -80, 234, 43, -150, 455, 81, 106, -133, 69, -179, 65, -135, 376, 217, 55, 185, 184, -59, 158, -72, 59, -34, -51, 124, 98, 239, -48, -214, 78, 141, -9, 25, -82, -10, 17, -28, 213, -223, 63, 0, -102, 167, 154, -22, -238, -309, -332, 310, -88, -94, 254, -135, 113, -37, 195, 161, -36, 36, 198, 250, 62, -165, -232, 143, 36, 87, -364, 75, -11, -107, 91, 91, 300, 150, 71, -62, -143, 193, 131, -84, -2, 162, 116, 18, 138, -27, -199, 155, -137, -81, -43, 190, 179]
4767A79l07P9k36L23J92k91J87k0k48m8K92j82J73j71L18k16j10K19m1j05kj96
4789b11K77k20n1K77N9j33R7J93l81k3P3M5l5J00N2r5k40L82m41L12j50J45r9
4812f7J9K26m13K58R3p8J79j35l6j35K0l2j3J48q1L24k82K00j1j99R6l50K90j41
4836a20J61N8m33N10K2k93J15J07j21l2j3k7J41l04K75l61K54K25k36O0K15k67
4858f4r2O8J20q6j41Q3J16j70L7M39n24j72o4K72P5J12J27l41J35J63j0j76J4
4881g9R8k20K56j9k4J82J07k73K3l06L44k09K34k8k22J57l4J79p1O7k3q3O2j24
4905foQ3m27N07k49L8j77L38k15j04K94j13m1l4N5k3K2K5j36R4J47q4l4J41k96
4930b01K71J0k4k16J54NRK50m20L47k59J10j17J38p0p5K38p6J8l94J84J33J55
$$ y = [179, -128, -49, -285, 38, 230, -61, 126, 106, -142, -190, 102, -80, 93, -78, 240, 24, -86, 133, 92, -13, -15, -211, 66, -154, -205, 72, 131, -2, 95, 288, -93, -116, -43, 2, -33, 67, 119, 24, -216, 166, -275, 37, -113, 32, -67, -48, 178, -235, 23, 116, 38, 217, 82, 46, -89, -69, -101, -114, 34, -47, 277, -5, 195, 184, -15, 81, -269, 21, -120, 41, 99, -334, 176, 198, -95, 20, 127, 6, -26, -39, -66, 75, -229, 46, -315, -61, 164, -72, -12, 203, -64, -156, -88, 32, -54, -195, -112, 4, -166, -129, 310, -214, -386, -450, -178, -103, 9, 136, -205, -70, 93, 83, -93, -79, 19, -201, 55, 36, 12, 194, 301, 28, 51, -255, 89, -120, 114, 86, -136, 21, -13, 166, 95, 162, 139, 56, 118, -6, -12, 71, -356, 151, -98, -60, -237, 101, -114, -218, 76, -37, -78, -112, -57, -80, -58, -33, -169, -75, 72, -12, -46, 95, -201, 70, 80, 56, -160, -6, -1, 8, 258, -162, 185, -74, 36, -81, 57, -13, -88, 150, 74, 92, -302, -118, 15, 170]
4953A70j19R4j65J51l58J07J36pL4K80j72j01l28L85k18J16l43M61r4L4jo5j47
4976a50K70j53k63L69o7qj71O7k57N42j97K47Oj48o3p0j75K66L1J32P7L6k30L8
5000A29k10L41l39J68j35L5J82k79NQ5j58J67J39k25J16l2K86k32l32J62K68l42
5022b01j8J48r2L68k12m5l4L09l35J02N7k51L98n0j15r1M9r5q7J75J48p4P5l32
5046b03K95j15J09k99J28l0l5R0Q0P6j32k51J98O7k89L58L3j73r5J88n1N1j2q7
5070i9J6p8n4R5Q0j73M32l02k7q0j4N08l18p9K45rj04q4K25j34K06K0m87M23k83
5095g5O1p2K90L0j82m0K32k51J4n8P8k90K74l1j07m3L36q6q4j58J1K32j37K39
5119A83j70j32kk96L79j0K29j81J6L7j08M2j5M6j93L31j96l3J09m0J24J17j69
$$ y = [170, 51, 145, -20, 131, -227, -120, 16, 9, 43, 323, 151, 50, -278, 107, -111, 5, -338, 123, 29, 63, 62, -3, -150, 120, -33, -296, 73, 6, -2, -173, -106, -363, 179, -18, 229, 235, 87, 24, -46, -221, 45, 76, 208, 285, 321, 91, 129, -81, 260, -79, 89, -46, -11, 171, -108, -103, -18, -176, -9, 130, -95, 21, -11, 275, 43, -289, -127, 141, -201, -219, -71, -163, 205, -7, -52, -86, 223, -112, -10, 47, -204, 194, 144, 29, -62, -13, -108, -195, -20, 128, 54, 129, -203, 92, -23, 86, -213, -85, -115, -150, -60, 20, 96, -36, -287, -89, -22, -311, 47, 80, -93, -188, 0, -51, 0, -12, -99, -83, -161, -215, -120, -40, -213, 219, -83, -110, -190, -204, 304, -14, -93, 152, 143, 39, -45, 180, 46, 252, 272, -215, 208, -75, -14, -86, 204, 234, 52, 12, 244, -7, 7, -51, 27, -263, 11, -20, -127, -170, 166, 80, -4, -162, -151, 81, -56, 183, 13, -119, -121, -417, -38, -48, 181, 0, 16, 53, -55, -13, -28, 18, -175, 156, -40, -73, 36, -4, 120, 237, 68]
5142F8m3j58K51R7q7k18K34j83j53K10J38r2M8k40N6K76j81l23K78P3q0j13J15
5165b7%K08j90Q2j36K4K0J29Q5l54L8J66K66o29M97j05L3k75L23j03J01k19K5
5188d1o9k5J89l8j38M76n64K37K35l04J60l68M36k41K07j03K8r8j1K41j19km6
5211D2k24J80J13l2j9p6k07M01r5k7Q9k51K72j02J06l44J48J03N7m55K47L18l21
5234g7J86L0k5l39q3K66J96j91p2j3K09k98K87j52j18N77m70L1K95j54k45K22
5256F2n8J74n5l23K68Q2k89K06k00j21L37J21m19m50Q88k65P2n2J57j47K0Nj27
5279a14P5j36N31l79l1J28k8M6j5qj78M3j47K18J95j82O4j78k1J17L3k86K65o9
5303e7J14k06J42o7K8K02l84L51l98J92j67L03j7l8K78k61p5j19K81k2l1j31N0
$$ y = [68, 25, -133, 118, 215, 128, -90, 144, -39, -192, 18, 156, 64, 112, -128, -72, 204, 23, -300, -22, 51, -29, -142, -27, -27, 181, -9, 73, -63, -39, -19, 110, 195, -159, -121, 45, 311, -318, 179, 74, 107, -168, 155, 52, 153, -66, -41, -110, -135, 54, 16, -122, 354, -210, 27, 262, -42, 118, -250, 186, -55, 152, 49, 77, -21, -32, 209, 90, 88, 42, -182, -2, 111, 79, 60, -16, -223, 178, 83, 56, 145, -106, 166, 64, 170, -174, -26, 77, 134, -321, -74, 244, -77, 109, 139, 114, -225, -308, -42, 154, -37, -109, -122, 87, -211, 76, -76, -194, 383, -87, -56, 239, 85, -160, 62, 4, 178, 123, -200, 68, 150, -139, 67, -133, -254, 83, 204, -215, -665, 223, -42, 30, -22, 135, -12, 8, 13, -114, -39, -175, 356, -23, -54, 74, 46, 92, 77, 69, -109, -66, -213, 5, 200, 18, 82, -96, -117, 0, 33, -253, 12, -57, 57, -149, -7, -74, -46, 156, -228, 123, -275, -83, -250, 53, 36, -2, 276, 15, -60, -179, 102, 80, 49, -82, -32]
5326c2J66j68j00M8J99qj78M7R4k14J39K24l62O3J60L3j22j09K91l31m0M75m54
5349a79l78O60m02K96M9Q7p3j40J89l86M67k79NP3o0j88L40P7k57RL11m15J70
5372b4J87l30l2J42L6J47j92k3Q7P6k7l90N06N9l11P0k8L45m21L01k5o4O9j11
5396D7k17R4o4K07k58j1N29m26J24j43P2K70j68rr8L29j18j05J9K08k7k78J75
5419A52K35l42R7j29P9J51j77J15j19m18L50R9l20K21n6k2L03m12K77J09n1l13
5441a71L88j88l17O21l34M8k36L02n6k02K03q6M04l60L21l39j74L63l10O6O9m9
5463c7K20J26K1m39k95L37q2L2J44J51j95N5r6J97o5j88J05R4k53O1N9k72N79
5486B59k34Nl1J23j33r9J00Q4o7N1j76L04k43qm7J02J17J47k61j7Q0k5J3J3K2
$$ y = [-32, 134, -34, -134, -86, 113, 105, -73, -26, 68, -146, -7, 217, -145, -82, 78, 111, -11, -120, 171, -160, -200, 275, -179, -557, 103, -299, -3, 46, 133, 60, -80, 109, -277, 190, -89, -84, -11, -71, -259, 81, 158, -99, -90, 221, -194, -24, 163, -167, -199, -57, -21, 126, -66, -89, -2, 74, 47, -343, 163, 222, -89, -19, -47, 298, -123, 178, 153, 89, 158, 47, -170, -76, -140, 67, -191, -202, 327, -99, 25, -118, -46, 224, 56, 47, -51, 278, 160, 55, 74, 282, 255, -23, 152, 387, 45, 142, 13, 92, 243, 66, 181, 62, -356, -6, 93, -227, -6, -62, -84, 219, -193, 84, 193, 142, -171, 217, 29, -288, 333, -1, 47, -189, 113, 57, -145, 58, -28, 376, 16, 337, -2, -176, 187, -123, -57, 12, -37, 183, 309, 330, -109, -404, -67, -149, -117, 27, 178, -17, 38, -58, 139, 74, -114, -9, 85, -168, -107, -48, -320, 259, 25, 30, -1, 122, -11, -110, -10, 74, 7, 58, -118, 186, -57, -65, -112, -10, 107, 254, -7, -24, 56, 31, 44, 57, 79]
5511G9j96K54o0j92K39m19N17n62L32M8j54r3K87k88J74j81J96j4J16k66J95J29
5533A41k56K4q1K32m6J64k29j33J09J38q0j80K90l2M0j89r1L03k39K73k40K09
5555A27j33J63k80L05l49K45l29L13j21O3J57j16k11Q8P8j40L3Qk9k7m3J43q6
5578a41J37o0lL5k19K35R1j19m43K93M4M5J48jj24L10j47j34J02o1j94L80r6k9
5602D9j61L38j47L88m43J19m07L99J88k87m7J97o6j80K26j51K7l5o1M6l46J82
5624a72K17J56l21J90j00o0k2J91k19K55l04K5o8J89j8L04l84O2R3r2K87O6n34
5647b59J38J64j00q6R4O5J06J3l63L26P1m53K71N7j43n2K26J40k44k13K56m1k7
5670e4K23r3j5l62K61j14M6kJ5J33m5K1m8LN4j85N4J52r1M31l78j8j06J13l00
$$ y = [79, -117, 137, 77, -115, 124, -295, 222, -340, -8, 40, -114, -207, 80, -208, -34, -215, -19, -33, 83, -183, 12, 141, -115, -91, -172, 60, 14, 178, -51, -184, -75, 63, -17, -197, 93, 61, 101, -88, -179, 124, -115, 158, -82, 127, -6, 157, -123, 182, -167, 78, -251, 62, -59, 4, 161, 45, -166, -78, 0, -140, -107, -99, -128, -155, -198, -55, -141, -4, -64, -67, -32, -251, -16, 75, -44, -487, -194, -150, -105, 43, 42, -82, 228, 81, -53, 49, -12, -206, 174, 78, 49, -112, 226, 79, 467, 24, 143, -264, 135, 323, 36, -11, 186, 120, -60, 166, 15, 42, 7, -54, -8, -354, -172, 45, 201, -120, 70, -30, -90, -112, 79, -140, 115, -189, -164, -232, -43, -61, 243, -141, -79, 14, -78, 209, 275, -259, -121, 43, -57, -143, -49, 16, 122, 135, -228, 98, 169, -284, -13, 44, -99, -151, 75, 215, -29, -242, 14, -27, -54, 169, 76, 61, -301, -40, -154, -108, -110, -95, 38, -7, 14, -34, -31, 23, -162, -108, 44, -47, 384, 6, -12, -118, -5, -305]
5695c05M69j88J02Rn0j31J94j25P0k61L25j69k5J75mk35J52m1q5J37L8q8k92L61
5719C3n3L2l4O0N9k94K3J61J57j53L9J04j12n1j17L23K0j46k15J23j51J09K77
5742A94l30L03l45J58J55k7k47l9J63K56j82k11J42L15k94J69j70j55O7r1K15
5763D6J51n4j38m5n5L33n22L89q8l23J69M9J99p1J44k00nM2j35K54m1j04p8J10
5787B7k35L02k16L40l48j2L15l20J75J61j16M8K1m4p8j53J18m5J80qKq8l66M39
5811I9J53j35l15N57l98o0K56k90J83k44L4j34K76oJ36j02N1m11L45L4j38oJ05
5834a0Mk16O9J25O9l04M35j59k02P3J21k82L01j44J38M3M5j77N8k53L52N9j11
5857C4J97m49l5K17O0k16J90N8j66j01N00j86n2Kr7J41k97K10l04K87P8O0j42
$$ y = [-305, 164, -24, 78, 87, 37, -94, 100, -25, 45, -216, 109, -60, -85, 90, 86, -149, 3, -38, -123, 14, 52, -36, -328, 33, -20, 12, -22, 38, 97, -197, -174, -13, 144, -9, 30, 134, 22, -29, -146, 177, 197, 51, -164, -41, -192, -83, 194, -136, 167, -178, -20, 135, 108, -139, -178, -15, 241, 59, -152, -10, 305, 11, 180, 10, -145, -78, -169, 46, 197, 143, 5, -40, -95, 238, -284, 105, 17, -306, -137, -88, 111, 40, 184, -16, -21, 21, -114, 140, 99, -5, -83, 27, -208, 94, -122, 218, -130, -142, 173, -147, 28, 189, 73, 121, 142, 98, 20, -133, -15, -60, 120, 112, 114, 26, -340, 99, 252, 117, -198, 359, -39, -99, 157, -133, 50, -194, -160, -294, -18, -24, 112, 10, 61, -350, -5, 29, -109, -115, -10, -6, -222, -153, -28, 41, -263, 172, 13, -189, -116, 5, -277, 24, -120, 18, 61, 106, -71, -13, -266, 86, 145, 34, 231, -218, -253, -36, 24, -192, -2, 56, -110, -211, 289, 103, 51, 53, -44, 97, -200, 10, -294, -7, 71, 131, -11]
5880a1K05k59J23Lj37K07j37L3n0M15k06j79J20k87Q0k04M73l05K8O9K6pr5m2
5904a37K12q6o0L1O1j33K32n2j92l7J67Q6j3j06j9P4j46L22j60k43J48p4o7J42
5928e0J59m7k18J99Ko5j60M61j31k71J83j2pj26K15J43l09M7K64l16j41L7L32
5951A89k78J6P5k5O2N4k35J10J44j33l9J40P1k55p3R9J29L5k42K09Q0j75J43p4
5975B7k68K08K01k75m1K22l22K72L2K0j12J32o8k46L69k07J31j42J13J14K08l31
5997C7j99L81k14j17K10q9J47p7J25j92j60j25M03j0j78N0j14J92j75J58j93K45
6019A05m6j36J63k15L3K13l57L99o9k82P5L6Qj93K50K92j30k48j27L48r5j54K86
6042A56l72M67k00j96RJ55j33o8K44J83l36q3M41k28k34M0K18p9K9l00N9j30K75
$$ y = [-11, 194, -65, 58, 61, -76, 131, -6, 27, -23, 392, 186, 7, 127, -160, -80, -284, 189, -116, -88, -19, 7, 0, -95, -137, 75, -11, -71, -40, 21, -112, 120, 68, -124, -161, 6, 92, 79, -27, -46, 28, -118, 204, 44, -199, -51, -125, -192, -50, 109, 62, -156, 43, 45, -20, -180, 281, 150, -121, 62, 50, 43, -83, 132, 275, -34, 13, 277, -39, -180, -143, 189, -89, -73, 2, -23, 39, 93, -142, -32, 112, -21, -60, 80, 151, -104, -177, -78, 51, 86, -156, 53, 133, -42, 101, 27, -241, -33, 168, -107, -148, 74, -248, 24, 56, 76, -36, 96, 28, -218, 151, -56, 75, -67, 46, 160, 368, 37, -162, 219, 5, -112, 98, 9, 156, 79, 204, 12, -148, -273, 130, 120, -58, -8, -122, 70, -105, 53, -140, 105, 59, -77, 86, -129, -96, 117, -240, 159, 90, -192, -117, -81, -73, -266, -16, 276, 146, -102, -229, 119, 24, -130, 156, -216, 251, 51, -145, -136, 19, -114, -182, 62, 245, -91, -174, 267, 39, -195, -155, 63, -16, 13, -287, -228, -358, -83]
6065h3K95j27P2l53K52j11l00L87J39k31P2j3K1J53l49M00m42J84l46L15O5l2
6087c2j19K51j50o1J58j41J89q3k8j17K01l8m4k9n0OJ83j53J46J8r4k39K59K21
6111B54O7m3l27N4pQ6J40k98R0j9k44K76Q0m27L59R8l08R0M3n4j57R9J69j10L10
6136B21l85J8K42l32L08n6j20m6J48J70j55K34j78k10J85j40J17L9j46K43j57
6157@l3J79k66KJ85L4p8J15N1j56q2j00N19j38l00J90q1l4j1r9l1K39p5P7n6r7
6183d6j82K68m7K78j33m4j1J3k99M67j28Oj58J8O0L7r9j13j1K74k87J80j89J00
6207d6l2J00j21k8k0J55nM0j05O4M22l44op1O2mKk14j22J46jL04q4k52K76m9j51
6234h4Q8k0Q3N3m9nj98J18J10m1R3q5m3K4K6N8k58K44r0j70J8J96L6k36L34j02
$$ y = [-83, 212, 85, 157, -196, 56, -55, -355, 32, 171, -60, 12, -1, 20, 173, -176, 224, -218, -34, -380, -65, 0, -32, -151, 100, -50, -111, 47, -94, 95, 12, -16, -133, 68, 30, -14, -43, -93, -87, 96, -57, 89, 107, 13, -226, 33, 254, 321, 278, -49, 5, -2, 84, 224, -74, 16, -3, -247, 29, 109, -318, 41, 139, -169, -79, -36, -90, -247, -148, 21, -89, 221, -164, -146, 96, -236, 72, 16, -104, -150, -2, 168, 13, 247, 69, -141, 44, -96, 21, 60, -86, 157, 0, -33, 146, -120, -118, 67, 101, 23, 138, 189, 33, -49, -149, 370, 232, -68, 122, 41, 7, -4, -103, -134, 105, 30, 107, 51, -46, -228, 40, -7, 271, 138, 94, 83, 96, -203, 264, 136, 142, -16, 2, 62, 99, 0, -113, -124, 150, -137, 43, -146, -46, -78, 22, -99, -127, -147, 8, 3, 43, -62, 2, 424, 80, 74, 3, 65, 61, 63, -151, -273, -127, -128, 176, 92, -160, 116, 67, -84, 4, -16, 67, 120, 71, 66, -132, -14, 96, 55, 148, 63, 20, 44, 70, 128, -130, 114, 24, -146, -128, 68, 104, -132, 202, 100]
6260A00j37J06j4R0J13j07o2J48l72K16m94L82j65N8M0M3P9r7O4J54o9k50K15
6283D1q0J58l14K11l44K44KkP4m1L89j65k72J6j46J33J97r6J20j96J54j46J13
6306E0j1K14n20L57j33K43k87j81M76k33p8L1M8L2J38j59L6k22K50pk4J1O9l20
6330b20M13l29p8K77Kl19K45J49p5J02k41k0J71K72l34J11m56L50J23j8P5n53
6352c53M92m24J64L08j23j14L72k07N6op3J52j33j83k0J46M0jj3l33K15K50p6
6375A36l51j19K78M1lN0j98pK85k73K48j88J99l38L76j20k6L0M7j01o8K2N7N3
6399C0r1J75j68J68j34P1j43q5K86m22K13j00N13k45p2M9j4r9K54j53r7k9J85
6422I2j1j52p7K64l41M76j33l27K60l10J29O0O2J36l63Q0K86n5J52K45o15K71
$$ y = [100, -37, 69, 55, 145, 258, 151, 89, 237, -135, 81, -413, -31, -196, -138, -98, -55, 24, -73, -9, 145, 76, -174, 41, -39, 119, -195, 16, -328, -84, -82, -84, -10, -51, 338, 173, -99, -83, -229, -96, 101, 5, 125, -71, 83, -63, 50, 39, 253, -267, 90, -43, 200, -87, -268, 208, -25, -103, -72, -24, 8, 146, -13, 23, -199, 51, 44, 20, 31, 100, -220, 193, -136, -214, 63, 65, -254, -9, 140, 65, 167, -74, -94, 77, 349, 15, 126, -330, 20, 143, 125, 200, -353, 139, -285, -121, 187, 64, -50, 322, 115, 171, 165, 92, 244, 111, -72, -92, 54, 94, 93, 80, -253, -38, 212, 136, -215, -334, -56, -15, -18, 32, -166, -173, 112, -161, 87, -101, 98, -240, 136, 16, -10, 20, 67, -34, -102, -80, -23, 30, -61, 114, -54, 114, -20, 51, -92, -177, 109, -313, -100, -200, 313, 68, -4, 45, 31, -68, 186, 33, -64, -93, 92, 81, -71, -148, 116, -225, 251, 118, -209, 51, -259, -130, -70, -8, 128, -235, -155, 131, 76, 228, 473, -142, 129]
6444A29j12q2M2kJ2j54J02O8K1m0m2l3K70k53K5R4l7l0O7kl0L26J8m9m72L79j24
6471I1k82L66K5l90L58O9k11j34K32j42o3J70l4k4q4P8j27n1m1J00Q1m06N47Q8
6495B16r0k42j15K50J87k23Km53P00k38j80L77j81J04k79J74p0J29K0l04J41M15
6517C40n03j41J38J61J07j93K21k41J52L0p0j9j23K39k63J45K61l38M3L4L0l1
6539b1j24o5K85j72K88l89K24J9R2k77J18J60p4nk59R8m3k3L92j48l3k51JK31
6563B4On6j36mq3P20o87K63ro2L1k07K79j64J77o3k5J80j94n1J77l12K04J0l0
6588a2J25j87m8k55N98n4l10J21j2mlK2J33k94K12Q2o4j11n1J18kQ5r5Q8LJ55
6614B40m46M57j26k42j80L37j58o9P2j04J13K66J06j99j72L29j49j25mP0L9l5
$$ y = [129, 17, -65, -23, -25, -13, -167, -65, 3, 24, -16, -58, -91, 179, -74, -49, 45, 8, -22, 45, 43, 13, 339, 357, 308, -164, 215, 91, -191, 175, 200, -190, 168, 237, 26, -108, 124, -18, -81, 89, 55, 31, -53, 25, -102, -153, -194, -94, -13, -419, 128, 216, 126, -116, -231, 19, 206, -17, -15, -468, 232, -6, -186, 191, 10, 114, -165, 9, -61, 68, 88, -216, -75, 340, -163, -304, -166, -5, 102, -91, 130, -111, 41, 71, 1, -18, -141, 98, -165, -20, 241, -97, -54, -20, 10, -21, -145, -210, 75, -97, 191, -198, 26, 45, 137, -140, -22, 138, 64, 59, -200, -102, -145, -168, 224, 76, 43, -208, -207, 24, 30, -26, -162, -166, -249, 471, -216, 47, 38, -24, 7, -200, 79, -85, 92, 29, 4, 184, -10, -61, 116, -196, 8, 18, -12, 113, -74, -122, -377, 221, 167, -143, -22, -34, -38, -41, -19, 114, -180, 32, 114, 50, -61, -112, 6, 4, 89, -6, 82, 85, 240, -206, 251, 125, -117, -297, 40, -118, -187, -115, -219, -106, 160, 266, 67, -105, 224, 75, -50, -54, 16, 55, 20]
6636B0N4J70k88K70q5k02N8J86j59n6L11k84J84l18J28q7J11l12N27k31Q0m21
6658c44K44L04k36J0J53K6k00N0r1N2l2j35K87M3k08o9J39J3J02K05n63M75j88
6681C7L3Kk66J34o2lL7J64j62K07l57K91j8j94J29k8J14m18L91l83O84m61l3K98
6705A36j94K77k02J15n87O76p2k82P3J97j17j43K50j86oL83m58L3k0J11o8N3P1
6728D0j11K26k56j04M62l68K63q0J09k83J21K05j31j24N0O1j15L5n1J71lq6q6
6751e5q0M73n14J32J09k48K03j8l9K50J29m87J04j84N4J13Q2j4l84M00N2L78m10
6774D6k5J03k92K06Pn9k3jL53l67k68N13j48J0r3q1O3O3J15j99P5P7k5r0L9R8
6800I7k3k33K42J4k79K18J44L7k65J00j84L13p5K4j24M6J14m13J83n5R9M8r5K03
$$ y = [20, 74, 244, -44, 226, 141, -61, -3, 183, 24, -32, 279, -5, 179, -139, -11, -98, 13, -299, 228, -3, 77, -344, -100, 204, -32, -22, 131, 157, -43, 7, -84, -32, -64, -199, 88, 131, -77, -146, -7, 6, 108, 313, -250, 225, 37, 70, 72, -194, -60, -122, -125, -88, 76, -86, 121, -236, 55, 37, -157, -28, -56, 58, -360, 31, -352, 332, -129, -162, 136, -58, 219, 17, 132, -455, 221, 149, -133, -60, 137, 20, -123, 127, -59, -65, 318, -140, -107, -127, -16, -84, -31, 40, -71, 155, -101, -205, 257, -111, 152, 72, 181, -102, 19, 224, 93, -31, 19, 80, -35, 0, -51, 120, 117, 31, -55, -135, 338, -176, -44, 65, -183, 20, 2, -37, 213, 342, -145, -41, -225, -171, -58, 24, 10, -374, 26, 78, 456, 46, 21, 124, -168, 38, 45, -14, -37, -38, 315, -52, -320, 193, 45, 55, -38, -119, -56, 7, 122, -77, -2, 75, 50, -40, -1, 97, 74, -159, 83, 97, -182, 36, 180, 217, -48, 52, -132, 181, 106, 130, 6, 52, 166, -247, -64, -119, -20, 28, -67, 136]
6824A36l06O4j3Q2MO6J36j91Q3ml45K20j13L74l70K78l7j8L1l68L47L23m00l5
6848e6J25m4k31J24J92k23K04p1o1%Q2K08q8l43L04k9l44r4J66K29j51P3J53m0
6872H5r0m6q4N7J80k38K03j64j04K98j6n1lJ60l71N7m7J50J94k05J09k9j19J64
6896I0k04L67l04r3N6O9J14L5j47j77j61M26j23L7j1n6K27j39J78j81k6J98k36
6919f1J2N1J12k19j5Q0Mj11J04R5k72N96m38r4L1N4n4J50N9q4l78K18J37Lj3j79
6945b12P2K32o1j55R5o5m8K35J92l25o3J12q2K93k0k11j58K27n4M9J46l49J97
6968D7N1k35Q2j01J04P4k5J23j2j31R0j04k88K19j25K17J4k06Q9L40j52J91l28
6991f6K10k11j0n7J56Q9l06K68lj40J17R2l43K88L8qj98J56K33l84q7L63k71K81
$$ y = [136, -170, -106, -119, -37, -33, 33, 169, -22, 61, 57, -288, -68, -181, 193, -177, 101, 64, 46, 77, -291, 56, 379, -21, -56, 69, 25, -206, -82, 110, -113, 91, 20, -41, -41, 41, 249, 161, -182, 122, 93, -251, -345, -179, 50, -101, -28, 125, 85, -5, -51, -135, -78, 102, -136, 67, -97, -201, 97, 81, 30, 27, 187, -184, -127, -174, -24, 170, -35, 74, 45, -74, 90, -114, 253, -51, -144, -88, -19, 95, 130, -17, -194, -355, 71, -52, -15, -26, -82, 145, 6, 184, 3, -23, 175, -61, -49, 2, 114, -105, -120, -40, -36, -147, -43, 52, -220, 376, -62, -156, -125, -71, -125, 25, 84, 0, -378, -160, -23, -20, -33, -212, -140, 92, 31, -124, -29, -94, -142, 93, 285, -40, -103, 9, -73, 220, 200, -11, -169, 58, 4, 53, 199, -150, 47, 98, -137, -55, -156, -52, 22, -3, 120, 108, -23, 67, -37, -325, -106, -231, -14, 0, -206, -117, 223, 71, 262, -66, 144, -67, -77, -134, 22, 111, -195, 73, 70, -70, 47, 139, -204, 84, 122, 114, -84, 72, 305, -79, -166, 197, -74, 207]
7015B07r3l13K68j81J63j18J47j54j25N6L31j88J85l3j21N4k00J91J9k04K19r0
7037B0j49K89r1j16N3q1O0oJ52m9l2j06J57k24R5n3Q1q0n3N4K32j43r3J76l0k11
7063a48L52j54p7Q8j05o0J66R8k64M8j64M9K24j86J49Q6L5k88K78l45L9K8J42
7086iL28l20K1k63K44J49l11N2J52K02o7l31R3r2L59k16J35j9L1rj89Q6n2N1p7
7111e2K15Q8Q2k62J8k21j5K78j11l0l3R3j21k21J50K17j65LJ98j53L17k10K9k20
7135a26J18k24J66k24K94l20R4L28nk15o9K07k21Q9j3k0J05J27j23P3Q5J75j89
7158A12m15L69q1N4j27R1J07k16Q2M0Nj34K87j39l71L30j5l7j47L40N4l64M7m9
7182a77N06m15K13l35J84Q7l1r3j8l17J48N99l53j14oK3J82o4q6mNR1k07L73k69
$$ y = [207, 114, -199, 69, -112, 51, -67, 80, -74, -199, -143, 188, 0, 185, 152, 31, 85, -115, 76, 95, -109, 110, 20, -129, 160, 69, -47, 6, -75, -15, -21, 131, 82, 50, -56, 101, -123, -28, -81, 0, -80, -133, -79, 153, 10, -83, 93, 63, -148, 204, 50, -27, 61, -44, -104, 62, 160, -104, -56, -220, -171, 53, -133, 16, 102, 137, -151, 127, -218, -179, -151, -9, 319, -1, 20, -243, 1, 150, -161, -109, 43, 245, 178, -153, -60, -152, 207, -9, 126, 107, 138, 129, -60, 26, -26, 25, -52, 163, 251, 333, 71, 89, -132, -147, 131, 20, -10, -43, 50, -71, -292, -142, 75, -90, -87, 111, -42, 275, 65, 94, -126, -8, -232, -66, -290, 4, -316, -222, 106, 101, -114, -183, 24, -197, -108, -121, -141, -36, 91, -32, 41, 126, 301, 112, -303, 66, -15, 39, -88, 3, 110, -106, -24, 16, 21, -113, 174, 35, -336, -6, -21, -58, -205, 135, 189, -175, -128, -177, 329, -86, 127, -208, -24, 63, 32, -61, -79, -396, -248, 351, -2, -116, -122, -99, 83, 19, -67, -71, -66, 25, -182, 191, -78]
7207g8k5j01J11L5J57k15j05K27j10P4j79Q7O1K66L9j81j38J15j59L76l31P6p1
7230f9J81j34K29L8k73L82n28J69n2O3K21k86K8j59j62K73N6o3Q5p0J8N0J29N0
7254A76m36L72j99o3j53K88j45K67j52K19j47J37o5j39j75K55K5M5J78o5j17O
7276A12J5J06l45J34L68l46m2o0j37R6J44j00J10k9Q7q3l2O6L8j83O5q3L25l99
7300a73J14J24J01M4k96R1o6j11L48k24p4L1J40r5N6k30K39k87K82Mk27K00j65
7323a74J66j63K51P9r6l9k0k02J76j40K12j40M5K3m3q5Q8L3j33K65j72M2J29p0
7347C2N2j33K9M70l97k33q3K34n7K33O2j21j31M3J22p4r7N6J32l65O4K89j22J87
7371A92l09K0J63k41j15K35J63j55k6K22k25P2N7Nj26j23J78K8l2%j59L56l04
$$ y = [-78, -103, -204, -93, -58, 99, -116, -221, 6, -104, -30, -209, -122, -61, 205, 244, 63, -75, 40, -119, 257, -74, 2, -69, 112, -22, 207, 245, -28, 354, -174, -5, -57, 6, 227, -59, -31, -190, -352, -79, -23, -86, -1, -71, -53, -3, 126, 176, -260, 112, -87, -150, -303, -15, -160, 107, -45, 174, 27, 164, 99, -40, -215, 40, 65, 110, 288, 223, 106, 112, 127, 233, -112, 22, 390, 44, 2, -58, -195, -99, 45, -55, 55, 26, 113, 30, -2, 64, 102, -81, -16, -99, 226, -173, -59, 65, 166, 210, -86, 5, -61, -172, 176, -48, -122, -91, 49, -46, 10, -220, 19, -268, 14, 18, -209, -9, -174, -8, -171, 80, 159, 63, 24, 4, -198, -22, -162, 50, -90, -45, -22, -65, -150, -62, -29, -162, 103, -69, -27, 102, 32, 84, -49, -20, 450, 53, -180, -263, -29, -86, 147, 209, 88, -43, 0, 122, 48, -49, 7, 139, -226, -162, 127, 5, 192, -117, -97, 66, -175, -290, -55, 108, -47, -73, 149, -76, -4, 53, 58, -68, -191, -13, 15, -17, -17, -176, 180, -124]
7394a24p3O3o8J06Q6k09K85o2j88R7N7j09K43r7j45j4J8K08k27L37q4j57Np5L28
7419B01k56LJ63J17p1j40J52k57M8j29jK47J8j56OQ8k40J89J11j6l19K52p9J27
7443E8J20k73k68J21L56Q5m1k78K2N6L22k59q0o6K34J22k81J58m84J47k5J17k5
7466a62J43n6K15m07n9L17J12m7J25j95j29J96K8L6k79k1J93k47J40J15J9j77
7488a40k04L54o1L43m35K91k78P7J20J2k54j23K21K63J0m18J15k7L08k31j28N45
7510C60k85O6M2r0k32R0j33J42L63m71J21o2j06J05J48j2K7j21RJ00j4J9K6K7
7534A19n0O7K3l11J93Q5k77L64k61O1j9n5r7J99K9o3J70r1l19K74M6k02J68J29
7558A82l35J58l00L64j32mO7l0P9p3R1k41K37j88J26j11K35nJ60l35k42Q4K69
$$ y = [-124, -197, -134, -202, -96, -10, -219, 66, 4, -184, -87, -30, -139, 104, 7, -138, -152, -134, 74, -153, 184, 100, -57, -52, -127, 201, -55, -52, 111, 228, 157, 17, 169, -88, -40, -169, -170, 77, 95, -61, -55, 33, -207, -18, 93, 77, -242, 10, -69, 58, 178, -95, -363, -242, 114, 199, 158, -120, -98, -42, 280, 21, -59, -125, 109, 231, -50, 108, -376, -229, -254, -137, -162, -19, -75, 140, -267, -326, -9, 103, 56, 181, -14, -143, 53, 81, 117, -162, -183, 10, -237, -97, 18, 37, -140, -344, 10, -51, 292, -143, 148, -130, -53, 67, 79, -175, -298, -77, 186, 196, -222, -107, -134, 174, -57, -185, 360, 75, 141, 183, 93, -139, -49, -182, -40, 323, -148, -27, -89, -195, -90, 58, 46, 73, -48, -39, 61, 47, 66, 92, 119, 69, 136, 159, -152, 41, 126, -151, 213, -48, 13, -6, -61, -158, 41, 70, 7, 177, 86, -233, 41, 87, -115, 53, 182, -153, 5, -295, 69, -63, -67, 0, -30, 49, -24, 67, -174, 63, -125, 1, -110, 125, 120, 280, -55, -297, -213, 56]
7581E6l93M31Nk41J2P9J17k34J70k2J15j23r6J72q0lN0j39K66j20R4N5k86J42
7605B7j07Q7L8K4j44J14M4m1Jj30J27J48j6j13j66J89M4j49j18P8j4J95l05L6
7629a51K18j29q3m0K13q9J43J37j43j93J72l13K23k19M00j59K28N9k81Q4k55L99
7651B21k88j92N28k10K3k09K28r7o5K59k31J86l65K68K58k19k80J36j90L92j66
7672a3P8K06k42l0k34L30p5n4K28k47P1K5J82m9k55K31M8m07J69K18Qo2k89L56
7696A93j14j55j6L08k14j71L14j96j5QP1j91L13r4M4j96m0J48Q0L2M0J2p9M5p3
7721E4J07k50J0j47K88q7K73l61K96l4k25K79k74L7J41L0j61k8k25L02R0k96K18
7744C7K1Q7K9j23p2M9j6K4j62J20J17k74Q9M0M5l44K69O0J15k33k24K65K35j81
$$ y = [56, -337, 94, 99, -142, -130, -51, 66, -168, 2, -20, 95, -28, -124, 48, -32, -35, 15, -124, 142, 22, 116, 171, -115, 27, -80, 7, 45, 69, -75, 39, 83, 42, 43, -87, 40, 188, 172, 59, -107, 82, 126, -23, -141, -63, -77, 118, -187, -151, 67, -62, -145, -185, 28, -61, 82, 219, 76, -117, 55, -258, -35, -254, 146, -13, 215, 274, -7, 77, -178, 221, -67, -259, 269, 59, 82, -127, 101, 4, -61, 198, -33, 153, -212, 56, 314, 95, -185, -49, -239, 153, -13, 65, 271, 29, -1, -235, 95, 20, -34, 194, -53, 18, 43, 225, 176, -79, 152, 200, -207, -38, 180, 188, 126, -163, 193, 79, -76, -92, 216, 2, -169, 145, -51, -66, -58, 13, -178, 135, 41, 85, -111, -151, -3, 77, 109, 149, 161, 82, 127, 54, 161, -89, -79, -226, 62, -25, 248, -113, 183, 149, -76, 203, -71, -34, 107, 137, -24, -52, -277, 25, 115, -181, 37, 58, 145, 174, 51, -21, 28, 12, 36, -126, -6, 111, -163, -74, -34, 11, -333, -64, -4, 111, -122, -346, -81, 154, -27]
7768b7K23l27O5J96J17j32m9J61j57J50k61j7J76n7n6l8L4P1k9L0j64P7K8Kq7
7793g1J13R2k53j95M52k38k8K21l08K31l4K46j51q4o2o2J06K36j70K20k73K05
7815A93k05K90m63k4K30M7J3j04j20L8K88m24M9M84k91L3jJ36j47P8J5k59K36
7838I2j56o0K81o6R5k61l1kK40l7j32N1J3%l4j24J11P6R4k70M4J24j29J47J43
7863B09j60J02l14K97q8J8j04L5N3kj8M8nq8P0M0Q6l00J30J23l98J70J67K2k17
7888a24K11m8J56n0n5n8RL1j75J26J14l24K16k27M81j74j13K96k95L2Pl26L11
7911B1p4m4opm1l1L76j63J46n4k03p0K58qr8K1nk6L46o20M25p9l09J61j8K01m58
7938c59N00P1m10L34j34n3L8m9J00k77M05l4l01K99j92L7J63k76L57j27n7O4j44
$$ y = [-27, 196, -131, -66, 130, 247, 115, 66, 227, 70, 220, -41, -58, 118, 61, 5, -33, 1, 72, 43, 73, -91, -14, 14, 16, -71, 42, 134, -119, -314, 138, -100, -128, 93, -215, 16, -18, 228, 77, -7, -69, -131, -25, 211, 41, 261, -12, 193, -12, 278, -185, -209, 21, 68, 81, -23, -143, -105, 183, -241, -192, 292, 1, 34, 33, 169, 22, 100, 115, -144, 92, -64, -124, 157, 91, 186, -75, -106, -108, 132, 95, -37, 14, 27, 27, -7, -131, -20, 56, 150, -120, -76, 48, -81, 66, 209, 49, 151, -163, 134, 46, 64, -40, -5, 48, 46, 28, 76, 71, -17, 53, 93, 179, -121, 9, 132, -266, -96, 71, 93, -124, 87, 39, 195, 145, 90, 32, 41, 72, -103, 23, 137, -187, 29, -198, 283, 109, -4, 292, -3, 29, 36, -290, 21, -53, -97, -103, -110, -151, -182, 194, 31, 177, 123, -80, -150, 108, 100, 2, 23, 18, -8, 338, -282, 143, 64, -245, -84, -102, 99, -359, 141, 212, -198, 136, 2, -51, -13, -62, 38, -239, 166, 132, -169, 130, -62, -25, 138, -138, 219, 92, 35, 99, -45]
7961d5j70k5K89j47O1m5q8J97j54K46j72J89k33Q9j24K26M1k8l31k9J11J36j24
7984a30J78J06K0l01N9J46l62M14j88n4l8j28J0L12j59L61n32M11n08N41l84K0
8006b06K77J6N5j48o4j04L2J94N7p5j67K16o7k58K13K35m3l51Q1J24j04Lj9j37
8030b40J09J7K34l78M5K86k36Q0J5R4J89J16l92n6J46j7lm9K4j17J42j38j39L47
8054G9l4q6p9L0PK01k39L40q8M7j77l51O61m53K32k80K33k05J80J8k36M02j18
8077H4j89k67M69k38r8J75M40m84j4K49k32J52k18l8L18l06K4K71PN5l33j23K98
8100BJ99j98J3l77M80L8l52J03m7J74m9j06j42K74J4K27j75k12R0j66K23l59L65
8123A9M5k5j36o5L86m68L15j20Q6n2J25k8L0l12K80j29j43L14l11L08r3N4o2L51
$$ y = [-45, -215, -240, 49, -98, -37, -82, -170, 27, -127, 119, -53, 136, -97, -8, -132, 94, 135, 107, -224, -253, -142, -6, -130, 48, 154, 174, -127, -68, 78, -284, 130, -58, -112, -150, -278, -268, 44, -115, 246, -286, 125, -383, 158, -226, -206, 71, 87, 142, -6, -70, -174, -142, 52, 109, 34, -133, 83, 16, -242, -29, 206, 163, -188, -107, 17, -87, -84, -103, -240, -131, -114, 120, -258, -213, 73, -163, -83, -68, 26, 215, 331, -61, -117, 29, 12, 9, -40, -16, -133, 9, -129, -268, 79, 45, -41, -120, -90, -83, 118, -121, 219, 131, 178, 1, -350, 311, -142, 90, -190, 43, -162, 18, 36, -200, 202, 84, -105, -372, 97, -141, -239, -64, 376, -108, -122, 127, -105, 47, -171, -209, 109, -197, -173, 98, 105, 160, -173, -296, 2, 201, 3, 16, -361, 119, 157, -195, -92, -139, 35, -14, -120, -262, 12, 26, 253, 78, -134, -44, -210, 13, -346, 19, 64, 39, -97, -162, 224, -244, 71, -49, 37, -15, 110, 82, 112, -200, 80, -49, -192, 122, -189, 119, 26, 80, 18, 369]
8147C69l86J81m67L67l1J63r9j73J27j34j97j18L85K11k43n4o1J89J7j13n7K11
8169H7m1J30k39O8N2r9J32j44j0K8J42j11r0j41l2J83K94l93K36j06N9l42
$$ y = [369, -17, 164, -303, 64, 33, 196, 97, -76, 51, -83, -280, -398, -13, 198, -45, -99, -160, 29, 46, -67, -124, 87, 46, 176, -63, 5, 57, -42, 90, -54, -64, -36, 106, -5, -95, -236, -268, -85, 209, -184, 52, -54, 5, -337]
8191c37
$$ Imaginary data points
##PAGE= N=2
##DATA TABLE= (X++(I..I)), XYDATA
0@%%%%%%%%%%%%%%Qj6J6j6J6k3L1l2M0m8N4o2P2q6R5j06J22j41J62j82K06k33
36a23K60k91L28l65M05m52N01n53O11o75P45q22R05r96J099j211J334j473J628
55H55j804K003k232K499k811L189l656M244n015O072p616J0092j4690K6023j04124
70h6971j58886K39085J36840j20150q4004J19960L7755q4319j3304M6358j0665
81B1699L84n78l7035j4592L5914J2178j6410P72J9199k2171k3490L7422L1962
94D5254k0117l450p642l8279j571K2687j3899P986N4419P408p7438m6493O4282
107f853N1960n3932k9349M4280l695l8928J7116K8008p242m764K702k4729k0059
120d5485M7789N4231m1235n2514L4080K8988m2002k5196L6947M4529q621m3773
$$ y = [0, 0, 0, 0, 0, 0, 0, 0, 0, 0, 0, 0, 0, 0, 0, 8, -8, 8, -8, 8, -15, 16, -16, 24, -24, 30, -32, 40, -46, 49, -57, 65, -76, 86, -96, 110, -123, 137, -154, 174, -191, 214, -238, 263, -290, 321, -354, 391, -431, 474, -522, 577, -634, 700, -773, 855, -949, 1054, -1178, 1321, -1490, 1699, -1957, 2287, -2728, 3344, -4272, 5820, -8870, 17153, -86971, -245857, -6772, 130068, 9918, -74086, 45874, 83629, -690, -13994, 32364, 21699, 22083, 21505, -15530, -30122, 5792, 17970, 1560, 2332, 21531, -640, -24130, 13292, 45254, 25137, 21687, 14045, -24234, -25805, -3118, -17017, -9031, 45388, 52796, -24642, -71135, -6853, 45107, -8825, -38174, 6106, 2411, -36517, -19401, 8607, 1365, -3399, -697, -25426, -45485, 2304, 56535, 15300, -37214, -3134, 25854, -16148, -41344, -4397, 40132, 31511, -12262]
132a2262j129L5565j7k2773N400J6510r899l2120j1388K6875J7526q654o180l678
146f224K141J3031J398l185J0730J392j6333j9421j0218J4353K3682l211j4576
159f441J846J0172k085j6320L820K6376j0738l9705M061L2181M895p205J0598
172A1455J0545j4152j8620J1042J2505r285M020O411k3619j2761K2176P417j8325
185a1191K259K7755L581l0763q741K4476O688j2540n703o881j810J0106K98j308
199c774J5141K883k5280j7631J7099K4735k336j0742L755o043j2812P388N497
212b120n062J0006J0002j2706j1048J4716J5343j5358j8113J6362J1669k4240
224a0549q756K7867J5763j3106j1650L123M536m933j157Q573L419o314j2481j5589
$$ y = [-12262, -13391, 22174, 22157, -616, 4784, 21294, 11395, -20725, -32113, -5238, 12288, 3634, -2546, -6224, -4083, 8948, 10346, 7161, 17891, 19283, 2950, -16471, -26689, -12336, 11346, 8135, -6441, -4595, 5577, 3492, -12828, -9008, 17368, 6630, -33075, -29014, 3167, 8062, 857, 11455, 22000, 7848, -10772, 270, 12775, 3490, 7510, 13921, -9698, -22459, -283, 7134, -11191, -8932, 18823, 22404, -8359, -17100, 7376, 14064, 1524, -4179, -11060, -12870, -2764, -2466, -3774, 11367, 14250, -11030, -28661, -11562, 13173, 10837, 95, 3850, -2193, -15005, -7617, -2120, -7182, 2824, 12826, 120, -10928, 3788, 19131, 3773, -14340, 2022, 13691, -10549, -19305, 8562, 24325, 11219, -431, 2692, 7228, 2295, 1138, 9711, 13130, 6816, -5665, -21254]
238b1254K867K2353Q655q445l662K592j60l047j675L619R28q096r511k365J4268
253b933J7605r175j8345P744J3438j1114j4309Q573J7524k963j6685j491O600
266e531j32N870J0204k619o344k99k346l961M474R631k491j4192K09J3839k087
281D225r583R803J4211p237j9708m424J8756J5158j1024j6744O37Q884k79p621
295d946L113J2664k048j2144p27L992N46K000J473m149n310J65P36k270J498J2103
311F696K897j4803n072J0344L612p869k610O919L24j3164l785J6686J1652o028
325E799q882J7M419m92m227K612O496j741p243o005J760J2243R452o663j0265
340b720J543Q243j523j0217J601J2007k573j2895J089J0752K538n210o68N959
$$ y = [-21254, -18387, 3966, 12621, 4176, 514, 3106, 2946, -101, -1776, 1843, 2771, -5325, -14836, -17201, -2933, 14672, 5497, -12848, -5104, 8334, -2780, -17089, -8516, 9008, 6045, -10640, -12131, -5531, -5663, 207, 10411, 7792, 1448, 1149, -1197, -5158, -684, 8947, 6456, -7736, -7527, 6312, 4225, -5358, 4445, 18656, 11419, -8289, -12713, 6043, 21201, 10177, -6567, -5930, 2954, 2675, -4946, -1833, 10831, 8783, -3361, -4088, -96, 450, 2450, 3923, -226, -5536, -5371, -4635, -6905, -5407, 6696, 9593, -5210, -10282, 62, 3674, -4195, -6805, 114, 438, -12726, -16511, 175, 11827, 5799, -3083, -3066, 1353, 861, -3366, -754, 5742, 4001, -3242, -9247, -7487, 4756, 14208, 7545, -2720, -1177, 7066, 5543, -4674, -3073, 8934, 6361, -6534, -5445, 5307, 7845, 2635, 1967, 7926]
354G926k466j2432k123J0641N979m734p846j589L540J553N95K574N82j030m97
369F73n227m100O591R934k590j3103l145J0942M282q204P80R768k198r388j494
384f479P977L152m520j462L461j565l601J177L601K667J341k785m661j036L149
399D16L111k031l801J472J460n552k465P663R966j969j1284l182P006m2o449K601
415c080P085j872q769r70R086N285m229k947N30P06Q1o15k86L358J803m023n823
432d680j3O682M761k883l153J991o88n932l266N510R117r06q615j548N256J260
448B893k036Q13L36l002l838O05J642Q70L187j057q063m303O755N381l6R44K941
465D032l608p006K53P673L156m130k034K186K576j864n220J811R686J077j0969
$$ y = [7926, 5460, -6972, -9095, 1546, 7525, 2791, -5055, -6644, -3104, -1551, -956, 1618, 2200, 1170, 673, -4554, -8654, -2063, 7871, 5281, -7822, -10967, -25, 4257, -3947, -3167, 6601, 4403, -4985, -6479, 1498, 4650, 130, -1332, 2129, 564, -3037, -1860, 1741, 4408, 5749, 2964, -1697, -2733, 416, 3527, 1496, -2305, -833, 627, -4925, -7390, 273, 10239, 8270, -3014, -6196, 810, 768, -5681, -3080, 4005, 2133, -6636, -7606, 1480, 6765, 2536, -411, 119, 825, 906, 291, 5, 3363, 5166, 1143, -4680, -4693, 1989, 6750, 3867, 714, 2705, 2017, -3915, -7181, -1671, 7446, 6540, -2075, -3623, 1633, 2893, 857, 1670, 2006, -996, -4834, -4229, -2587, -1717, 1470, 413, -7650, -11953, -5198, 183, 147, 1091, 4032, 424, -6582, -6329, 1344, 4500, 370, -1664, 522, 3098, 1234, -3986, -2175, 7511, 8588, -2381]
480b381m884Q483O858l340k692J327k501l926K740M741P94K951q42r548n102Q022
496G00M235o400j449P210j358r694J887R394o27o175j668o93k51K201N18j779
512c949K297J673n690n117O617Q973j772l953J727p91k948J564K392J4K140Q44
528D021o049l711P415O071o878n359N308J872n767R88P888J811m937k223O41N15
544A606J231P34q29J349J364n199o873K171P352N3n229l287J212M085J921k530
560h69j347K552L98m368j443N940L381l907k864K665k95l060j103L512M465j9
576C638m347k917J837K401n74q34K653K44l561r98K845K314J117k227n691j294
592e394O664L666m142j191M276j103o828N55O716q8m131J230J389k813j416j1
$$ y = [-2381, -7265, 1218, 8076, 4736, 2044, 3371, 870, -3056, -316, 4425, 5219, 8170, 7328, -2220, -7322, 700, 4935, -1465, -2914, 4296, 2938, -6756, -4869, 4525, 3898, -2277, -3945, -4638, -4889, -2688, -2170, -3949, -1652, 21, -5669, -10786, -4169, 4804, 3032, -921, 806, 15, -2933, -1369, 1023, 1037, 3177, 4021, -2028, -5739, 1676, 7747, 869, -4490, 818, 2690, -3077, -2089, 5799, 7610, 2673, 450, 1091, 1606, 2837, 3571, 2742, 4091, 5455, 256, -6617, -4446, 2906, 2959, -2270, -5557, -4345, -260, 1661, -869, -2216, 336, 734, -3634, -5077, 863, 4244, 337, -2527, 138, -157, -3217, -4320, -808, 3657, 3638, -709, -3626, -1789, 612, 38, -796, 1857, 2101, -1460, -2458, 387, 2701, 3818, 1591, -4100, -5394, 1270, 4936, 794, -397, 3879, 2776, -4052, -3497, 3219, 3131, -1000, 230, 1619, -1194, -2610, -2621]
608b621j141K174N037k107p196J927P986N02m469R87P54l547K71M422R13Ml34
625C562n196m822N243N814m063l909N596J195p227k09O553L97m110J706J339k226
641c57L33K426k068j446L539j185q170L13Q921K067n660k048J831j539p53K902
657h94K635M72j604k700k279L658M604k669n054K468L721j846k436K146K865o15
673B472j823j528l35J573K371K72o30l39j710l244R21M769J750l368k819O31J855
690H18k24o51J405J670k039l162L14L583J475k072k560j088P93O10q27q01K786
707C0K671l210m855J411M249O26j728R83Q36k554j479J765K052J246m90m456j869
724d772M245L669k568k181L109R8m005l89M765J724k024m02m21r70J011O24j437
$$ y = [-2621, -3762, -1588, 3449, 1342, -5854, -3927, 4059, 4561, 92, 1079, 1833, -1714, -1443, 2979, 3892, 3896, 3562, -1634, -6456, -1213, 4601, 538, -3371, 2225, 3420, -3807, -4016, 2537, 2934, -1176, 530, 1869, -357, -24, 2402, 334, -1112, 2427, 1242, -6928, -6615, 2306, 4373, -1287, -3335, -1504, -3043, -3796, -894, 1741, 2213, 609, -2091, -4370, -712, 3892, 1223, -3831, -1363, 2358, 512, -1924, 222, 3087, 2472, 649, -879, -1214, 359, 2730, 3002, 2372, 2033, 323, -2921, -2000, 2769, 4519, 1151, -1668, -1037, 818, 594, -57, 1348, 3018, 979, -2183, -1869, 1714, 3189, 1117, -1443, -2531, -1738, -1128, -1955, -2756, 30, 2701, -509, -5364, -3953, 296, 922, -806, 177, 1013, -1541, -3020, -1255, 797, 2043, 1553, -2903, -4772, -527, 3142, 574, -1607, 1502, 1600, -2405, -2794, 1971, 3695, 1671, 1269, 848, -122, 889, 1513, 76]
741G6L88L534j318n773J78N547J074l154o83P12j478n92K586J324q13j309j726
758a427j756K222L060j864k330J588J240l240j450L293K551j363k452J89K39J512
774A2P88j510o22J912L36l404p61L806K891k735l040O66J479K53J08J029Q13n49
792A472j875r05J437K594n75j875o76J184r5j198L87K002P08k441k457J455K361
809A503j60j238k14P40l09k019m00K289K240j052l640m54K907Q52j969K84K215
826A575o20k921k65K515J524q75j228o87M55P02p6r34J336J739j973k977R22L226
844A438K73j804j95O18p87o51Q19N40Q52M00k197j984J481K576m07j896N59R01
862E36j470j039J217J950K4r76j231j3J031L70n71K38J752q07l409N24L719J384
$$ y = [76, 464, 3998, 2680, -3093, -2915, 2632, 3706, 552, -131, 581, -897, -1489, 1097, 2421, 1608, 299, -1427, -3183, -961, 2099, 235, -2095, -507, 733, -2507, -3957, -664, 1887, 524, -1928, -1739, -1500, 12, 800, -710, -1332, 580, 916, -2488, -3249, 557, 3448, 713, -2327, -1661, -182, 71, 179, 1208, 2021, 1472, -403, -1308, 129, 2723, 2148, 273, -403, 781, 686, -512, -125, 1877, 2585, 144, -2313, -858, 1503, 1343, 105, -109, 631, 322, -1697, -2097, 192, 2432, 1380, -2260, -2714, 193, 1045, -924, -640, 1575, 955, -1966, -2231, 284, 1808, 933, -295, -982, -527, 175, 99, -835, 501, 2240, 267, -2710, -1788, 1438, 1711, -93, -288, 330, -457, -1108, -289, 251, 1103, 1503, -694, -2678, -1197, 1379, 972, -924, -365, 536, -934, -1973, -756, 1194, 1218, 242, -989, -1002, 29, 399, -172, 66, 1818, 1011, -2398, -1874, 1845, 3229]
880C229k497j768J395M37r35j20R60J635o49k164j240J444K122J13j708m92O47
897D09q49q88J151J077J04j747j695R27R35M34k97k20K63l78j635K80K372J387
915A630j544j927J73J017P15p21J61R10j2j256r04J223K576m41j788p94J047Q92
933I57k10J53R19O87j348j766L14K041L18j227p70P40j88j120j25J449J044j492
951C76j562j11J247O17m45q04L31M81j051j279J162J796J8j687j039P85P21rm56
970i09O55M20o11r76j02J610J048j206j666J185Q87p57k38J134Q68k58j781l90
988a087J925J130k14j336n7J085n77j636J39J930L68j705j145M60J192j62n71
1005b61J95L35Or69m81J819J467j538j537L08P28j24k33J92P48k80j156q78N08
$$ y = [3229, 732, -1036, 359, 796, -139, -259, 701, 2336, 1687, -477, -1717, -273, 1849, 1962, 254, -238, 409, -440, -1328, -177, 900, 1004, -743, -2438, -1511, -576, -142, -439, -659, -396, -774, -2409, -2129, 243, 1630, 86, -1841, -1668, -651, 64, -657, -496, 414, 402, -854, -1758, -535, 2041, 1600, -188, -982, 65, 957, 747, 900, 1819, 2506, 1158, -608, -294, 1747, 2065, 838, 68, 808, 620, -500, -625, 824, 1868, 376, -1186, -1297, -50, 567, 122, -682, -351, 130, -921, -2200, -1038, 758, 776, -911, -1950, -1165, -444, -453, -909, -254, 166, -445, -1421, -1523, 87, 1135, -71, -1737, -552, 335, -422, -660, 474, 1342, 1084, -697, -1087, 838, 1968, 1754, 418, 361, 1446, 869, -767, -628, 1302, 1670, -35, -1180, -720, 472, 310, -261, -66, 269, 275, -694, -1175, 644, 2111, 573, -964, -656, 72, -52, -285, -93, 655, 375, -781, -1659, -1151]
1024a151J452K79j321J29Q16m7o47M9J372M6o31j093k69J418P26n69j084K64Q92
1043F31j175r18J808J101j106j143j98P50N37m81J06N5L12k45j397N28J936K61
1061A362j809p9Q14J82r46N45Q70L7q03j133l08J277J749r51j895M06J107m26
1079aq58J072R33m69p84J7N24O65q7l41p78R07k84j333j03J766K58j433j147P28
1099g48P19n30J18N11M2k78r25l57J543J318j211j385N6J106J45m51j55O65Oq64
1119f75m72N12R18K73o86m11P55j86q01N23J239K66o79r61j96J119N52j97m80
1138D13q0M85j046k66J475J125j629j628M33J208P6l24m14j27Q91m41j124k78
1156a251J587O07j636M6J197o77r78Q66P34j73o91n89m98Q75J090m49j409L70
$$ y = [-1151, 301, 580, -741, -612, 204, 157, -490, -441, 931, 977, 346, -747, -1016, 402, 1128, 559, -525, -261, 631, -544, -1462, 346, 1447, 341, -802, -1000, -250, 287, -194, -88, -33, 279, 34, -1363, -835, 1101, 1362, -447, -526, 288, 470, -476, 69, 939, 976, 173, -960, -1268, 9, 1758, 807, -1088, -682, 425, -1, -859, 213, 1146, 677, -107, -90, 434, 1099, 1012, 671, -107, 800, 516, -817, -920, 846, 1104, -329, -1476, -748, -29, -559, -441, 70, 112, -166, -1091, -1448, 95, 1413, 202, -1183, -1127, -21, 124, -327, -482, 183, 189, -675, -1147, -635, 283, 556, -130, -541, 214, 28, -773, -250, 989, 1255, 576, -385, -581, 538, 1090, 893, 413, 333, 818, -228, -494, 981, 2106, 477, -1151, -718, 490, 566, 242, -172, -299, 592, 151, -973, -1251, 336, 943, -693, -647, 550, -127, -1105, -239, 495, 322, -369, -958, -1456, -581, 509, 60, -1349, -979]
1174i79Q89p61l28J570O70j246p80Q68L15J35L19k08p41R19K77j354m71J372J154
1193A620j375n58O35Nm92P35L92m27m34j63n62N79J483o68j542k72J302j88l45
1212b75L12M96n82o83R7P63P6j2o12l02J058mj291n18J626O50j324m94L49K67
1232d03J43L82k18L24j97o52m40J338J428j242j423M89R44j20k45O9J1J59l71
1251b4k97j83J050K46j008k69J333l64j028K86R88R5n74n45q4J56O36L34j061
1270c13K71K97o25m87J293O55r64r81N60N16j37K28Om60M45R1p83m42J340M74
1290I84j386j74Q94J45r96L44P83l04k61k76o16N29J010J32j386k78R40j9p83
1309g18L70J054p88n01N3L21P5K05k96KO8M62p39n02J532N33j275q03Q27M13m24
$$ y = [-979, -90, -851, -1179, 391, 1061, -185, -965, -97, 218, 353, 672, 464, -277, 642, 919, -435, -906, 466, 1620, 245, -313, 322, 327, -165, 570, 962, 535, 101, -62, -624, -45, 1438, 770, -772, -1044, 258, 70, -275, 37, 533, -49, -732, -635, 128, 204, 192, -420, -722, 336, 332, -959, -1477, 149, 799, -525, -1019, -670, -403, -260, 122, -96, 228, 31, -621, -1061, 277, 1705, 463, -960, -471, 473, 353, 108, 177, 188, 347, -24, -321, -504, 546, 792, -216, -485, 848, 484, -544, -258, 730, 825, 251, -294, -378, -222, 414, 748, -313, -42, 255, -370, -857, 436, 1091, 127, -854, -294, 222, 85, 313, 319, -141, 304, 395, -388, -830, 510, 984, -402, -576, 318, 463, -533, -189, 594, 290, 29, -247, -863, -334, 676, 808, -578, -856, 84, 65, -718, -348, 706, -82, -583, -530, -209, -134, 71, -225, -223, -155, 307, -432, -934, 598, 1131, -144, -947, -120, 293, -131]
1330a31J28O21K6n93l47j11M02J118l63p78l15Q44jk43j54L98k82n19R1L73J83
1351C47J75l71n99M29L76q06l81J027N13r22o02K58L54M58n98j00J66K72m08o34
1371a046O92R48n19j056J23N65K94j44o2K46J63j43l72O5O19O28r82l13N82j7
1391B71L2%M60l4l52k77j20M37J32mo41k6L80K37n84K41O09m02r12l2N49K09j04
1414F9l04kK6K28m61j95O16M44q20n54M48N83k07l28L10L25l27l53K11N7K18K45
1436B29m67n5L44L90p42j45J284n21n94k31O16K11J90l52j58L1K98m48j77N51
1456B54L01n33n23L69L67K13m93J85K86m56n0k27J95M77j92m68k89M86N84m61
1476B5k19L93K92n26n20K09M44K37o15R6K0J98j09j29L42L88m60m67M0L40K48
$$ y = [-131, -3, 618, 644, 51, -296, -407, -5, 1113, 750, -28, -343, 501, 500, 257, 103, 501, 219, -300, -209, 164, 347, 522, 151, -448, -19, 357, -449, -830, 197, 710, -212, -814, -556, -202, 256, -342, -442, -276, -4, -412, -1046, -354, 594, 75, -981, -858, -293, 1, -143, -205, 41, 204, 61, -311, -246, 373, 1001, 19, -294, 288, 271, 303, 303, 763, 729, 377, 100, -20, 417, 549, 545, -96, -122, 258, 495, -89, 152, 761, 359, -553, -585, -36, 173, 69, -235, -237, -211, 17, -444, -639, -23, 421, -399, -953, -505, 78, -129, -457, -147, 178, -149, -502, -291, -234, -16, 229, -238, -293, 51, 441, -301, -446, 838, 317, -277, -508, 108, 319, 509, 157, -1, 30, 328, -120, -297, 254, 555, 22, -501, -132, 235, 448, -45, 140, 426, -30, -80, -307, -112, 365, 173, -295, -584, -98, 486, 25, -194, 199, 491, -35, -555, -346, 98, 335, -280, -184, -164, 34, -75, -204, 138, 526, 66, -401, -361, -21, 227]
1497B27l04J2n7Q2l0j24L22J65J5o16j40M34K62Rl17J32m8j59m33N47K74P2P3
1520C98r05K35M80q8n35M15J98O1l59k60M93J90j67k10J50L65m73R4J83J56K4
1541D45n99l02N66K8J60n25R7J7J13k76m6O18L70l62n69j98M73J78l37J2J65J58
1563A86n75k83L08K41K60o68J8J19K76k14L13J10K42n16k43J37M83J05n00J03
1583i8P3L66n55o7M81K87l14m22K24K71k9j77j93K60j9j30Q5L6L16l2n51k10N13
1606A15K16k88o4K6K80j46l54m2K99K33n93j92L17K13k71j6J79K70n65q9M1M51
1628B0j14k09N2J01K11J1j39j66L95K30o66k32N01j5J18k37J44J72N7m01m3K25
1650A5N79n35K0J22l0J29j57l1L28m18j6k38L26J28R3n74m7L30J3j58k12O47j16
$$ y = [227, -77, -65, -122, -40, -70, -194, 128, 293, 308, -308, -448, -14, 248, 257, -60, 72, 24, -135, -568, -21, 253, 325, 398, -507, -272, 208, 120, -415, 0, 198, 259, -100, -360, 133, 323, 156, -54, 96, 461, -12, 82, 265, 421, 445, -154, -456, 110, 138, 298, -227, -130, -113, 0, -276, -322, 296, 666, 304, -265, -463, 10, 188, -149, -137, 28, 186, -389, -672, -364, -123, 137, -531, -513, -394, -118, -332, -19, 91, 333, -183, -426, -289, 194, 299, -201, -98, -25, 341, -214, -281, 200, 487, 173, -249, -25, 246, 217, 40, -153, 107, 88, -42, 43, 79, 395, 363, -188, -398, 115, 331, 43, -21, 5, 285, 139, -215, -257, 42, 275, -318, -510, -193, 20, -251, -267, -88, 182, -383, -472, -431, 20, -94, -303, -251, -150, 61, 72, -67, -233, 162, 392, -274, -506, -5, -20, 98, -139, 5, 177, 234, -167, -210, 15, 594, 59, 79, 201, 171, 300, 143, 112, 440, 22, 6, -232, 94, 222, 315, -259, -306, 24, 37, -121, -333, 314, 198]
1673A98q0m87M41l1j59K81Nj45J4k98K38LN33p45k34K29N43M6m13J8q3J17j72
1696a81k7K18Q8O3j42l09N67m3l85j45M99J59o27o4J14O9M52P3k78k50m6K63m25
1719c57L80M71n11m59M23K88Rl15J27k22O9L05j64k28N20k22j32n57O37L24p01
1740c15L55K59k40m11L74j76J14L85j04m81j23O03j35k17O5J22j9j50j04L89k71
1761h0L72m19j73K15P7j35J25J79R7k56m24M69o5m30J78K38l3J99k33l26M71L84
1783D30k10o88r3O55n0j87P5K17j59K1k1K94j3O5k25o7K13J94N2q79N31J60j85
1806A30l28M38l71K94j45j53J15k4J08k19k6M25j30m46l01N68J85k66J94k4j12
1827h8K23j21j19j33N50n68k65N54k2l86L9N53l05L6k3l6L83J8j00k59p1K94q9
$$ y = [198, 118, -369, 72, 41, -118, 163, 168, 23, 37, -261, -23, -20, 513, -232, -466, -237, 306, 352, -61, -43, -126, -9, -181, -208, 10, 98, 161, 19, -290, 277, 234, -151, -296, 203, 362, -265, -329, -215, -146, 306, 379, 101, -149, -195, 68, -357, 23, 494, -17, -476, -53, 235, 244, -71, 56, -166, -97, 208, 44, -184, 336, 114, -18, -575, 62, 386, -315, 40, 299, 59, -352, 22, -154, -40, 345, 241, -240, -363, 240, 105, -112, -47, 75, 56, -94, -198, 191, -80, 292, -127, -300, -85, -8, -143, -18, 161, 258, 2, -422, 47, -18, -448, -270, -32, -65, 134, -99, -425, 46, 430, 220, -468, -561, 94, 44, -143, -68, 149, -10, 11, -10, 284, 271, 336, 111, 44, 257, 451, 503, -376, 155, 315, 130, -198, 240, -131, 163, 18, -135, -20, -44, 64, -155, -181, 244, 114, -332, -633, -65, 120, -146, 48, 24, -88, 135, 14, -105, -238, 312, -256, -521, 33, 11, -375, -336, 217, -88, -52, -75, -111, 272, 290, 190, -69, -140, 154, 65]
1850F5q7q2M67k85n27N87L62k72l14K12M4k01J84j09j63J13L36o50K35K26Q4j35
1872I0j85l8O2p1j8j7K0K78j03n45P9K26K94j72jPKm6N5K97k84J45k73j2L31q8
1898C3j33q7L83Q0l17r9L7M22j85k15J62K04k83P9P6J26p8j64l72L07o3P3L3q1
1922f2K39k6J9k57J37J1Q2l27J5nM9p1n3J85R1L1Oj93O0lL54m09J1J56q4m51M11
1949h4K31j01l67L22J44m09O6j41L04P0j86N8j4J78m9q1k50J74K08Q4j63k52P
1972b51K06L8K55m23K16r6R%r0J73RL4J15k21k10P5N6K31q7j42j31K99K11k29
1996D7K0N3J98k6m02J07M56m73j0P7p6LJ38k48L06p2j10J23m32L70k67J53K93
2019B28k29m0M1R9m20K16K29p6q5K4l27K88j88J56Q5K64m51J61J89j42Jm01M73
$$ y = [65, -22, -104, 363, 78, -449, 138, 500, 228, -86, 126, 170, -31, 153, 44, -119, -6, 330, -320, -85, 141, 225, 90, -95, -133, -71, -142, -160, -177, -157, 121, 18, -527, -448, -222, 72, -100, -101, -94, -92, -138, -83, 214, -70, 75, -198, -210, 121, 33, -100, -187, 196, 276, -41, -140, -103, 319, 134, -81, 81, 285, 2, 81, 157, 283, 205, 41, -331, -24, -87, -14, 19, -62, 177, 151, 170, -87, 50, 61, 143, -184, -169, -174, -125, -196, -249, -64, 27, 58, 64, -129, -69, -72, 282, -127, -116, 40, -44, -495, -84, 147, 46, -321, 1, 145, -264, -198, -339, -35, 35, -151, -93, -107, 71, 22, -59, -309, -135, 73, 157, -6, -258, -251, -45, -7, 248, -175, 41, -55, -46, -46, -136, 37, 46, 80, 195, -26, -236, -161, -105, 126, 39, -103, -234, 65, 276, 47, 67, 120, 318, 292, -110, -3, 453, -20, -30, 47, -29, -26, 112, -136, 170, 98, -12, 111, -321, 49, -218, -65, 228, -1, -41, 0, 99, -321, -105, 124, 48, -37, -13, -340, -52, -240, -84, 1, 265, -186, -25, 164, 22, 23, -378, 95]
2042I5j93J11m2m7N2J45j75r6M13L1K2l75j2J12J49j21j01K45l38q9K44j57m4
2065a71K14N9j87j57L43p8q0r0N1j26J80k92M11J30m77O3O1R%J73n0M7K8j00k0
2090e9o6N2j81P9K16R6k66N7L5J56j63P5m4O4J6O0j03K90j89l79L63j3j83L66
2114B79q6j78K10l58M13p5l66p2J29l4jL13k14l8Q4j15K43j49k84J52J74J92k4
2137A95j32k42L93k93O7k11L19j02J1j78K50k2l1j88K57j75L11l25j10J71N13
2158D78m86o0P9R3Nj74J69q3l87L00j0j4o5K6O1q0M5P9j12J50Q7j89k9p1K03j0
2184EL2n6J93j90j84N8O9R2j81M24j71j05K4R4j56J14l3K20o9m2J92j75r4m0q8
2209f7L15k85L8k56K88L0n62N79k92L80k06J17N2l71K68q0M1J62J24k86K44k87
$$ y = [95, -98, 13, -29, -76, -24, 121, -54, -150, 263, 294, 316, -59, -71, 41, 190, 69, -32, 213, -125, -214, 30, -127, -171, 43, 102, -85, -242, 101, 23, -57, -147, -96, -222, -42, -334, 77, 207, -270, -207, -146, -137, -137, 36, -14, 33, 61, -39, -59, -125, -73, -254, -175, 41, 137, -129, -72, -37, 119, -44, 31, -13, 51, 67, 127, 24, 314, 125, -254, 109, 96, -87, 279, 193, 15, 225, -133, 280, 205, -161, -233, -104, -138, -139, 174, -40, -78, 6, -109, 134, -15, -299, -147, 27, 219, 195, 63, -179, 214, -79, -12, -223, 96, -6, 5, -173, 77, 55, 24, -164, 93, -82, 229, -96, -206, -35, 478, -8, -68, 11, 104, 109, -65, 104, 21, -366, -66, -76, -90, -155, -129, -68, -148, -103, -24, -136, 14, 101, -88, -117, -188, 15, 5, 37, -19, 174, -16, -200, -142, -73, 19, -162, 262, 91, -14, 10, 104, -52, 62, 29, 249, 180, 138, 330, 155, 61, 21, -67, 248, -37, 1, -255, 33, 63, -499, 80, -212, 168, -38, 79, 131, -240, 28, -52, -11, 151, 275, -11, 233, -54]
2231e4l1L75j52k02N2O4R2l84j06L34J46j48k9M9j13M5K39l06K08p2j35L30j13
2254H9k7P6m4o3k37J83o2J99J8r3k57J87rJ76M8j11l28R4M4K71j3j80l5J83k37
2279a28m9L10O9l16NJ45j61J58j10j4r1Q9J90j85J14r3R4j19O9j34J83J9j56P1
2303d0J1m4R4l4j3k53K27J86j67J47k47j0L37j60j79J58r2J13j04R5N8J2L8j21
2327A2Lrr3mM8oJ57j94J25L7K2k13J47L3l21L49K90l79j20K58q1k20J08O0k33
2352b24K99k08R5J95k30J87q7o9K13j91o24O74l5J22k96M82m78J22K32o2j50J13
2374H0m41L20JRK03j13k70Q5J38j24J72j20k56J58J96kJ24j13r5m3J58n7m1L5
2398DL2J55j03j52j06O1K9rPN6J25j97J89n6l1l90K34L29J30k76o5K35j40j6j85
$$ y = [-54, -85, 290, 138, -64, -12, 52, 144, -240, -346, -12, 134, -14, -43, 6, -107, -62, 177, -129, 79, 7, -128, 202, 89, 62, 138, 94, 31, -206, -23, -85, 114, 132, 39, -218, -31, -40, 136, 184, 73, -255, -161, -117, 154, 141, -39, -74, 109, -128, -177, 133, 202, -114, -109, 36, -125, 33, -77, -91, -182, -93, 97, -88, 26, -67, 27, -92, -23, -157, 26, 45, -111, -40, -29, -73, 21, -13, -26, -279, -52, 134, -33, 114, -133, -143, 194, 34, -145, 13, -79, 34, -70, 25, 83, 95, 133, 12, 15, 6, -87, -91, -43, -49, 108, -86, 39, 76, 98, -115, 32, 65, -256, 93, 383, 4, -116, 142, 61, -159, -51, 9, -224, 75, -133, -38, 157, -73, 114, 27, -42, 171, -20, -644, 30, -5, 117, -179, 303, -175, -53, 179, 117, -33, 80, -361, -41, -40, -31, 172, 59, -211, -126, 12, -112, 60, -60, -316, -158, 38, 36, 160, 47, -48, -91, 67, 10, -31, 4, 36, 191, 88, -64, -170, -109, -80, -89, -82, -26, 99, -98, 91, 35, 4, -386, -152, 177, 307, 31, -34, 201, 61, 45, -140]
2423a40J16j58O0K55l14K41K37k45j32J16J40k38o4Q8j51J31L0M0J36k29K39j65
2445gJ86k46M6K53j78q9o7J43j18J55n9Mk11P6J17j38J63l2M5n0J43l07K16j6
2469B9j08J86k20J15l21M14q3J28o2r0J8K11k83K09k15L6p9j93R5J97n7q5N6K51
2493A49q3k99J97J33Q2l15L8M1J94k64m7L83l8k54q0J89J1J87k07J07k30j70M74
2516A98l62l6J0K28j52N5J06j66J06J29O9p7k5Mj36j39L2K60O9mo0j69j46M43
2540B37k07j77J98j83L44Ok30K9J57k33j2J05p7K9M8%j35j55L30j66K87j43M50
2563E02l86j19K22k45k0J10J72p2KM4k77K83j50j87K07k17M94k39j62L04m19L2
2585a21J33k81L97j27lj49o1K09L3k89K40R6L5j41K53j01k42L4J57j59K23j84
$$ y = [-140, -24, -182, -122, 133, -181, 60, 297, 52, -80, 36, 176, -62, -126, -38, -189, -58, -28, 12, 148, -81, 158, -7, 179, -67, -21, 232, 54, -35, -102, 41, -77, 78, 19, 23, -188, -112, 5, -133, 30, -2, 43, -7, 136, -171, 45, 29, -79, 107, -113, 2, -319, 95, 12, 140, 78, -12, 6, 217, -66, 143, -72, -36, -115, -308, -213, -16, -73, -158, -102, 149, 66, -233, -36, 97, 179, -136, -98, -57, 137, -127, -174, 209, 171, -83, -163, 26, 37, 224, 17, 124, -106, -276, 198, -164, -200, -190, 38, -114, -59, 47, -119, -13, 116, 185, 108, 83, 87, -49, -188, -156, 104, 173, 169, 109, -60, -206, 237, 30, -147, 51, -132, 212, 218, -12, 17, 174, -59, -71, 34, -43, -14, 34, 34, -101, -256, 74, -92, 195, 52, 502, 116, -3, 219, -26, -46, 64, 236, 164, 166, 210, -67, 216, 66, -121, 86, -131, 363, 124, -38, 266, -153, -121, 12, -269, 128, 1, -2, -151, -212, -3, 30, -259, -19, 77, 112, -29, 224, 123, -119, -85, 72, -87, 136, -48]
2607d8m7M9R7j5N1J6p7j08p7j5R3l8J14j8Q6o3L4Q3r1j61J14Mk09K40O3n7L1j06
2635e5J71k09K75k57j43K15J14j6j80J75N2l25J76j23k2J01J84P7l76k74L16J04
2657b0K23l07K19j05k69J83P6J29j06q4L27j52k99J3P8J7Q0J9K78l29j06J63p
2680B1K48k54J16j8l15M74n00R5K34p0k3k3l7L42n06L5K05m5K73k29j45M7J84
2703A09j93J49j43J71j07rK66j54j66O6j8J73R2k11j26O0k4L38k85q3M89m53p6
2726a35R0k99L41J91j2j99N2j9J48j22J04r2k38L71k33K29l79J39p3p7K10m6j0
2749e9J31k63n4K68J0k93O18J81n51p3o4J09m1j89L99l33J18K07p3j62J03p8j82
2772b71J44K4J47j9j73L6k05N8J00L25Kk76J47j35p2L07n8j71J18k32J00J14O6
$$ y = [-48, -95, -46, 51, 36, 87, 103, 26, -82, -159, -174, -81, -119, -5, -23, 63, 0, 34, 117, 26, -135, -21, -17, -226, 14, 77, 20, 51, -55, 116, -93, 182, -75, -218, -3, 111, 95, -85, 90, 142, -183, -7, -130, -152, -51, 133, 210, -166, -440, -124, -20, 203, -104, 115, 10, -259, -76, 0, 129, 23, -61, 266, 114, -185, -172, -94, -77, 3, 22, 300, -29, -135, 28, 21, 269, 15, 131, 113, -202, 272, -228, -133, 101, 31, 8, -15, -52, 290, -216, -181, 24, -21, 252, 23, -122, -75, 109, -84, 65, -78, 93, -14, -23, 243, 89, -77, -11, -29, 144, 236, 25, -101, -41, -65, 273, -12, -95, 394, -59, -135, -45, -344, -3, 188, 176, -23, 29, 10, 158, 36, 140, 48, -190, 181, -52, 177, -202, -63, -136, -213, -3, -49, -59, 72, -191, -245, 23, 33, -260, 358, 539, -12, -85, -149, -40, -81, -270, 129, -204, -86, 121, 48, -114, -11, -89, -271, -127, -103, 44, 25, -148, -112, -317, -259, -159, 166, 168, -108, 39, -96, -168, 139, 81, -90, 28, -204, -104, 10, 76]
2795G6k35J44j53J22l9O3P4J1J98o6l35J36J61k41K7q1K34k09N3J08j14P2Lj31
2819a22M6j26J56Q8l00N4K36N4p2O5k76q1L06Q6k01j17M85l60l2M29m68J28J18
2842I6J2j0k14K43r8k7j59M5J07r9o8k7nK6K15k47K39p8J52k0k89l3J67j9K1j43
2868b13K63q9J21J0p6Nr3J50k79L53n3j66P9J50j34J59k21l6L19l29J44J70l07
2891g3q9J13j25J99j2m31J89M69l79R3j31j99K41J53j9o7j06L70n61K38K72k58
2913a13R4j06K34J2m4n2m00K46K00J24m20M70j17j41k41M19j74l5k43L08L57m24
2935d6k7L13j48j31N5j15k34M57K59n62L42m2k20L02l81K33N6k1l00L62k93l2
2957a73K93k77j76M16K36m91K43n22K69J68j27K89NJ30k43j76o4J60M2J08J47
$$ y = [76, -159, -15, -168, -46, -85, -22, 52, 63, 261, 195, -140, -4, 157, -84, -57, -138, 96, -113, -60, 48, -66, 6, 9, -122, -76, -202, -46, 42, -258, -204, 32, 86, 14, 79, -197, -278, 28, 114, -87, -204, 281, -79, -111, 318, -150, -22, 96, 108, 98, -116, 127, 29, 2, -157, -112, -5, -104, -172, -199, -204, -178, 37, -210, 29, -49, 103, 83, -206, -239, -72, -91, -70, -213, 50, -39, 82, 92, 16, 21, -72, 78, -201, 152, 99, -67, 12, 162, 28, 187, -34, -70, 249, -80, 64, 234, -73, -162, -49, -174, 25, 13, -418, -229, 240, -139, -46, -177, -376, -135, 18, -1, -68, -174, 196, -365, -127, 145, -113, -19, -125, 109, 121, 77, 25, -375, -129, 71, 195, -225, 245, 128, -13, -254, 165, -9, -44, -287, 21, 378, -46, -73, 240, 92, -39, 16, -99, -333, 124, 383, -179, 163, 121, -99, 203, -178, 55, 111, 90, -210, 152, -141, -173, 120, -157, -333, 83, 319, -172, 71, -451, -182, -14, -141, 148, 153, 283, 40, -136, -200, -40, 2, 110, 257]
2978B57k92M2O5k07J42j56l4L15j71Jj41K01N2j30M29o35J22K68l82O2J0R2L4
3001e6J98k43RL1N5K37k23q8q5L09q7m1j59lPJ26p7m4p1J24J73J21N9l64L43j15
3027A36P2l98J03L9N8K13l47j93M51P5l34K3K69j06j24k81M57n2j8O9p2K8k48
3050a80J4J54j46L54o1jR8k51J11k8j41j34K62N5r9R9r7r1J06J55l78L18k80M15
3074B54j26l47K07O3Q8j39j26j22L38K97n03K98k27L07k31M7J59l11N5K38m03
3095a84K7Q4j26J73O2q6P3j14J76j10k20K86R6r5k89J66J24q2J6L41m04K47k20
3118e9j39J38q6J82J17k66m4J50Q3j79J59P3k32K9k04L13P5k07J52j5J79l36j
3141a18l9M72m39P1J22J70l84m4K86Pk02K9K6J28j32N3k95K97k18l6j02L07Q5
$$ y = [257, -35, 7, 72, -135, 7, -149, -183, 132, -39, -38, -179, 22, 74, -56, 373, -262, -140, 128, -254, -192, -182, -90, -56, 142, -101, -92, -61, -6, 231, 8, -80, -165, 144, 57, 16, -143, -146, -139, -13, -90, -134, -205, -81, 92, 213, 272, -92, 251, 136, 208, -190, -87, -48, 10, 223, -124, -317, 134, 209, -125, -102, 167, 61, -63, -344, 113, 61, 43, 112, 40, 68, -180, -166, -12, -158, 196, 135, 134, 232, -19, 92, 64, -77, -211, 51, 106, 7, 106, 9, -82, 24, 179, -199, 119, -161, 254, 128, -219, -12, 51, 139, 0, -126, -248, 90, 387, -116, 182, -45, 262, 31, 78, 237, -74, -19, 219, -184, -157, -73, -199, -26, 36, -50, 23, -91, 85, -25, -245, 41, 137, 42, -247, -81, 43, -39, -23, 318, -86, 161, -59, -198, -60, -146, 36, 153, -113, -157, -7, 76, -103, 56, 129, -103, -74, -278, 35, 110, -97, 55, 40, 219, -117, -118, -157, 315, -124, -53, 69, 239, -145, -189, 97, 104, -98, -69, -43, 85, -47, 6, -289, 8, -210, -246, -348, -41, 44]
3164D4jK4k7j22R1J16m02L08m3J35k25J2Q7K9j78J93q0r7K50P1K2l0j59q5l2l3
3190a32K60j89J93j84K19k91k01O01l13J11l27K39j66K73k33J71n4k45K37J25
3210I4l5l62L05Kj24J24M9r9J1j50K8K12J4k63P1K27k08K53n7R5J99l68m2k3J3
3235c4l6j43L75j99K15j70q2K30q6O4j54M1L3j83J21J56M3j16M3r4K6j42J23O9
3259A00q8k1p3Q8J52k94j27o4J40L49l83K91q0J17j17o7Q9j41K27r3l41K51k14
3282b99K86K06Q1k31q6P7N7J62k14q5q8L94l52J6J64J20m12K76P4j51k3j75L35
3305A32n3j17r0M1J69jk20J87k31K06q3J2j17J33N6p3nj69j0J32J30j35O9o7L3
3330g1j31M53l03j72M50k12L09k78K11j59k1J00l1j33q8M41n49j9J70J12J20j66
$$ y = [44, 43, 67, 40, -82, 9, 125, -277, 31, -12, 123, -102, -90, -3, 26, -152, 41, -39, -136, 114, 185, 207, 177, 18, -67, -99, -132, 128, -61, 132, -52, 167, -124, -325, 276, -37, 74, -253, -14, -180, 93, -140, 31, -23, -268, -31, 94, 59, -303, 2, 4, -120, 4, 53, -46, -35, -185, -157, 55, 69, -194, -123, 104, -104, 149, 92, 187, 386, 18, -24, -47, -34, -70, -213, 162, -37, 178, 8, -74, 156, 70, 134, -20, 21, 54, -129, -8, 148, 191, 75, 118, 24, 50, -92, 31, 100, 12, -9, -82, 6, 158, -136, -263, -327, -187, 162, -221, 70, -10, 107, -10, -77, 12, -129, 98, 5, -336, -85, -299, -13, 193, 274, 43, -43, 34, 91, 253, 39, -46, -134, 260, -92, -76, 88, 208, -204, 72, 146, -5, -28, -203, 132, 79, -38, -128, -87, 82, 81, -139, 48, -183, 23, -60, -48, -165, -32, 24, -49, -54, -223, -233, -101, 29, -106, -37, -104, -71, -202, 251, -52, -224, 226, 14, 323, 45, 256, 97, 76, 176, 145, 12, -76, 365, -184, -203, -33, 79, 199, 33]
3352C3j9k60L40K4j25J59m2k46r6K33j85R7K6J48J41l31J02n0qj29N3K0J47O5
3376I7l25J66k6MR5pN2k70M07j51j46J77k8N6l42J45m5L53k68k8Q9l03K17K3o2
3401a20J13L29k40o7K01l40K38j78J09j28K79o0p6r0K50l62J05p2J32RJ01k72
3423a39K13O7k76k3o2L22k25o6L14L06m84J21k62N56q8l56j31J08l9L64k23K34
3445B31l08M7L17k51m7J93j91j36L16J9q8l8o5O4l1k08L67l63J44m2M1mQ0J58
3469B05j96Q3L7r4m8o3K15j71J24j22Q7R0m48O17k49o4J72m25K21j2L9Oj66L90
3493B28l20J99J75j00k15pJ35j95j20K04Q2L9p7J66k09k52J19P1jk18M26m48J75
3516a43L00J49j05m36M34m89J49J10j45L78l06Q4M0j3L8o4j46K20P0q2l12R1J36
$$ y = [33, 14, -246, 94, 118, -7, 152, 110, -136, -232, 1, -184, -87, -61, 87, 228, -103, -1, -51, -59, -188, -135, -115, 32, 97, -228, -62, -88, -84, 11, 4, 56, -214, 193, 42, -104, 73, 45, 101, -241, -96, -141, 212, -56, -84, 5, -298, -81, -58, -120, -7, 322, 82, 15, 216, -124, 114, -64, 45, -83, 196, 136, 60, -30, 220, -142, -37, -109, 23, 32, 133, -139, 74, 141, -135, -158, -220, 102, -123, -189, 125, 431, -53, 68, -194, 362, 274, -82, -213, -105, -144, 220, -3, 231, -77, -30, 287, 36, -11, 182, -9, -145, 171, 190, 102, 64, -1, 63, 32, -176, 191, -172, -28, -70, -29, -33, 47, 205, 9, 92, 129, 35, -13, -76, 139, -32, 92, -30, 57, 147, -301, 316, 67, 3, 175, -250, -29, -41, -2, 4, -162, 228, -92, 107, 282, 182, -33, -40, 95, -100, -220, -16, 66, 105, 28, 194, -15, -267, -148, -77, -78, -296, 130, -318, -143, 157, 306, 201, -235, 199, -290, -141, -31, -176, 202, -104, -20, 20, 7, 45, -19, -165, 55, 125, 43, -269, -178, -42]
3539d2Q9O7j22K95m81J1J45J1J8RJ80m38L92M2Q9k73Q5k55L8R4l3N0N2j40j62
3564b79M78k56j13Rj44M30M2m32L44j05m3l76L58j5J1j08M19j27N5k56J26j05
3586h7K30O9p5l77J12K55r4r9L03j69J50J77k20j61J12j51J20j74L93k30k89M73
3608B68j22l96K89O2k45j00J05p7J75L6p8M48l29J61L7k16L0J07q1j77L19j68
3630D8k05J31J47k20J58j37j52Q2k06N19p8J14o8Nk63L12P1q9k12n2L36l23K72
3653A90m10L9K18j13K46j00k21K10J12j35j6K08l56K71j02j07m8J12k05L12k62
3674a57K00q6n3K58k06J08R3j93N5k38J62K41l25L03M6k69N7j74K46j33mj72J96
3697d5r8J0J04j96L59K09l57K10m3qj27P0q9R9R0l77M2J89nm5j98K32j93k0o5
$$ y = [-42, 47, 114, -8, 287, -194, -183, -38, -27, -9, 0, 180, -258, 134, 176, 265, -8, 77, -178, -140, -46, -79, -29, 23, -117, -279, 199, -57, -170, -161, -305, 125, 167, -265, 79, -26, -69, -445, -87, -102, -91, -199, 220, 93, 148, -108, 18, -87, 143, 212, 137, -240, -128, 127, 33, -66, 237, 68, 218, 395, 175, 14, 126, -25, 95, -79, 314, 84, -205, 268, 146, -250, 39, 101, -144, -244, -139, -216, -41, -5, -83, 365, 36, 197, 234, 18, 48, 155, 74, -103, 216, 48, -157, -26, 121, -99, 59, -78, -230, -148, -354, 165, 87, 201, 133, 138, -125, 187, 258, 169, -43, -95, 241, -82, 190, -220, -181, 37, -76, 170, 70, -151, 59, 171, 36, 20, 228, -128, 143, 41, -66, -114, -2, -207, 105, -157, 43, -43, -96, 162, -44, 64, 157, -36, 19, -219, -57, 184, -141, 162, 208, -61, -4, -178, 68, -65, -69, -241, -45, -143, -133, -29, -225, 134, 343, -14, 196, 153, 145, 18, 88, -1, 98, 188, -189, -147, 42, 37, -8, -206, 26, -167, -187, -252]
3722b52L19K07k31k21L18k07L68m01J7L24l72R2j58L69k3l61K16J57j44K23l96
3743a56J06Kk7J09k05K49k04J09q1J4J43l04N04q3j05J64l87N07l42j33Q9J28
3765I7L8j90J30L0l17R8J29mJ7R7j35J41j17r1j7K04j37R3NpK9k03L1M4K38j60
3791D3j48k1J30J98l43nL22j26j17j22k26K96K07j54L5jj12j07j3O00l75k81J94
3814a26N6l6K92n2k48L08r6l7j76O5l22K95k24J90J9j04J12L6J97n7j65K3j24
3837a74K23r4N1J20k6j02k74J15r8L52o9J2j39K2J02p0J34j25N05m44K5P9Q9m51
3861b37K36J18j13M0l6K5k39j43M75o7j27P3M9L2l7J2r7K6k01J65N6J91l48J11
3885c6r0J46k68L05m9k25J80Q0j58L1l3J13l02M93k09k03J95k92K35K29P2k4l74
$$ y = [-252, 67, 274, 43, -178, 140, -67, 301, -100, -83, 241, -131, -39, -197, 172, 149, -212, 4, 161, 17, 240, -156, -50, -48, -75, 34, -171, 78, -126, -17, -98, -84, 59, -245, 259, 176, 71, 235, -152, 355, 13, -120, -31, 97, 135, -55, 75, 105, -212, -114, 15, 11, 28, 125, -10, 131, 14, -77, -94, 110, -27, 66, 71, 64, 93, -110, -79, -35, 203, 43, -105, -126, 4, 202, -141, -146, 176, 50, -67, -189, -415, -119, 88, -66, -31, -32, -144, -251, -264, 336, -39, -320, -126, -70, -106, 186, 134, -114, 194, 98, 61, -115, -50, -372, -77, -301, -111, -92, -196, -84, -48, 149, 92, -73, -50, -174, 49, -45, 6, 126, 100, -2, -276, -161, -259, 93, 24, 36, -103, -81, 21, -49, 85, -40, 465, 21, 46, 125, 214, -237, -1, 117, 4, 44, 8, 33, -206, -349, 126, 59, -68, 5, 54, 86, 49, 61, -36, -10, -211, -46, 10, 201, -147, -36, -126, 20, -248, 57, 8, -217, -37, 43, -115, -84, -117, -4, -306, 187, -22, -225, -30, -322, -87, 142, 214, 190, -184]
3908a84Q9Q2K73n4l03M5J86l69M28j62j38O2P7n5o7J54r9j11O5L99m53J91q1J
3932b4K10k06j1j4J51O7p1j04qQ6j38Q7J02j97Q9Rk11P7o0P2O2j66L90j26k34
3957a68K14j41M03m62P2J46j07M4J01k12k3M8K45n07L13O8k47J37K9O3O7J40o3
3980A60k04r8Kk18L73Kj45L21l56K27K1l17L34J01k97J09J42j66R9j26J50j81
4002f7J87J35j25j31k43J90j8M6J63k4n8K7r1J14k37L72m19m5J80m3Q9l40N48
4025B10l26N7Nj58M1J7K16j93J50k19N8Q3L5j7mJ36Q2l4k21J6L83l58j04K95l31
4050a81J81j12J06J16j53N2j60K18j97J12L16j17l0j02k15L05k09J72n8k06J19
4071d3J28k58K49l07L42k23K75k44Pj31K64k71K3K57j31l2K01L7j62J64j14j91
$$ y = [-184, -95, -13, 260, 206, -97, -52, 134, -235, 193, 31, -107, -45, 32, -23, -90, 64, -35, -146, -81, 318, -135, 56, -25, -24, 186, -20, -31, -45, 106, 173, 102, -2, -10, 76, -62, 25, 127, -70, 19, 28, -183, -106, -166, -94, -32, -198, 192, 66, -168, 46, -95, 308, -154, -82, 64, -43, 1, 102, -110, -133, -85, 160, -347, -34, 34, -213, -76, -47, 16, 83, 223, 160, -44, -142, -140, -358, 15, 17, -128, 193, -163, 64, 85, -232, 102, 203, -94, 15, 157, -9, 90, -36, 114, -67, 120, 255, 130, -1, -244, -54, -72, -26, 137, 113, 55, 82, -9, 105, -132, 240, -179, -224, -44, -87, 2, -338, 210, -116, -59, -54, -212, -171, -154, 62, -131, 19, -200, -142, -59, -24, -41, -45, 91, 173, 139, -82, -66, 317, -41, -145, 150, -181, 0, -112, -6, 110, -43, 9, -151, 67, -130, -18, 298, 181, 151, 49, -166, 139, -70, 102, 44, -162, -43, 85, -173, 76, -231, 111, -112, 163, -81, -74, -205, 59, -212, -189, 68, -63, -95, 106, 143, -19, 145, 31, -160]
4093a60O4Q5J78j45j06j60L13L2q4J9j72J6P4K49l38L74l41l4L5J37r5o6Q9K48
4117B12k58j51K90k49K20o4P6j57J19j54J54M0j72M1j9p0K05j3Q2k96K62K8j4
4140A12l61k8L13J57l26J79lk09j07L61j3r7k5J92p1Op9K23m3k1L7j76R9q1k26
4165a87P5j41K32J58k20J40m7J79k20J78j56l9K41o53M16L6o3K6l96L95R4l3n9
4188d4p9R5J99k09L71n02K52k32J82j03P9M0J90j20k57L52m8j93m7k5N5j6J09
4211D9J3k77K27j86J70p3J50k58J71K36j13pr3l12K38Q6K73n58K99J86o6J6Q6
4234B57j35j90L7Q0j20K19l18J26M25l70J57l89M8L80o0p4j06K91j94K4j99J71
4256F0n1m7k0o4LJ81j61K42j16O0J26j44j7n7K74l39O1K92l30k09n8K84J24j22
$$ y = [-160, -96, -11, 167, 22, -84, -244, 69, 101, 17, 36, -136, -120, -46, 203, -135, 239, -102, -136, -101, 36, -59, -125, -36, 212, -46, -197, 93, -156, 64, 0, 76, -81, 38, -116, 38, 78, -94, -53, -72, -142, 63, 50, 132, -164, 98, 126, 112, -249, -277, 36, 193, -133, 46, 43, -166, -273, 88, 75, -22, -47, 145, 74, 80, 1, 224, 181, 160, 197, 21, 120, 39, -187, -112, -253, -21, 137, -83, 57, 10, 189, -31, 147, -9, -48, 193, -460, -44, -8, -71, -45, -441, -46, 48, 15, -44, -123, -28, 171, -38, 333, -169, 83, -149, 33, -70, 9, 49, 239, 119, -138, 214, 166, -27, -74, -99, -44, -60, 49, 62, -215, 12, -174, -4, -77, 73, -185, -14, 222, 109, 102, 9, -303, -65, 21, 294, -264, 35, 221, 155, 171, 257, 122, -68, -31, 49, -71, 148, -170, -44, 381, 11, 168, -221, -173, 207, 147, 73, -33, 258, 64, 88, -111, 60, 9, -38, -58, -122, -119, 62, -99, 143, 27, 87, 213, 69, 52, -5, 269, -70, -9, 283, -47, -256, -314, -30, 94, -28]
4280b8p2k1N8J0L7k21K36p6k46K15jJ09Mj72L98k34j40J26J89k18K02k62K10k38
4304a35L50j58J83k13L8J51j62j50J94J95k01L7M0qJ48k85M5o0k88N43l93o4j02
4327b95K19N7j80J63J46o4k14J12q3J86k17L40J01l48K08k65l0J60J61j56p7J00
4349B4R2k68m3K77j71l3Q3l17M29k99L11j50P1m2J75k53J04j00O1o8K3M7M0L17
4373C10m47JJ96M5q6o8p8J41j96Q8J39n2R9N1k52J90n8nn7J80r7j14K57j12K71
4398C46m32j6K15K7K5k80j00K45j8m5k7J19M3j20J69j38J71l80K43j42P8p9M2
4421e4k18K13J6M8k97R3k3K01kl4R5J1k28J49k6k3K62l48Oq6L15M4j46J05j09
4446c6J07K5k0J58j49P5l8j46K2J85l46m4J37J11J06O2k29l1JJ37Q8q3j87m4L04
$$ y = [-28, -100, -121, -63, -53, -16, -237, -1, -77, -323, -108, -109, 0, 4, -168, 230, -4, -144, -18, 171, -47, 155, -107, 103, -135, 215, 57, 240, 27, 65, 216, 54, -96, 98, 293, 92, 129, 169, 161, 309, 24, 69, 9, -279, 264, -129, -193, -295, -76, -19, -199, -36, 110, 46, -168, -56, -139, 47, -170, 170, 271, -77, 131, -134, -164, -4, 157, 1, -76, 24, 116, -152, -195, 82, -89, -122, -39, -356, 73, -226, 85, -65, 6, -36, 139, -114, -10, -110, -49, -117, -94, -47, -7, 310, -137, -136, 60, 105, 19, -49, -127, 14, -182, -94, 45, -7, 92, 143, -109, 81, 23, 18, -39, 141, 44, -70, 187, 75, 346, -86, -102, 113, 140, 165, -115, -215, 30, 12, -33, -60, 59, 102, -18, 151, 13, 184, -196, 47, -95, -17, -96, -54, -272, -59, -43, 5, -292, -199, -222, -21, -23, -57, 38, 49, -179, -30, -56, -79, 183, -165, -159, -245, 70, 114, -32, 73, -36, 71, 96, 76, 234, 85, 160, 122, -24, -2, 183, -163, -207, -70, 41, 147, 209, -20, -51, -50, 87, 175, 92, -95, -139, 165]
4471A65k47J5J45p9m05M32M3j29M2l98K39J79k3J35k24J61j18j16M0k22L94J25
4493A54l12J84j58k1J22Q4J10j80j77p0O53m11Q7Nq9KL1N3K75k57k96O5O5q4L75
4518B10o3l56K67p9N2L2k95M4K12n3j64L86k81J03L0j45n9K40r7q2p3k02L70k27
4542b30K97l3p1J08L7K5k5k3jk06L01r3kl67N40k26j52K31r7K20k79J9j5ok5j29
4568b02M1L01L0K27m54J78k55L28l47J9K50J8k42N9J79j57m6K05r6l5K18l21K84
4591A82j14R1j87K09m8R0l09n6J26o4K4q4J08J43J5K8j99o7K79k03K14O0k60j6
4615c8j7r6o3M11k47l61M77J9n5j75M9k0J67j53J55p1k3n8k59K44L4J09j90Q8
4639g3L50k83n8j67N40L0m06M8K37j04j40L2o9J34j24K41K4j85J88m0o9j06L2
$$ y = [165, -82, -67, 78, -1, -406, 26, 69, -60, -18, -416, -177, 2, -21, 114, -110, 51, -67, -183, -143, -365, 29, 154, -158, 26, -132, -153, -31, 53, 163, -17, -194, -264, 389, -22, 65, 70, -19, -17, 14, 67, 342, 85, -211, -146, -81, -165, 210, 147, -209, 58, -21, 31, 63, -232, -188, 24, -29, -193, 193, -88, 15, 45, -100, -159, 81, -16, -98, -171, -373, -3, -230, 67, 34, -37, 71, 108, 133, 108, 85, 84, -122, 179, 86, 84, -283, 257, 31, -121, 110, 13, 233, -46, -27, -42, -48, -73, -202, -161, 140, 170, 397, -57, 121, -134, 194, -153, -134, 116, 134, -108, -49, 130, -27, -73, 132, 36, 1, 219, -102, 182, 68, 159, -28, 181, 133, 223, -86, -142, -16, -80, -56, -140, -32, 111, 126, 154, -45, -112, 167, -36, 178, 238, -22, -38, -55, -151, -214, 197, -50, -411, 66, 85, 30, -145, -96, -116, 51, -102, 53, -18, -41, -99, -358, -114, -80, 29, -161, -73, 277, -6, -64, -231, 309, 339, -67, -19, 218, 114, -26, 6, -63, 71, -53, 188, 212, 27, 215, 175, 106, 0, 32]
4662C2Lj03J01j33jl3l4L33j08J77j77j27J15q7K9K23j51J01l47R8L74k71j01
4685h7K0J6k3m5J52j11l06L28K28l55L24j73P9l60O3K61Q5oO8K33oj72J30k92
4709E1M6k0P1j23J32k05q0K58Pk20M61o5m89J8K01j79J16o8q4J89o5j3j35J11
4733h5O3o3N8J51J29l76q4L41P1j47l81M95j93M2ln3K55l28K26L1k68K75j54J08
4757A10j52J03N6j53J65R4k98K46k94N57k96k5N8j79J26K29o1l32k42P8K90k54
4779a74L37P2M7l41J20j92K6k22L64p4K53j09k3L34m71l0j21N06m29O4j5O3q2
4802i7j00K84J7k74L94j74L9L4k22J95j40N8K21l47K42J11l69j7J23L09k16L0
4824A01k96K15q0K0L6R1j41j21J54Q6J33p9l15J18J25O7J0l25J50o2r5K92O4k24
$$ y = [32, 35, -68, 33, -100, -101, -134, -168, 165, 57, 234, 57, -70, 45, -42, -13, 210, 59, 160, -187, -89, 285, 14, -87, -67, -51, -74, -119, 33, -78, -384, -56, 172, -183, 141, -32, 47, -313, -250, 11, 96, 90, 158, 391, 385, 213, 343, 51, 97, 77, 148, 25, 157, -48, -128, 130, 137, -83, 378, 313, -176, -158, 43, -136, -20, -88, -172, 17, -48, -61, -196, -85, -22, -85, -27, 124, 253, -123, -207, 134, 205, 58, -323, 172, -21, 21, 18, -35, 220, -108, 118, 149, -119, 156, 2, 110, -42, 61, 117, -36, 129, 223, -75, 171, -123, 434, 138, 113, 171, -8, 118, 347, 286, -46, -288, -210, 80, -174, 163, 235, 282, -59, 61, -131, -105, -327, 37, -37, 216, 107, 84, 418, -53, -83, -204, 302, -127, -63, -78, -15, -97, -197, 87, 104, -170, 224, 50, 89, 123, -99, 96, -44, 14, 235, -112, 130, 241, -128, -145, -22, 287, 71, 101, -195, 20, -60, -40, -4, 87, -54, -175, -21, 65, 198, 119, -196, -78, 47, 114, 124, -201, -51, -113, -208, 84, 148, -76]
4848g6J36nm1O7J41j10k27RK18j96l6pP2j19%Q8J75k2m3j29l7K39pl1l2j02M3
4875c2j1J14j34J3q0j75L87j85P2J38l33L43j14pj41K3Q5r7L85J13m79L45J45
4898C75L3m86o7K57K8L6j69L7m6J7L0J62p7k69K58j3J87o5l62J60j61K94jj52
4922Fk89K45K06l11lj8L9j51K62r3j32J10L0J62j75J75j62J03k22L22q1K3k2M6
4946G0n8m8K75l07J93M3p6J9j35j94L92j44L8l6J5M6J96k93q9L49k11L43j86o0
4970A42l7j62RR3J49j28j20J10O7k37l9j0L10k65j8n0L49J08n7j61J67l23M0J25
4994F2l2p0J01j52nQ4r1L89l56o4m8J79L8j83j8K52J42k79K60m16N82j85j54k53
5018b17J84J58K9M8N5K4q3k17l5J49j30J17k17j11L53j83j27oJ84J64n0k10Q6
$$ y = [-76, 60, 55, 14, 81, 222, 112, -115, -106, 112, -84, -120, -127, -55, -174, -174, -86, 89, 67, 24, -105, -142, 97, 90, 59, 27, -75, -32, -43, 71, -63, -50, -130, -305, 82, -103, -31, 107, -226, 117, 3, -4, -145, -122, -37, -134, 251, 364, -115, 230, 375, 408, -78, -145, 112, 140, 176, 7, 44, -2, 15, 45, 207, 130, -139, 119, 106, 293, 228, -134, 26, -135, 159, 158, 6, -283, -38, 168, -143, -146, -164, -125, -276, -14, -107, -239, -129, -99, 63, -112, 63, -99, 4, -218, 104, 23, 46, 24, 70, 12, -36, 239, -68, 125, 168, 92, 111, -24, -218, 174, 30, 68, 32, 47, 93, 289, -4, -93, 256, 45, 388, 202, 142, 105, -57, -48, 45, 194, 66, -54, 56, 123, -114, -153, -163, 147, -118, -136, -186, 163, 271, 214, 53, 220, -103, -63, 62, 30, -40, 61, -91, -96, -12, -103, 286, -70, -134, -182, -3, 35, -148, -166, 86, 228, -51, 209, -207, 375, 190, 36, -217, -33, 125, 154, 202, 257, 281, 198, -19, -54, 95, -35, 82, -135, -246, 107, -76, -203, -209, -25, 139, 89, -121, -35]
5041c5l28L58J50j15r2J48J11k03J43k19Q5P1rJ53l85l8O7K37o1k27K69p8J4N7
5065G3M1j33J07J04r6m8pJ19j79J7N6k40J84o6j04J38J32j44J33nj25J49N8l38
5089a74J38N8o9J00l1J1j17r7K50j23J10j03J31Kj19R5k16K85j84J44k41J43L6
5112B9K09l13J62r2j65M04n90N49K7k85j70K44J04M4k33j3M1lJ49k5q3K35k61
5135c6l9k92K94L40l69K33r3j49n2O9K56l10K63J12l15J40L59l21j92N37l43k02
5157a10R7P4l52K17r9O9q4L84k64K5j34J57J09J3l04K68J88l21P7j41K34k5k4
5180E4j00L4np5P8K17k68k2j07KJ49L08m56M36k83l4K14k88o0J76j11L4K51N1
5204A95m6j07l04K86n2r9K41j23k2j05Q0k87M07j7N7j70j28K16l1j2j98L52r0
$$ y = [-35, -363, -5, 145, 30, -62, 86, 197, -6, 137, -82, 3, 74, 65, 218, -167, -205, -138, 99, 38, -189, 80, 2, 16, 73, 114, -19, 88, 192, 96, 48, 41, 160, -19, -2, 54, -186, -2, -68, -172, -34, 98, -46, 87, 82, -43, 106, 164, -174, -36, 22, -47, 53, 22, 33, -84, -181, 69, -54, 56, -47, 84, 86, -33, 62, -154, 131, -53, 91, -150, -7, 29, 238, -75, 87, -5, -170, 234, -356, 193, 220, -65, -235, 9, 113, 157, -76, -89, -48, -51, 98, 73, -10, 225, -36, -75, -367, -73, 267, -102, 131, 38, -111, -163, -94, 162, -148, 115, 227, -88, 52, 411, 90, -102, 435, 92, -110, -13, 61, -291, -74, -173, -104, -188, 196, -68, -43, -177, -20, 89, 102, -202, 66, 254, -67, 10, -131, 103, 78, 54, -46, -12, -17, -92, -14, 203, -65, -87, -194, -192, -43, 265, -191, 245, -38, -72, 142, -146, -206, -30, -141, -107, 144, 195, 149, 42, -262, 24, -28, -127, 114, -9, -31, -136, -56, -343, 64, 47, 104, -66, -194, 22, -9, -21, -219, 133, 43]
5227D3l31M21q6J17q0o3J8L09m83l06K61R4j48K29j40k3J64j53L06k92K02J12
5249A71p3l08M18j34k92J91R7r1J89L56m10R0l27M19j11l02L30k34oPK6nM3j02
5273e8r0R1L9m6J94o2n6J15K7l97o3L41k9mj58K71p5j29Q9J47l01J28J04N3K8
5298A59m83N69k61J45K20l87J52k5o3J50J7l7j15q3n7l5M08k04k34N0R9J94l48
5321a69K44r9k4qq4L32l03O1N9j21j00L31o6j9k04Q7K10J53l82N6q5O3P1k17K40
5346B6k75J29n2L41k04QQ6J09j97J42J9j02R9n7m4Kk24K22J9k5O3k6K4k11K93
5371A65j48J30J95n07O0PO5r7K10k25N7K21j33J12k77J75k4j6P3l81J15J59n2
5394a16K60k66m8M9K01k08M96l31P5p0j06j58J07J33R0j74j66J79p7K46k39L17
$$ y = [43, -288, 133, 47, 164, 84, 21, 39, 348, -135, -441, -180, -86, -234, -5, -145, -168, -4, -157, 149, -143, 59, 171, 98, -210, 208, 74, -218, -27, 70, -21, 168, 524, 114, 204, -123, 296, 185, -117, 213, -21, -27, -20, 6, 1, 44, -58, -148, -57, -18, -64, 130, 68, 12, 127, 154, -243, -306, 35, 6, 2, -156, 115, 40, -89, 0, 147, -154, -26, 78, 131, 159, -324, 245, -16, 129, 349, -38, 114, 89, 26, 176, 193, 156, 41, -42, -99, -134, 274, 70, -164, -114, -15, 179, -169, 75, -24, -48, -56, -140, 192, -111, -50, 9, -112, -212, 119, 53, 34, -170, -83, 127, 280, -102, -46, -131, -68, 3, -214, 26, -249, -120, -172, 169, -35, -27, 59, 168, -29, 113, 132, 30, 129, 72, 28, 30, -194, 28, 47, 22, 85, 59, 83, -128, 165, 17, 147, 342, -165, -105, -98, -33, -130, 80, -145, -88, 133, 0, 112, -165, 10, -14, -30, 43, -338, -223, -64, -116, 144, -122, -170, -121, 80, -128, 368, 37, 112, 42, -64, -222, -115, 18, 108, -66, -232, -53, -130, 116, -123, 194]
5416A94l21J74o8J20j49J61k37K29Q4j00j96J91j06Oj35P6j19J83o5K48k86J52
5438C6O4j62o8ML16m10L5K7J20j1k30M01Ro4j79J98P4l41M4K96m76M06l4k26j02
5463b73K34j94J34J28L2j67L57l84K22j97J16o2j13J56j29J28j52N7J62o4J51
5484A42l81J76L59l13j20K54j21J03j84J65m1o1J18Lj0J55m26Q4J50j8J47n15
5506c34L80kJ55J38l79l9K32j97j58L26j67J16J93k41j12J53j20j59K29o1j12
5527a59K44j35r9K64m43K89K39k93RK27J8r2K6l1k19J92j22n7K96k23Q8m0k5m9
5551i5K47l83K04M2JMJ64j04j29J75k08M44j66j15J60j42j91nK00j7J39r0j1O5
5575A89O8ql23J75J01k02l9j00J22j84ML57Q2o05L1L39k0p5M7R4k04J18K91j70
$$ y = [194, -127, 47, -21, 99, -50, 111, -126, 103, 187, 87, -109, 82, -24, -18, -153, -77, -196, -13, -78, 170, -116, 36, 100, -62, -130, -126, 190, -220, -185, -158, -38, -49, -279, 122, 131, 67, -112, 86, 160, -181, -137, 159, -317, 89, 55, -171, -273, -39, -233, -99, 29, 61, -106, 251, -133, 89, -108, 8, -54, -167, -11, -140, -12, -164, -107, 55, -9, 142, -239, -63, 296, -17, -137, 117, -4, 99, -85, 80, 39, -22, 96, 99, 89, 244, -182, -98, 52, 34, 181, -334, 46, 44, 199, 337, -42, -81, 151, -46, -204, 122, -45, 71, 264, 23, -89, 64, -56, -215, 14, -47, -159, 85, -50, -149, 115, -328, -39, 200, -93, -84, 143, 161, 69, 95, 64, -155, 37, -85, -142, 154, -69, 19, -21, -46, -95, 152, -231, -27, 15, 16, 20, 184, 80, -49, 126, -82, 362, 196, 81, 241, 99, -92, -97, 103, 86, 225, 135, 124, 189, 257, 249, -74, 101, 202, 0, -39, -139, -17, -201, -197, 160, 242, -363, -332, 7, -13, -88, -41, 53, -151, -33, 258, 88]
5599H8m31K81K64m03O9R1J56r0L3j2J09q5M9k18q9J33R3j12Rj00K75k29K2M05
5623C08m26J76j07k80M40j59K37j18j88l1J66k68K58K5j55K96k00k21N12j87p4
5644Dp2J1K2k16L85l57K99N2k62K14J86l81n1J53M7M3k72Q9M8K81l37K86j47L7
5668F2l46K66K80k88K07k23J99j26m5Ok02L82k87J56jj06Q4n9n9J05j31J79q0
5691b7J17K57k08Q9l49K00j33J65j76J72k43J06j79O9J20m4QO4Q0k33J57p3l31
5714c92M85j00J31m55L09m1J72k85K93j9j42j88K29k42K73O8k76K99k01K1j92
5735b53N76j46j96L88m86J3O4m5K67J09n12R1J45m29K52N18o13L65L5j12K18l51
5757a02j29K25L09l52L63j36n2ok81K40j94J87J0m5o5j20K27M1j59N3Q0R8j57
$$ y = [88, -343, -62, 202, -201, -132, -41, 115, 25, 58, 46, 155, 70, 119, -99, -188, -55, 38, -74, -65, -165, 110, -119, -97, 308, -118, 58, -49, -329, 111, -48, 189, 71, -117, -148, 18, -250, 8, 33, -122, 174, -26, -247, 265, 78, 4, -68, -57, -35, -251, 134, -223, 76, 128, -134, 80, 266, -115, -166, -13, 34, 77, -195, -106, -58, 223, -114, 172, 25, 62, -284, -18, 262, -26, 181, -42, 157, 31, -14, -8, -210, 172, -115, 41, 40, -66, 18, -41, -100, 5, -126, 53, -27, 90, 347, 139, 228, -121, 79, -54, 111, -65, 107, -136, -30, -209, -140, -20, -64, -56, 8, 88, -145, 12, -61, -392, 93, -7, 124, -331, -22, -63, 109, -176, 117, 98, -44, -232, -3, -245, 28, 96, -180, 119, -82, -61, -253, 323, 177, -19, 369, -117, -104, -40, -85, 182, 291, -221, -130, 15, -414, -162, 356, -257, 108, 143, 31, 249, -102, -231, -6, 303, -49, 314, 178, 126, 120, -161, 79, -115, 72, 82, 37, -28, -148, 79, 120, -39, 14, 94, 192, 35]
5780C5L1rk45J38k3j5o8k02J35K81j47J30l17J60J04j20j16L45j38J34l28O6p4
5803b43L62J18j25k47O1J91J53k34j32K64k38J66n1l9K7l21K65K0L8j55j25Q1
5825a64m2L74p2k57m6L16o7p3K24n07N62k83J42k23p1J97m6q2K15k15L28j51K4
5848H3p7j86K19Q2r4j54O3Q1N0K6m22J53N7L67k80M7R4j69O5J72k70R3o0j2j21
5873a93K30N7j03k3j86L03J84j51m56J49J55K2j36J75k5r4K43k75l7J28j05N5
5895h3J85j91j07L8K55m7J0l2O2L9k2j02J32j81J39m0j17P1m7P4k40R0K89O0k68
5920c3q5J56j12J33j27k15K08Q1k08L72r0j75K23j99jq9L03k90K08M6j37K00j47
5943B2O2j58J05ro9J24j0J05k25QO0o3L9mM1J29j94p5j95K59P6L0q9R9j29J35
$$ y = [35, 66, 57, -188, -50, -73, -88, -156, -358, -223, 58, -89, 41, -276, -116, -12, -132, -248, 97, -41, 93, -235, -169, -243, 119, 237, 112, -135, -74, 117, 270, 36, -96, 168, -70, 96, 45, 6, 33, -288, -23, -3, 35, -120, -245, -164, -206, 168, 96, -161, -207, 109, 42, -31, 193, -314, 248, -35, 107, -116, -187, 10, -36, -118, 97, -118, 210, 59, 83, 6, -180, 39, 121, 27, -127, -64, 17, 67, 93, -329, -176, -119, 248, -32, 15, 109, -60, 5, 177, -93, 0, -60, -72, -193, 37, 94, -9, -32, -218, 85, 269, 118, -338, -189, -34, -12, -148, 27, 2, -92, 151, -124, -161, -33, -138, -83, 102, -89, -196, -158, 97, 50, 60, 28, 90, 129, 107, 5, 137, -44, 95, 55, -62, 9, -38, 36, -204, -114, 175, 235, -33, -118, 38, -74, 59, -68, -283, -75, 6, -202, 170, 80, -95, 128, -71, -72, -161, 142, -148, 60, 106, -31, 169, 22, 84, -74, 31, 22, -47, 77, 67, 172, -53, -45, 15, -48, -9, -13, 28, 157, -37, -112, -307, -48, 28, 58, -31, 68, -61, 74]
5969G4J83l39K08j39J44k7k87P0K04l1j03J58k13O2NO8Q2p8k25J75j84L68l64
5992a89K51on8K6j35J74m9j88K11J83l45j15L36K59k92o5l8L0J62L0p7K26k41
6015I0j12K29k64l8L94j24j82L9K9J90k19Q8l3J52j94k40L01m34L87m3Q7R2k01
6038fl20J70K09k85K02J00OJ39l12r4K28n6P9J1j91J28K18k26K8j36n1K16P4l4
6062I7o9J79k33j6M05l34j86M18j03l25K79p5r1l2K11J3j09J22j51J19j61L1k39
6085b50L09j09n7q9K71J21m3m9j27O8mj55k1K15j24l0N9J39j66Mr7J71L1l2j06
$$ y = [74, 257, -82, 126, -13, 131, 104, -183, -113, 91, 60, -43, 115, -98, -36, -31, 37, 119, 41, -184, -9, -193, 175, -189, 62, 56, -2, 24, -111, 63, 14, -174, 37, 220, -125, -240, 96, 355, 63, -2, -40, -10, 152, 182, 105, 331, 90, -22, 207, -57, -95, 299, 175, -7, 32, 61, 251, 32, 120, 87, 239, 45, -195, 106, -328, 59, 16, 103, 195, -6, -326, -156, 53, -232, -30, 70, 76, 215, -97, -191, 37, -19, 60, 71, -120, 8, 226, 0, 28, -108, -159, 57, 131, 97, 28, 207, -26, -42, 363, 29, -157, 261, 158, -167, 112, 37, -54, -86, 125, 138, 29, 151, 0, 119, -42, -11, -250, 59, -50, -107, -196, 75, 196, 153, 104, -23, 45, 41, -114, -135, 80, -44, -74, -15, 124, -42, -38, -135, 36, 67, 35, -71]
$$ [...]
8191g4
##END NTUPLES=NMR FID
##END=
